##TITLE=31Pdec_DE-57_D2O
 D2O, 64 sc
 5.7.2024
##JCAMPDX= 6.0         $$ Bruker NMR JCAMP-DX V2.0
##DATA TYPE= NMR SPECTRUM
##DATA CLASS= NTUPLES
##ORIGIN= UXNMR, Bruker Analytische Messtechnik GmbH
##OWNER= root
$$ XWIN-NMR		Version 3.5
$$ Fri Jul  5 13:48:41 2024 Russian Standard Time (UT+4h)  she@DPX200
##.OBSERVE FREQUENCY= 81.013821
##.OBSERVE NUCLEUS= ^31P
##.ACQUISITION MODE= SIMULTANEOUS
##.ACQUISITION SCHEME= undefined
##.AVERAGES= 64
##.DIGITISER RES= 17
##SPECTROMETER/DATA SYSTEM= spect
##.PULSE SEQUENCE= zgpg30
##.SOLVENT NAME= DMSO
##.SHIFT REFERENCE= (INTERNAL, DMSO, 0, 198.062)
##AUDIT TRAIL= $$ (NUMBER, WHEN, WHO, WHERE, WHAT)
$$ ##TITLE= Audit trail, XWIN-NMR		Version 3.5
$$ ##JCAMPDX= 5.01
$$ ##ORIGIN= Bruker BioSpin GmbH
$$ ##OWNER= she
$$ F:/spectra/data/she/nmr/P31/2/pdata/1/auditp.txt
$$ ##AUDIT TRAIL=  $$ (NUMBER, WHEN, WHO, WHERE, WHAT)
(   1,<2024-07-05 13:47:08.62 +0400>,<she>,<DPX200>,
      <created by zg, POWCHK disabled, PULCHK disabled
       configuration hash MD5:
       00 E9 B6 7A A2 85 ED C7 34 08 36 98 17 FE 4E 26
       data hash MD5: 32K
       74 B9 3A 32 DB 32 3C D3 F9 ED 2E F2 B6 14 83 BB>)
(   2,<2024-07-05 13:47:21.04 +0400>,<she>,<DPX200>,
      <Start of raw data processing
       efp BC_mod = 2 LB = 1.5 FT_mod = 6 PKNL = 1 PHC0 = 2962.448 PHC1 = -333.714 SI = 64K 
       data hash MD5: 64K
       2C 47 91 CB 27 AC 91 E1 FE 2E D2 02 33 2C C1 E3>)
(   3,<2024-07-05 13:48:02.17 +0400>,<she>,<DPX200>,
      <pk PHC0 = -172.6538 PHC1 = 431.7997 
       data hash MD5: 64K
       3B 27 83 17 E4 38 A5 4D F9 44 BA 99 E2 35 B0 92>)
(   4,<2024-07-05 13:48:06.67 +0400>,<she>,<DPX200>,
      <abs ABSG = 5 
       data hash MD5: 64K
       47 11 47 C5 9B 6D 88 1C 3C D1 13 59 79 D3 03 E4>)
$$ ##END=
$$ 
$$ hash MD5
$$ 5E 41 CC 76 A9 D2 88 A8 B1 4A 3F 77 92 9F 4C EB
##$RELAX= 
##$RELAX= 
##$RELAX= 
##$RELAX= 
##$RELAX= 
##$RELAX= 
##$RELAX= 
##$RELAX= 
$$ Bruker specific parameters
$$ --------------------------
##$DU= <F:/spectra>
##$EXPNO= 2
##$NAME= <P31>
##$PROCNO= 1
##$TYPE= <nmr>
##$USER= <she>
##$AMP= (0..31)
100 100 100 100 100 100 100 100 100 100 100 100 100 100 100 100 100 100 
100 100 100 100 100 100 100 100 100 100 100 100 100 100 
##$AQSEQ= 0
##$AQ_mod= 1
##$AUNM= <au_zg>
##$AUTOPOS= <>
##$BF1= 81.014009
##$BF2= 200.13
##$BF3= 200.13
##$BF4= 200.13
##$BF5= 200.13
##$BF6= 200.13
##$BF7= 200.13
##$BF8= 200.13
##$BYTORDA= 1
##$CFDGTYP= 0
##$CFRGTYP= 5
##$CHEMSTR= <none>
##$CNST= (0..31)
1 1 145 1 1 1 1 1 1 1 1 1 1 1 1 1 1 1 1 1 1 1 1 1 1 1 1 1 1 1 1 1 
##$CPDPRG= <waltz16>
##$CPDPRG1= <>
##$CPDPRG2= <waltz16>
##$CPDPRG3= <>
##$CPDPRG4= <mlev>
##$CPDPRG5= <mlev>
##$CPDPRG6= <mlev>
##$CPDPRG7= <mlev>
##$CPDPRG8= <mlev>
##$CPDPRGB= <>
##$CPDPRGT= <>
##$D= (0..31)
0 1 0 0 0 0 0 0 0 0.06 0 0.03 2e-05 3e-06 0 0 0.0002 0 0 0 0 0 0 0 0 0 
0 0 0 0 0 0 
##$DATE= 1720172827
##$DBL= (0..7)
120 120 120 11 120 120 24 19 
##$DBP= (0..7)
150 150 150 150 150 150 150 150 
##$DBP07= 0
##$DBPNAM0= <>
##$DBPNAM1= <>
$$ [...]
##$SUBNAM3= <"">
##$SUBNAM4= <"">
##$SUBNAM5= <"">
##$SUBNAM6= <"">
##$SUBNAM7= <"">
##$SUBNAM8= <"">
##$SUBNAM9= <"">
##$SW= 400.765351723535
##$SWIBOX= (0..15)
0 1 3 0 0 0 0 0 0 0 0 0 0 0 0 0 
##$SW_h= 32467.5324675325
##$TD= 32768
##$TD0= 1
##$TE= 0
##$TE2= 300
##$TE3= 300
##$TEG= 300
##$TL= (0..7)
0 120 53 12 22 120 120 120 
##$TP= (0..7)
150 150 150 150 150 150 150 150 
##$TP07= 0
##$TPNAME0= <>
##$TPNAME1= <>
##$TPNAME2= <>
##$TPNAME3= <>
##$TPNAME4= <>
##$TPNAME5= <>
##$TPNAME6= <>
##$TPNAME7= <>
##$TPOAL= (0..7)
0.5 0.5 0.5 0.5 0.5 0.5 0.5 0.5 
##$TPOFFS= (0..7)
0 0 0 0 0 0 0 0 
##$TUNHIN= 0
##$TUNHOUT= 0
##$TUNXOUT= 0
##$USERA1= <user>
##$USERA2= <user>
##$USERA3= <user>
##$USERA4= <user>
##$USERA5= <user>
##$V9= 5
##$VALIST= <valist>
##$VCLIST= <CCCCCCCCCCCCCCC>
##$VD= 0
##$VDLIST= <DDDDDDDDDDDDDDD>
##$VPLIST= <PPPPPPPPPPPPPPP>
##$VTLIST= <TTTTTTTTTTTTTTT>
##$WBST= 1024
##$WBSW= 4
##$XGAIN= (0..3)
0 0 0 0 
##$XL= 0
##$YL= 0
##$YMAX_a= 17429
##$YMIN_a= -2671
##$ZGOPTNS= <>
##$ZL1= 120
##$ZL2= 120
##$ZL3= 120
##$ZL4= 120
##$ABSF1= 198.0616
##$ABSF2= -202.7028
##$ABSG= 5
##$ABSL= 3
##$ALPHA= 0
##$AQORDER= 0
##$ASSFAC= 0
##$ASSFACI= 0
##$ASSFACX= 0
##$ASSWID= 0
##$AUNMP= <proc_1d>
##$AZFE= 0.1
##$AZFW= 0.5
##$BCFW= 0
##$BC_mod= 2
##$BYTORDP= 0
##$COROFFS= 0
##$CY= -3
##$DATMOD= 1
##$DC= 0
##$DFILT= <>
##$DTYPP= 0
##$F1P= 0
##$F2P= 0
##$FCOR= 1
##$FTSIZE= 65536
##$FT_mod= 6
##$GAMMA= 0
##$GB= 0
##$INTBC= 1
##$INTSCL= 9.790993e-09
##$ISEN= 30
##$LB= 1.5
##$LEV0= 0
##$LPBIN= 0
##$MAXI= 10000
##$MC2= 0
##$MEAN= 0
##$ME_mod= 0
##$MI= 50
##$NCOEF= 0
##$NC_proc= -10
##$NLEV= 6
##$NOISF1= 182.463
##$NOISF2= 159.3651
##$NSP= 0
##$NTH_PI= 0
##$NZP= 0
##$OFFSET= 198.0616
##$PC= 4
##$PHC0= 2789.794
##$PHC1= 98.08572
##$PH_mod= 1
##$PKNL= yes
##$PPARMOD= 0
##$PSCAL= 0
##$PSIGN= 0
##$REVERSE= no
##$SF= 81.0140089999434
##$SI= 65536
##$SIGF1= 159.3651
##$SIGF2= -187.1042
##$SINO= 113.3802
##$SIOLD= 16384
##$SREGLST= <1H.CDCl3>
##$SSB= 0
##$STSI= 65536
##$STSR= 0
##$SW_p= 32467.5324675325
##$SYMM= 0
##$S_DEV= 0
##$TDeff= 32768
##$TDoff= 0
##$TI= <>
##$TILT= no
##$TM1= 0
##$TM2= 0
##$TOPLEV= 0
##$USERP1= <user>
##$USERP2= <user>
##$USERP3= <user>
##$USERP4= <user>
##$USERP5= <user>
##$WDW= 1
##$XDIM= 65536
##$YMAX_p= 109346233
##$YMIN_p= -280552914
$$ End of Bruker specific parameters
$$ ---------------------------------
##NTUPLES= NMR SPECTRUM
##VAR_NAME=  FREQUENCY,     SPECTRUM/REAL,   SPECTRUM/IMAG
##SYMBOL=    X,             R,               I
##VAR_TYPE=  INDEPENDENT,   DEPENDENT,       DEPENDENT
##VAR_FORM=  AFFN,          ASDF,            ASDF
##VAR_DIM=   65536,         65536,           65536
##UNITS=     HZ,            ARBITRARY UNITS, ARBITRARY UNITS
##FACTOR=    0.49542278885378, 1,            1
##FIRST=     16045.7642231865, 0,            0
##LAST=      -16421.768244346, 0,            0
##MIN=       -16421.768244346, -280552914,   0
##MAX=       16045.7642231865, 109346233,    0
$$ Real data points
##PAGE= N=1
##DATA TABLE= (X++(R..R)), XYDATA
$$ [...]
8452 67090933 55032110 44388547 44853296 53458283 55734820 40992795 15283420 -5305173
8444 -5305173 -12702501 -11601535 -7385717 487794 10181596 13139384 5275783 -4937483
8436 -4937483 -7563793 -4854782 -5838176 -11950984 -16742372 -16707461 -13600125 -7575315 3484242
8427 3484242 17509319 27591434 28430007 19615791 4580725 -9102358 -11847957 -1234865
8419 -1234865 13035064 19513470 17839822 15314784 15130740 16517071 22394400 35558729
8411 35558729 48850999 50906059 42007156 32834959 26666397 15677914 -1646172 -12596171
8403 -12596171 -7205063 6428194 11950337 3576569 -11369800 -23067169 -26377855 -22200270
8395 -22200270 -16926980 -17002822 -21041381 -21837808 -17623472 -14427127 -15381870 -16518211 -16709960
8386 -16709960 -21927811 -33507440 -41111827 -35097644 -19268150 -4768008 2188719 1048502
8378 1048502 -6277259 -12721268 -9078932 2547820 7523195 -567400 -8330861 -2577542
8370 -2577542 8797848 9709968 -245037 -11309413 -24123347 -44347996 -61905844 -58728720
8362 -58728720 -37920408 -23223457 -25282897 -29400213 -23778562 -18887591 -26438187 -36764401
8354 -36764401 -33502962 -19108817 -9173779 -8340550 -7292027 -403252 7021369 8741894
8346 8741894 4727596 -2119478 -9206433 -14338578 -17876895 -23535664 -32450622 -38768507
8338 -38768507 -35975757 -25324462 -13527388 -4747327 949317 4729475 9537774 19768984
8330 19768984 34355462 43051040 36209747 16983180 -1710608 -10962425 -11299739 -6187156
8322 -6187156 2854730 13603193 21223506 22092422 17775494 14021329 16264164 25054799
8314 25054799 34567963 36955121 29920305 19254895 13290677 16228275 26369578 37433016
8306 37433016 41427364 35000648 24678374 21327211 27161528 32364023 26713747 10389852
8298 10389852 -8352647 -21040955 -22784188 -14758294 -5987886 -6201728 -13531422 -16282733
8290 -16282733 -10389989 -6133111 -11705163 -19657447 -18448911 -9284190 -1148157 3979923
8282 3979923 9476533 13299340 11185075 6467970 4521261 1618827 -7138506 -12911682
8274 -12911682 -2896278 16049046 21891438 8489556 -5742512 -6057323 -394984 -610418
8266 -610418 -1730680 5323439 13284004 8944454 -2804546 -3243383 13720781 34921651
8258 34921651 48101827 54110256 56250141 51905454 42229992 39085065 51280917 68942284
8250 68942284 72048118 53970243 28486092 12178579 6779089 2284030 -8041611 -21674947
8242 -21674947 -33035663 -38583486 -35468609 -22615928 -7120507 -3403577 -18582003 -40800431
8234 -40800431 -49457483 -37591364 -18129526 -6797009 -5234403 -4488021 197153 4415517
8226 4415517 3341897 131489 3194866 16463234 34269591 46470405 47447236 38342539
8218 38342539 21825982 -355597 -22852885 -35577075 -32990928 -21848297 -13846305
8211 -13846305 -12343780 -12127152 -10033977 -7800586 -4911328 2006517 10223375 10208355 -921507
8202 -921507 -11895439 -9688677 4464943 17301940 19348889 13218029 7261490 5863903
8194 5863903 7192547 8118412 9042591 12102691 14604103 8655105 -7958840 -23585863
8186 -23585863 -23094249 -6757745 8611637 9185270 -2086777 -13234907 -16995717 -12891884
8178 -12891884 -3307074 6331338 9067558 4503736 1138764 4932743 10056884 7637417
8170 7637417 -311059 -3728906 618505 5357209 4419218 2039235 6786107 19849226
8162 19849226 32103589 32854569 21193736 7736653 3418356 7932185 12883894 14578124
8154 14578124 16744484 20556472 21249409 17922323 16920927 19279671 14457276 -3707866
8146 -3707866 -22518927 -24436798 -11575610 -3172705 -9416627 -20357177 -22930317 -17684439
8138 -17684439 -13760297 -15747408 -21420219 -27093905 -29925657 -28156398 -23086229 -18898401
8130 -18898401 -18162206 -19017953 -17612223 -11407880 -449550 11649581 18609356 17465598
8122 17465598 13554253 14909521 21278230 24095058 19213091 14011363 17386116 26185914
8114 26185914 27543281 14938720 -2601444 -9959000 -2414369 10712425 18335222 18728747
8106 18728747 16152500 11780895 4559618 -1694483 -761652 5861125 9646046 7813168
8098 7813168 6967533 10957594 14490500 14032460 15485177 23126259 29284452 24978841 14670902
8089 14670902 9849948 12088375 12631829 5980443 -5257810 -16307090 -22662734 -20218077
8081 -20218077 -11659317 -8483941 -17045871 -27162720 -25388303 -14827541 -9096336 -10771504
8073 -10771504 -10759683 -7117656 -8467327 -17502574 -25746312 -27300899 -25152115 -22100773
8065 -22100773 -17925916 -16376052 -21520943 -26631966 -21521785 -11435899 -11624632 -21634922
8057 -21634922 -24470258 -15017675 -7623986 -8292677 -2803797 14955372 25345557 11518337
8049 11518337 -12838048 -24274215 -22809458 -23025188 -25007531 -18345656 -6887527 -4867504
8041 -4867504 -11535828 -12134380 -3716245 772002 -3730946 -5030166 7503243 29086288
8033 29086288 48132754 56763479 50815581 31307918 8475379 -5324200 -7902191 -4808329
8025 -4808329 2134014 13225089 21785605 19953730 11056275 3050066 -6352460 -22086405
8017 -22086405 -33443565 -23978130 247158 14138974 9058989 2920043 8083291 12067034
8009 12067034 2696994 -7962199 -2196805 15345174 25938574 22870045 13078805 1416747
8001 1416747 -10472231 -16143643 -11304620 -4446664 -5618552 -8169596 2903673 25856461
7993 25856461 40760857 34728930 15430608 -3215658 -16694738 -26587294 -31773904 -29917887
7985 -29917887 -22562088 -13854070 -6844435 -2574753 517083 6332484 15761550 22140976
7977 22140976 18164465 7598698 2891877 9106383 17610789 19632861 18822440 23353472
7969 23353472 30453535 28427773 14287424 759876 1279580 13113230 21544249 19018931
7961 19018931 13375205 15226332 22944337 25403343 17082501 4174312 -5016556 -10063086
7953 -10063086 -15265003 -20207236 -19345822 -11565127 -4893087 -7085627 -13464547 -10913614
7945 -10913614 3369569 13823475 4816267 -16813271 -28390156 -20824261 -8810443
7938 -8810443 -6864590 -8407890 514363 16933232 25024279 18939146 6661965 -5787068
7930 -5787068 -18250943 -25472162 -19498226 -6264765 -3429670 -15326643 -24577980 -16647060
7922 -16647060 573520 11303204 13710392 15313272 16530164 12561045 5599580 2151734
7914 2151734 1385408 -3036029 -11888139 -20048621 -24253150 -23240761 -14603272 -560654
7906 -560654 7766848 2520983 -7795621 -8301835 1976956 11574579 16303894 23828900
7898 23828900 37272076 47565227 46728265 38201076 28729641 19074647 8716940 1896269
7890 1896269 1714293 3478723 713654 -5697144 -10344139 -12604531 -17028196 -25121624
7882 -25121624 -31867223 -31526502 -24048041 -14692291 -8890387 -7990739 -8622987 -5378736 4612957
7873 4612957 17934967 26176621 23813345 15644501 12831963 19174307 25631954 22987327
7865 22987327 15067096 11708004 12850139 11019880 7774987 12966239 24972493 27539328
7857 27539328 14132082 1229876 6120481 23209894 35267105 37726267 36549256 30334087
7849 30334087 12555412 -11814809 -28366602 -31077911 -25040806 -14526019 -2623321
7842 -2623321 1284616 -8447886 -17643956 -5748771 22668130 39412339 30601136 14104569
7834 14104569 11419066 20310391 26430589 26240212 24616229 21597432 15704177 12206238
7826 12206238 15474366 19561213 17381691 13181847 15357223 22282100 25499337 22649687
7818 22649687 17886481 13085158 6898434 -601638 -8761988 -17704031 -23763687 -20056743
7810 -20056743 -7558973 2107584 2139915 299236 4653370 9036451 4174639 -5045075
7802 -5045075 -6976145 -1597586 2581297 4804225 10145966 15235109 12652520 8461382
7794 8461382 18013240 41693930 60332509 59288938 43944354 27071974 14554236 9880846
7786 9880846 19306664 42067071 63814857 69571069 58775118 41768893 27421237 20054154
7778 20054154 21796476 29970805 36179507 34847331 29774546 27112422 25933348 21752668
7770 21752668 15596106 12376151 12202807 10299268 5359959 2068610 4251525 9680521
7762 9680521 12750896 9554048 254698 -10403459 -14694477 -7654615 6929626 18573511
7754 18573511 20205934 14849760 10350319 9269531 7859393 4768550 4913042 11049489
7746 11049489 16686904 14584340 9339258 11542508 19065522 16233064 -2826556 -21131701
7738 -21131701 -19113336 -174876 15540372 17485819 12001427 6590359 1314096 -3736875
7730 -3736875 -6021967 -8278531 -16345707 -25995287 -24652180 -11130201 -451349 -1526512
7722 -1526512 -3072993 7326912 21487378 22190587 8804234 -4317816 -10766400 -16780421
7714 -16780421 -23346596 -20582745 -5331832 9146899 9353664 -1727871 -12051702 -17075484
7706 -17075484 -20035066 -21657802 -20404791 -20584434 -29205626 -43342228 -50076050 -42941576
7698 -42941576 -30961183 -26026697 -27522806 -26606976 -21161315 -17100669 -16140864 -12505022
7690 -12505022 -4281776 1210020 -1115564 -4600380 -363472 8282158 9161024 -2985601
7682 -2985601 -21216437 -35610927 -40860751 -35655559 -22452576 -9117178 -3866918 -5964459
7674 -5964459 -6218374 1644238 14530374 25635513 31566606 33179768 34659321 42020244
7666 42020244 55825028 64508493 53406227 24171298 -2385247 -8501268 835246 5839975
7658 5839975 -4730059 -23588179 -35149774 -31017214 -17204727 -8605848 -13625717 -23434238
7650 -23434238 -21731712 -6186267 8306203 11581839 13329369 27498993 49298169 59665331
7642 59665331 49766938 30064363 15203177 9097083 6152576 -58924 -10930571 -20397141
7634 -20397141 -18432710 -2322751 16305134 21857470 12034035 -1023386 -6213135 -3688828
7626 -3688828 -17799 -579515 -7973845 -20976759 -32680354 -35479353 -30539920 -27591147
7618 -27591147 -33129049 -43059356 -48640375 -45395142 -34875083 -22540241 -15822035 -19449592
7610 -19449592 -29807664 -37154778 -35301488 -26429685 -16425476 -10034157 -10731369 -18948062
7602 -18948062 -28197693 -29047627 -20440124 -11952956 -11108726 -13534560 -10502172 -1724931
7594 -1724931 5658183 8409008 10809219 16734360 23492081 25758338 22656443 18147194
7586 18147194 15058707 11331822 3939334 -4868519 -9136225 -8145747 -9169178 -17455998
7578 -17455998 -27520540 -30322362 -26093527 -22285468 -20233565 -13239406 836805 14506560
7570 14506560 21739910 25515835 29031022 27149322 14242778 -4138883 -14854832 -10415954
7562 -10415954 5969971 25363562 38377947 39065464 29246431 17234164 8619153 1280612
7554 1280612 -7463396 -14193690 -15305021 -14508424 -17579507 -23748610 -29482134 -36317888
7546 -36317888 -45693710 -49264836 -35732324 -7711822 18090434 29132038 26980345 18359462
7538 18359462 6913217 -2509867 -1878930 10298647 23851896 28454382 25263315 20737256
7530 20737256 14014182 -1013682 -23172876 -41961511 -48938364 -45050709 -35151052 -20848304
7522 -20848304 -2450993 15284597 24405958 21616148 12043758 3077019 -3890237 -11989794
7514 -11989794 -19469934 -17724476 -2984947 14514727 20407060 13953057 8071509 10611353
7506 10611353 13874401 7020116 -7727701 -17718670 -15457480 -5826362 1047587 160476
7498 160476 -4541029 -4674287 3040348 11789159 13194142 10700096 16781606 33879272
7490 33879272 47551134 45865494 36900726 35916207 41772102 40451109 28925078 19170790
7482 19170790 17214392 15009437 8824711 9647756 25061523 43941097 52023944 52249924
7474 52249924 54936510 56133784 43501021 19825128 2212513 -2445027 -3426969 -4672140
7466 -4672140 4275304 27773273 50446076 55649494 45830587 32886589 19179564 2066952
7458 2066952 -11520070 -11623355 -2233441 3647423 3574269 5385219 9027749 5290192 -5929492
7449 -5929492 -12980358 -12478429 -15444116 -26042646 -30113002 -16208449 5165863 17079216
7441 17079216 20579648 27998662 38924790 40009892 26770986 10185014 556509 -2163800
7433 -2163800 -52850 8372934 20914626 28304449 23389680 8282178 -9690841 -23419849
7425 -23419849 -27238597 -20656233 -12100036 -10870757 -14109909 -10758362 -25466 5234979
7417 5234979 -2081500 -11998220 -13127230 -9913564 -14287898 -27115608 -38690852 -43233511
7409 -43233511 -42298352 -36347358 -23572275 -7320596 3962162 5733057 641125 -6722007
7401 -6722007 -12431763 -12091574 -4971846 746218 -4462142 -16544246 -18928220 -3023057
7393 -3023057 19074719 28372666 20772681 8324079 1732933 -28025 -1900511 -2792402
7385 -2792402 771425 5242575 2215468 -9159093 -18580989 -16969968 -7109706 3153478
7377 3153478 12921736 24643529 31740667 22593326 -146403 -15943494 -9623811 9687917
7369 9687917 20940093 16145376 4341281 -3915524 -5472419 -759256 8231428 15876623
7361 15876623 17305237 15529225 17358915 22605914 24510034 20213632 12837604 3420007
7353 3420007 -10294182 -25764015 -34841795 -33364913 -24538198 -11653309 4353305 18395313
7345 18395313 21664033 12859393 1899875 -1244396 4798386 16989507 31988344 42952073
7337 42952073 41962039 31231842 23590820 25980124 30444420 27435985 19239502 12493767
7329 12493767 5782442 -5761172 -19917828 -30952175 -38246726 -42354707 -38489754 -24569082
7321 -24569082 -10817763 -9560353 -17950254 -21518513 -13024043 1827434 14636697 20000366
7313 20000366 14286699 883757 -5526147 6515661 26651811 32437851 18886371 3849373
7305 3849373 762163 1535990 -5983425 -17273204 -19225800 -10404158 -1933455 -2297317
7297 -2297317 -9578878 -16207362 -15850331 -8405365 -1641184 -3842044 -12562228 -16730459
7289 -16730459 -12157048 -6518737 -4987049 -1062767 10803518 22761087 24235225 18735124
7281 18735124 18732795 27260971 35152970 34840034 27343604 16393244 4695771 -3246898
7273 -3246898 -2246218 7725287 21160841 32283973 37270688 34315336 27087599 25017912
7265 25017912 33189643 44230326 47247866 42137226 36946554 33960169 28891833 22843386
7257 22843386 22926635 28655975 29237481 19623375 10041086 13267980 29382613 48708203
7249 48708203 62967794 67277411 58149891 38524622 20810910 15723553 19173616 17899764
7241 17899764 7858021 -501104 3099117 15268804 23680001 21365885 12489070 5730777
7233 5730777 5435418 9305457 12494014 12771203 12122554 13781206 17643058 18851137 12043674
7224 12043674 -2133579 -15904718 -21878399 -21263263 -21546685 -25618335 -27642341 -22363531
7216 -22363531 -13894865 -9893192 -10062278 -7665062 -1924123 -1098869 -10752225 -25190738
7208 -25190738 -34108215 -32697700 -21605659 -2709935 18696028 31696700 28605805 16362497
7200 16362497 11712371 22309576 37804409 42765205 33788592 19593804 8335495 1415787
7192 1415787 -1802682 -1130911 408207 -3621471 -14504941 -23933845 -23239973 -13838547
7184 -13838547 -3188988 6206444 16602346 26123258 28987198 24774592 18822604 12538046
7176 12538046 3006540 -5824443 -3488870 9772247 17664840 8575786 -8271139 -17681391
7168 -17681391 -19587026 -21801251 -20566086 -6599832 13107589 19142523 7190584 -5780643
7160 -5780643 -7311284 -5270759 -11179420 -22484805 -30510607 -33634233 -32554758 -23428363
7152 -23428363 -7192731 3033251 -3641233 -19469880 -26956491 -19839185 -5529997 8657525
7144 8657525 20869054 29184010 31271990 28705164 23468565 12334519 -6437907 -22810452
7136 -22810452 -21848518 -2168409 20629914 30809451 26762438 17818232 12976037 14192974
7128 14192974 16266036 12444030 2855395 -4409757 -3898747 -476967 -795548 -1688318 4210466
7119 4210466 14009001 16012371 5867727 -7987064 -16334620 -18206101 -16236455 -11505033
7111 -11505033 -6038234 -3115212 -1721789 2935394 10484333 13626594 8953254 3214158
7103 3214158 4170428 10071991 12639023 6620765 -7070602 -23423022 -34771025 -34566487
7095 -34566487 -24432905 -14508120 -12664338 -16049255 -17162709 -15407234 -17531101 -27576732
7087 -27576732 -40808345 -48247015 -44912143 -33430870 -21074939 -13225354 -8945775 -3367518
7079 -3367518 5458575 13476801 15073990 9456929 1705171 -2170051 -1014996 670554
7071 670554 -1462646 -5294297 -4321835 2960848 9202565 6311597 -5469401 -19283300
7063 -19283300 -28686102 -29183835 -17559947 3212619 20505882 21086506 4616438 -16128639
7055 -16128639 -27781551 -25592426 -13567400 -1601293 353689 -7507294 -12607865 -5163884
7047 -5163884 7536378 10916924 3691397 -3109474 -5647394 -11325176 -21846361 -27334049
7039 -27334049 -22649160 -16157408 -15087514 -14186342 -7560011 -1249443 -4027799 -13736376
7031 -13736376 -22322943 -27832524 -32678293 -36190484 -37090984 -37303824 -35671926 -24931568
7023 -24931568 -3649919 15701829 20351893 13213451 6081374 3163219 1623913 2240158
7015 2240158 7302837 12111114 10780318 7807694 12347206 23174792 30366608 29635890
7007 29635890 23850091 13009319 -4398856 -21085545 -25382394 -17347458 -9034676 -7808192
6999 -7808192 -10960909 -17841694 -34126928 -59768099 -83355554 -93232654 -86613295 -66474796
6991 -66474796 -39429717 -18111960 -13635833 -21638796 -26498251 -23012086 -22153241 -30819775
6983 -30819775 -39342971 -37175073 -28719597 -22903765 -17164064 -4446593 10941240 17953365
6975 17953365 15875936 14452379 17846346 19535011 14846642 9720713 12933965 24129576
6967 24129576 33143286 30560334 18239300 8559567 11121604 21202202 26054265 22109970
6959 22109970 18257352 20052148 20132459 10556208 -3258839 -9757595 -7264586 -3482148
6951 -3482148 -2266572 -815875 634203 -4116857 -17845393 -33945120 -43034526 -42155475
6943 -42155475 -35717831 -29762588 -26204701 -21302115 -10216233 5829955 19021997 23671001
6935 23671001 22749273 22341561 22079196 16037594 2794545 -9778418 -11344515 760650
6927 760650 18524468 29764282 28393840 18874670 10068986 6017159 5119162 6056395
6919 6056395 8689944 9345069 2372402 -11254448 -22984377 -26881836 -24828482 -19549432
6911 -19549432 -10348093 444628 5452586 2767429 574791 4244565 6844814 1319654
6903 1319654 -5698683 -3587547 4663834 7335144 2929433 1116538 6189660 12369843
6895 12369843 15474839 16574469 13067783 -565201 -19701926 -29695550 -24527903 -15207034
6887 -15207034 -14357478 -22256908 -33683830 -47939315 -63677349 -72669740 -69038344 -59110966
6879 -59110966 -52515123 -47748194 -36271315 -18196925 -3916583 -217868 -3323780 -7143675
6871 -7143675 -11258323 -17689195 -24500132 -26282070 -19774674 -7924135 1070378 27447
6863 27447 -9768434 -18543513 -17875363 -9286407 -494483 4671471 8041105 9827581 5785208
6854 5785208 -5784918 -18312704 -22262991 -14985929 -2625803 6929505 10353596 8475829
6846 8475829 2905204 -5003328 -13366414 -20186259 -24432353 -25582706 -22865692 -16629844
6838 -16629844 -9610579 -4333435 278712 6497075 12001586 10852880 1803213 -8835763
6830 -8835763 -15657534 -21442859 -31602283 -44265806 -51088045 -46841756 -34088581 -19258405
6822 -19258405 -7648467 -916974 4285737 13906006 29018463 42306936 45669087 39306013
6814 39306013 29529416 20769620 14693874 13191039 15113673 13591869 5308361 -570504
6806 -570504 6489762 20024659 22326399 9734006 -1826617 -858609 4444543 2915049
6798 2915049 -932651 2972871 11250065 12212793 4541502 -2435819 -3980590 -3190553 -1065495
6789 -1065495 4472933 10182179 9846974 5464463 4690915 6590801 3138743 -2335929 6485924
6780 6485924 33651590 57213683 54021084 30206321 12482224 13167881 19254378 16309372
6772 16309372 7195929 913831 -3803391 -12827451 -22737795 -24909157 -20007493 -16861596
6764 -16861596 -17810782 -16392051 -10695463 -7565447 -9883802 -11011841 -8319978 -11425380
6756 -11425380 -27130536 -44936247 -49786378 -42798189 -35420859 -27907357 -11136905 10352122
6748 10352122 16563186 40235 -20614995 -25681951 -19784611 -19758976 -27374305 -29761216
6740 -29761216 -21949397 -13278166 -11369001 -12773455 -12270290 -11117510 -11529132 -10054899
6732 -10054899 -1715005 12248796 23710270 23706081 9488630 -12100653 -29026815 -34330703
6724 -34330703 -31149285 -26226125 -22137274 -19320870 -20904471 -28265997 -33760806 -26054106
6716 -26054106 -4671774 15936751 19556080 3533438 -19358632 -32545537 -29669669
6709 -29669669 -18962022 -13707414 -18936492 -29790326 -40663225 -48671127 -48353943 -34390149
6701 -34390149 -14611315 -8585307 -23495426 -40879515 -39146404 -21059912 -5133449
6694 -5133449 2360779 8860878 13910988 7709615 -7390976 -15130539 -11283048 -12182266
6686 -12182266 -28069240 -45406978 -47996864 -40360421 -35232525 -30863758 -18796682 -5124280
6678 -5124280 -3735885 -11803996 -11583887 2141291 14095390 12631632 6151908 7196949
6670 7196949 12699447 11575329 4273991 1834399 7427112 10473536 2038544 -12122622
6662 -12122622 -19217281 -15365567 -7720394 -2760309 621050 5470108 10813035 14707005
6654 14707005 17747022 18754024 12125092 -3638410 -18812393 -22619448 -18083595 -16402927
6646 -16402927 -17179046 -7043684 18017882 41134333 43894477 29130241 14882409 10686423
6638 10686423 9575135 1945462 -10916785 -18394953 -11588890 7291694 24934576 28687596
6630 28687596 19912868 11837776 12636166 16665281 15656962 11252690 10150572 12627510
6622 12627510 13490562 10840444 7171056 4677414 4846564 8551609 11049560 2904325
6614 2904325 -15999218 -28996354 -19997536 4452588 21150861 17139025 616409 -14013030
6606 -14013030 -20645549 -19858958 -14455890 -11329543 -18878444 -36359298 -50847512 -49320293
6598 -49320293 -30676082 -4309969 18405930 29627772 27826460 18623294 9628411 2579472
6590 2579472 -6494032 -19086633 -30509108 -35126571 -31496653 -22402720 -14047862 -14179232
6582 -14179232 -24851255 -36824141 -37473853 -25321525 -10999255 -3356527 -1312160 -458728
6574 -458728 40275 253434 2591291 8136386 14346080 18781068 20430549 16116358 2232054
6565 2232054 -17104712 -30199906 -30420918 -24006468 -21835781 -27862849 -38397484 -47542163
6557 -47542163 -49908332 -43025932 -31117088 -22666892 -21272359 -22632524 -22104880 -19667358
6549 -19667358 -15374386 -6824926 5005370 13706927 15594983 14296948 13284047 10280745
6541 10280745 3946105 -461943 1833594 7913125 12824728 16719912 20060689 17810548
6533 17810548 6380131 -8175945 -16882827 -19219738 -20504052 -21867986 -20826115 -18395784
6525 -18395784 -17250285 -15535974 -10919062 -8023073 -12408670 -18834729 -15662193 -1290236
6517 -1290236 12969160 17373331 12339178 1208137 -16013517 -37377837 -54691782 -60202514
6509 -60202514 -54396338 -44016908 -34858416 -27877857 -19487791 -5032695 14923026 31923109
6501 31923109 37030413 30677158 21135091 14029205 8597812 4061140 3315358 8244654
6493 8244654 15888177 21354798 21766073 17093920 10444150 7021361 8697611 10203904
6485 10203904 5400227 -3217813 -6536374 -239743 11040910 20726069 25533863 23726369
6477 23726369 15085891 4543409 -36483 3843828 11436297 17948429 22483512 24249625
6469 24249625 21400890 15967445 14124449 18354273 23459920 22613685 13924519 482968
6461 482968 -11555579 -15074852 -8425622 -384540 -1810579 -11161041 -15865154 -9954500
6453 -9954500 -1763269 -535349 -3945237 -4367425 -288678 4542728 7176020 4952926
6445 4952926 -4687883 -17402537 -21076774 -9627669 6914531 14062757 10913485 8247761
6437 8247761 11219375 13004003 5994026 -7963430 -20281219 -24000043 -18300451 -7924036
6429 -7924036 985553 5805454 7686628 7084861 2794500 -3170419 -4696453 989935
6421 989935 8889536 12297774 9130980 -278932 -15419365 -31072850 -37052601 -29359689
6413 -29359689 -17265331 -12856908 -17293575 -23084236 -25331483 -24367450 -22065180 -22348546
6405 -22348546 -30081221 -41783090 -43354730 -26633309 -3051401 9896720 10967183 11622577
6397 11622577 14589922 11635254 2253373 -1794629 5430704 15352297 19926892 23285919
6389 23285919 31308194 39552350 39535330 30173543 16643983 3728627 -4871854 -6785808
6381 -6785808 -5001678 -5558124 -7603920 -2914183 10700647 23456487 26233376 21527841
6373 21527841 16147076 10868599 4479425 1014875 4440301 10675638 12081326 5922788
6365 5922788 -7042233 -26405311 -47669655 -60155141 -58015998 -48999671 -44064748 -42620516
6357 -42620516 -36846278 -26642731 -20111959 -20933723 -24564563 -26207344 -24468465 -18304697
6349 -18304697 -8567589 -1467500 -1917143 -4146476 2004545 15401565 23811740 21394555
6341 21394555 16651160 19276068 26621200 27818968 16496025 -3742248 -22398707 -28947089
6333 -28947089 -21172108 -8099234 -379542 2268878 8421742 20169097 29054547 28795255
6325 28795255 23951733 21846105 22710094 22902859 22335770 23103833 24616424 25073729 24885435
6316 24885435 24616217 22292706 16211276 7934632 241493 -4427810 -1820544 12024388
6308 12024388 32484114 45643282 41813552 26457138 12666073 6442867 4887380 4809034
6300 4809034 5399845 4385302 -181690 -3795484 1671082 17004479 32935473 40583455
6292 40583455 40222640 37418724 34538480 29588938 21461422 12945064 8072863 7533719
6284 7533719 7513575 3964121 -2119865 -5768456 -5086203 -4098539 -6358277 -9169131 -8130058
6275 -8130058 -4700658 -4196824 -7964352 -12983024 -18017082 -23838630 -27679878 -24893546
6267 -24893546 -17808413 -15578536 -21741459 -28607392 -28753826 -25626734 -25776946 -25928175 -17803446
6258 -17803446 -4499801 -1225991 -15698411 -35260630 -39841755 -24228697 -1634942
6251 -1634942 13084242 17284505 16608667 13797706 7363833 -581307 -2532027 4868988
6243 4868988 13977768 14677677 8323281 6663521 15730155 27312836 30011889 22903037
6235 22903037 12641091 2291532 -8275050 -13629440 -5678330 12205846 23490900
6228 23490900 16344207 -3507679 -22879374 -36681738 -45644958 -45316399 -29641741 -4384633
6220 -4384633 14670423 19470493 16539697 13414760 8279998 -1200515 -8043435 -4357584
6212 -4357584 5897683 12367222 13289622 14918978 17467317 13018034 -342479 -12800336
6204 -12800336 -16440657 -16303815 -21087024 -29370083 -33335308 -31694078 -29441084 -26745456
6196 -26745456 -18436386 -6010367 -543369 -8937120 -24202240 -34765488 -37489005 -35117806
6188 -35117806 -26814760 -11305746 3045221 3253723 -10463214 -21964182 -19721218 -11694489
6180 -11694489 -12224204 -21135581 -26186049 -22277977 -16349065 -13485249 -10038312 -3493968
6172 -3493968 1660672 3382707 7984442 19104163 28236329 25122316 12407515 1213186
6164 1213186 -3349195 -2673383 5042635 22393484 41064924 45403537 31511500 12999650
6156 12999650 3596076 3134185 5591978 11142802 21634934 30954982 30171429 19854198
6148 19854198 9096727 3493749 1204945 444040 3826300 13508947 26551659 37026845
6140 37026845 40669169 37580872 32604895 32043854 37112940 41437287 37803225 26345364
6132 26345364 13156879 2218939 -7469193 -17335405 -25813694 -30245331 -29739344 -25645788
6124 -25645788 -20572923 -16498940 -12908472 -8253177 -3864914 -3050682 -4532689 -1485637
6116 -1485637 8938610 19611136 22419492 19176121 16654303 14515710 7564518 -1508167
6108 -1508167 -2495931 7202162 17427288 18877370 13410921 6445955 -2065269 -12047758
6100 -12047758 -16021691 -7001480 9706901 21487868 23893525 22976710 22180301 15772468
6092 15772468 -445907 -17680087 -20123750 -2435037 22689356 36537445 32881179
6085 32881179 22352043 18380031 22093637 24021667 18152686 8722519 2582689 234932
6077 234932 -2808639 -9278158 -17537162 -23283750 -21870988 -11388782 4785273 20515243
6069 20515243 32346008 39324968 38359140 26504768 9646346 1141912 6906375 18034848
6061 18034848 23747466 25253708 29369359 34344946 32440876 23925258 17700470 17601718
6053 17601718 17627684 12965392 7557259 7047449 10194903 11287052 7670339 2472438 2013473
6044 2013473 10493305 24312079 33140156 30949587 23861754 21410578 23092299 22098532
6036 22098532 20022985 25898312 39308046 47146038 42217316 33872774 33271730 38145306
6028 38145306 40572986 40635635 41817773 40057027 29348441 14153192 5164072 5432236
6020 5432236 10561352 19153066 31516745 40322391 35607067 19694141 5130127 -3410841
6012 -3410841 -12563050 -23429151 -26063194 -17548660 -11808065 -20009177 -31112215 -25598519
6004 -25598519 -3206803 16739713 21105644 16415419 15295918 20800792 28511887 35503761
5996 35503761 40952865 42882204 40175613 35363927 31126908 26033906 17793722 9312132
5988 9312132 6962691 12264520 18819281 19370101 13893473 8540195 7572722 9017653 8832048
5979 8832048 6838420 6143300 7593836 7720195 3067434 -5367086 -13387677 -18112096 -19883308
5970 -19883308 -20540138 -21442426 -23174783 -25674979 -27572196 -25785689 -17335169 -2981952
5962 -2981952 11430503 19529185 21048225 21502633 23656196 22342524 11374385 -6506267
5954 -6506267 -21466486 -27774119 -28130104 -26731077 -23910298 -19664875 -17069290 -18669809
5946 -18669809 -23155985 -28184697 -32297105 -31551452 -20338412 -962000 12599426 7924691
5938 7924691 -11136064 -29429385 -37874335 -38664608 -35246980 -27034569 -15973340 -9153528
5930 -9153528 -9352415 -8569638 3006624 23990653 42102154 46332550 36388182 21857752
5922 21857752 14527869 20081593 34698340 49371015 57421910 57006764 48328639 33014117
5914 33014117 16846685 8103730 9828193 15969889 17494395 10942168 357289 -6594411
5906 -6594411 -3887808 7525846 17772655 15036201 -2960408 -26780199 -45536030 -55577127
5898 -55577127 -58061919 -54023446 -45890110 -38985539 -36156117 -33970116 -28719345 -22639330
5890 -22639330 -19085682 -15434233 -7707734 198227 -225438 -9844202 -19829766 -22537411
5882 -22537411 -18387660 -11382573 -4354495 -317307 -2041697 -7119423 -8670451 -4641950
5874 -4641950 -2354811 -9948030 -25926764 -40093838 -42561651 -30135357 -7662445 13567879
5866 13567879 22041051 15476703 3621759 -1159253 4552973 14666735 22306414 25697171
5858 25697171 26183232 24059389 17907945 7202486 -5046666 -12814423 -11770176 -3985852
5850 -3985852 3729153 6903363 6709929 5231999 719739 -9066689 -20700408 -26930691
5842 -26930691 -25332939 -21291852 -20310228 -20529228 -16894563 -11374066 -13145010 -26037836
5834 -26037836 -40825477 -45783533 -41891226 -39204452 -38474352 -27545868 -1379700 24729391
5826 24729391 32339087 23367603 13720017 7851135 -4255621 -24072603 -35822795 -28090409
5818 -28090409 -10336819 2120114 8403766 15629300 21634282 18907719 10704240 8321040
5810 8321040 13702171 17969708 16790244 13761288 7549836 -9622277 -35717227 -54275065
5802 -54275065 -54035599 -43212958 -35983826 -33701588 -29152177 -21691325 -15985122 -9960727
5794 -9960727 3128851 20865694 31066042 27044170 14439347 537266 -13910178
5787 -13910178 -27702303 -32846164 -23551899 -7175586 2269941 452382 -4438494 -5266637
5779 -5266637 -5189045 -10496947 -19961684 -26593247 -27497800 -26626697 -27788540 -29404983 -27711599
5770 -27711599 -21967100 -14376083 -7198355 -2571448 -3590489 -11987965 -24220722 -32439261
5762 -32439261 -31064556 -21915002 -12309962 -8591595 -11462383 -16395777 -17582911 -11963595
5754 -11963595 -871812 11162122 19543491 23140050 25547591 31311429 39076972 40091182
5746 40091182 27158324 5073068 -12103639 -15813597 -11182934 -8120886 -8750760 -8346333
5738 -8346333 -5336634 -3662093 -5727324 -9367089 -13091149 -18753373 -26257180 -29836359
5730 -29836359 -23245126 -6614982 14140370 32581296 44342898 47262693 42571335 35103943
5722 35103943 29293461 24987702 19613628 14603027 16759518 30896068 51943962 67362948
5714 67362948 69236498 62347243 57259790 56182524 50541224 34253423 13931742 973500
5706 973500 -2639080 -3983896 -6765746 -7353422 -4004659 -2138902 -6877141 -15993158 -23983172
5697 -23983172 -28313804 -27918316 -20685778 -8041724 1522882 -52432 -10414965 -19498115
5689 -19498115 -21902646 -22000487 -26130305 -33600470 -37328744 -31822641 -19365868 -8567161
5681 -8567161 -6692518 -13383040 -22382530 -28241437 -29075350 -24358282 -15080795 -6468306
5673 -6468306 -4392103 -6493213 -2771905 11083926 26760354 34824517 37023319 39469296
5665 39469296 38979927 27565030 9541719 2187797 14908603 35719992 44132636 33091971
5657 33091971 13781479 2050104 4200293 14126753 20697336 17870245 8835252 523344
5649 523344 -4240215 -6810751 -7023293 -2377335 6751928 15523012 19432977 17567120 11311156
5640 11311156 4111946 2001177 8292112 16861422 17217971 8204280 -118464 -843806
5632 -843806 1513412 1828360 4789369 15951781 28652345 30669702 21263473 11036739
5624 11036739 5524704 -414103 -10370473 -19197847 -22489201 -24360701 -29544503 -34589066
5616 -34589066 -34008636 -29704113 -26151726 -20425917 -7088088 8162293 10867665 -2656260
5608 -2656260 -17244480 -16941042 -5164102 1356548 -4029953 -9828981 -3441055 11293381
5600 11293381 19002651 12077420 -325371 -2716293 10663307 31263451 45469818 46409116
5592 46409116 37129692 24713450 13829166 5935379 1326290 -993339 -3725816 -7851919
5584 -7851919 -9509406 -4738470 2345769 1679953 -9604105 -20926779 -19909542 -7499362
5576 -7499362 3533168 3752851 -4157715 -11370478 -13099663 -12013057 -14534594 -24123562
5568 -24123562 -35913535 -38822251 -26133279 -3396740 17156554 28498457 30996281
5561 30996281 25144396 9917423 -10071755 -23118501 -21061410 -7914894 5455935
5554 5455935 12047593 11306829 5338598 -2215663 -5325567 1070004 15587508 30294039
5546 30294039 36624664 31269252 18032969 5466348 1121610 5696675 12394276 12493289
5538 12493289 1820225 -16679840 -34781839 -44467988 -44381630 -40328023 -37224213 -32916901
5530 -32916901 -24043628 -14779182 -12208092 -14298994 -12012528 -4767823 -3540179 -14258859
5522 -14258859 -27730878 -32453018 -28891869 -23466400 -16669954 -7041238 -95414 -1348845
5514 -1348845 -4306065 2593135 18529342 30713716 31649991 25781670 19290640 13776715
5506 13776715 10585915 10863197 9975895 2411208 -6014068 -2212653 14545699 28577799
5498 28577799 28575473 21375431 17919730 15987943 6915922 -7911879 -18352783 -19936022
5490 -19936022 -18165725 -20000747 -26924198 -34201485 -33084000 -18452100 1331882 8856869
5482 8856869 -1584109 -14755211 -14508286 -5911247 -5867988 -17239968 -26880607 -27673561
5474 -27673561 -26733899 -28690255 -25525312 -10738130 7018033 14023565 9258304 3610680
5466 3610680 4573423 8829715 8971936 2597814 -5291543 -6787604 1005893 11893863
5458 11893863 17114194 16155540 16442547 21251320 24502789 21309844 17162682 19717856
5450 19717856 25435088 22726595 8075004 -8098499 -13654446 -8078121 -1133916 -1273241
5442 -1273241 -8141843 -15440475 -18878234 -20292578 -23988926 -30345776 -35307608 -36389169
5434 -36389169 -36106230 -37523877 -38997918 -36391489 -29104205 -20905970 -15560669 -14158427
5426 -14158427 -15658824 -16966467 -13482344 -3856601 5305963 3884753 -10123535 -26202117
5418 -26202117 -31515553 -24123347 -13384565 -8263240 -8723471 -9402357 -8255727 -8117421
5410 -8117421 -10704242 -13334564 -13566558 -13835151 -17082475 -18626071 -8148378 16973642
5402 16973642 43931074 55237522 46788303 30717979 19525321 12425473 1194100
5395 1194100 -14242596 -23212782 -18429300 -6359971 1511051 4256760 11388005 27239706
5387 27239706 42741425 46334071 37810784 26225310 17781275 11979209 7659315 5795556
5379 5795556 5941340 5832612 5502575 6611294 7183206 3117872 -3889632 -6912764 -4771087
5370 -4771087 -5011672 -11745802 -18040865 -16880472 -13262523 -17096809 -28359280 -37786280
5362 -37786280 -39230390 -32857203 -19052869 616403 17239226 20155122 10771722 2044276
5354 2044276 2082730 6641538 9819724 12388930 15204055 13758814 5951086 -1969478 -4150786
5345 -4150786 -3816553 -6267275 -8942010 -6582144 -1969331 -2543894 -8263303 -10987837 -5760619
5336 -5760619 3489746 9268554 6893001 -2808698 -12458803 -12617155 -3247225 2400898
5328 2400898 -7055749 -24353909 -30685604 -18609600 1451873 17552825 28121241 34700781
5320 34700781 34012952 24356952 12248096 4723397 -117879 -7735744 -16522089 -20668031
5312 -20668031 -21415289 -26558999 -37314138 -42875092 -32578769 -10457918 6807425 7008155
5304 7008155 -4742463 -11989940 -5025132 9862335 20311527 23175865 25330162 31443371
5296 31443371 37803849 39495423 37342721 34081181 28119378 15921300 -911808 -14071010
5288 -14071010 -14037988 2167414 25542990 38166788 28112287 3864222 -11834590 -6284192
5280 -6284192 10032135 18526546 14690241 8637366 8163319 10125012 7994760 628578
5272 628578 -7788250 -11861128 -8482292 61752 6648368 6388965 2317308 711630 2744737
5263 2744737 5554627 9877717 20159126 36261781 50262402 53496764 44257811 28402588
5255 28402588 14672364 8138177 5569029 -157507 -7798168 -5039991 14771392 37825823
5247 37825823 43064530 29400582 17396731 21126476 30766277 29564713 17025289 5087968
5239 5087968 -1189698 -7043402 -14995522 -19814777 -17796602 -13099274 -12274386 -17251938
5231 -17251938 -25089311 -30622061 -28546177 -17217148 -2444237 5474189 1192285 -9810129
5223 -9810129 -16181965 -11927773 -2484039 1340943 -4035089 -10865590 -11283740 -9304072
5215 -9304072 -14883458 -27224662 -33788039 -28794919 -22185048 -23155618 -24682686 -15810666
5207 -15810666 -1993915 2065801 -2753369 622992 18190612 33347759 31154741 20566029
5199 20566029 19559909 27158553 26089529 10349520 -5831023 -9647723 -7195881 -11698657
5191 -11698657 -22609542 -25940903 -12702418 10546034 29577869 35712120 30302939 20029832
5183 20029832 9970200 349741 -10610511 -20851605 -23370327 -12971501 6872386
5176 6872386 26061201 36107543 34794251 24929587 12377676 4005518 2149256 258075
5168 258075 -10948532 -31213311 -49300401 -55703445 -51282846 -40636931 -24575617 -5790096
5160 -5790096 5132600 720546 -8740562 -3730849 19326706 41785173 45657343 33639272
5152 33639272 20789620 14793520 12851291 12297004 14106286 17289362 18378532 17470792
5144 17470792 18659827 23139248 26644712 25311579 20501130 16258133 14462847 13815736
5136 13815736 12233346 9587853 8368966 10578616 13400385 10477011 -396233 -13150722
5128 -13150722 -19744060 -18556368 -13591062 -7778270 -1504764 3305335 2472164 -6006719
5120 -6006719 -19223663 -31263648 -36534633 -33048122 -25089574 -20712829 -22930948 -24742846
5112 -24742846 -16807726 884303 18820525 28389490 28364894 22217562 14429848 9783777
5104 9783777 10842326 14162174 12946776 5494364 -1906940 -2086460 5371278 14504513
5096 14504513 18519167 14231328 3684981 -7216970 -13109105 -12941739 -9196708 -5099331
5088 -5099331 -4030623 -8511209 -15945408 -17881622 -8466086 7904201 22057487 30581853
5080 30581853 34439042 30158595 13114665 -9370825 -19853884 -11798221 -265916 -3781477
5072 -3781477 -21337062 -35852811 -36733645 -29682853 -24622482 -22599520 -18010548 -8705737
5064 -8705737 676794 4617763 3359596 2361612 5118211 8216905 5920784 -1109559
5056 -1109559 -5519419 -2477416 4938403 11546023 16959957 23105890 28393229 29498774
5048 29498774 27512159 27234441 30098940 32088795 30129711 27164196 28257524 33415085
5040 33415085 37317290 36190499 32134695 29164886 27345356 23896499 18812764 15323362
5032 15323362 14973945 16853467 21863176 31461095 40587781 39930528 29695874 22709117
5024 22709117 26689623 31872195 26353554 15726389 13319025 16358553 9358879 -9370132
5016 -9370132 -22290756 -16890905 567764 19467833 36168916 44876286 35509161 12033948
5008 12033948 -2400678 7754372 30467450 45428711 50458809 53758701 52657568 39931892
5000 39931892 23440884 18619891 24340840 24869560 14705901 4252540 1068311 2285187
4992 2285187 6535592 16838608 28824175 31114388 21225412 8482732 -1003685 -9412441
4984 -9412441 -16305306 -17344853 -15743610 -19313076 -23540346 -15156164 2629848 7395640
4976 7395640 -11431839 -36750435 -50131850 -56681593 -69003487 -81620313 -79834387 -64215869
4968 -64215869 -48083325 -36684436 -25351795 -13940428 -7433485 -4670274 -133989 5618719
4960 5618719 10089900 19421293 39672972 59701914 59603079 38102828 16392890 10966101
4952 10966101 16277168 18987624 15878674 10402361 3315277 -3581145 -2961190 8373204
4944 8373204 20669999 21842364 14106001 11312332 20693572 34980870 43286101 43036323
4936 43036323 38553157 32960399 26212945 19462056 16473093 18575434 20648074 15865988
4928 15865988 4687904 -4656378 -6939233 -7776498 -15879376 -28718264 -32455714 -19316083
4920 -19316083 -431262 4798834 -8288334 -23537197 -24072953 -13237494 -8514743 -16853432
4912 -16853432 -25922416 -22797975 -11561879 -4691154 -4302214 -2506192 3680297 9206250
4904 9206250 11211043 11442115 9290849 3710189 1252664 8821288 17862118 11447871
4896 11447871 -9403817 -23214245 -18483721 -9851925 -14223234 -27096417 -35112655 -36680739
4888 -36680739 -35078334 -25455137 -6531133 6971854 2859653 -7678119 -6741064 3393954
4880 3393954 10366387 16219518 26901877 29937285 13705118 -2276121 3348503 -519076
4872 -519076 -70660848 -195750100 -280552914 -254904091 -160044811 -89625553 -75837600
4865 -75837600 -78131381 -63193912 -43047412 -35048213 -30955668 -19159869 -5789839 745365
4857 745365 3688401 5053402 -1823767 -16362124 -24357045 -18049580 -8513952 -8693314
4849 -8693314 -16625672 -23886168 -28583978 -31380874 -29609305 -23925400 -21145308 -22965486
4841 -22965486 -21764268 -14952791 -12504302 -20800931 -29258747 -24688243 -11324392 -4443123
4833 -4443123 -9470639 -19526381 -30015632 -42713924 -55283032 -58235306 -46163479 -25221930
4825 -25221930 -6213311 5313194 9820005 8734630 2547667 -6618726 -13635175 -14612928
4817 -14612928 -13033556 -17766017 -31294852 -43430049 -43233071 -35018411 -33532258 -42782358
4809 -42782358 -49701621 -42329113 -24869341 -9150432 413203 6078723 8030668 5104635
4801 5104635 255950 -2046156 -1045814 2787826 10733909 20490823 23573591 15730654
4793 15730654 5265288 2853385 7408639 10603591 10643160 10967799 9062095 -649969
4785 -649969 -13613235 -17894134 -12011278 -7982457 -13018757 -19584165 -19320735 -16711746
4777 -16711746 -20857924 -30685675 -36882074 -34899074 -29174548 -26438444 -29663595 -36774579
4769 -36774579 -41702443 -38695723 -28307979 -16867014 -8421844 -1015274 6936003 11386954
4761 11386954 7730114 -2384786 -13247410 -21557573 -27481751 -31626807 -33671135 -31963922
4753 -31963922 -23336469 -6941843 10658164 19545953 17857671 13503584 12033805 10107779
4745 10107779 5254692 3348438 8345541 11946989 4275476 -9603798 -15389419 -9732116
4737 -9732116 -3199088 -3288684 -6085857 -6758659 -7220779 -9164752 -9035912 -5381338 -3439034
4728 -3439034 -6877631 -11855632 -14886272 -19604099 -28579570 -34460967 -28387675 -14212682
4720 -14212682 -5359248 -7783545 -13594894 -13093838 -7275924 -5075818 -10591457 -16029845
4712 -16029845 -8995359 12101247 31938383 32617889 14570433 -3233991 -6291964 -48152
4704 -48152 2612283 578651 1433685 5240607 3987908 -4670225 -15183368 -25353847
4696 -25353847 -37277594 -45603358 -38811998 -17618292 704669 4539738 3335465 10874796
4688 10874796 23386173 27441840 22368487 19588370 22683283 22759670 13526161 -1943684
4680 -1943684 -19716631 -37149262 -45851145 -37378954 -19251014 -9952935 -12466638 -9104071
4672 -9104071 8711894 23443260 18797309 7590012 11156515 22766614 17799963 -4365360
4664 -4365360 -17342930 -9944255 -3445593 -15939473 -34482193 -39718085 -37405236 -43107301
4656 -43107301 -50371190 -40231332 -15541374 17615 -2998113 -8872216 -4554578 2792457
4648 2792457 3728539 3663645 10869188 21064593 25916571 26952334 29683248 31647183 27234984
4639 27234984 18624651 11893438 6922013 459744 -4817704 -3434789 3578077 10387842
4631 10387842 14404036 15539237 11585520 2516368 -4712520 -4993075 -5138793 -14682581
4623 -14682581 -29195888 -34443739 -26373145 -14851024 -6669777 2324415 14475729 21712844
4615 21712844 16162263 581670 -17346498 -32485751 -38493078 -27061026 -700054
4608 -700054 21328476 21611634 5624061 -6103507 -4140654 2490376 4131508 3184242
4600 3184242 5343349 8711753 8904738 8373916 12337652 18447606 18381871 9392687 -2555190
4591 -2555190 -12459183 -22692027 -36108871 -47635994 -48378901 -36181013 -17196937 1481770
4583 1481770 15268639 19675346 12696039 1512863 -1343642 6625672 12847733 5841419
4575 5841419 -9442190 -19614655 -21140666 -21829664 -27125302 -34029149 -37418449 -34403187
4567 -34403187 -23913549 -9864091 -2178875 -5239134 -8326980 256753 11656529 4752316
4559 4752316 -22144697 -44600250 -43285956 -26623468 -13500216 -7593568 -658777 9970059
4551 9970059 20155014 27306012 29126834 22185049 11710982 12617481 28777257 42142195
4543 42142195 36846524 22864491 17967954 17443671 5326992 -11561414 -9134309 14057525
4535 14057525 30423913 23396471 8488344 4107214 5140904 391730 -4297987 713185
4527 713185 7399306 1696295 -12673611 -19552680 -12889510 972175 16563380 29791969
4519 29791969 31713733 18098343 1153478 -3708228 462639 -1076247 -9544005 -11508521
4511 -11508521 -2810941 4016628 -20579 -8103074 -11255212 -11256342 -13087608 -15162771 -14373216
4502 -14373216 -12737435 -12670366 -12326607 -10617183 -10162710 -10832031 -7439503 1298916 8413353
4493 8413353 8429204 5022734 3936580 4995312 6619439 10831826 16420318 14088677 -1759262
4484 -1759262 -20763373 -26681947 -18082463 -8907641 -8214753 -9667285 -4760433 2325837
4476 2325837 380223 -12453988 -25624769 -29802772 -27802142 -28912541 -35801417 -41883590
4468 -41883590 -41106811 -34896853 -27428843 -19724634 -13294763 -14262240 -25166882 -35151402
4460 -35151402 -29286896 -9339801 5486481 3245386 -5160640 -2320248 12332100 25276260
4452 25276260 28771251 26545199 23053724 19084398 17552435 22096243 28089597 25619064
4444 25619064 14720249 7767956 11848981 18006715 14911815 5415664 721280 3568770
4436 3568770 7058658 7353916 7443068 8383853 6306381 522250 -3313990 -1941517 241040
4427 241040 -324144 1856479 13926913 31748959 42011830 37702525 25065729 13302556
4419 13302556 3598901 -7159553 -16629326 -18287445 -11638455 -4234803 -1659515 -1202957
4411 -1202957 1283903 3610171 1696141 -2191651 -2853065 -1822482 -5140210 -11163856
4403 -11163856 -10426356 -1616429 2094832 -8911482 -23716936 -23779631 -9567101 -805617
4395 -805617 -8806812 -21940668 -24443559 -17734121 -13147646 -12507879 -9046926 -3048810
4387 -3048810 -2318515 -7369942 -10063107 -10067223 -18755717 -38753663 -51220758 -36321793
4379 -36321793 -851423 27561447 32765598 25011203 22277823 28339365 35177459 38136342
4371 38136342 39064924 38048639 31868122 21974030 16527134 20285989 26738547 25484518
4363 25484518 15800137 7419993 7160950 10159013 7812811 548071 -2572016 4442666
4355 4442666 17916699 28610424 27521539 9402434 -21498799 -48341590 -53572812 -38303694
4347 -38303694 -22114625 -18646584 -20302494 -14650617 -5740812 -5563962 -10906045 -6145466
4339 -6145466 11227557 24928728 23933612 17059590 16377911 19512367 18443578 15068762
4331 15068762 15803906 17716746 12172657 -1402019 -15297438 -23841222 -25463729 -18827106
4323 -18827106 -6466994 1763474 -408630 -4382303 2424872 16847737 23853416 19230916
4315 19230916 14190304 15357934 15004249 7202915 582238 5509214 17725949 24747778
4307 24747778 22622212 17161525 12498117 6956893 -1271454 -10521725 -16930615 -16308241
4299 -16308241 -7722326 2340777 4511510 -1164730 -3440885 4746344 15544149 17452299
4291 17452299 11327499 6914107 8204667 11566888 15215717 20637729 25705226 25339720
4283 25339720 18852043 9053248 -4598021 -23134132 -39123422 -40715379 -26408297 -7231367
4275 -7231367 7317771 16687534 21135303 17127080 6066199 -1689169 1031375 8099975
4267 8099975 8718442 1193996 -8036357 -14449054 -17551491 -16018463 -7834056 4819143
4259 4819143 14994682 15668187 4686131 -11614620 -19288724 -7879052 15741678 30894165
4251 30894165 25728583 10882399 4696462 10593013 17241864 16983194 14176396 15631946
4243 15631946 20757530 22734343 15243686 -1149257 -15768535 -14572145 4143128 24510954
4235 24510954 30411718 23689944 16407237 10130632 -3526402 -23131844 -34036619 -29125348
4227 -29125348 -19639410 -18558925 -24386568 -29134098 -31892681 -34615087 -33164816 -24250061
4219 -24250061 -15164776 -14154561 -14635164 -2066986 23548613 43946646 44089640 28262608
4211 28262608 11776878 4872748 8631287 18972364 28390420 28591056 18136571 5790760
4203 5790760 1477468 5039084 8035794 5671333 2027063 2528104 5924529 7421678
4195 7421678 7204222 10329046 17124265 18922309 7944276 -10882845 -23340915 -21204597
4187 -21204597 -9649668 935380 5541254 5614271 4917562 7340260 14564482 22650601
4179 22650601 24693009 19887806 15730357 17783033 22252628 23510196 23761231 28329911
4171 28329911 35202368 37464763 34327951 31572602 31365272 29444679 23509069 17728500
4163 17728500 17373404 24375866 38713073 57740795 72716875 72760289 55883212 32023337
4155 32023337 12757229 1401060 -5837215 -13578462 -23808707 -34433449 -39613191 -35129174
4147 -35129174 -24254151 -14622181 -9294272 -5174446 595858 8290662 18667095 31417948
4139 31417948 40969296 41252972 33520265 19940889 -8519522 -62183114 -126490893 -162485279
4131 -162485279 -145392739 -92651733 -42742076 -15602126 -5663339 -3505265 -6178697
4124 -6178697 -9140470 -5394071 4146584 10738927 10582587 8679295 9126058 10204882 9869096
4115 9869096 8223014 4573183 -377464 -955943 5772979 10786138 3053698 -12002302
4107 -12002302 -17120714 -7807547 1429497 -633188 -7253606 -7965807 -4464866 -2672324
4099 -2672324 347394 9784081 20352150 21781818 13506965 4614502 1798500 4862094
4091 4862094 11102964 16789723 16846773 9884415 1574921 -2195749 -2387882 -2212322 -400694
4082 -400694 4572149 8644916 8352471 8431094 14710672 23321393 26212061 23820415 21885310
4073 21885310 18845092 9051867 -2274954 -1361615 13649851 27025905 25780339 15339089
4065 15339089 8587321 8777084 11383537 15113748 20976013 24640840 19730484 8228423
4057 8228423 364527 3469661 15548972 29511606 39136382 40684844 33062309 18568278
4049 18568278 2282154 -10217750 -15385284 -14219919 -12716966 -16634439 -24171622 -27125407
4041 -27125407 -21637317 -14195473 -13384367 -18832056 -23092172 -22368497 -19657886 -17556204
4033 -17556204 -13918477 -7038509 -1015640 -2121874 -10958033 -21053388 -25427084 -22620143
4025 -22620143 -15535014 -6470987 3612905 11104153 9643971 -2318479 -16595933 -22974524
4017 -22974524 -20912484 -18241737 -18773762 -18244812 -14077621 -11214730 -13823727 -18272565
4009 -18272565 -20621951 -24842245 -35289968 -45803860 -46431009 -38539177 -32114718 -28237480
4001 -28237480 -16622254 5679379 24767274 26874357 16835617 10668720 14857534 22007974
3993 22007974 23895278 19482988 10857695 277198 -7017340 -4477683 7850032 21647676
3985 21647676 28807977 27623476 19498509 5598731 -9522552 -16250605 -8141482 9678478
3977 9678478 25098035 31634254 33124853 36548369 43708442 50204194 49928946 40363792
3969 40363792 25410350 12606415 5603022 506680 -7756451 -17129074 -20650885 -16212009
3961 -16212009 -8974820 -3533008 947188 6087157 10474087 13713039 19099187 27836743
3953 27836743 35210523 37838773 40328039 47792567 55381308 54157388 45775456 41047869
3945 41047869 42820132 41062075 29321920 15988637 11651816 13192352 10185421 1872898
3937 1872898 -3405688 -3559242 -5778283 -12706127 -16297237 -10277338 -538564 3363175
3929 3363175 1396094 442229 1811925 -784157 -10970561 -24171675 -34466157 -42028762
3921 -42028762 -49981772 -56300924 -53334134 -36393664 -10702518 11796915 21979233 19040602
3913 19040602 7958632 -5332253 -15398081 -17823586 -12848668 -7931809 -11952703 -24708268
3905 -24708268 -35103147 -32624882 -19178995 -6883463 -4777363 -10305693 -14172463 -11230220
3897 -11230220 -5168105 -3626080 -10290613 -21511233 -29071720 -25955263 -11583280 6394410
3889 6394410 16783778 14946822 8660674 9919903 19222912 22876776 10290540 -10268008
3881 -10268008 -20345158 -14101565 -4123467 -3289005 -9452756 -12626170 -9969236 -6140098
3873 -6140098 -3052876 1934345 8040392 8738590 -281079 -15103538 -27426143 -31741014
3865 -31741014 -28159293 -21220098 -16687251 -16571236 -16389475 -10122094 1178619 8712342
3857 8712342 5572010 -5264554 -14541971 -16651991 -14010219 -12791601 -16654783 -24707326
3849 -24707326 -33741463 -40940006 -44406964 -42750790 -36473102 -29994197 -29501454 -36583927
3841 -36583927 -45499139 -48884943 -44804551 -36101436 -25335419 -14671639 -9369261 -15180116
3833 -15180116 -30150318 -43319902 -44859395 -35505881 -23811127 -16025152 -11119000 -4723315
3825 -4723315 4188627 10787795 8496490 -3385422 -16489149 -20043806 -11362230 2039569
3817 2039569 10758584 11434710 6471587 -108334 -4543655 -4312210 -371980 2745100 890714
3808 890714 -6461508 -16892028 -26084803 -27871468 -18196523 -2189559 7135241 2704888
3800 2704888 -6242621 -3643740 13519756 30630701 32924782 22782548 14928754 16617948
3792 16617948 19184601 12085910 94037 -1322420 12054942 24754926 21006486 6078932
3784 6078932 -1004460 7448905 21320698 30705325 37127127 42762804 41580252 29989074
3776 29989074 16364232 9575925 5898388 -1426786 -6803393 -435482 12402006 15542492
3768 15542492 4792994 -7693773 -12873912 -14184722 -14578561 -9196729 2455915 10059532
3760 10059532 6852668 -48932 -2500902 -4528204 -12243136 -19230902 -14753810 -1567733
3752 -1567733 6950024 5538798 2249060 5476959 14718618 24128258 27969826 23232318
3744 23232318 13414669 8064453 11768348 16045826 9896240 -4436356 -15400474 -19090688
3736 -19090688 -20891735 -21389833 -14186553 -148097 9530113 9870738 9685139 15454253
3728 15454253 19065514 11527203 -710107 -5623702 -5176817 -10706018 -21403712 -22523195
3720 -22523195 -7951846 7894062 7354381 -9252293 -26801911 -34865773 -36747684 -40644120
3712 -40644120 -47932948 -51707303 -44389850 -25970210 -5682264 4886823 1592532 -9508339
3704 -9508339 -19542240 -25289474 -28485156 -28625868 -21394347 -6278076 8334656 12982685
3696 12982685 9344708 8872228 17254044 25619691 21666804 5535765 -11449621 -21306631
3688 -21306631 -25296644 -26243106 -23810471 -19629237 -18575614 -20058332 -15187717 691858
3680 691858 18076994 23673797 17207695 9953479 8656010 9152909 5510740 -2260735
3672 -2260735 -10367408 -14743567 -12521182 -6757469 -8587574 -25056683 -44115138 -43672629
3664 -43672629 -20355082 2418268 3312255 -10411355 -16898601 -11845067 -10831778 -22519687
3656 -22519687 -36547099 -41454821 -40140218 -40444993 -41913586 -41391724 -43415577 -53631096
3648 -53631096 -65836124 -66622902 -52949505 -36553874 -29193137 -29883991 -29322225 -22430204
3640 -22430204 -13230028 -8818660 -10421616 -11032672 -3221086 10757895 20192486 18879269
3632 18879269 12044397 6691539 961873 -9634762 -20043629 -20155326 -10320171 -1583684
3624 -1583684 632358 1792559 3866105 -2043037 -20661598 -39742741 -43010991 -30493487
3616 -30493487 -16184223 -9696454 -10080971 -14203057 -19671068 -20275241 -10013150 6276255
3608 6276255 15498777 11782915 1426519 -8579100 -17036943 -21139315 -14318834 1808134
3600 1808134 13271203 10875564 4477196 9849195 25927887 36145541 30663776 16716795
3592 16716795 6146269 2162326 1315516 890205 -43943 -1970748 -3362649 -1023101
3584 -1023101 5144672 10389918 10211844 4692228 -3417556 -11320527 -15152710 -10788837
3576 -10788837 550380 10608964 12541122 9356258 9253385 13098317 11865753 -1304260
3568 -1304260 -20260840 -30934382 -26387175 -13395888 -3335086 314097 2458071 6205217
3560 6205217 7337801 1074498 -9636953 -17071996 -18111370 -15369971 -9281903 4294902
3552 4294902 25490668 44870942 51939526 46492036 36353628 26183512 15134467 4772134
3544 4772134 975982 5011827 9619170 8796734 5870557 5811756 4801861 -3502893 -13792014
3535 -13792014 -12203361 4259379 21170404 24654738 18195905 14795868 18499959 22135003
3527 22135003 19715556 11993678 920678 -12512940 -23977777 -27195946 -22177100 -16354989
3519 -16354989 -15574995 -19048020 -24053360 -28985470 -29947588 -21889531 -6822066 6090909
3511 6090909 13126374 21590722 36831334 50457493 49801805 34808217 17427346 7447794
3503 7447794 6443340 11885200 18036313 15607006 1037760 -14776954 -17328921 -7699186
3495 -7699186 41971 602215 3096603 11974383 17456572 12963708 8448460 14453907
3487 14453907 23616259 22495260 14147470 12291879 16827664 13301812 -1814216 -12453269
3479 -12453269 -5513643 11918226 25741593 32917099 36171949 31234442 13502015 -7553474
3471 -7553474 -14899365 -4998112 8608011 13787620 11763783 8289523 3254259 -4886724
3463 -4886724 -11552577 -10368049 -1508667 10350327 23678115 39231342 52633566 54732965
3455 54732965 41867072 21899897 6999331 1841905 1203162 -1181583 -3702650 1019840
3447 1019840 14804624 27469694 25740958 8916421 -8677303 -13600859 -8524594 -7722668
3439 -7722668 -19402274 -37219240 -49039272 -49470211 -42344695 -34467422 -29587260 -27094244
3431 -27094244 -24500572 -20762547 -16971718 -13786940 -9986813 -4987536 -532439 2788401
3423 2788401 8050223 16367448 20698764 12239831 -5963110 -18626061 -15108290 -1910814
3415 -1910814 5707789 987671 -9501919 -15363497 -12385832 -4699170 -432492 -4178141
3407 -4178141 -11673699 -13864918 -7781593 -10615 2813946 2440630 4254414 8964639
3399 8964639 14489251 21802307 31786859 39295271 38560779 33185376 32158344 35713661
3391 35713661 33770511 20228563 697848 -16660612 -29681143 -37311064 -34562973 -19840054
3383 -19840054 -1920889 8575039 11971462 16273875 22840804 23652363 14107736 1166368
3375 1166368 -5358204 -5122798 -5881934 -11520062 -16438386 -13223755 -2782657 6170823
3367 6170823 7081087 2113494 -2050867 -2288274 -679205 -47878 -1216968 -4212515 -8778686
3358 -8778686 -12875087 -13189058 -8378485 -483975 7145457 11848178 11914527 7276666 450937
3349 450937 -5119168 -8270357 -10537952 -13697022 -18234223 -23372203 -26925505 -26447735 -22366437
3340 -22366437 -17741747 -12491895 -1730587 15137430 27449477 23473235 6454434 -7986292
3332 -7986292 -10942851 -7992424 -6511219 -5482222 -2646935 -2415245 -8968077 -17736376
3324 -17736376 -21391212 -19761498 -16733557 -11539621 -1024781 11920219 19633407 18486519
3316 18486519 11161320 2274682 -2969606 935308 13418765 23360079 18965403 2847518
3308 2847518 -9090265 -5231873 9908509 22209169 22410775 13712684 8069869 14511388
3300 14511388 28806902 37076906 32626685 24865567 26065464 33937669 35869430 27677970
3292 27677970 17925608 13652127 12182915 9559606 7662556 8540684 9311574 7929084
3284 7929084 8157176 13685507 21963671 28537656 33246638 37408787 38829452 35201750
3276 35201750 30157344 30474144 37490044 44807637 44737249 35429693 22425595 14257106
3268 14257106 15180361 21332463 25334141 24344072 20785662 15634116 6099448 -7952995
3260 -7952995 -19890270 -22660329 -17208363 -11530187 -12598459 -21029837 -31762968 -37727754
3252 -37727754 -34431337 -23540669 -11817345 -5480118 -5974659 -11095981 -18285407 -25743658
3244 -25743658 -31540973 -33102840 -28400416 -18617589 -9182874 -5300518 -5560098 -3737189
3236 -3737189 1117449 1441366 -7854705 -20188603 -25027425 -20398056 -11009145 866408
3228 866408 13312647 18325339 9932867 -3192069 -6621923 -1453102 -2121017 -11379825
3220 -11379825 -14183185 -2338715 11267287 12999738 8589258 10334461 16213211 16398696
3212 16398696 11752314 10676415 13801100 16431172 20898164 30955536 37553309 27009334
3204 27009334 3127320 -14720182 -17675866 -16841767 -22762338 -29495222 -26337223 -14828906
3196 -14828906 -5633187 -4926125 -10801775 -18885026 -26117661 -31563210 -36373065 -40521935
3188 -40521935 -39280782 -27871198 -10701850 -81164 -2542047 -10376502 -10084109 2410852
3180 2410852 16791761 18669523 5777236 -6945235 -3011017 14770521 27645809 27974568
3172 27974568 30174790 45064188 56445963 40840764 2938096 -28843532 -39150130
3165 -39150130 -37385004 -33567793 -26109680 -18029503 -21145427 -33617713 -34663945 -15369646
3157 -15369646 4105518 3959769 -5984198 -5413099 3010173 1931584 -8877948 -12823644
3149 -12823644 -4108045 6993037 14807663 23527619 31441077 29944727 21385817 19684680
3141 19684680 28398373 34554006 29912924 22911237 22508963 24436473 21914439 17484686
3133 17484686 14601758 8052545 -6441651 -20208061 -19160288 356501 29191997 54328304
3125 54328304 66262454 63973570 56822833 54821670 54046309 41168520 16304864 -1653224
3117 -1653224 -1116129 3752781 -5794105 -23539396 -27171482 -11610302 4995159 8952822
3109 8952822 7497173 12382161 20800127 21132730 9345429 -8058045 -22239722 -27248237
3101 -27248237 -21350395 -9070223 42396 -1060727 -10952679 -22332308 -28669072 -27777032
3093 -27777032 -21736632 -14372752 -6898946 3074488 14898266 19377776 6827651 -18535548
3085 -18535548 -39365378 -43497757 -35953547 -29586942 -29670298 -32204489 -32067579 -26725044
3077 -26725044 -15509253 -1732505 6361987 2770853 -8646618 -18282798 -21768553 -22570065
3069 -22570065 -24463072 -26079738 -23353609 -14356103 -2117426 5255562 120684 -14864616
3061 -14864616 -25612788 -21628097 -9990855 -6668046 -15140913 -23380548 -23137561 -20911428
3053 -20911428 -24557309 -29602809 -28173813 -24009430 -26933592 -35646642 -37458542 -25240937
3045 -25240937 -5121475 13632190 27271404 34142416 32169702 24841067 22521906 31510452
3037 31510452 46096404 56452180 60125728 60474470 58059821 50817171 41060112 35389880
3029 35389880 36862659 41661838 43925959 40460303 31159254 18713243 8079798 3041287
3021 3041287 3283674 7107117 14993266 26508069 35999744 37541830 33369621 30595080
3013 30595080 29486755 23270050 11711770 5611414 11937495 22210605 23994552 18584870
3005 18584870 17454828 23852841 28730032 25786350 20675096 21361954 26535649 28449690
2997 28449690 22735517 11608832 1200896 -1264337 8052286 24284408 36591448 39270748
2989 39270748 36126355 31240641 22027281 7138950 -5338954 -6939085 -2358192 -3374842
2981 -3374842 -10246855 -10354387 2512591 17934042 22636134 16151813 7186294 1480733
2973 1480733 -395206 700335 1182816 -5462945 -19692929 -29991453 -24084269 -4655557
2965 -4655557 13226493 19420152 16792600 12957390 11357524 11364726 10791263 6608043 -2011039
2956 -2011039 -10393788 -12462345 -8298510 -3208632 -50656 1897368 1427589 -3696205
2948 -3696205 -9605140 -7997437 2483160 13185028 16248904 12052630 3961191 -6256363
2940 -6256363 -14100362 -12008535 315760 11867101 13521958 10032806 12046938 20731595
2932 20731595 27498937 25555723 14910209 -1123673 -17560707 -27863136 -28471410 -22157597
2924 -22157597 -13512633 -4743033 793178 -2181641 -11547660 -15020801 -6408223 1477491
2916 1477491 -7461592 -27450887 -35191554 -19463251 6247831 22412233 22928228 13174056
2908 13174056 346845 -8933686 -10453497 -7382399 -7134473 -10561841 -11566377 -8862337
2900 -8862337 -8278430 -10663608 -8835780 -1444906 1958107 -2838362 -4660215 6653395
2892 6653395 22927939 28499711 21848653 14277675 11460198 8823604 3727183 695828
2884 695828 3346553 9528855 15796356 20638635 23094591 23095651 22152007 19564884 11218788
2875 11218788 -2502329 -11906871 -8339399 4304770 15928142 23659883 29538567 29246608
2867 29246608 16090898 -4383495 -16620034 -14326634 -6776587 -3156809 -1294216 3822980
2859 3822980 10207802 13592380 14559859 15160532 14071306 9842823 3960345 -2930472 -12492944
2850 -12492944 -23092620 -28393122 -25159163 -17459527 -10508840 -5855297 -4217829 -5316628
2842 -5316628 -2335208 13714416 38531629 52563784 42364735 16984032 -4563665
2835 -4563665 -15224418 -20607508 -24568694 -25517128 -23862858 -22279843 -19241217 -10922821
2827 -10922821 973671 10546975 15623664 17588598 15632662 8996455 2773647 2811088
2819 2811088 6334728 6449415 4116407 5241614 6911195 -873637 -17692874 -29443147
2811 -29443147 -27356697 -19210535 -15327178 -13604331 -6714387 4062136 11705241 14514126
2803 14514126 15146542 12654481 4421243 -6194238 -11963065 -10441188 -4952508 392945
2795 392945 1027219 -8210834 -25118168 -35547724 -27373926 -8148404 2045789 -3716177
2787 -3716177 -11980138 -10429245 -4653367 -6469124 -15636426 -23126506 -25546094 -25179834
2779 -25179834 -20323924 -8144920 4148585 4030776 -7884100 -15740742 -9892862 -130156
2771 -130156 -120724 -7884970 -12382404 -13042511 -19208999 -31799463 -39455205 -36138870 -30443114
2762 -30443114 -30832446 -31488428 -22430851 -7529192 -1253466 -8882967 -19631520 -21083231
2754 -21083231 -13268260 -5565363 -4656485 -8919550 -12238751 -10986600 -7911402 -9000943
2746 -9000943 -15321528 -19715843 -14418530 -253582 15236187 26659129 32888990 32445656
2738 32445656 23902781 11216140 1939124 -1079930 -197693 4873221 16827722 30776865
2730 30776865 34775759 25797682 15642204 13151893 9869144 -5075006 -22970286 -24030772
2722 -24030772 -6629020 7482200 1231014 -17046332 -27597503 -24130867 -16130882 -12908548
2714 -12908548 -14818579 -17806064 -18828224 -16934236 -14142053 -14886835 -20539562 -25389931
2706 -25389931 -22379081 -12472997 -4160766 -3102749 -5729853 -4334057 3694150 12919955
2698 12919955 15399005 9144706 1255921 946555 8578565 14542922 11501281 4217606
2690 4217606 2207047 5062779 2664328 -9120141 -20857804 -22221601 -16331480 -14720640
2682 -14720640 -21178674 -28108647 -28360868 -23327641 -17771805 -13515777 -11696367 -15081472
2674 -15081472 -22663801 -26752790 -22623566 -18083383 -24711833 -39885817 -47145279 -37900009
2666 -37900009 -24307384 -23931213 -37274898 -48593197 -46218713 -33922280 -22557829 -18306580
2658 -18306580 -21202598 -28738543 -36671662 -39603049 -34647401 -23898042 -12317147 -4738168
2650 -4738168 -4708752 -12461439 -22054848 -23439564 -10488578 13294139 37813834 54137341
2642 54137341 59268506 55526121 46716817 34773061 20641722 8317042 3960426 7231433
2634 7231433 7290966 -5199344 -23105463 -28510839 -15361930 1898342 6500855 -1365488
2626 -1365488 -9328182 -10320584 -7332434 -4702748 -3156169 -2508178 -2768319 -2779990 -2310279
2617 -2310279 -4077173 -9383723 -14144131 -14093163 -10899661 -7505891 -1376490 9937490
2609 9937490 20311612 22352614 21055699 27716526 39251964 37422796 14652148 -11149986
2601 -11149986 -17156108 -3440437 9917695 9079867 -412642 -5632868 -2326862 3571323
2593 3571323 5436142 3487088 3089644 6357994 7822457 1975647 -6615486 -7620481
2585 -7620481 -103786 5046323 1329186 -3537364 -256620 7680504 10859712 8466041
2577 8466041 5597941 1153344 -9485712 -21980744 -25802846 -20068226 -15269811 -17211430
2569 -17211430 -19672611 -15977359 -7809805 1580079 13433251 27094224 35402091 32624394
2561 32624394 21296562 6850562 -8009458 -19675253 -22947937 -20088404 -21942673 -31915406
2553 -31915406 -37040157 -25631706 -7204807 -2006042 -14468843 -30416131 -38774565 -41236961
2545 -41236961 -38870159 -25023651 860989 24406576 31797439 27296008 25662179 31651684
2537 31651684 36795380 34787946 30670375 32711912 41336271 49325523 50004419 42484394
2529 42484394 29890289 15106793 326899 -9728624 -8669616 3337988 15337815
2522 15337815 16648492 11420867 13539648 25533565 32935026 25011892 10804866 4930931
2514 4930931 5726989 807032 -10033310 -12924676 -2055716 10343353 11208220 2890293
2506 2890293 -4129151 -5842497 -4692225 -1860747 2448726 5409844 5128757 4492010 5924754
2497 5924754 6180536 2065976 -2773492 -3290522 -1500717 -2369187 -4536190 -3120576 715945
2488 715945 1783938 1054557 4297491 10332133 10767142 4193758 1161279 9583580 22120008
2479 22120008 24557257 12968126 -2684363 -9776027 -4229804 7556470 15279918 14254022
2471 14254022 8662649 3633119 -2994754 -14813201 -25166279 -22020246 -6462190 5174489
2463 5174489 3285082 -1949170 1936819 9712050 8702938 1145751 47121 5722028
2455 5722028 3919644 -10180343 -22259323 -20164147 -11861391 -12115403 -20424912 -23562150
2447 -23562150 -14889633 -265673 12815265 21638665 23910204 16732520 3043941 -8008601
2439 -8008601 -11414546 -12238761 -16927474 -22801567 -22354537 -16374563 -15396429 -25495382 -38267237
2430 -38267237 -40184918 -28973772 -14756595 -6558623 -5096629 -9155747 -19397997 -31058311
2422 -31058311 -32060442 -17724912 -1496311 95925 -9937969 -13696462 -4885577 3426451
2414 3426451 1175342 -2623817 4924475 19766430 26781780 20477210 8628106 -1250936
2406 -1250936 -8269343 -12468002 -13054289 -12845745 -15541938 -17348055 -9871990 6172630
2398 6172630 18005835 15356906 1840200 -11966726 -20838409 -25441748 -25734709 -20587099
2390 -20587099 -12123259 -4655406 892090 7576429 16750551 24423683 24577503 15521288
2382 15521288 2712019 -5119587 -3962820 1095724 941676 -7822229 -19606689 -25826909
2374 -25826909 -21699397 -7942504 9451490 19995163 15237561 -789638 -11546366
2367 -11546366 -4505803 13748919 24773378 20297094 10786862 10475033 20121076 28997798
2359 28997798 29434166 22802943 12563948 -935704 -15615465 -23258585 -16582932 -8614
2351 -8614 12475774 12369389 5519612 2843880 5859112 6799280 1560512 -4287650 -4189297
2342 -4189297 572310 4509784 5687125 4528555 -1587808 -15172113 -30623374 -36963188
2334 -36963188 -30927590 -21328738 -17047820 -16311308 -12873883 -7794666 -7308839 -11073000
2326 -11073000 -11276854 -4858529 1191179 495846 -3180480 -2760870 536336 -31345 -4159798
2317 -4159798 -2768340 9443253 25838833 35468698 34760910 28416425 22077160 18056023
2309 18056023 16254761 15091350 11932169 5904210 510087 987235 8550845 18679309
2301 18679309 24987174 23678939 15296658 4263230 -3900183 -7243142 -8988528 -12329752
2293 -12329752 -14563186 -10058323 484075 7699324 2895972 -12316375 -27661507 -33953333
2285 -33953333 -29834315 -20695921 -13100859 -9634325 -8008264 -5563916 -4090653 -7663405
2277 -7663405 -15614845 -21669779 -21814306 -18712669 -15363326 -9594941 -647037 3393246
2269 3393246 -5888584 -22102986 -27653051 -15665037 168993 2797940 -8190977 -20207320
2261 -20207320 -25221814 -25278303 -24143380 -22746255 -22187103 -23104086 -21563838 -12833314 -116606
2252 -116606 7366897 6081926 1093479 -3353972 -7536179 -8372877 2031384 24248123
2244 24248123 46224462 56684034 56312620 49236629 33509340 11072673 -2264152 6496754
2236 6496754 24851006 26924003 9160239 -4201550 3735746 19932713 24165590 18594295
2228 18594295 19220113 28494563 34437142 32360954 29796071 29719248 25032132 13596106
2220 13596106 5074011 6226710 9932959 6500277 -2003121 -6574939 -4301615 1545566
2212 1545566 9755541 20701587 30036082 31525791 26111163 21035624 19595475 18562864
2204 18562864 16658812 18038550 24307560 29901685 30205159 28569706 29114480 27397649
2196 27397649 16800397 2123411 -2864180 6955616 21269304 28451972 28630662 27540541
2188 27540541 25024470 18389919 12672322 16933457 30134569 39286022 33917290 16572737
2180 16572737 -2172388 -12991129 -11106637 1885902 15585483 16549795 2280475 -13663717
2172 -13663717 -14896200 1288731 22719773 34414747 29744365 13678588 -1814922
2165 -1814922 -8394065 -9226514 -12936406 -19697203 -20541904 -12896158 -7678312 -14297617 -25943305
2156 -25943305 -28607060 -19905389 -9815551 -5712417 -5442230 -3570341 3285887 15860106
2148 15860106 29744466 35298886 27319337 12937512 2899425 -1987375 -7561529 -13412618
2140 -13412618 -14117860 -10725774 -8392925 -3415540 13180149 36928402 48955724 38904130
2132 38904130 16917843 -2247246 -14511935 -19544291 -12593603 5372506 19888163
2125 19888163 18761435 9592452 9503666 21617274 32909856 32347503 20464775 3224015
2117 3224015 -12660564 -18768495 -10046605 6911188 18428858 18754170 14392191 12250740
2109 12250740 10321626 3505200 -6292417 -10858022 -5782472 2995152 4521336 -4895860
2101 -4895860 -16642693 -19545030 -12684353 -3878883 2513851 8414158 13086439 12088015
2093 12088015 8138324 11423336 22589706 26572491 12674265 -9139478 -23155370 -29757831
2085 -29757831 -38409133 -46426376 -41941556 -25020381 -9025557 -1009854 3670580 6294510
2077 6294510 657624 -12033861 -19185560 -14119129 -5104659 -881638 1383644 6890106
2069 6890106 12653960 13914999 12158453 9596180 4272649 -2225701 -1164928 10716332
2061 10716332 22681935 22898889 13232730 2804874 -6087952 -15661043 -22179271 -19102147
2053 -19102147 -7833031 4093556 12977977 18709675 18265990 9526832 -648120 -2480886
2045 -2480886 3399484 8397739 10854561 17305635 27511585 30160773 18973777 3854024
2037 3854024 -1571313 2347776 4011155 -1960421 -8070466 -5753672 2017248 3754611
2029 3754611 -6757202 -23396516 -35243312 -38189551 -36237650 -33513378 -30247058 -26845957
2021 -26845957 -25816660 -26734280 -24345045 -15636533 -4774113 2837820 7100505 9586449
2013 9586449 8603913 4154361 3141131 11415058 23234927 27005108 20223086 10889891
2005 10889891 5526139 4704882 9693748 22739676 38420420 44693629 37007842 23563352
1997 23563352 12741721 3815296 -4809724 -7332195 900779 12932962 17755524 14651034
1989 14651034 11067193 8830967 2338950 -9403205 -18172997 -16880044 -8054085 1104169
1981 1104169 7061304 10203100 11263293 11641274 14436470 20767502 26075705 24050936
1973 24050936 14948006 7181449 8567022 16921096 21942314 17546697 9918310 9645386
1965 9645386 16581550 18499674 8263318 -2762596 4294386 32372799 63101977 76456840
1957 76456840 69874608 55401682 44325286 40026309 41246663 44433190 43445900 33911787
1949 33911787 19835346 11271033 13227310 20171152 23322171 20219303 14903170 11491642
1941 11491642 10562927 10522775 10105802 9753850 11102622 14058014 14969980 10852114 5507418
1932 5507418 6737236 15714812 24552761 28035951 31916663 42941823 54915170 53682869
1924 53682869 35282304 10945661 -6636648 -14217803 -13866544 -7051932 2386031 6655518
1916 6655518 2220200 -4559273 -5963316 -3679962 -4766978 -9371859 -9935702 -3287268
1908 -3287268 2475379 -3723954 -22898551 -43112471 -49655273 -38843319 -22165915 -14967045
1900 -14967045 -20223639 -26249214 -21802718 -9544815 -1387293 -4295414 -15381997 -28022396
1892 -28022396 -36616398 -36516776 -26220899 -11463856 -2276586 -3360419 -9933684 -14242019
1884 -14242019 -13265844 -8689459 -2276014 6049059 16201488 25374031 27989931 19807900
1876 19807900 3878797 -8979991 -9024137 2578128 14941459 18746087 14357140 9013326
1868 9013326 8982168 15406757 25034515 32562904 33151596 25033352 11061701 -2390151
1860 -2390151 -9414114 -9095490 -6046154 -5114713 -6031458 -5318123 -2620107 -1407088 -3273993
1851 -3273993 -6135515 -9167696 -14290531 -20621140 -23325954 -21344871 -19812378 -19878344 -13268768
1842 -13268768 5135803 25285810 32874398 28899257 27257170 34009591 40400946 37592805
1834 37592805 27605258 16950355 9299682 8145659 17270275 33277043 45315817 47407155
1826 47407155 44313006 40940674 34199672 21759401 11177538 11571399 20795002 28797089
1818 28797089 30433229 27996719 24073522 18761070 11916458 2596845 -10977667 -25582495
1810 -25582495 -31044135 -20993633 -2478853 12111285 19522915 24445202 27635655 25583378
1802 25583378 20580101 19763496 22759646 21072431 12905979 8078912 12881635 19702326
1794 19702326 19354019 15813405 19025128 28235715 33210970 29922513 24389998 20434039
1786 20434039 14038092 3525913 -3668953 -901401 7169824 11568292 12558773 17434670
1778 17434670 25985610 27937400 17976529 5431869 3071309 11057293 18529713 18466260
1770 18466260 14340772 12858638 16456394 23807188 32059629 36325217 31424528 17601705
1762 17601705 2548412 -4796880 -2231339 4085978 5265843 -1819599 -10118152 -8849483
1754 -8849483 2785102 11780886 6393584 -8270432 -17331853 -16629421 -16168043 -22800962
1746 -22800962 -30776131 -33169500 -31955075 -30558159 -25849679 -15204471 -3503169 4989647
1738 4989647 14019009 25561206 30426691 20100536 2098322 -9017901 -11702762 -15267909
1730 -15267909 -20818452 -19442014 -9406278 -47277 4226080 9631069 18340263 22009697
1722 22009697 16844702 12567326 17329014 24189783 22934625 16752687 15634217 19383355
1714 19383355 19488520 14768436 13512895 20401815 30757799 38233865 40125375 34425726
1706 34425726 19573335 -367343 -15948417 -20457635 -14849451 -4532921 4920527 9327069
1698 9327069 7969625 4697378 3128941 1040793 -6206605 -17403410 -26225254 -30379001
1690 -30379001 -33809577 -38442753 -40315112 -37029833 -32881901 -31506613 -28180871 -16237072
1682 -16237072 669311 9425503 1953542 -15158071 -27070228 -24303881 -9126489 8725142
1674 8725142 20158604 21603074 14992360 5466560 -732375 1182723 10627470 20204894
1666 20204894 21792097 15968478 12254481 16798469 22603559 17278335 -57724 -15590585
1658 -15590585 -16610231 -5427338 6275394 12772029 17869454 24674767 28839658 24477662
1650 24477662 12294404 -1631717 -12588174 -19497036 -22452735 -22094621 -21201722 -22998491
1642 -22998491 -26358566 -25427223 -16509174 -4127363 2457979 -985258 -9048535 -13063855
1634 -13063855 -10235805 -5388618 -5020120 -11776503 -23928822 -37142766 -46156535 -47649640
1626 -47649640 -42954534 -35915309 -27769344 -18106659 -11897749 -18582410 -38221571 -53971923
1618 -53971923 -47924864 -23273192 -1555627 2578877 -5748541 -15606832 -25073372 -35086495
1610 -35086495 -38683934 -28212748 -9154708 4278292 6744326 6086609 9624867 14232393
1602 14232393 12335298 1828577 -12581528 -23906326 -27115381 -22386326 -15534811 -12601759
1594 -12601759 -13460012 -12882774 -7111921 3306712 15425040 24684186 25621327 16976040
1586 16976040 5387494 -915060 -1267667 -241065 2199638 10513256 22926427 29316732
1578 29316732 23699332 13045570 9148695 15192757 23706678 24944199 14848952 -2235259
1570 -2235259 -16276348 -19474617 -13612123 -7846246 -8733118 -15051753 -22278026 -27863918
1562 -27863918 -30869443 -30207487 -25253530 -16483993 -5963144 645644 -4258409 -20786639
1554 -20786639 -36111676 -36286415 -22980222 -10413826 -6391267 -6779118 -9510065 -20494231
1546 -20494231 -39547403 -52643689 -48341369 -34081589 -26212682 -29601392 -36521384 -40584433
1538 -40584433 -41599426 -39988489 -36360210 -34907856 -38305974 -40299603 -31546315 -12201445
1530 -12201445 8606514 24745310 36876767 45099165 46139671 39035527 26976059 12486748
1522 12486748 -3486384 -17587970 -25703493 -29712204 -36659856 -49459252 -62908042 -69769048
1514 -69769048 -66596181 -53802635 -35310074 -18549888 -9500440 -6763805 -4900457 -3307463
1506 -3307463 -6266980 -14377129 -22791179 -29222689 -36417493 -43553788 -42326769 -27850279
1498 -27850279 -9528372 -3700446 -14707946 -27987924 -25017117 -3816705 18619560
1491 18619560 25436974 17998105 10614071 9950628 8195109 -1710596 -13837562 -18614871
1483 -18614871 -16563151 -14056405 -11390028 -5205059 1436649 2634600 1216638 5588272
1475 5588272 15702000 22876177 23389219 21323368 17863705 10015731 1403969 1004548
1467 1004548 7174841 5948906 -8744298 -25227480 -31724219 -32308044 -36081019 -40846612
1459 -40846612 -38791667 -30722306 -23256505 -17581679 -11680712 -8392041 -9925796 -8642076
1451 -8642076 4461184 24008952 34490699 29715479 17677386 6469065 -3656417
1444 -3656417 -12973117 -17969421 -18062825 -18068596 -20055461 -20050933 -16762287 -16582392 -24702468 -36273147
1434 -36273147 -41559390 -36719023 -25732859 -14815706 -8483930 -8282317 -11583216 -13207855
1426 -13207855 -10759847 -6659540 -3408148 -99652 3648903 3825311 -3162054 -13225592
1418 -13225592 -17009207 -10203954 1753392 9861094 9504348 1596115 -10458452 -22006129
1410 -22006129 -27553500 -24185647 -15413131 -9018880 -9537096 -14029916 -16105769 -12735896
1402 -12735896 -6274516 -1433010 -1540859 -6176902 -11033796 -11837685 -9908083 -11506175
1394 -11506175 -19587094 -29150609 -33897671 -33994486 -32344260 -26694001 -13151723 3654069
1386 3654069 12744922 10698404 5404202 3197633 177940 -9141710 -21655795 -30220460
1378 -30220460 -33112796 -32923820 -30509850 -26183645 -22997708 -22608908 -21558323 -18110941
1370 -18110941 -18575204 -28214860 -38522204 -33930466 -12447554 9026966 13092298 -405068
1362 -405068 -17250976 -23635966 -15399889 1499279 15053383 15410571 3983043 -6681188
1354 -6681188 -5117354 7691693 20831167 25693056 23390349 21118374 24064525 31463115
1346 31463115 38520174 40388620 34738740 22690277 8836323 -575476 -1620234 4605561
1338 4605561 13856379 22520339 28728099 32092266 35009983 41453411 49869585 50054268
1330 50054268 34368480 10886429 -3840466 -6206203 -9350519 -21940052 -34367874
1323 -34367874 -33356740 -20363886 -5990411 5045989 11862846 8543553 -7584860 -23405552
1315 -23405552 -22345401 -8628604 -3068865 -12839077 -21962268 -17249463 -7680673 -8242067
1307 -8242067 -17529463 -24038221 -25492139 -27767233 -29678350 -23518156 -10682795 -4137115
1299 -4137115 -11487955 -24202415 -28440804 -21013880 -10010502 -3803173 -4966495 -12918529
1291 -12918529 -25505155 -35565794 -31624133 -8770455 21928280 41538030 42822255
1284 42822255 36054977 32711432 30804003 22705204 10458154 2614394 -831144 -8178794
1276 -8178794 -20257452 -26639587 -21136702 -11185057 -6804210 -8380087 -10871858 -12950599
1268 -12950599 -15719388 -17941632 -18583780 -19823681 -22571241 -23260773 -19625381 -15393773
1260 -15393773 -15234431 -19677761 -28334769 -41587839 -54503400 -56819336 -46150581 -34355729
1252 -34355729 -32316939 -34760188 -30361650 -21235595 -19195034 -24932382 -25392912 -14342857
1244 -14342857 -2895524 -3639644 -13383336 -18709989 -13087633 -2243058 4032980 614670
1236 614670 -9829599 -18582199 -17738512 -8172933 1195551 3759728 1620634 -846182
1228 -846182 -5743645 -18529732 -37250374 -50638231 -49488659 -37169821 -25613365 -21285533
1220 -21285533 -18260314 -7235470 10233062 20235113 10719493 -14997764 -41128116
1213 -41128116 -54709956 -55793877 -52901821 -51353588 -48378394 -39572386 -27595473 -20962917
1205 -20962917 -23291286 -27508751 -24721310 -16650971 -13590861 -19998970 -28222996 -28761763
1197 -28761763 -21730185 -15037335 -15136403 -22579720 -33004035 -39249969 -35843110 -24851031
1189 -24851031 -14954941 -12494421 -16141847 -21211326 -24185718 -21611491 -11701179 -604920
1181 -604920 637882 -9102580 -16938395 -13537836 -6656061 -7769194 -13277068 -12073451
1173 -12073451 -6164621 -7772687 -17316797 -20912769 -12721907 -4388872 -5871912 -10004386
1165 -10004386 -5033628 7275320 15592377 14168783 5277355 -7882613 -21924181 -30895224
1157 -30895224 -31765777 -30209340 -33415574 -38265930 -33641725 -15092483 8032580 21710193
1149 21710193 20994230 13997210 13104374 21763067 30421421 27992770 16432949 8903756
1141 8903756 12971656 22028206 25569814 20932280 10977033 -2172948 -14553524 -18342557
1133 -18342557 -11308415 -3632470 -5366689 -9822653 -610286 24332132 46475883 48010461
1125 48010461 31024916 10956601 -1635175 -6241858 -4741738 2554945 13174492 21355923
1117 21355923 23705702 23305925 25406465 29733681 29716572 20606173 6465067 -3940478
1109 -3940478 -7831701 -10950569 -18079298 -25880785 -29137844 -29678915 -32125078 -32893229 -22753938
1100 -22753938 -2847349 10333196 2933867 -17329968 -27899891 -16953039 3654832
1093 3654832 12625865 1696897 -19268563 -36287129 -44905504 -49133105 -51324720 -47758345
1085 -47758345 -34520933 -14506618 3848704 14013632 15895528 13605649 11016559 10236054
1077 10236054 12413525 17423694 22113901 20641246 9171912 -8570593 -21887884 -21802526
1069 -21802526 -10051172 1798137 3008646 -7087847 -20175674 -27200449 -24735490 -15560620
1061 -15560620 -5548699 523603 2083036 2051822 2662285 3089532 1953887 -175944 -3088130
1052 -3088130 -9265962 -19613136 -28142191 -27069817 -18753430 -16428914 -28742904 -48245600
1044 -48245600 -61337891 -66193004 -72082795 -81086739 -81033364 -62545634 -35532443 -19111260
1036 -19111260 -17939013 -18998303 -13331601 -10480775 -24069984 -49242921 -64742618 -57635185
1028 -57635185 -37529006 -22685243 -18802364 -18701346 -19351015 -28074014 -47580450 -63795176
1020 -63795176 -59501956 -38327384 -23547518 -29069721 -41345608 -37841983 -16070644 6458366
1012 6458366 16810793 18121375 16620596 10835260 -1006951 -13276520 -20073776 -23110704
1004 -23110704 -25859345 -25977425 -20475189 -13304062 -10672085 -12376579 -13479212 -10688166
996 -10688166 -2454304 11305566 23680394 22162677 4045294 -15804550 -22068899 -18100271
988 -18100271 -17551967 -23147011 -26919377 -26884795 -28129319 -29307713 -24078275 -16265207 -17338570
979 -17338570 -26411056 -28984463 -20111208 -12962805 -17769695 -27064007 -29939964 -27256543
971 -27256543 -23638800 -17453172 -8990671 -6509258 -13016494 -18283288 -15594299 -15013249
963 -15013249 -26428391 -40008302 -39587260 -27593580 -19622735 -19249066 -15135953 -780350
955 -780350 18438119 36603214 50877904 54330128 40083846 14680930 -5130376 -11324417
947 -11324417 -10356077 -9834781 -10448084 -11708281 -14465906 -16020820 -12514053 -7016461 -5927042
938 -5927042 -8043879 -7716672 -7269014 -13175819 -20065009 -13467847 8500168 30070890
930 30070890 38715366 38359736 37253825 35626489 31529015 27256707 23263536 15875017
922 15875017 6709423 3746687 7344618 6522404 -4181317 -15530315 -18856101 -19198848
914 -19198848 -24135948 -29673065 -27325278 -17203340 -5204400 5099128 10135059 4905416
906 4905416 -7978017 -17079174 -17815011 -18736219 -24135062 -24237601 -14530768 -9987754 -23116441
897 -23116441 -40428255 -40974829 -28652005 -23763844 -29583640 -32153048 -29748369 -35094968
889 -35094968 -46086565 -42141479 -18530735 519592 -3764730 -18241909 -21577001 -16267678
881 -16267678 -17816457 -25585891 -26192339 -18793686 -15998987 -21308738 -23878816 -17386183
873 -17386183 -8918611 -5523940 -4361333 -957348 2551628 2370974 -1317198 -7547126
865 -7547126 -15989592 -21296378 -14449358 3475858 15752893 7522253 -14408848 -28742367
857 -28742367 -25878270 -17181751 -16092383 -20103195 -18186923 -8612445 626541 5953037
849 5953037 12176208 21867302 30505315 34986667 38179903 40876079 38012429 29296894
841 29296894 25357819 34137789 47152815 49723096 40602320 29677297 18703950 -1422600
833 -1422600 -31868873 -57585606 -64405802 -55193204 -42188538 -31231438 -21977481 -18075859
825 -18075859 -26478785 -45954222 -62720686 -60619503 -35699388 -2070032 17260107 10077378
817 10077378 -12265868 -25475179 -17531858 873342 12143957 10929918 3677303 -3106812
809 -3106812 -6394084 -3778707 3484736 6881084 -778638 -13598204 -18071828 -10990448
801 -10990448 -3021947 -2168918 -3179913 846827 4557669 -2335304 -17465505 -25867658
793 -25867658 -18634657 -3368793 7016119 9273383 8950081 9820515 10843557 11166633
785 11166633 11189233 8829214 1180302 -8853135 -13529394 -10207118 -4820292 -2413824
777 -2413824 -4292 6417647 13243109 14607159 12918488 15868576 23780160 27802974
769 27802974 22116112 11525164 4492339 3671109 6478403 11497069 20368730 33438610
761 33438610 45064991 45216013 29166317 6354405 -5842751 -1168371 7908451 7455467
753 7455467 1006144 1738259 10149807 12755614 3484640 -6672402 -5766101 3612049 10039709
744 10039709 6057601 -9150495 -31110913 -48886495 -51119248 -39506951 -28830460 -27869204
736 -27869204 -28587622 -20965399 -9372978 -4561107 -6649366 -7073550 -2670185 2801455
728 2801455 7754630 13103137 15737883 11399901 2909959 -2972729 -5538127 -8639117
720 -8639117 -10695317 -5422558 6932100 17062383 17113775 8663852 -56045 -1100284
712 -1100284 7189276 17132460 18045828 9976481 5758078 13516432 24135336 24747973 17340726
703 17340726 12207797 9212769 207902 -13430486 -21340589 -21315869 -20775178 -21010323 -15411508
694 -15411508 -4755909 1433849 1321573 2675299 5130616 -2292455 -20402537 -33831528
686 -33831528 -33549313 -28893199 -28520943 -26750075 -20031071 -19388745 -31567507 -43364897
678 -43364897 -41501188 -33799497 -31951461 -27325304 -7400361 14244771 12083946 -10587994
670 -10587994 -22471451 -8548352 11411539 15450999 8101809 5551025 10304139 14118109
662 14118109 13621085 10204695 3059170 -6597697 -10726585 -3409197 9570654 16571287
654 16571287 11416337 -4850172 -26848714 -45017716 -50389935 -45181497 -42275927 -48614609
646 -48614609 -55586938 -51698880 -38030973 -24368563 -16262706 -13578531 -16450812 -23851479
638 -23851479 -29357463 -26755499 -19104822 -16112042 -22638316 -33408372 -38007522 -29486548
630 -29486548 -11615271 871181 -4675552 -22510461 -32703932 -26375878 -17825431 -23393343
622 -23393343 -36853159 -38175945 -21846525 -2611166 6137402 6659759 7512294 11467889
614 11467889 17290211 24498291 30662222 30274369 21882136 12204711 8470905 9413443 7534866
605 7534866 -1575259 -14895724 -25648243 -29533430 -27938378 -25420103 -23877840 -21005563
597 -21005563 -15756143 -11820331 -11982149 -12359034 -7800155 -689772 2079709 -532052 -3369194
588 -3369194 -4146824 -4885034 -4341162 1569182 9522448 8766721 -3253018 -13387085 -8470917
579 -8470917 6681710 14845605 7369006 -7373216 -15727561 -13212829 -6366069 -3624529
571 -3624529 -5891430 -6186996 397260 7759323 4266449 -12155476 -29748515 -35989463
563 -35989463 -29713089 -17550917 -4848589 4639828 5889152 -2864273 -15500960 -24564328
555 -24564328 -30252785 -36775673 -42565696 -42008206 -35817119 -31262658 -31007116 -29423263 -22637575
546 -22637575 -15507458 -14377582 -17503447 -17296756 -9764797 1847251 11540182 16080040
538 16080040 16663439 16747889 18231178 19722248 19180004 17303780 16357138 16088810 13212599
529 13212599 5492987 -4801949 -11453522 -8220628 5314114 20215283 23882978 13053866
521 13053866 -1141955 -5175312 1995100 10514682 13366521 12064993 10240429 9283072
513 9283072 10704503 15113362 17290564 10064200 -4037858 -12590257 -8985519 -1435795
505 -1435795 -926990 -6479107 -9160036 -5765352 -546366 3704976 7876063 10213941 5193561
496 5193561 -9220090 -27304836 -39941967 -41224634 -32032576 -20487360 -17419063 -26720923
488 -26720923 -40167982 -45474493 -39209871 -28282031 -19864511 -15039654 -12430252 -12027112
480 -12027112 -12827306 -11351900 -6352428 -2214602 -3720952 -8765087 -10253898 -5543513
472 -5543513 -363496 -1149827 -5897093 -6714209 -1418839 2574047 -784890 -5971462 -3511673
463 -3511673 4146595 3581492 -10484372 -25756557 -27685240 -17306589 -6336057 176168
455 176168 6664925 14787375 18560101 13509300 3259923 -5564514 -9762377 -9234779 -5498950
446 -5498950 -2697529 -5636317 -14224470 -22562297 -24682518 -18888522 -7307683 4662269
438 4662269 9289538 2605613 -9757409 -17862566 -18777725 -17015311 -14312026 -7398602
430 -7398602 2222457 5740031 -326469 -6476717 -2192750 9711170 17685047 16279209
422 16279209 9056366 -493894 -12921282 -27545100 -39321233 -42810378 -36843601 -25437100
414 -25437100 -15632334 -12394235 -13486764 -11905886 -5298889 980926 2801260 3669486
406 3669486 7323803 9552470 4962182 -2036007 -2133959 4385295 7188846 685736 -8891676
397 -8891676 -13298588 -12101154 -9667061 -8166038 -7282253 -6895496 -6795216 -6334570 -6225657
388 -6225657 -8116038 -11483040 -14098891 -16228469 -20552660 -26795498 -30267347 -27390150
380 -27390150 -19566333 -10540344 -3298743 -364246 -2950585 -7904122 -8915057 -2903092
372 -2903092 6978392 15328184 18693052 15879673 8095338 -674474 -7325487 -13722819
364 -13722819 -22564273 -29767819 -27812898 -17646879 -9459512 -8709665 -9252223 -4918080
356 -4918080 -92674 -1845528 -7764669 -9972811 -7333042 -5403982 -6572392 -7940699
348 -7940699 -7734386 -6860442 -5114989 -2501407 -3360614 -12108381 -24918902 -32483653 -31604816
339 -31604816 -27614047 -24682625 -20814492 -14439283 -9287390 -9263450 -13389043 -18998814 -25795976
330 -25795976 -33752128 -40478315 -43293206 -41129670 -33246685 -20022641 -6160276 2104178
322 2104178 5214513 10193337 19157538 23935427 17260857 4151531 -4574956 -6567853
314 -6567853 -8275067 -12921728 -16124707 -14028706 -8935926 -4945496 -3432437 -4889029
306 -4889029 -10144993 -16867611 -19100988 -13835328 -5169211 1094329 4304487 7299822
298 7299822 10608770 12399302 12568182 12476123 11140678 6087122 -1413181 -6052422 -5299839
289 -5299839 -3592593 -7465501 -18190140 -30870115 -39152416 -39262593 -31320240 -19145150
281 -19145150 -7995308 -609012 4101308 7702932 9518728 8878794 7667544 7588156 6565196
272 6565196 1292718 -7905847 -18170320 -28027106 -35304617 -33318071 -17212787 4930771
264 4930771 16113508 9930447 -1111820 -2540271 3386989 3767290 -5264278 -14999550
256 -14999550 -18444403 -17856999 -16876334 -14331255 -9272471 -4918013 -3232257 -833040 5593697
247 5593697 13945300 20312228 23934765 24809172 20114525 7821991 -7836980 -18297636
239 -18297636 -17810369 -7806711 3714811 6963645 -978990 -10559467 -7982838 7880009
231 7880009 22082177 21289605 9458422 139013 -1496973 -712795 -788881 1368980 6906545
222 6906545 11069289 10005708 5335683 277100 -2990400 -1199085 7595495 17297255
214 17297255 17114706 5647445 -5431135 -7010065 -5020382 -10075987 -20520001 -25578125
206 -25578125 -22458269 -19339027 -20610304 -19571332 -9961084 3498459 12094915 14640384
198 14640384 14964859 12231782 2638355 -9901872 -13597222 -2694683 14097392 23326388
190 23326388 21313147 14738279 9714893 6110692 2551255 1388122 5645632 13517434
182 13517434 18826307 16629166 7159056 -5260014 -16162166 -23798099 -28482225 -29859403
174 -29859403 -26652828 -20087261 -14980308 -14208223 -13913189 -9053096 -2995061 -4893286 -15534888
165 -15534888 -22810231 -16314693 -1072004 9674515 10927222 7097901 -115876 -13992922
157 -13992922 -31381422 -39545931 -30682408 -13518670 -4044671 -8149287 -18857937 -27788017
149 -27788017 -32971031 -35929433 -36770449 -34244797 -28219404 -20720776 -15121399 -13904493
141 -13904493 -16541920 -20490416 -24445743 -28302882 -29387580 -22879113 -9114276 2787341
133 2787341 3278742 -6666940 -16730497 -18764566 -13924395 -9004522 -9005791 -13252594 -16405372
124 -16405372 -13734571 -6951664 -2669155 -3016682 -2133918 3117699 3983732 -9206354 -28678228
115 -28678228 -33591775 -15871745 8865564 21948131 23595152 25658869 30579042 29911890
107 29911890 20451471 9113410 1085529 -5657394 -11073189 -8522221 4766425 20130679
99 20130679 26804885 23705928 16375494 7678295 -1083495 -4009870 4730429 19965292
91 19965292 27492500 19812312 4791677 -3743695 -51924 10731111 19554278 20226284
83 20226284 12346978 972296 -7723459 -12259061 -16070599 -21104626 -23791484 -19444189
75 -19444189 -8734033 2356936 7809768 5619602 -1321240 -6864215 -6534504 -2688474
67 -2688474 -2106246 -6462743 -9078166 -4910346 424339 -1788746 -9100911 -9801310 -280172
58 -280172 7991176 3540423 -9523999 -18085043 -18577124 -20384566 -30068431 -40095919 -38391212
49 -38391212 -25214705 -13993869 -14982675 -23625358 -28475040 -26667863 -25332014 -28394643
41 -28394643 -29649475 -22700531 -11751575 -5824470 -5603227 -3934520 1469832 4325215
33 4325215 656377 -4312771 -4174361 -222917 2404181 2455118 1058218 -3277723 -11710612
24 -11710612 -19588287 -20412680 -14533143 -8572966 -6684690 -7161616 -7146938 -5684037 -2157091
15 -2157091 3367425 7795221 7526009 3883091 1827187 3061603 5071298 7117710 11272607
6 11272607 16071463 15547544 7994486 262714 -1146250 1113251
0 1113251
$$ Imaginary data points
##PAGE= N=2
##DATA TABLE= (X++(I..I)), XYDATA
65535 -691185 -3723445 -3247010 -3193646 -8276172 -15384862 -16802405 -10669551 -3795594 -3281151
65526 -3281151 -8197098 -11432113 -8657665 -3115888 -666263 -1983491 -2379052 943140
65518 943140 4961536 5801588 4704371 6127128 11457710 17449646 20079664 17695804
65510 17695804 11326354 4138988 -364216 -1676392 -2524328 -3950753 -2795944 2540479
65502 2540479 6538524 1991727 -10100193 -21386528 -26425282 -26361613 -22331248 -12284081
65494 -12284081 2978732 16762113 23830606 26734196 30765768 36058858 38885115 37978894
65486 37978894 35095340 31088760 25570206 19315247 13443184 7170775 -430577 -7450232
65478 -7450232 -11008785 -11259008 -10761669 -10938814 -11755978 -13309407 -14655423 -13046300 -8309969
65469 -8309969 -6006194 -10783503 -17332968 -14192881 2113491 21926082 33151009 32350358
65461 32350358 23477891 11366252 251435 -6076356 -7728362 -9127527 -11287686 -7254908
65453 -7254908 8364768 27763057 35940179 28781639 17254918 11229527 7175270 -2620493
65445 -2620493 -15431984 -21450973 -18626933 -14459370 -12627431 -7544707 3732053 12702602
65437 12702602 10435298 2453313 2894577 14483142 23836154 19907297 9398697 7689269
65429 7689269 18868161 31783921 34575321 26770394 16263556 9648659 7942744 8375406
65421 8375406 7551481 4416570 1723932 3078406 7631429 10109440 7684086 4175476
65413 4175476 4850327 9286457 12793827 13249582 12259923 10324880 6206650 2238496 4556208
65404 4556208 14168458 22001272 18579853 6998237 337426 5888801 17535526 25500706
65396 25500706 27985047 29015547 29120361 24626432 15360373 7078266 4568967 6265980
65388 6265980 7647872 6918960 5111593 3095324 1240553 485153 968741 378153 -3857594
65379 -3857594 -11029982 -18007393 -23448138 -28697930 -33840347 -35112138 -28189843 -13667696
65371 -13667696 1932039 11091339 11359798 6589777 2041336 -1249264 -5869819 -11809560
65363 -11809560 -13732494 -7110207 4571382 12471134 12221186 7611321 4113255 3026681
65355 3026681 3876344 7991401 15475353 21651824 21886539 18875087 19790209 25801741 29447953
65346 29447953 24110624 12075003 1149193 -3218903 -332828 7561610 16291584 21472519
65338 21472519 22097296 20478351 17026922 8984161 -2743078 -10467627 -9039412 -4379182
$$ [...]
##END NTUPLES=NMR SPECTRUM
##END=
