##TITLE=31Pdec_DE-57K
 CDCl3, 64 sc
 26.6.2024
##JCAMPDX= 6.0         $$ Bruker NMR JCAMP-DX V2.0
##DATA TYPE= NMR SPECTRUM
##DATA CLASS= NTUPLES
##ORIGIN= UXNMR, Bruker Analytische Messtechnik GmbH
##OWNER= root
$$ XWIN-NMR		Version 3.5
$$ Wed Jun 26 15:42:11 2024 Russian Standard Time (UT+4h)  she@DPX200
##.OBSERVE FREQUENCY= 81.013821
##.OBSERVE NUCLEUS= ^31P
##.ACQUISITION MODE= SIMULTANEOUS
##.ACQUISITION SCHEME= undefined
##.AVERAGES= 64
##.DIGITISER RES= 17
##SPECTROMETER/DATA SYSTEM= spect
##.PULSE SEQUENCE= zgpg30
##.SOLVENT NAME= CDCl3
##.SHIFT REFERENCE= (INTERNAL, CDCl3, 0, 182.463)
##AUDIT TRAIL= $$ (NUMBER, WHEN, WHO, WHERE, WHAT)
$$ ##TITLE= Audit trail, XWIN-NMR		Version 3.5
$$ ##JCAMPDX= 5.01
$$ ##ORIGIN= Bruker BioSpin GmbH
$$ ##OWNER= she
$$ F:/spectra/data/she/nmr/P31/2/pdata/1/auditp.txt
$$ ##AUDIT TRAIL=  $$ (NUMBER, WHEN, WHO, WHERE, WHAT)
(   1,<2024-06-26 15:40:14.03 +0400>,<she>,<DPX200>,
      <continue with go, POWCHK disabled, PULCHK disabled
       configuration hash MD5:
       00 E9 B6 7A A2 85 ED C7 34 08 36 98 17 FE 4E 26
       data hash MD5: 32K
       90 F1 69 74 DB 72 7D 74 12 50 CC 99 26 5F EE 6C>)
(   2,<2024-06-26 15:41:19.90 +0400>,<she>,<DPX200>,
      <Start of raw data processing
       efp BC_mod = 2 LB = 1.5 FT_mod = 6 PKNL = 1 PHC0 = 2908.331 PHC1 = 191.8863 SI = 64K 
       data hash MD5: 64K
       E0 AB 8A A2 42 2D 2D 50 CB B8 40 47 5E FF 14 EC>)
(   3,<2024-06-26 15:41:40.06 +0400>,<she>,<DPX200>,
      <pk PHC0 = -158.6018 PHC1 = 59.8 
       data hash MD5: 64K
       B5 BF 39 07 72 9C AF 1A 12 6A 20 C9 4E DE 00 4F>)
$$ ##END=
$$ 
$$ hash MD5
$$ 66 9F A7 62 D9 B3 6C 0A 9D DF C2 1F C7 06 67 CB
##$RELAX= 
##$RELAX= 
##$RELAX= 
##$RELAX= 
##$RELAX= 
##$RELAX= 
##$RELAX= 
##$RELAX= 
$$ Bruker specific parameters
$$ --------------------------
##$DU= <F:/spectra>
##$EXPNO= 2
##$NAME= <P31>
##$PROCNO= 1
##$TYPE= <nmr>
##$USER= <she>
##$AMP= (0..31)
100 100 100 100 100 100 100 100 100 100 100 100 100 100 100 100 100 100 
100 100 100 100 100 100 100 100 100 100 100 100 100 100 
##$AQSEQ= 0
##$AQ_mod= 1
##$AUNM= <au_zg>
##$AUTOPOS= <>
##$BF1= 81.014009
##$BF2= 200.13
##$BF3= 200.13
##$BF4= 200.13
##$BF5= 200.13
##$BF6= 200.13
##$BF7= 200.13
##$BF8= 200.13
##$BYTORDA= 1
##$CFDGTYP= 0
##$CFRGTYP= 5
##$CHEMSTR= <none>
##$CNST= (0..31)
1 1 145 1 1 1 1 1 1 1 1 1 1 1 1 1 1 1 1 1 1 1 1 1 1 1 1 1 1 1 1 1 
##$CPDPRG= <waltz16>
##$CPDPRG1= <>
##$CPDPRG2= <waltz16>
##$CPDPRG3= <>
##$CPDPRG4= <mlev>
##$CPDPRG5= <mlev>
##$CPDPRG6= <mlev>
##$CPDPRG7= <mlev>
##$CPDPRG8= <mlev>
##$CPDPRGB= <>
##$CPDPRGT= <>
##$D= (0..31)
0 1 0 0 0 0 0 0 0 0 0 0.03 2e-05 3e-06 0 0 0 0 0 0 0 0 0 0 0 0 0 0 0 0 
0 0 
##$DATE= 1719401934
##$DBL= (0..7)
120 120 120 11 120 120 24 19 
##$DBP= (0..7)
150 150 150 150 150 150 150 150 
##$DBP07= 0
##$DBPNAM0= <>
##$DBPNAM1= <>
##$DBPNAM2= <>
##$DBPNAM3= <>
##$DBPNAM4= <>
##$DBPNAM5= <>
##$DBPNAM6= <>
##$DBPNAM7= <>
##$DBPOAL= (0..7)
0.5 0.5 0.5 0.5 0.5 0.5 0.5 0.5 
##$DBPOFFS= (0..7)
$$ [...]
##$SUBNAM2= <"">
##$SUBNAM3= <"">
##$SUBNAM4= <"">
##$SUBNAM5= <"">
##$SUBNAM6= <"">
##$SUBNAM7= <"">
##$SUBNAM8= <"">
##$SUBNAM9= <"">
##$SW= 369.568048894756
##$SWIBOX= (0..15)
0 1 3 0 0 0 0 0 0 0 0 0 0 0 0 0 
##$SW_h= 29940.119760479
##$TD= 32768
##$TD0= 1
##$TE= 0
##$TE2= 300
##$TE3= 300
##$TEG= 300
##$TL= (0..7)
0 120 53 12 22 120 120 120 
##$TP= (0..7)
150 150 150 150 150 150 150 150 
##$TP07= 0
##$TPNAME0= <>
##$TPNAME1= <>
##$TPNAME2= <>
##$TPNAME3= <>
##$TPNAME4= <>
##$TPNAME5= <>
##$TPNAME6= <>
##$TPNAME7= <>
##$TPOAL= (0..7)
0.5 0.5 0.5 0.5 0.5 0.5 0.5 0.5 
##$TPOFFS= (0..7)
0 0 0 0 0 0 0 0 
##$TUNHIN= 0
##$TUNHOUT= 0
##$TUNXOUT= 0
##$USERA1= <user>
##$USERA2= <user>
##$USERA3= <user>
##$USERA4= <user>
##$USERA5= <user>
##$V9= 5
##$VALIST= <valist>
##$VCLIST= <CCCCCCCCCCCCCCC>
##$VD= 0
##$VDLIST= <DDDDDDDDDDDDDDD>
##$VPLIST= <PPPPPPPPPPPPPPP>
##$VTLIST= <TTTTTTTTTTTTTTT>
##$WBST= 1024
##$WBSW= 4
##$XGAIN= (0..3)
0 0 0 0 
##$XL= 0
##$YL= 0
##$YMAX_a= 3253
##$YMIN_a= -5003
##$ZGOPTNS= <>
##$ZL1= 120
##$ZL2= 120
##$ZL3= 120
##$ZL4= 120
##$ABSF1= 0
##$ABSF2= 0
##$ABSG= 0
##$ABSL= 0
##$ALPHA= 0
##$AQORDER= 0
##$ASSFAC= 0
##$ASSFACI= 0
##$ASSFACX= 0
##$ASSWID= 0
##$AUNMP= <proc_1d>
##$AZFE= 0.1
##$AZFW= 0.5
##$BCFW= 0
##$BC_mod= 2
##$BYTORDP= 0
##$COROFFS= 0
##$CY= -3
##$DATMOD= 1
##$DC= 0
##$DFILT= <>
##$DTYPP= 0
##$F1P= 0
##$F2P= 0
##$FCOR= 1
##$FTSIZE= 65536
##$FT_mod= 6
##$GAMMA= 0
##$GB= 0
##$INTBC= 1
##$INTSCL= 9.790993e-09
##$ISEN= 30
##$LB= 1.5
##$LEV0= 0
##$LPBIN= 0
##$MAXI= 10000
##$MC2= 0
##$MEAN= 0
##$ME_mod= 0
##$MI= 50
##$NCOEF= 0
##$NC_proc= -10
##$NLEV= 6
##$NOISF1= 182.463
##$NOISF2= 159.3651
##$NSP= 0
##$NTH_PI= 0
##$NZP= 0
##$OFFSET= 182.463
##$PC= 4
##$PHC0= 2749.729
##$PHC1= 251.6863
##$PH_mod= 1
##$PKNL= yes
##$PPARMOD= 0
##$PSCAL= 0
##$PSIGN= 0
##$REVERSE= no
##$SF= 81.0140089999434
##$SI= 65536
##$SIGF1= 159.3651
##$SIGF2= -187.1042
##$SINO= 113.3802
##$SIOLD= 16384
##$SREGLST= <1H.CDCl3>
##$SSB= 0
##$STSI= 65536
##$STSR= 0
##$SW_p= 29940.119760479
##$SYMM= 0
##$S_DEV= 0
##$TDeff= 32768
##$TDoff= 0
##$TI= <>
##$TILT= no
##$TM1= 0
##$TM2= 0
##$TOPLEV= 0
##$USERP1= <user>
##$USERP2= <user>
##$USERP3= <user>
##$USERP4= <user>
##$USERP5= <user>
##$WDW= 1
##$XDIM= 65536
##$YMAX_p= 301208972
##$YMIN_p= -82921731
$$ End of Bruker specific parameters
$$ ---------------------------------
##NTUPLES= NMR SPECTRUM
##VAR_NAME=  FREQUENCY,     SPECTRUM/REAL,   SPECTRUM/IMAG
##SYMBOL=    X,             R,               I
##VAR_TYPE=  INDEPENDENT,   DEPENDENT,       DEPENDENT
##VAR_FORM=  AFFN,          ASDF,            ASDF
##VAR_DIM=   65536,         65536,           65536
##UNITS=     HZ,            ARBITRARY UNITS, ARBITRARY UNITS
##FACTOR=    0.456856943014862, 1,           1
##FIRST=     14782.0589164792, 0,            0
##LAST=      -15158.0608439998, 0,           0
##MIN=       -15158.0608439998, -82921731,   0
##MAX=       14782.0589164792, 301208972,    0
$$ Real data points
##PAGE= N=1
##DATA TABLE= (X++(R..R)), XYDATA
$$ [...]
8694A7387491j032090o06908R097756J7629445J0807821q548151k4222459k6325125
8686e812220j8357551p422941L370109J2042159J4856573J0283261K660023j437057
8678A0182356L58059M910655P562160N767474L7840o159603p819731k777511M596674
8669A6658373O995022K776305j973517j692275J767425L179193J393938r46416
8661B8158048k104309j606807J025415L590762J111260n996974q167280Q96060
8653A6906175J1763802R614407m508629j4251856j0577779k034760O48262j544679
8645F014943l236230n453240j0868804j5497575j3407864n207731M374884J2902548
8637c0379069J8887183J9036941J2587555M233756j993504p166339j1660377j0977089
$$ plain form
8694 17387491 16355401 15748493 24846249 42475694 53283515 44735364 20512905 -5812220
8686 -5812220 -24169771 -31592712 -28222603 -16180444 -1323871 8959390 11619413 10182356
8678 10182356 10540415 15451070 23013230 28780704 28818544 22658941 14839210 12061699 16658373
8669 16658373 23653395 26429700 24456183 22763908 24531333 27710526 29104464 28158048
8661 28158048 26053739 24446932 25472347 29063109 30174369 24177395 16010115 16906175
8653 16906175 28669977 38284384 33775755 19523899 8946120 6911360 7559622 6014943
8645 6014943 2778713 -2674527 -13543331 -29040906 -42448770 -47656501 -43281617 -30379069
8637 -30379069 -11491886 7545055 20132610 24366366 22372862 15206523 3546146 -7430943
8629g430943k798133P392626J3185766J4018097J0129042j334694j7583664k5301873
8621i723776j5019077M314133J5101320J1904485L277240l074669o296169o273678
8613e790191k715743M00836o34714j125803N672091J4889940J3976959J362437
8605B6035812r826999r498023k122173L036713L940588L261540J872184N05462
8597A7205104J827082N482000N836993n59541r185414j3343676j2316888j0092431
8589a5146771r135138r040112r012428q505910o729802l362483J237044O565036
8581e3130564J0841116J0667982N670008K200191O609329J4648504J4394109K105361
8573A4006036j1047506j2045842j151813J0199136J2809257O435994l895333j2616558
$$ plain form
8629 -7430943 -10229076 -2836450 10349316 24367413 34496455 33161761 15578097 -9723776
8621 -9723776 -24742853 -20428720 -5327400 6577085 9854325 6779656 483487 -5790191
8613 -5790191 -8505934 -8105098 -8739812 -9865615 -4193524 10696416 24673375 26035812
8605 26035812 16208813 6710790 4588617 7625330 11565918 14827458 16699642 17205104
8597 17205104 19032186 24514186 30351179 29791638 20606224 7262548 -5054340 -15146771
8589 -15146771 -24281909 -33322021 -42334449 -50840359 -57570161 -60932644 -59695600 -53130564
8581 -53130564 -42289448 -31621466 -25951458 -23751267 -17141938 -2493434 11900675 14006036
8573 14006036 2958530 -9087312 -10239125 -39989 12769268 19205262 15309929 2693371
8565B693371j5051347r082042K267437J1626965J2890868O739763r8237k075414
8557I911364p20999j382819m724898n545984j232746L589028M013315J548451
8549E454712p20404m512467j1087626j3896253n575756R388701J8214843J6109012
8541A3374762J0289741P055197M193512j180013o285832q696053j1183239j5188775
8533g620700j5454983p076929O053040J4857545J4406548O505134l346613q456185
8525a33143m695704M150200Q196413K517304o534841r406591m378429L105124
8517g179667Q400394R977006O542088j873617r955870r621766R89254J3456182
8509A0734004J6665464Q444059k110905n165942j618183p76465o688439j2187942
$$ plain form
8565 2693371 -12357976 -21440018 -19172581 -7545616 5345252 12085015 11986778 9911364
8557 9911364 9190365 7807546 3082648 -2463336 -3696082 -107054 3906261 5454712
8549 5454712 4734308 221841 -10865785 -24762038 -30337794 -20949093 -2734250 13374762
8541 13374762 23664503 30719700 34913212 33733199 27447367 18751314 7568075 -7620700
8533 -7620700 -23075683 -30152612 -24099572 -9242027 5164521 11669655 8323042 -133143
8525 -133143 -4828847 -678647 7517766 10035070 3500229 -5906362 -10284791 -7179667
8517 -7179667 1220727 11197733 17739821 15866204 5910334 -3711432 -2722178 10734004
8509 10734004 27399468 35843527 33732622 28566680 26948497 26172032 19483593 7295651
8501G295651r651207k255802J388653k18484j812660j681080l014696n568701
8493a5518326m605340Q06888N934755P827938P575181M946439j014170n643709
8485C09656k456717N143948O193808j016910n282758M9927P064959O905351K690031
8476A9601295R06432p1552l160743l027237N098080J3243084R356266n052109
8468C6893516j6327492j5676501o062170N330051J2712270J1791185K921549o559913
8460B5022495r806863q443464p251698n100610Q05328N891840L699287k130714
8452B685601k376702K328494K346694l839186n753892J750513Q629199M359104
8444A0129825n893888q946764k651696K495324M2579l317677R01252Q991803R861490
$$ plain form
8501 7295651 -2355556 -4611358 -3222705 -3441189 -5253849 -6934929 -9949625 -15518326
8493 -15518326 -20123666 -19316778 -13382023 -5554085 2021096 6967535 5953365 309656
8485 309656 -2147061 2996887 9190695 8173785 2891027 2940954 10005913 16911264 19601295
8476 19601295 20507727 20436175 17275432 14248195 19346275 32589359 41945625 36893516
8468 36893516 20566024 4889523 -1172647 4157404 16869674 28660859 31582408 25022495
8460 25022495 15215632 6772168 -479530 -5580140 -4774812 1117028 4816315 2685601
8452 2685601 308899 2637393 4984087 1144901 -4608991 -2858478 5770721 10129825
8444 10129825 4235937 -4710827 -7362523 -4867199 -4824620 -8142297 -7241045 1750758 11612248
8435A1612248K071134k883707K266533Q579720M388320n451573o331722K268356
8427A6519309M728459o052912j6898166j4347388l133081M873547Q212213J0657035
8419D559016R084776M13701p412163n818212m59279j072947k903850M797029J6181489
8410A7369560J3952696l007535j5704726j2122690k096161p6003o860586j4255942
8402b2801387j6522030j1912408k230046N644051O344733M860013Q749209J3122895
8394a4744970P597612k435403J71184J5674518K2617147R587689p270339j0169556
8386B1027882n401513p638586j3415735r482353J854773N663768j280840o792127
8378a5464731l408025K610661L971067K130176J682492L550261O085984P106641
$$ plain form
8435 11612248 13683382 10799675 13066208 21645928 26034248 20582675 14250953 16519309
8427 16519309 21247768 15194856 -1703310 -16050698 -19183779 -14310232 -6098019 4559016
8419 4559016 13643792 14057493 6645330 827118 367839 -705108 -3608958 1188071 17369560
8410 17369560 31322256 28314721 12609995 487305 -1608856 -1684859 -8545445 -22801387
8402 -22801387 -39323417 -51235825 -53465871 -47821820 -41477087 -36617074 -27867865 -14744970
8394 -14744970 -7147358 -9582761 -9411577 6262941 28880088 38467777 31197438 21027882
8386 21027882 15626369 7987783 -5427952 -14910305 -13055532 -7391764 -8672604 -15464731
8378 -15464731 -18872756 -16262095 -12291028 -10160852 -8478360 -4928099 1157885 8264526
8370H264526M137630k639424q198683p514986j347891N750746J0274553R958269
8362A8684740M002768l232948m374328P86168L367992j697425q137247r426354
8354b6634r012970j1554518j2138157m417647O873505J2174847J0741483P764920
8346D04829L153428n445018j2770649j1171687k899946M024333R053895J6180278
8338E29463K0717055J2993842m776890j8356041j9733430j4262221q466001k153926
8330c3508149N289529J1332917J5339751J7985788J5014976K003290j4108069
8323A9350033k0078139j4520596q553872o263334R43201J5345901K3293274J4160042
8315B3676510k763897j1328804r656610o960259o048683j390085Q012532J4569872
$$ plain form
8370 8264526 12402156 9762732 1564049 -5950937 -7298828 -1548082 8726471 18684740
8362 18684740 22687508 19454560 15080232 15866400 19234392 17536967 9399720 -26634
8354 -26634 -9039604 -20594122 -32732279 -37149926 -30276421 -18101574 -7360091 404829
8346 404829 3558257 -1886761 -14657410 -25829097 -28729043 -24704710 -15650815 529463
8338 529463 21246518 34240360 29463470 11107429 -8626001 -22888222 -31354223 -33508149
8330 -33508149 -28218620 -16885703 -1545952 16439836 31454812 33458102 19350033
8323 19350033 -728106 -15248702 -23802574 -30065908 -29122707 -13776806 9516468 23676510
8315 23676510 20912613 9583809 -72801 -7033060 -13081743 -14471828 -6459296 8110576
8307H110576J1816928J845647p704716j0860217q135013n439652o148453n350586
8299b1865486K231728R876108M947850j0170198j5822170j347063J7581958J9097871
8291D530598M194706p703803o852262j933067j868349l676191k118623K25744
8283a5201247j127219m032425l379884R99041N083600O639743O478296N311628
8275G71533K656952j114472l343603p62447O488620J2630311J0492747k18882
8267B7600759j1003915j3373427p854481j652893O83405Q56530K312782N620444
8259C189204Q090407N913918k124520j1219019j3305846o134859L104003O652290
8251e834422N333762M123860K506648l174090r853411r635150k542671J716679
$$ plain form
8307 8110576 19927504 21773151 14068435 3208218 -4926795 -10366447 -16514900 -21865486
8299 -21865486 -19633758 -9757650 -4809800 -14979998 -30802168 -32149231 -14567273 4530598
8291 4530598 8725304 1021501 -5830761 -7763828 -9632177 -13308368 -15426991 -15201247
8283 -15201247 -16328466 -20360891 -23740775 -22741734 -17658134 -11018391 -4540095 771533
8275 771533 3428485 2314013 -1029590 -1792037 4696583 17326894 27819641 27600759
8267 27600759 16596844 3223417 -4631064 -6283957 -5600552 -4744022 -2431240 3189204
8259 3189204 11279611 17193529 15069009 3849990 -9455856 -15590715 -12486712 -5834422
8251 -5834422 -500660 3623200 6129848 2955758 -6897653 -16532803 -19075474 -17358795
8243a7358795k061045p036274n939093k331532k835648m350143J103500J1593484
8235b9215546J5786824R055753J33293j101120M816613J1053994J3382686J0220797
8227C4133294j1870j4717180k4189275k0323433o834670N275227J0903661J3166163
8219b598083J4192494J1741896N599717m92359n143869j0341953j4432155j2432795
8211a3907107o329183n559511j1901979j3666886l135076R370793J0142155L633248
8203c1353546N277968J6403874K1695245J2402021k172878r959226j0366063p933802
8195f006407k922765M349983Q246389M871755j154190l384285k109019q97578
8187I93883J00841J727349J731553r33148k339149j23222Q43103l778856q416892
$$ plain form
8243 -17358795 -19419840 -26456114 -32395207 -34726739 -37562387 -41912530 -40809030 -29215546
8235 -29215546 -13428722 -4372969 -4239676 -5340796 -524183 10529811 23912497 34133294
8227 34133294 34121424 19404244 -4785031 -25108464 -31943134 -26667907 -15764246 -2598083
8219 -2598083 11594411 23336307 28936024 28443665 23299796 12957843 -1474312 -13907107
8211 -13907107 -20236290 -25795801 -37697780 -51364666 -54499742 -45128949 -34986794 -31353546
8203 -31353546 -26075578 -9671704 12023541 24425562 22252684 12293458 1927395 -6006407
8195 -6006407 -8929172 -4579189 3667200 8538955 7384765 4000480 1891461 993883
8187 993883 1094724 2822073 4553626 3620478 1281329 1158107 2001210 -1777646 -10194538
8178a0194538m242288O696636J2344568O365480l664547o026469J606929J1139587
8170A4025358J4317917J1182820P697983O689352M788080o9618l207295j191301
8162E4233296j064767j1634258k6542547k8209332j1721642P140968J3406235
8155d392047J0677736R180570P756224K84639q535961q805495k681659j620601
8147A863406p629192j0582782n043912K297529M496085L500154M101582O812639
8139a84491R882112J2017619J1080195N791073l46082k485590j630332k190585
8131C1933919l528294j755704R18668j943530r133428j1528421n860819M45439
8123d52170J067194j375929k530871k647795j847131K308773P828791P213837
$$ plain form
8178 -10194538 -14436826 -7740190 4604378 10969858 7305311 1278842 2885771 14025358
8170 14025358 28343275 39526095 47224078 53913430 58701510 58631892 55424597 54233296
8162 54233296 53168529 41534271 14991724 -13217608 -24939250 -17798282 -4392047
8155 -4392047 6285689 15466259 23222483 23507122 14971161 6165666 3484007 1863406
8147 1863406 -5765786 -16348568 -21392480 -19094951 -14598866 -11098712 -6997130 -184491
8139 -184491 9697621 21715240 32795435 38586508 38240426 35754836 34124504 31933919
8131 31933919 28405625 26649921 27568589 25625059 16491631 4963210 -897609 -452170
8123 -452170 615024 -760905 -3291776 -5939571 -7786702 -5477929 2350862 9564699
8115I564699j033774p387879l855576N287716J1403498J3139101J3098960R645122
8107D9861867J063941o671465n942874O74206L182020j724133o823459n354290
8099B8265813N02324M096763K961561N23023R26829L741556M221663n64286o912111
8090C7763135q441113m217142J054945M536418P277781Q184138L377480n417187
8082D4118455r344460m442188J327380m84555n973718n322105J937965O908519
8074B8725293N040083J456116J707725L825592K014098n291205j2825110j2937687
8066A1714905l489363P883219J0341086K469000n648451n606387q67985M28394
8058A7224418k646315n387713o344067p114360o510530k755854Q55658L93708
$$ plain form
8115 9564699 8530925 1143046 -2712530 2575186 13978684 27117785 40216745 49861867
8107 49861867 50925808 44254343 38311469 38985675 42167695 40443562 33620103 28265813
8099 28265813 28768137 32864900 35826461 36349484 37276313 41017869 45239532 44675246 37763135
8090 37763135 29322022 25104880 26159825 30696243 37974024 46158162 49535642 44118455
8082 44118455 34773995 30331807 31659187 31174632 25200914 19878809 21816774 28725293
8074 28725293 33765376 35221492 36929217 40754809 42768907 37477702 24652592 11714905
8066 11714905 8225542 16108761 26449847 28918847 23270396 17664009 16796024 17224418
8058 17224418 14578103 9190390 2846323 -4268037 -10778567 -13534421 -12678763 -12285055
8050a2285055p60170L015899Q332938O576477j369395n173819j638725L49394
8042b952456l865220m834568N707113J8085802J5135824l465484j8602603j5222475
8034a0014067j35175P769329k1151j4054808j9803014j3118121j717668N264637
8026d5830038N968534M913632O639720J1189064J4110757J0531553J058311o808379
8018A773154o426655q82967Q36100k979285m463749K49173L710583l27001n358827
8009a3869474k893541J829676k233871j1912877j2616115j390388Q047120P028509
8001b8010961L836349O913410J0186510N897862N04622L957929J0963969Q282165
7993B2531855l097925q490322k026769N835658O033265K862694K822578L057649
$$ plain form
8050 -12285055 -13045225 -10029326 -1696388 4880089 3510694 -1663125 -3301850 -2952456
8042 -2952456 -6817676 -11652244 -5945131 12140671 27276495 23811011 5208408 -10014067
8034 -10014067 -10149242 -2379913 -2401064 -16455872 -36258886 -49377007 -51094675 -45830038
8026 -45830038 -39861504 -34947872 -28308152 -17119088 -3008331 7523222 8581533 1773154
8018 1773154 -4653501 -5536468 -4700368 -7679653 -12143402 -11894229 -8183646 -8510647 -13869474
8009 -13869474 -16763015 -14933339 -17167210 -29080087 -41696202 -43086590 -35039470 -28010961
8001 -28010961 -24174612 -17261202 -7074692 -1176830 -672208 3285721 14249690 22531855
7993 22531855 19433930 10943608 8916839 14752497 20785762 23648456 26471034 29528683
7985B9528683j055682n611183m861907k111366l925362p346860l837543M860350
7977E639130O109313n117713j6491447j3416600K155534J5259356J6934541J2125272
7969B3197386R278756R435989Q173606L475992k126933n436200n995836n981539
7961C4021221p469971r610537r389545o090363k527938O80471Q197398K1380143
7953B9190879K9862002K1534480J311394j1220256o887167J362229j247514j0291499
7945E3614548j2334583p094054m838763o757061m130415L651365O069615p36730
7937B7443922p129362n425221K35547M511681Q931405J2777651Q278367n834502
7929D3789488j6444714j2472949r25412M242231J762388j97694k28163k889311
$$ plain form
7985 29528683 28473001 22861818 17999911 15888545 11963183 4616323 778780 5639130
7977 5639130 11748443 6630730 -9860717 -23277317 -21121783 -5862427 11072114 23197386
7969 23197386 32476142 41912131 50085737 53561729 51434796 45998596 40002760 34021221
7961 34021221 26551250 16940713 7551168 1460805 -1067133 -386662 7810736 29190879
7953 29190879 59052881 80587361 81898755 70678499 63791332 65153561 63906047 53614548
7945 53614548 41279965 34185911 29347148 22590087 18459672 22111037 28180652 27443922
7937 27443922 20314560 14889339 15124886 19636567 28567972 41345623 49623990 43789488
7929 43789488 27344774 14871825 13946413 18188644 19951032 19753338 19525175 16635864
7921A6635864n756474j627039P226511J0253079M881963m90462j300372k609804
7913B7213266p031382q401876k688713M354374O144553L903704J150025k406331
7905B2237620n714349l380224M773025Q635323J430719p644388n149520O205155
7897B1393361J1120122M769196p53010L562951R216243L724671r759455j6870411
7889B6403668j2348242n086402k550062m78514P125863J5269040J3007113j486939
7881C9855525j7673924k4104751j8067406m402178R434525J6224976J2669336
7874A3936103K898729n303474r015446j0709711j0284778m092262N559327Q954322
7866h057190L149478r25628N215831J1684292L660966j3391512j7817317k323083
$$ plain form
7921 16635864 10879390 9252351 16478862 26731941 31613904 31123442 29823070 27213266
7913 27213266 20181884 11780008 9091295 13445669 19590222 23493926 24643951 22237620
7905 22237620 16523271 13143047 17916072 26551395 27982114 20337726 15188206 21393361
7897 21393361 32513483 37282679 36529669 40092620 49308863 53033534 43274079 26403668
7889 26403668 14055426 8969024 6418962 5940448 13066311 28335351 41342464 39855525
7881 39855525 22181601 -1923150 -19990556 -24392734 -14958209 1266767 13936103
7874 13936103 16834832 11531358 2515912 -8193799 -18478577 -22570839 -17011512 -8057190
7866 -8057190 -4907712 -5833340 -617509 11066783 14727749 1336237 -16481080 -18804163
7858a8804163J4959383J5746182M610935k297528p69650J190182m4783K8147K935575
7849A7554280L703588j51666m435222n244264m012650l727862n109223q005900
7841i428919j1921592j3715042r478805p64043N362702N099735K909713M412616
7833b7523635P657670O389083O77456j406074N282554J4399502J4635718L636578
7825B3748852q878924j2723419p902024j359163K668606M145390K150375m281371
7817b431678j0271672p989873J772261Q001653L893517l558635m340347K83937
7809a4640837K514836K403989O603596J3960501J4243518M356329m584802k666224
7801B2190906M103365K762251p412782j3714066p318634N864901J3610959J1298439
$$ plain form
7858 -18804163 -3844780 11901402 16512337 14214809 13445159 14635341 14590558 14618705 17554280
7849 17554280 21257868 21106202 16670980 11426716 7414066 3686204 -1423019 -9428919
7841 -9428919 -21350511 -35065553 -44544358 -45308401 -39945699 -34845964 -31936251 -27523635
7833 -27523635 -19865965 -13476882 -12799426 -14205500 -8922946 5476556 20112274 23748852
7825 23748852 14869928 2146509 -5755515 -7114678 -4446072 -300682 1849693 -2431678
7817 -2431678 -12703350 -20693223 -18920962 -10919309 -7025792 -10584427 -14924774 -14640837
7809 -14640837 -12126001 -9722012 -3118416 10842085 25085603 29441932 24857130 22190906
7801 22190906 26294271 29056522 21643740 7929674 611040 6475941 20086900 31385339
7793C1385339M275378n74597j847619k522709m657517p079725q032324p976595
7785B969631p977543o456050o05095Q377216J4341853J2329477M059855m092396
7777B2946948p050557l978814K195700O070796K940655o035855j2964243j0716693
7769f592063r07792Q311959J1680605J0631670Q024628L693378k770982q390484
7761B3680919r370976n942801k033565q08879k406416n148967o926899o176798
7753a5134382l805171l512104p361301j1121305p583130M024465J5075379J6707853
7745a2709696R935824L515257L019219N778379O656959M919141L628001M875073
7737B9618157P713271R240854O194062k689713j3870355k0133731j7033439p544347
$$ plain form
7793 31385339 35660717 35086120 33238501 30715792 26058275 18978550 10946226 2969631
7785 2969631 -5007912 -11463962 -12069057 -3691841 10650012 22979489 27039344 22946948
7777 22946948 15896391 11917577 14113277 20184073 23124728 17088873 4124630 -6592063
7769 -6592063 -7499855 812104 12492709 23124379 31149007 34842385 32071403 23680919
7761 23680919 14309943 8367142 6333577 5524698 3118282 -2030685 -8957584 -15134382
7753 -15134382 -18939553 -22451657 -29812958 -40934263 -48517393 -44492928 -29417549 -12709696
7745 -12709696 -2773872 741385 3760604 9538983 16195942 21115083 24743084 29618157
7737 29618157 37331428 46572282 52766344 50076631 36206276 16072545 -960894 -8505241
7729h505241J474748O133038O618850L612937j816606m995414K3506J1954803
7721A4500621K0081879J5161178J015399r207879q259032j870053O29599j975779
7713C0075933m548807n759829r459133j5157283j4656915l603106Q659615R110323
7705e339202n19737m742889M102104J4496657J1672604k685750j4853597j7701331
7697a5571141j4943151r853717j253929Q619281J2971564J0486542P983933R613066
7689H052448J1322775R558966O919226M608195j662597j1899374j6914827j1536888
7681a552076m619694n964675j0684906q459413j877130r63187l446028K550334
7673c5016775J5986064K0543800R513674k610051j428131P326869Q907906Q85399
$$ plain form
7729 -8505241 -7030493 -897455 5721395 9334332 7517726 2522312 2545818 14500621
7721 14500621 34582500 49743678 50759077 41551198 33292166 31422113 32051712 30075933
7713 30075933 25527126 19767297 10308164 -4849119 -19506034 -23109140 -14449525 -5339202
7705 -5339202 -5858939 -10601828 -6499724 7996933 19669537 16983787 2130190 -15571141
7697 -15571141 -30514292 -40368009 -41621938 -33002657 -20031093 -9544551 -1560618 8052448
7689 8052448 19375223 28934189 35853415 40461610 38799013 26899639 9984812 -1552076
7681 -1552076 -6171770 -12136445 -22821351 -31280764 -33157894 -34121081 -37567109 -35016775
7673 -35016775 -19030711 1513089 11026763 8416712 6988581 14315450 23223356 24108755
7665B4108755p022822p558945j152354P800875J1953770M312419j1412746j9822175
7657A206777j1737413K818981Q458754M739669J991391L097379K775025J178380
7649A4528943L555251P171309K996383q038546j3981376j0072923n274664o357165
7641a5472788p793106l502250K515508M632512N087595P159071P210202J806100
7633A642844m416620o134898n841055o748514m432678M370086J0993033N234057
7625e333745p039863r766748L44312R391479P095558L33784M78604O391728P847333
7616I742442Q87501q085066j2249796j2052649j1480575j0764451o434498J946890
7608d8490202Q894265R358912N616422L842102N386469O908144Q231598J2227661
$$ plain form
7665 24108755 17085933 9526988 8374634 16175509 28129279 32441698 21028952 1206777
7657 1206777 -10530636 -7711655 747099 5486768 7478159 10575538 13350563 14528943
7649 14528943 18084194 25255503 28251886 20213340 6231964 -3840959 -9115623 -15472788
7641 -15472788 -23265894 -26768144 -24252636 -19620124 -14532529 -7373458 -163256 1642844
7633 1642844 -2773776 -8908674 -14749729 -21498243 -25930921 -21560835 -10567802 -5333745
7625 -5333745 -12373608 -22140356 -21796044 -12404565 -5309007 -4975223 -4496619 1895109 9742442
7616 9742442 10629943 2544877 -9704919 -21757568 -33238143 -44002594 -50437092 -48490202
7608 -48490202 -39595937 -30237025 -24620603 -20778501 -15392032 -8483888 -252290 11975371
7600A1975371J5743804J0388131l105821j1230109o250077O01158m734381j7059331
7592c671255j9503958r010839O96095J028090j365446J006634N387276O861275
7584a8572128O242737M613503J23875m470765j358703Q790956J2868001L102050
7576A1339526r943277j1580460l003438L229725K274400M67360K494945N571993
7568H50774O182357M417812J183030k754959n047272m066317j971918j319718
7560b526211j027495j24640j619325o662261r080408l468759M750406O273660
7552a3485033K360937K370702Q177553J1999684J0298963Q425654Q744010N561303
7544D4453773k793465p147513o07525R131916R447790j80024r365603j1832416
$$ plain form
7600 11975371 27719175 38107306 35001485 23771376 17521299 18122457 13388076 -3671255
7592 -3671255 -23175213 -32186052 -31489957 -30461867 -31827313 -30820679 -25433403 -18572128
7584 -18572128 -12329391 -7715888 -7592013 -12062778 -13421481 -4630525 8237476 11339526
7576 11339526 1396249 -10184211 -13187649 -9957924 -7683524 -7216164 -4721219 850774
7568 850774 7033131 11450943 12633973 9879014 4831742 765425 -1206493 -2526211
7560 -2526211 -3553706 -3678346 -5297671 -11959932 -21040340 -24509099 -19758693 -13485033
7552 -13485033 -11124096 -8753394 -575841 11423843 21722806 30148460 38892470 44453773
7544 44453773 41660308 34512795 33905270 43037186 52484976 52304952 42939349 31106933
7536C1106933j0676244r862515q772391o646250n975084q213133r722345n354853
7528c4115882M871002J4619426J7061377J1477982L646419o52831j526292k822565
7520A2558636n161646m496283J566569R166960J1871200P047024k731056j2450786
7512A7370618j7383370j5402210q701840j833553L077266P147638J0062807Q345961
7504B683317J150730n400343m213447L471995R022885O971950J016607j907531
7496A2796163o73893l14847m144170q573565p574906q70248N409192O712142N285405
7487H051273N269499O167810N432502M622291O581568P664763Q60315j1544795
7479C3105226j6660727p437991N840319P434752l939137j4000568j0558147L387121
$$ plain form
7536 31106933 20430689 10568174 1795783 -4850467 -10825551 -19038684 -28761029 -34115882
7528 -34115882 -29244880 -14625454 2435923 13913905 17560324 16907493 15381201 12558636
7520 12558636 7396990 2900707 4467276 13634236 25505436 32552460 29821404 17370618
7512 17370618 -12752 -15414962 -24116802 -25950355 -22873089 -15725451 -5662644 2683317
7504 2683317 3834047 -1566296 -5779743 -2307748 6715137 13687087 14703694 12796163
7496 12796163 12122270 11807423 7663253 -910312 -8485218 -9355466 -3946274 2765868 8051273
7487 8051273 13320772 19488582 24921084 29543375 36124943 43789706 44650021 33105226
7479 33105226 16444499 9006508 14846827 22281579 18342442 4341874 -6216273 -2829152
7471b829152J4232525J1602173k243321j4382703j3948589m344811J139564j773134
7463a2547448j174858J2152187K5998572K0104086l816832k0759506j5024851
7456D931350N7790L624078l297419l148802R708966K0948064J7012787J774751
7448E1611565j1220311j4516371j0180846l731810J78760n54247m025558o159011
7440A402171n711798n060581n293955m409525j696298O38751K074475M701228
7432a3355532O944505L068182o125103r323791J99859J1318566Q237641o085158
7424e120831j3229385o551567r9685m784851j0366376k735891J1640330J4055116
7416a7193140J628026q645078m341599P590181J4127455J2878130R492937O811845
$$ plain form
7471 -2829152 11403373 23005546 20762225 6379522 -7569067 -11913878 -10774314 -12547448
7463 -12547448 -13722306 -1570119 24428453 44532539 40715707 19956201 4931350
7456 4931350 4989140 8613218 5315799 2166997 11875963 32824027 49836814 51611565
7448 51611565 40391254 25874883 15694037 11962227 12140987 11586740 7561182 1402171
7440 1402171 -4309627 -9370208 -14664163 -19073688 -20769986 -20131235 -18056760 -13355532
7432 -13355532 -6411027 -3342845 -9467948 -18791739 -18591880 -7273314 964327 -5120831
7424 -5120831 -18350216 -24901783 -25001468 -29786319 -40152695 -42888586 -31248256 -17193140
7416 -17193140 -15565114 -24210192 -28551791 -20961610 -6834155 6043975 15536912 22348757
7408B2348757L824428O69372j501042l184080n058492n992121n074964l257707
7400B774151j433264J10357l88811m451937q672847p178586l86370M713838N107197
7391i806272N486582Q152338P375597k49598p394619o073133l25040M70906k999839
7382e363078j357924Q120377J6931902J6767845Q106498l402430j2797427j7080587
7374I925176j5758121j0977138m240967M945630J3785217J4584507N220866l735850
7366A3749320j826146N152163L276955p405711j2404921n172155M071938N839051
7358E280494M546470P659530J2856526J3992857J1120013O895899M73231p969245
7350E4855775j3496571j3509688j1528137q685575o56207J0580909J3087734K603589
$$ plain form
7408 22348757 26173185 26842557 25341515 22157435 17098943 11106822 6031858 2774151
7400 2774151 1340887 1451244 1062433 -3389504 -12062351 -19240937 -19627307 -14913469 -9806272
7391 -9806272 -4319690 3832648 11208245 10958647 3564028 -2509105 -2834145 -2363239 -5363078
7382 -5363078 -6721002 1399375 18331277 35099122 43205620 39803190 27005763 9925176
7374 9925176 -5832945 -16810083 -21051050 -16105420 -2320203 12264304 17485170 13749320
7366 13749320 11923174 17075337 20352292 12946581 541660 -4630495 -558557 5280494
7358 5280494 9826964 17486494 30343020 44335877 55455890 62351789 62825020 54855775
7350 54855775 41359204 27849516 16321379 7635804 6979597 17560506 30648240 33251829
7342C3251829p150434m078068K572952k694835j5226863j7060779n261026N892045
7334i755179R340715J1975977J5421463J0408974l817630j2979307r341992l635412
7326G617609n393033o813702R57090R030554M264336p896456j0965865k330785
7318a1530252N536305N887909M124187L809291J041509n001197q679936q411901
7310a3224085r330249j1799577q488327J827392Q298473L520195l954564k184224
7302c5334966N767700P285731N70628k776355L561715J0813291R199315L132683
7294B219742L891266J1518964J3933076M730691o842010q340712o28570M854416
7286B5336863K389831k352779l163146j839237k406096l305090j306077P84468
$$ plain form
7342 33251829 26101395 22023327 24596279 21901444 6674581 -10386198 -15647224 -9755179
7334 -9755179 -414464 11561513 26982976 37391950 33574320 20595013 11253021 7617609
7326 7617609 2224576 -4589126 -3632036 5398518 9662854 1766398 -9199467 -11530252
7318 -11530252 -5993947 -106038 4018149 7827440 8868949 3867752 -4812184 -13224085
7310 -13224085 -22554334 -34353911 -42842238 -41014846 -32716373 -29196178 -33150742 -35334966
7302 -35334966 -29567266 -22281535 -21710907 -24487262 -20925547 -10112256 -912941 2219742
7294 2219742 6111008 17629972 31563048 36293739 29451729 21111017 20482447 25336863
7286 25336863 27726694 25373915 22210769 20371532 17965436 14660346 13354269 14138737
7278A4138737k591382r836861j2201709n060618N530197R753644M678994l739909
7270F71093p372157l333855L974338P445780M501083o02888k370351l29041K110316
7261D694318K972568K669788J162507j700679l545586j475494L083184N664845
7253A3525451N277964N147022O055062M039551k853885r981212j1710412q470061
7245A029480m868783l335388k917331k351459j098379J231003L846692M754992
7237c709173M093625N299054R973923J3835688J1728238N233875Q50009R05006
7229D8210245P54343l986504j1169333j5074976j3292640q553017m871274l607515
7221a1590671l160899j551122J140779K943736K286873m53224l374453l955824
$$ plain form
7278 14138737 11547355 1710494 -10491215 -15551833 -10021636 -267992 4411002 671093
7270 671093 -6701064 -10034919 -6060581 1385199 5886282 5283394 2913043 2584002 4694318
7261 4694318 7666886 10336674 11499181 9798502 6252916 4777422 7860606 13525451
7253 13525451 18803415 23950437 30005499 34045050 31191165 21209953 9499541 1029480
7245 1029480 -3839303 -7174691 -10092022 -12443481 -13541860 -12310857 -8464165 -3709173
7237 -3709173 384452 5683506 15657429 29493117 41221355 46455230 47305239 48210245
7229 48210245 48964588 44978084 33808751 18733775 5441135 -3111882 -7983156 -11590671
7221 -11590671 -14751570 -16302692 -15161913 -12218177 -9931304 -10384528 -13758981 -17714805
7213a7714805j13685P385056J3419578J2363569M606732l559188p823765r970874
7205a407382j1921710j0362653k263449P436005J0026053M122617l063870n458845
7197a2893234l731188q75781K030606M153843M309102M251776P666476J3164574
7189A8076174J3093583L225108j0013692j6200656j2380400m328486J164627J518551
7181e845191j880515m942800l296057K732281O911520M736796N82652K196647
7173A195333Q851625J1140461M011082n701066q190926l044324J722614O87817
7165A0672616l623432n957273m586284j177900K264120M032995K371147k461543
7157A534446o210356l750648M597410J1810136J0958105K382881p156219j1376384
$$ plain form
7213 -17714805 -17828490 -10443434 2976144 15339713 19946445 16387257 8563492 -1407382
7205 -1407382 -13329092 -23691745 -25955194 -18519189 -8493136 -4370519 -7434389 -12893234
7197 -12893234 -16624422 -17500203 -15469597 -11315754 -7006652 -2754876 4911600 18076174
7189 18076174 31169757 34394865 24381173 8180517 -4199883 -8528369 -7363742 -5845191
7181 -5845191 -7725706 -12668506 -15964563 -13232282 -6320762 -1583966 -1001314 1195333
7173 1195333 10046958 21187419 25198501 19497435 11306509 8262185 9984799 10672616
7165 10672616 7049184 1091911 -3494373 -4672273 -2408153 1624842 3995989 1534446
7157 1534446 -4675910 -8426558 -3829148 7980988 18939093 21321974 14165755 2789371
7149B789371q981713k687406L614235P047529P560358P594810Q143305O257378
7141C1337867l14861p126558o783624O65808O682482N648477J457666q28137l461309
7132B7277811r742753j4504780r912262J335483Q080297O320436L547603N380625
7124A7782460P265719M341434J093383L398126O775298K022588r750239j6929013
7116A5999756j2875140l932722L16680j350677l311777j680246K478215N687586
7108A331675M450547k677841j1969384j5076585o689615Q190825J7708160J5045787
7100A0313569N202840j115187Q25289N632199N213272j088823n565505j852372
7092A7565282O398385R162874J947436r066216j4636388j2162060n979021r42160
$$ plain form
7149 2789371 -6192342 -8879748 -5265513 1782016 9342374 16937184 25080489 31337867
7141 31337867 31023006 23896448 17112824 17778632 24461114 30109591 31567257 30739120 27277811
7132 27277811 17535058 3030278 -6881984 -5546501 2533796 8854232 12401835 17782460
7124 17782460 25048179 29389613 30482996 33881122 40656420 42679008 32928769 15999756
7116 15999756 3124616 -808106 -491426 -1842103 -5153880 -6834126 -4355911 1331675
7108 1331675 5782222 3104381 -8865003 -23941588 -30631203 -22440378 -4732218 10313569
7100 10313569 15516409 14401222 15226511 20858710 26071982 24983159 19417654 17565282
7092 17565282 23963667 33126541 35073977 26007761 11371373 -790687 -6769708 -7711868
7084g711868J307535J721981K700965O047843R199666N860066n566007j6753939
7076c193758j8474115j2873233r156406p920833j54940J5412848K5195432J8379387
7068G214382K804376o419808p184719p673799q569046k585838Q696212J2415421
7060a302819L284135p172729o955303K0532J577599n098665j1193277q191045
7052c5031572L371147J4575347J4883195K368248j1125450j1221992P66753R128311
7044a2286013N961721J034050L485961O196957n88285j0548990j0718266k672862
7036b0135727J362452m81170J188038Q233625J1339005O441011R3931l830794
7028D210371q386973j1397259m289673J1048212J8526443R242753n224433r461220
$$ plain form
7084 -7711868 -6404333 -4682352 -1981387 4066456 13266122 19126188 13560181 -3193758
7076 -3193758 -21667873 -34541106 -43697512 -51618345 -51773285 -36360437 -11165005 7214382
7068 7214382 10018758 3598950 -3585769 -11259568 -19828614 -22414452 -13718240 -1302819
7060 -1302819 1981316 -5191413 -12146716 -12126184 -10548585 -15647250 -26840527 -35031572
7052 -35031572 -31660425 -17085078 -2201883 166365 -10959085 -22181077 -21414324 -12286013
7044 -12286013 -6324292 -5290242 -1804281 4392676 3804391 -6744599 -17462865 -20135727
7036 -20135727 -18773275 -19254445 -18066407 -9832782 1506223 7947234 8041165 4210371
7028 4210371 -4176602 -15573861 -19863534 -8815322 9711121 18953874 13729441 4268221
7020D268221l449571L612983Q158779J0507815P390073k100145r556312p205832
7012A1626011L24023L797031L181501L538080L047466k888095r676677q160360
7004D788980O69328O936854O511460L402909j103405r495832j7638955j5856217
6996b1784878m036289M871067J710345o535357o912333K678750J2356896J2842928
6988d808871M904459k874404l905113p67551r85728n543847o822184j113942L509691
6979a8407490j355616j0888754j3814647q238471q38586N575158J1960369J3743378
6971b2264659N629131n021692m567634N386156Q075961k578621j1563499n703226
6963c2608083O839105J0338537M010933p11912J958999P670290J0441022P329753
$$ plain form
7020 4268221 818650 4431633 12590412 23098227 30488300 28388155 18831843 11626011
7012 11626011 11950034 15747065 18928566 22466646 25514112 22626017 12949340 4788980
7004 4788980 5458308 12395162 18906622 22309531 21206126 11710294 -5928661 -21784878
6996 -21784878 -25821167 -20950100 -19239755 -25775112 -32687445 -30008695 -17651799 -4808871
6988 -4808871 95588 -2778816 -6683929 -7451480 -8437208 -13981055 -20803239 -21917181 -18407490
6979 -18407490 -19763106 -30651860 -44466507 -52704978 -53543564 -47968406 -36008037 -22264659
6971 -22264659 -16635528 -21657220 -26224854 -20838698 -12762737 -15341358 -26904857 -32608083
6963 -32608083 -25768978 -15430441 -11419508 -12131420 -10172421 -2502131 7938891 15268644
6955A5268644r57167p711847m190764P957345J5161973R599559N54664q3614M496423
6946D0095216L333830m122985r090715q251325n803458l672370n40278J688224
6938A3636139O16926M7698L872701O405303J51097r456405r943959j292369M094203
6929H131334J516530k52665L539658M646543l135363j1965275j1686680m858073
6921a4063991j162440k719920l285896J210556P808295J0593964O236598k326326
6913B290840o515099p03299Q888399R863864k49784j0623574j2158442p751528
6905a6958623l748959k4834N100992P909659N299906J787804K254241K867316
6897D487502j810261o969830l214040P764018J3602057Q203815p29767l427565
$$ plain form
6955 15268644 14311477 6599630 2408866 10366211 25528184 35127743 35682407 35598793 40095216
6946 40095216 43429046 39306061 30215346 21964021 16160563 12488193 11947915 13636139
6938 13636139 14253065 14300763 18173464 24578767 24729864 15273459 5329500 4037131 8131334
6929 8131334 9647864 9395199 12934857 17581400 14446037 2480762 -9205918 -14063991
6921 -14063991 -15226431 -17946351 -21232247 -20021691 -12213396 -1619432 4617166 2290840
6913 2290840 -4224259 -4927558 3960841 13824705 13574921 2951347 -9207095 -16958623
6905 -16958623 -20707582 -20732416 -15631424 -7721765 -2421859 -634055 1620186 4487502
6897 4487502 2677241 -4292589 -7506629 257389 13859446 22063261 21333494 17905929
6889A7905929J53834L633240L576857J488855k27211q73408j355573k851865m507825
6880A6942833l059574K571021O957896K705544r359521j8071999j2826506M422737
6872i717569J9731911J9886229M791194j2234397j7057115q195407L211999O788937
6864G205782L197088m61503j259716j818384l510754m288199l425805l178051
6856g539542m211909l659719L7872L658952L409006O12985J83967L692506O270465
6847B454583J811708r008920j7556515j5779258n035899O420189J3935706J9125432
6839c632974K1236366J4172964j808064j2926581p270449O262215P381850o938420
6831A6476907j7212651r486619N127171Q430144J153059k692724r2679j239111
$$ plain form
6889 17905929 18059763 21693003 25269860 26758715 26531504 25658096 24302523 21450658 16942833
6880 16942833 13883259 16454280 23412176 26117720 16758199 -1313800 -14140306 -9717569
6872 -9717569 10014342 29900571 34691765 22457368 5400253 -2795154 416845 7205782
6864 7205782 10402870 9941367 8681651 6863267 3352513 -935686 -4361491 -7539542
6856 -7539542 -11751451 -15411170 -15373298 -11714346 -8305340 -7692355 -7508388 -3815882 2454583
6847 2454583 4266291 -4742629 -22299144 -38078402 -43114301 -36694112 -22758406 -3632974
6839 -3632974 17603392 31776356 29968292 17041711 9771262 16033477 23415327 16476907
6831 16476907 -735744 -10222363 -5095192 3334952 4488011 1795287 1702608 463497
6823D63497r213471j3710167q313250k01458L261847N658918J1275784J4099468
6815C321168P572551k114077m216430j38709M13699k682178L14599J0384419J4777362
6806B7632404O345165l636103r66641J0661074J4448743K690852j4722540k3095789
6798A9357165j7208505k930391R353203J1885747M544744n625561j1432795j1406483
6790c462876p719872k012554L299983L889961m60197k211986M063334J0730294
6782F116087N505279r393249j7166769q657246N253144R352217L930176O36100
6774d424261M006818O905093L181947l514897n584232j074131N141413P631436
6766A2269186O014986M226443M426672L442551k075847q624143r355849m604503
$$ plain form
6823 463497 -8749974 -22460141 -30773391 -30974849 -27713002 -22054084 -10778300 3321168
6815 3321168 10893719 8779642 4563212 4424503 4838202 2156024 2470623 12855042 27632404
6806 27632404 33977569 30341466 29374825 40035899 54484642 57175494 42452954 19357165
6798 19357165 2148660 -781731 8571472 20457219 25001963 19376402 7943607 -3462876
6790 -3462876 -11182748 -13195302 -9895319 -6005358 -6465555 -8677541 -4614207 6116087
6782 6116087 11621366 2228117 -14938652 -23595898 -18342754 -8990537 -5060361 -4424261
6774 -4424261 -417443 6487650 9669597 6154700 570468 -503663 4637750 12269186
6766 12269186 18284172 22510615 26937287 30379838 28303991 19679848 10323999 5719496
6758E719496j852878l138845p89485Q967659J5935184Q161633j0499210k4293306
6750a789752k4624319j6594207q146197j762303K778882N568229P861217R867776
6742b6840674P255032l138958j4529488j5745971o449135K289645M443754O107767
6734d6608028J2497286J8252469J7009186J1494639O249304j448021j3592956
6727C853879k1116696j3653803L297709J2832010Q283785R9266m03799N319088
6719a488561Q975778P352873L612904J383762J379865J302424k264400q933336
6711A1321309j2087538o499416K181835K929928m609567q368820j670026O603696
6703a0198599O329343J872057L222111P723781M056805p264546j1642478k083989
$$ plain form
6758 5719496 3866618 727773 -61712 8905947 24841131 33002764 22503554 -1789752
6750 -1789752 -26414071 -43008278 -51154475 -52916778 -50137896 -44569667 -36708450 -26840674
6742 -26840674 -19585642 -22724600 -37254088 -53000059 -59449194 -57159549 -52715795 -46608028
6734 -46608028 -34110742 -15858273 1150913 12645552 18894856 17446835 3853879
6727 3853879 -17262817 -30916620 -27618911 -14786901 -6503116 -6403850 -6807649 -1488561
6719 -1488561 7487217 14840090 18452994 19836756 21216621 22519045 20254645 11321309
6711 11321309 -766229 -7265645 -5083810 -2153882 -6763449 -15132269 -16802295 -10198599
6703 -10198599 -3869256 -1997199 1224912 8948693 13005498 5740952 -5901526 -7985515
6695g985515R260522Q447213p26681m112196J617693N943472J223531p227666
6687F440373r763655m231004L963523R145768R532511O635286L147666O50142
6679B5520610j300952l067005k947569L82492M403903N000360J931869j218220
6671B8705488k306888k207001j480505J8240J21932l740051q645388q052738j611374
6662H01715K966896R20624k830258k149658J228846K544426K277650L041762L244318
6653A2046321J091463J03013K498625K232204n041729r769593K7065J6940993
6645B0128362J9832417L706816j2349268j3419973q765482j2393918j8009854
6638b1270900j0246484P617768J6318310R135756J26874J257024O803287O470606
$$ plain form
6695 -7985515 1275007 9722220 8995539 4883343 6501036 12444508 13668039 6440373
6687 6440373 -3323282 -7554286 -3590763 5555005 15087516 21722802 24870468 25520610
6679 25520610 24219658 21152653 18205084 18587576 22991479 27991839 29923708 28705488
6671 28705488 26398600 24191599 22711094 22729334 22851266 19111215 10465827 2413089 801715
6662 801715 3768611 4689235 1858977 -290681 938165 3482591 5760241 8802003 12046321
6653 12046321 13137784 13240797 15739422 17971626 12929897 3160304 3187369 20128362
6645 20128362 39960779 43667595 31318327 17898354 9132872 -3261046 -21270900
6638 -21270900 -31517384 -23899616 -7581306 1554450 1681324 2938348 9741635 16212241
6630A6212241J057460l460973p425748j2916935j4821851p864478J328634J127183
6622b6764467o712651p613058L652651J2765698N798344q973176j0981676L873968
6614c4954367J7218940J3443707m86126p188946k042410N444141P942262O743391
6606F120592L795605j365152n596109l335209L348637N178214k17499l800506
6598D128573M83144O115936N305306R11828j108673k723815p085431q243781p8207
6589b295120R749438Q493640j969719q202207o422318n476903q155769o154189
6581b0433147K407310P070878L879777M133618J3688902J8427100N375726j3160558
6573B1389606j4748475L50025J0334547L859365p512392j0811196q258416o271249
$$ plain form
6630 16212241 17269701 13808728 6382980 -6533955 -21355806 -29220284 -27891650 -26764467
6622 -26764467 -33477118 -41090176 -37437525 -24671827 -18873483 -27846659 -38828335 -34954367
6614 -34954367 -17735427 -4291720 -4777846 -11966792 -14009202 -8565061 -622799 6120592
6606 6120592 9916197 8551045 2954936 -380273 2968364 8146578 7929079 4128573
6598 4128573 4611717 10727653 16032959 16944787 15836114 13112299 6026868 -2216913 -2295120
6589 -2295120 7454318 15947958 13978239 5776032 -646286 -6123189 -14278958 -20433147
6581 -20433147 -18025837 -10954959 -7075182 -2941564 10747338 29174438 34550164 21389606
6573 21389606 6641131 6991156 17325703 21185068 13672676 2861480 -5396936 -11668185
6565a1668185k722389N198861J0892803O872391k627920o837718k689093L380680
6557b00570M964307J115826m773133o503779O31135J1847921J4210996K818164
6549B4110867r764775r510861j429557j327723r482586q930177O373829J8571012
6541H610029J1644717l190151l416716J1120090J8365683O537785j1012068j7613810
6533B1045559j4636917j2242730j0500634k180025J1308098J8958621J4500456
6526B6252428K951125p431425j2790846j2761906q352933k535446J483013L865701
6518i320289O747507R410470Q966324N595180K209043j309530p760910j4994998
6510d57203j4860076l946493Q881411J1105244J464069q131897o329773M541196
$$ plain form
6565 -11668185 -14390574 -9191713 1701090 8573481 5945561 -892157 -3581250 -200570
6557 -200570 4763737 5879563 1106430 -5397349 -4766214 7081707 21292703 24110867
6549 24110867 14346092 4835231 3405674 2077951 -7404635 -16334812 -9960983 8610029
6541 8610029 20254746 17064595 13647879 24767969 43133652 49671437 38659369 21045559
6533 21045559 6408642 -5834088 -16334722 -18514747 -7206649 11751972 26252428
6526 26252428 29203553 21772128 8981282 -3780624 -12133557 -14669003 -13185990 -9320289
6518 -9320289 -2572782 6837688 15804012 21399192 23608235 22298705 14537795 -457203
6510 -457203 -15317279 -19263772 -10382361 722883 2186952 -5944945 -12274718 -7733522
6502g733522J0889465L422017j1327088j7786445j0044907O50286N46433q776169
6494d0159930j3777031p737492K376861Q233734J0228167J1746475J1186778N568802
6486a2333636k748414q269652q111096k345443O806628J2843423Q244158m807268
6478a0721300j2960204p893341J415682J128673p155733r083423J230798J3790159
6470c0248689J7807452J4141542R245616N153871N25610m239644p892771j0487118
6462e994131j1109265p190089O68490O669988O023125O92738l536088l407512
6454a7182744J59530M194269N982212N660646O762651J0712394J1445528J626954
6446B9361440j4776807k3402724j6222128p91383J0983988J6049255J6857317
$$ plain form
6502 -7733522 3155943 6577960 -4749128 -22535573 -32580480 -31930194 -31383761 -40159930
6494 -40159930 -53936961 -61674453 -59297592 -51063858 -40835691 -29089216 -17902438 -12333636
6486 -12333636 -15082050 -23351702 -31462798 -33808241 -27001613 -14158190 -5914032 -10721300
6478 -10721300 -23681504 -31574845 -30159163 -29030490 -36186223 -45269646 -44038848 -30248689
6470 -30248689 -12441237 1700305 10945921 16099792 16625402 12385758 4492987 -5994131
6462 -5994131 -17103396 -24293485 -23624995 -16955007 -10931882 -10239144 -13775232 -17182744
6454 -17182744 -17023214 -12828945 -6846733 -1186087 5576564 16288958 27734486 29361440
6446 29361440 14584633 -8818091 -25040219 -25831602 -14847614 1201641 18058958
6439A8058958J2865546M121916k556290j364030K007600j863649j0401783j2680282
6431H187986p741422n909292r796273q212398M659639J6807437J4976127L949025
6423A6920829k181721o35151Q42222K05809K454879O793127O739957L608203N600840
6414D0348994J0752517N840491j1225241k2455303j4003749K412936N971492l842096
6406A3800041r874348m569932K231871K502896R09335K682203M201422J771277
6398A3654765q85555m15668m36754m176209q129720q729893p938311o946722k530230
6389b6534297M471635O242395J011930p47407P038631J2807538L796468j1924801
6381c837908j5435332m495661N525557O585551O162784Q471035N377886o636343
$$ plain form
6439 18058958 30924504 35046420 32490130 31126100 33133700 31270051 20868268 8187986
6431 8187986 446564 -5462728 -15259001 -23471399 -18811760 -2004323 12971804 16920829
6423 16920829 14739108 14103957 14946179 15151988 17606867 24399994 31139951 34748154 40348994
6414 40348994 51101511 56942002 45716761 23261458 9257709 11670645 17642137 13800041
6406 13800041 3925693 -644239 1587632 4090528 4999863 7682066 11883488 13654765
6398 13654765 12769210 12353542 11916788 7740579 -389141 -9119034 -17057345 -24004067 -26534297
6389 -26534297 -22062662 -15820267 -14808337 -15555744 -8517113 4290425 8086893 -3837908
6381 -3837908 -19273240 -23768901 -18243344 -11657793 -5495009 2976026 8353912 1717569
6373A717569j5232982q705274N851173J1554631L431424p716237r961952k150505
6365b1212153P075525Q164177Q8058q093610p998000k760638j084734k720059
6357b8541434L3822O711163P502300O44600k821555K195820N047673k540777j1254625
6348b3023013q969546r2240L371448J383048J788800L393323r54645q176642p667494
6339c8946961R65150P204127O605158N081184N668422M197479L9853j062480K336547
6330g911521M699355L932858M142085N716757L221256l976483r061992q678397
6322g916082o654341m278137K394329J1833343J4520692O523572l616034o786653
6314F020689l878648n5280L118633N349998N330734M441478M958291K998748o333981
$$ plain form
6373 1717569 -13515413 -22220687 -16369514 -4814883 -1383459 -9099696 -19061648 -21212153
6365 -21212153 -14136628 -5972451 -5884393 -13978003 -21976003 -24736641 -25821375 -28541434
6357 -28541434 -28507612 -21796449 -14294149 -13649549 -16471104 -14275284 -9227611 -11768388 -23023013
6348 -23023013 -31992559 -32084799 -28713351 -27330303 -25541503 -22148180 -23102825 -31279467 -38946961
6339 -38946961 -37981811 -30777684 -24172526 -19091342 -13422920 -9225441 -9185588 -10248068 -7911521
6330 -7911521 -3212166 720692 4862777 10579534 13800790 9824307 762315 -7916082
6322 -7916082 -14570423 -18848560 -16454231 -4620888 9899804 16423376 12807342 6020689
6314 6020689 2142041 2086761 5205394 10555392 15886126 20327604 25285895 28284643 21950662
6305B1950662j5472160j0226760O763126J4491018L357759r637197o718973M956993
6297I464468P919299J281465m085896o476070j0561776j1555125j970685J0451299
6289e533021J0981030J506139k840269J008653J680565l536292l964694K406540
6281A708651K410093r503566k0155210j8782279j3045730j2571224j0956004J739777
6273g9155492J9063565K5587551J8255218P590031J652548j42989k33850R8302
6265g285116j117230l217903k09571J0635221K0090196J5725074j554590j7700842
6257A5365239k2116015j6827729r048353k289770L000090O364238Q626421J2462446
6249d463433J8250130K1378954J6550015M221062q940620j6095829j5836848j1621309
$$ plain form
6305 21950662 6478502 -3748258 3014868 17505886 20863645 11226448 4507475 9464468
6297 9464468 17383767 18665232 14579336 8103266 -2458510 -14013635 -15984320 -5533021
6289 -5533021 5448009 6954148 4113879 5122532 6803097 3266805 -697889 1708651
6281 1708651 4118744 -5384822 -25540032 -44322311 -57368041 -69939265 -80895269 -79155492
6273 -79155492 -60091927 -34504376 -16249158 -8659127 -7006579 -7149568 -7383418 -7285116
6265 -7285116 -8402346 -11620249 -11829820 -1194599 18895597 34620671 33066081 15365239
6257 15365239 -6750776 -23578505 -32626858 -34916628 -31916538 -25552300 -16925879 -4463433
6249 -4463433 13786697 35165651 51715666 55936728 46996108 30900279 15063431 3442122
6241C442122o868651k411503J479449L762302M933009P236707R673178O782733
6233B8029346k751340j0373550p871761m64768n11648r363207j5931518j3753140
6225c2991586p707848j389414Q688019K0163553J9834925K480935j5976108j7287464
6217b4184988n329171K121086K64808J02807O776600J2051022J0834797R675964
6209A2312925J2547819J1160496j231378j5559480j7355831o673089K616670J770085
6201d11783l875225n788444l420003l3950O069390J7907602K9138436K6708420
6193F6294443Q323183j0272543j3231912m964503k584039j0628652j6044744r816139
6185G075094J41297L528679K417624K486968P55517o288633j1439407o951084
$$ plain form
6241 3442122 -3426529 -5838032 -4358583 -596281 4336728 11573435 21246613 28029346
6233 28029346 25278006 14904456 7032695 6567927 6056279 -3306928 -19238446 -32991586
6225 -32991586 -40699434 -42088848 -33400829 -13237276 6597649 9078584 -6897524 -24184988
6217 -24184988 -29514159 -27393073 -27128265 -27025458 -20248858 -8197836 2636961 12312925
6209 12312925 24860744 36021240 34789862 19230382 1874551 -4798538 -2181868 -411783
6201 -411783 -4287008 -10075452 -13495455 -13529405 -7460015 10447587 39586023 66294443
6193 66294443 74617626 64345083 51113171 46148668 43564629 32935977 16891233 7075094
6185 7075094 7216391 10745070 13162694 15649662 16405179 10116546 -1322861 -8273945
6177h273945J082760K425216M50024M616743J0604893O576791l031193p36242
6169A3715047J4665371K2616742J1165719o071316j2499588j0643417r990854
6162B2957704q890692l517750j742307j0863230k0771212j6917206l817436J923060
6154d1639069j837146j278158Q804762J6576195J2909145M502637J012340Q12401
6146a36893k785021r191012j2013442q499656j993146K761589L877027L549436
6138b4431118N474431R165078R109181L380021r52744J994872N397069j077059
6130H059731j2676016j3744844k156811N346257j328566r079386k177060J1708698
6122a6047997J1821352m569975j8006718j4292301j121202P363668R667662J1763104
$$ plain form
6177 -8273945 -7191185 -4765969 -4315945 300798 10905691 17482482 14451289 13715047
6169 13715047 28380418 50997160 62162879 56091563 43591975 32948558 22957704
6162 22957704 14067012 10549262 8806955 -2056275 -22827487 -39744693 -43562129 -41639069
6154 -41639069 -43476215 -44754373 -35949611 -19373416 -6464271 -1961634 -949294 -136893
6146 -136893 -2921914 -12112926 -24126368 -32626024 -34619170 -31857581 -27980554 -24431118
6138 -24431118 -18956687 -9791609 -682428 2697593 1744849 3739721 9136790 8059731
6130 8059731 -4616285 -18361129 -20517940 -15171683 -16500249 -25579635 -27756695 -16047997
6122 -16047997 -4226645 -8796620 -26803338 -41095639 -42216841 -34853173 -25185511 -13422407
6114a3422407J2086417M187118q293604j1397846R89735J6908641K0114358R548320
6106C0720732j520781l620398o63175k29198j941035r74128J639484l4185o291138
6097A7086178r453378m344518M340252Q832922Q561005Q620344R704236N551875
6089D8898916p273912k0894396k2345804q889308O840314J0275587J491318o259453
6081A843262m122148K478432M048954P00909m34302K717757N433920N059669L943547
6072B1670000L304473J470614n75682P89647M006935J920859o990752j3851104
6064A1744990j1122922l342493Q9184j796845k488824Q48895M506721N288871
6056C727577L975748J977284j56461j100303k64796l14526l606527p170447o378489
$$ plain form
6114 -13422407 -1335990 2851128 -5442476 -16840322 -15850587 1058054 21172412 30720732
6106 30720732 29199951 25579553 24916378 24687180 22746145 21772017 23411501 23377316 17086178
6097 17086178 7632800 3288282 7628534 16461456 25022461 33642805 43347041 48898916
6089 48898916 41625004 20730608 -1615196 -10504504 -3664190 6611397 8102715 1843262
6081 1843262 -2278886 199546 4248500 4949409 4515107 7232864 12666784 17726453 21670000
6072 21670000 24974473 26445087 25869405 26659052 30665987 32586846 25596094 11744990
6064 11744990 622068 -2720425 -2631241 -4428086 -6916910 -6068015 -1561294 3727577
6056 3727577 7703325 9680609 9524148 8423845 8159049 7844523 4237996 -2932451 -9310940
6047i310940k587038j166480k341179o37193N750745J1574389J2205875Q670638
6039B2158817L160135m152157j1154831j3019977r024098m320045j122988N295358
6031a2179786J6438931K3085188J6033688J14953j1137899j2324583r089771n824966
6023E115755m05961P253671J0463674M177403p170931j4191526j1779091k107664
6015h644670P910761J1007104N639447j202092j680514K077958R08486o783631
6007I232849j1276528n728791L763714P649292N465692K461152J77805j747706
5999I997479l6406O700203J1087495N738746m019468o914036l295806l715312
5991A5542895r710137r580994K411286J4899111J4751269M213996n209536q214717
$$ plain form
6047 -9310940 -11897978 -13064458 -15405637 -16042830 -10292085 1282304 13488179 22158817
6039 22158817 25318952 21166795 10011964 -3008013 -12032111 -16352156 -17475144 -12179786
6031 -12179786 4259145 27344333 43378021 43492974 32355075 20030492 10940721 5115755
6023 5115755 4709794 11963465 22427139 26604542 19433611 5242085 -6537006 -8644670
6015 -8644670 -733909 10273195 15912642 14710550 13030036 15107994 16016480 9232849
6007 9232849 -2043679 -7772470 -4008756 3640536 9106228 11567380 11745185 9997479
5999 9997479 9961073 16661276 27748771 33487517 29468049 22554013 19258207 15542895
5991 15542895 5832758 -3748236 -1336950 13562161 28313430 32527426 27317890 19103173
5983A9103173o294835M79007J1535523J8861610J2877398l765083j6114054j3137611
5975B3545128N65836J0963837R343569m55605p737077o673556j690419k26243
5967B7635470k324945k005652K134491M859378L856487L002149L231435k70966
5959D0117847o597098n602039N255286J0959560j018771j8484696j8695387j269855
5951D664847J0689347L480550j0182506j2406773l774415K774927J072849m609773
5943h290947q304611p018067j328432L337981R21111n634037m980801P575322
5935b3722481K1547710K3311556J1885905k284795r825212r015030l999715q26822
5927G071116k249301m226974j506036L103986K033529l793645m672846K239442
$$ plain form
5983 19103173 12808338 13287345 24822868 43684478 56561876 52796793 36682739 23545128
5975 23545128 24110964 35074801 44418370 43962765 36225688 29552132 27861713 27635470
5967 27635470 25310525 23304873 25439364 30298742 34155229 37157378 40388813 40117847
5959 40117847 33520749 27918710 33173996 44133556 43114785 24630089 5934702 4664847
5951 4664847 15354194 18834744 8652238 -3754535 -7528950 -4754023 -3681174 -8290947
5943 -8290947 -16595558 -23613625 -24942057 -21604076 -20682965 -26317002 -31297803 -23722481
5935 -23722481 -2174771 21136785 33022690 30737895 20912683 11897653 7897938 7071116
5927 7071116 4821815 594841 -911195 2192791 4226320 432675 -4240171 -2000729
5919b000729P898379O522545L918996M122504O49555r175474j3944388n427434
5911g436046M953723K638405o139446m868609N355350Q504982J327053k424296
5903A911116L302691P775292L592306k182207l559854n751609j1250802j0707019
5895a6870086J530365J4514339J4670485M043406n425389q343118p162194l803234
5887f845426M89488K049068l1736n0335N780055J1769863J0764667M912105J347725
5878C0185474J604854K210492J644998K05232k945484o663890o385230j383245
5870A8473201K148411J159575J924904Q651746J3274756O403330p525752j6531750
5862B7978421j7388502j4703528q779245K746176J4221250J6412478J0781063
$$ plain form
5919 -2000729 5897650 12420195 16339191 20461695 21111250 11935776 -2008612 -7436046
5911 -7436046 -2482323 156082 -5983364 -10851973 -5496623 3008359 4335412 1911116
5903 1911116 5213807 12989099 16581405 14399198 10839344 5087735 -6163067 -16870086
5895 -16870086 -15339721 -825382 13845103 17888509 12463120 4120002 -3042192 -6845426
5887 -6845426 -6355938 -4306870 -4338606 -4388941 1391114 13160977 23925644 28837749 30185474
5878 30185474 31790328 34000820 35645818 35851050 32905566 26241676 19856446 18473201
5870 18473201 20621612 21781187 23706091 32357837 45632593 52035923 44510171 27978421
5862 27978421 10589919 -4113609 -12892854 -10146678 4074572 20487050 31268113
5855C1268113P013561O985182L829226l233140o883204n967287p788023j3075814
5847A2148614j2763307m754203p5728n015546r716715l713128P841834J3382999
5839b665180J1266729O699735O26655p049845r997171l455546M946548M467352
5831D839277j904519k043310N761618J0500128O125165o70026l108646l716985
5823A5782702o240832p483912l912486J53521j507584o228327m700157O086985
5815h050090J7086483J6455249L099871j0977075j3133219m211801K828723p14472
5807B383669q907072j0699703m925306Q05652K730862L627064L889489j48050
5799a1243395o960895q270284j077689O505246O584459J789062j254275j875530
$$ plain form
5855 31268113 38281674 45266856 49096082 45862942 38979738 33012451 25224428 12148614
5847 12148614 -614693 -5368896 -5444624 -10460170 -20176885 -23890013 -16048179 -2665180
5839 -2665180 8601549 15301284 15927939 8878094 -1119077 -4574623 371925 4839277
5831 4839277 2934758 891448 6653066 17153194 23278359 22608333 19499687 15782702
5823 15782702 9541870 2057958 -1854528 -1701007 -3208591 -9436918 -14137075 -8050090
5815 -8050090 9036393 25491642 28591513 17614438 4481219 269418 3098141 2383669
5807 2383669 -6523403 -17223106 -22148412 -21342760 -18611898 -14984834 -11095345 -11243395
5799 -11243395 -18204290 -26474574 -27552263 -21047017 -14462558 -12673496 -13927771 -15803301
5791a5803301j998973N81720O865429R829491L129848o751866p958618j065528
5783a3171798K276144j576515l433276J664592N758260K668989n80043L726640
5775b667007R924406Q608800K586381L55679n94852q929224k0181352j8690515
5767b9587684j496249J4430711J4829091N743081R12491K290102K706466l47135
5759I480874m272351q871743j3609165j1740595J347160J6092794J6814377K507994
5751G749345j0774608j0524642j581796L806987J324080m598685q434264o689913
5743b9723496J446236J1169421J3662769O056125k897454k365491O896610J3540867
5735A7785587J0092044J605792j925124J542023M460389O28250o078976p047936
$$ plain form
5791 -15803301 -17802274 -17220554 -10355125 -525634 2604214 -4147652 -12106270 -13171798
5783 -13171798 -10895654 -12472169 -15905445 -14240853 -8482593 -5813604 -6393647 -2667007
5775 -2667007 7257399 15866199 18452580 18808259 18213407 9284183 -10897169 -29587684
5767 -29587684 -31083933 -16653222 -1824131 3918950 4831441 7121543 9828009 9480874
5759 9480874 5208523 -3663220 -17272385 -29012980 -27665820 -11573026 5241351 7749345
5751 7749345 -3025263 -13549905 -15131701 -11324714 -10000634 -14599319 -23033583 -29723496
5743 -29723496 -28277260 -17107839 -3445070 2611055 -286399 -2651890 4244720 17785587
5735 17785587 27877631 29483423 27558299 29100322 33560711 34188961 28109985 21062049
5727B1062049j134883L595884J093089n369813r855244j1667085j1657416o905237
5719b0838656K958297R068592L447408o662777o174584O220028J5683968J2282666
5711A5984942K310951m936354r157875j1724509q425369J622327R678916R631514
5703D984543P972589J1496627J3480721M315173j0626025j7149336j2299984n260120
5695c085812r77910L681291Q345157P169369J57504n042607m966683l888548l656354
5686b264593l09330O184223Q623839L362925l469925m712445q15556L337720M499555
5677A4436413J868302k597070l796584O07581M335709m3919q710674j0899924
5669d800166n147173l93143m27105L85559L813846L772866p7242J448898J0580340
$$ plain form
5727 21062049 19927166 23523050 24616139 19246326 9391082 -2276003 -13933419 -20838656
5719 -20838656 -17880359 -8811767 -5364359 -12027136 -18201720 -11981692 3702276 15984942
5711 15984942 18295893 13359539 4201664 -7522845 -15948214 -14325887 -4646971 4984543
5703 4984543 12957132 24453759 37934480 42249653 31623628 14474292 2174308 -3085812
5695 -3085812 -4063722 -382431 7962726 15132095 15289599 10246992 5280309 1391761 -2264593
5686 -2264593 -2573923 3610300 12234139 15597064 12127139 7414694 6599138 9936858 14436413
5677 14436413 16304715 13707645 9911061 10518642 14854351 14810432 6099758 -4800166
5669 -4800166 -9947339 -10340482 -10767587 -10382028 -6568182 -2795316 -2872558 -1423660 9156680
5660I156680J5421863P822935l304742o008148k053489J98651k57947n87763k302728
5651A8085312n582222m656593Q25641L26138r921024j5519442n160663Q181705
5643a3421148O109750m481110j935352J4115785K1619083J1071981k191197n062959
5635B5824833l779657n991078n722347K291983R232765N982274j508409k648207
5627B3682157J217617J659667k747706p068031q997100r080129o961251l625511
5619a1920287k076746j431250K623734P842505N627572l595100o632967K785299
5611f777240J1873940P149724m917523q481192j945658L027360J211956j685283
5603e43916k016470k494112l571194j685916L206151P413748J0491079J3767412
$$ plain form
5660 9156680 24578543 32401478 29096736 23088588 21035099 21233750 20975803 20388040 18085312
5651 18085312 12503090 7846497 8672138 8998276 -922748 -16442190 -21602853 -13421148
5643 -13421148 -7311398 -11792508 -13727860 387925 22007008 33078989 30887792 25824833
5635 25824833 22045176 16054098 10331751 12623734 21856499 27838773 26330364 23682157
5627 23682157 24899774 26559441 23811735 16743704 7746604 -1333525 -8294776 -11920287
5619 -11920287 -13997033 -15428283 -12804549 -4962044 665528 -2929572 -9562539 -6777240
5611 -6777240 5096700 12246424 7328901 -1152291 -3097949 -70589 1141367 -543916
5603 -543916 -2560386 -5054498 -8625692 -10311608 -7105457 308291 10799370 24566782
5595B4566782J3224421L806879r486063j5168696j0973566o231030p009354q883203
5587a6153830p441178n981998p357384o481460J596557J1309684J2264792L967948
5579a4276869j837333M318218J6364417J8278512L871614j3279206j5160485k532944
5571d254076O232913J175487n945771j583163P637631O166486m554089q215046
5563c339628P1102O782760K434785m613622l684637J849488L128528J053391K243812
5554E925979N720927M233557l357462r597480q436158k068214K875327K835774
5546a867750N60314J458168N927066P045464r6900q715427p318700L561023J0769423
5537A1322681P218457J195911J605114L908031j93381o915643n825583L071656
$$ plain form
5595 24566782 37791203 41598082 32112019 16943323 5969757 -261273 -7270627 -16153830
5587 -16153830 -23595008 -29577006 -36934390 -43415850 -41819293 -30509609 -18244817 -14276869
5579 -14276869 -16114202 -11795984 4568433 22846945 26718559 13439353 -1721132 -4254076
5571 -4254076 1978837 3154324 -2791447 -4374610 3263021 9429507 4875418 -3339628
5563 -3339628 -3268526 3514234 5949019 1335397 -2349240 -499752 2628776 3682167 5925979
5554 5925979 11646906 15880463 12523001 2925521 -5510637 -7578851 -4703524 -1867750
5546 -1867750 -1307436 150732 6077798 13123262 13026362 4310935 -3007765 553258 11322681
5537 11322681 18541138 19737049 21342163 25250194 25056813 18141170 12315587 15387243
5529A5387243R412469Q273640M850844K894160o75983o647058q810585l879040
5521B0805690J294458p98324o624342o864308o64982L369247O55306k598269L46052
5512H920528N581389L998056m604518j0228374o536095P76709L250857J800426
5504B958978L432444R008963J1677145P379342M16215l067909k197890j94832
5496B9412456j91190l820892j0295244j5469136j5187782j0430779n678947k216058
5488c3877572K135483O431974O073852P34355l277723j419506L802494Q620444
5480a0776199J2881102J5522381J1835342Q59927r725444j2303872r036615p098538
5472g841916p780765o451525p21242P175276J4209279J7834253J5633087Q372571
$$ plain form
5529 15387243 24799712 33073352 37924196 40818356 40142373 33495315 24684730 20805690
5521 20805690 22100148 21301824 14677482 7813174 7148192 10517439 11172745 8574476 8920528
5512 8920528 14501917 18499973 13895455 3667081 -2869014 -2092305 1158552 2958978
5504 2958978 6391422 15400385 27077530 34456872 34873087 31805178 29607288 29412456
5496 29412456 29221266 25400374 15105130 -364006 -15551788 -25982567 -31661514 -33877572
5488 -33877572 -31742089 -25310115 -19236263 -18501908 -21779631 -23199137 -19396643 -10776199
5480 -10776199 2104903 17627284 29462626 30322553 20597109 8293237 -743378 -7841916
5472 -7841916 -15622681 -22074206 -22795448 -15620172 -1410893 16423360 32056447 40429018
5464D0429018J098788k964883o296508j0398491j0060068j253622R081282R853961
5456B9489477R76681o617205n934521r77941K041594K883343L974104M855071
5448C0690603L563266L03006k910422m781318n977037q408584j2132620j2708130
5440a2361236n603340N021586Q056709M63947o263551k077149N793071L672765
5432c297198o713760j0725642l650098L518313L161921J393132L832202M428890
5424h052240k446641r139070n120843O078140J1343553O199163j171934l025784
5416e335656p46265M57868p10964j384076R95086N221426O821338L191550j661590
5407F848717j055974M543321O601022M35645p112009o984798p91422K069446j921592
$$ plain form
5464 40429018 41527806 38562923 32266415 21867924 11807856 10554234 19635516 29489477
5456 29489477 30466158 23848953 17914432 16936491 18978085 21861428 25835532 30690603
5448 30690603 34253869 34556875 31646453 26865135 20888098 12479514 346894 -12361236
5440 -12361236 -17964576 -12942990 -4886281 -4422334 -10685885 -12763034 -6969963 -3297198
5432 -3297198 -10010958 -20736600 -24386698 -20868385 -17706464 -16313332 -12481130 -8052240
5424 -8052240 -10498881 -19637951 -24758794 -18680654 -7337101 -1137938 -2309872 -5335656
5416 -5335656 -6081921 -5624053 -6335017 -7719093 -6724007 -1502581 5318757 8510307 6848717
5407 6848717 5792743 10336064 16937086 17372731 10260722 3275924 2484502 4553948 2632356
5398B632356o272307m142515L252034R226429Q996863L145932l857845p409891
5390E571056o096876j680683L963197R987776J4109858J2407587M385687m204127
5382C8443475p101906m668668k129062k282162l782765n516099p846844r022855
5374c906886n130843L942884J1862090J2341602O368799k62108n078100j0093572
5366A0043866j4780301j3710561m967050L635165L264004k949455l464754M658812
5358a8270274J0994483P291809q61779l915221j909808K50022L948426J1883707
5350I411365J6762006Q719539p014613j3759418o510147J807318Q90013l347540
5342F958523k026223K172432K747239J630451L310531M341582m29238o728653
$$ plain form
5398 2632356 -3639951 -7782466 -4530432 4695997 13692860 16838792 12980947 5571056
5390 5571056 -525820 -2206503 1756694 11744470 25854328 38261915 42647602 38443475
5382 38443475 31341569 26672901 24543839 22261677 18478912 12962813 5115969 -3906886
5374 -3906886 -9037729 -5094845 6767245 19108847 25477646 25215538 20137438 10043866
5366 10043866 -4736435 -18446996 -23414046 -19778881 -16514877 -19464332 -22929086 -18270274
5358 -18270274 -7275791 16018 -845761 -4760982 -6670790 -6420768 -2472342 9411365
5350 9411365 26173371 34892910 27878297 14118879 7608732 9416050 10306063 6958523
5342 6958523 4932300 7104732 9851971 11482422 14792953 19134535 18705297 11976644
5334A1976644o701861j968140m78494l055354l216072R42909M288652L956710
5326E744994K585876J729099m49085m029008o296848o369461n149577j132187
5318a3366197P216251J5070564J4455960M969143n184915j0130991j1763144j2468733
5310a1202062r487588o61819R291903J3276042J0176029M936753J634053l98862
5302A7564449l549703o999221o331067Q43665R355458R735317p66287j2792709
5294G059902j3851398j849400J2615745J6486649N458100j2424324k2307277j5071050
5286b3883053K472681J3155615Q573545j423989k751796M294290P439226J12632
5278G989151j1510667j8005073j5440815m808252R518847J9360409J7604001O278856
$$ plain form
5334 11976644 5274783 3306643 2828149 -227205 -3443277 -2500368 1788284 5744994
5326 5744994 8330870 10059969 9610884 5581876 -714972 -7084433 -12234010 -13366197
5318 -13366197 -6149946 8920618 23376578 28345721 23160806 13029815 1266671 -11202062
5310 -11202062 -20689650 -21351469 -12059566 1216476 11392505 16329258 17963311 17564449
5302 17564449 14014746 7015525 684458 1528123 10883581 20618898 19852611 7059902
5294 7059902 -6791496 -8640896 3974849 20461498 25919598 13495274 -8812003 -23883053
5286 -23883053 -21410372 -8254757 318788 -1105201 -3856997 437293 7876519 7989151
5278 7989151 -3521516 -21526589 -36967404 -41775656 -32256809 -12896400 4707601 10986457
5270A0986457m460889o896817k066634L966166N834552J637505n028225o491448
5262b519333L79899Q068602O789443k216842q665871p657952m096696k510878
5254a2429628j378274L69061j74529l279174l907798J89664M240402M533790M508456
5245g328030P945412J1688755J0669123N862853J796483n87205l419437o698067
5237A9929887q354411q043273o887293m299660J639049J0482155J7776422J7737267
5229C9980143Q514464m118203j0353738o615790l16232l83715n409263p071826
5221A4225840l516274j511107n087393j0044392j1507767r544963n040871K574727
5213b9452200J0434847J2226516P019371K051198K967261O783744P705313M250242
$$ plain form
5270 10986457 6525568 -371249 -2437883 1528283 7362835 9000340 3972115 -2519333
5262 -2519333 -2139434 5929168 12718611 10501769 1835898 -5822054 -9918750 -12429628
5254 -12429628 -13807902 -13438841 -13613370 -16892544 -20800342 -20610678 -16370276 -11836486 -7328030
5245 -7328030 617382 12306137 22975260 28838113 30634596 30047391 26627954 19929887
5237 19929887 11575476 3532203 -3355090 -7654750 -6015701 4466454 22242876 39980143
5229 39980143 48494607 44376404 34022666 27406876 27090644 26706929 21297666 14225840
5221 14225840 10709566 9198459 4111066 -5933326 -17441093 -26986056 -32026927 -29452200
5213 -29452200 -19017353 -6790837 228534 2279732 5246993 12030737 19736050 23986292
5205B3986292k132647r107737j1296997l556301R594891J5318493Q227570k167612
5197B8865952n069909k357491k598405p511713j1682890j1240145o456301M85299
5189a7565603N314314L543569l213815p591766o335104l419160o98851N099436
5181b4866980J1629787Q992845l367125r735350L11017J3839858J2312061p96391
5173H319722o357684J480738R649383P908028O75015l621762j913467N432922
5165B1572895J4149860J4180252M93759j5096287j6238419n439941k92764o145107
5157G184248r645523k716111M986574M587174K330037N485568Q335419L970332
5149B4517718k016673k393474k569441r937166j6916246j0268104O549378J5326642
$$ plain form
5205 23986292 21853645 12745908 1448911 -2107390 7487501 22805994 31033564 28865952
5197 28865952 23796043 21438552 18840147 11328434 -354456 -11594601 -18050902 -17565603
5189 -17565603 -12251289 -8707720 -11921535 -19513301 -25848405 -29267565 -29966416 -24866980
5181 -24866980 -13237193 -4244348 -7611473 -17346823 -17035806 -3195948 9116113 8319722
5173 8319722 1962038 3442776 13092159 21000187 21675202 18053440 16139973 21572895
5165 21572895 35722755 49903007 50396766 35300479 19062060 13622119 13329355 7184248
5157 7184248 -2461275 -5177386 -190812 4396362 6726399 12211967 20547386 24517718
5149 24517718 22501045 20107571 17538130 7600964 -9315282 -19583386 -13034008 2292634
5141B292634P368202o324655j0717973l112601Q096936J3495025R333045n30292
5133A9900321q045144r514427r133343j0285805p834089L088199J4011399J0336677
5125B523788p074408j8701331j0276437Q532936J7026354R539398n03205o62582
5117D04513N938578Q715890M901452P19901N97997J833441M22463k965191n013004
5108A5556040m265078j200126L258250O576033M802157k456005r369913j0091282
5100B810076n883494k011580M72555M426959R138614R519774L833644l110999
5092A9195549o176401n123320k608275j218429l070332p461300q506898j256816
5084a6226222Q772930R728216Q733p347262k187033Q452237J1309530N917646
$$ plain form
5141 2292634 9660836 3336181 -7381792 -10494393 -2397457 11097568 20430613 19900321
5133 19900321 11855177 2340750 -6792593 -17078398 -24912487 -21824288 -7812889 2523788
5125 2523788 -4550620 -23251951 -33528388 -24995452 -7969098 1570300 1067095 404513
5117 404513 6343091 15058981 19960433 20680334 21278331 23111772 23534235 20569044 15556040
5108 15556040 11290962 10090836 13349086 19925119 24727276 22271271 12901358 2810076
5100 2810076 -3073418 -5084998 -4612443 -185484 8953130 18472904 22306548 19195549
5092 19195549 13019148 7895828 5287553 4069124 998792 -6462508 -14969406 -16226222
5084 -16226222 -7453292 2274924 2283657 -5063605 -7250638 1201599 12511129 18428775
5076A8428775K396869L651957J753925o801180j3273928r187947J200071P485458
5068E654000P019993N093564M256422J447948m154274p745854n954675j690488
5060C926636J543505N139136J0240001J1598635L976215p364625j0955991m387417
5052A3716095K887710L811299J997820J843491l63185p951384j3778498q580147
5044f416799M203957J1407522O713072l334189q821230n409054M577119J3549184
5036A6469582J3207706M001460l123284j291481J060055o673672j8099654j7613609
5028a2062897n133605K586216l161904j2091304j2768341o930291l30278O792674
5020d3099730J2540329R490684k717363j1678719q408232M08398N056078P199385
$$ plain form
5076 18428775 20825644 24477601 26231526 19430346 6156418 -3031529 -1831458 5654000
5068 5654000 12673993 17767557 22023979 23471927 19317653 11571799 5617124 3926636
5060 3926636 5470141 10609277 20849278 32447913 36424128 29059503 18103512 13716095
5052 13716095 16603805 20415104 22412924 24256415 23893230 15941846 2163348 -6416799
5044 -6416799 -2212842 9194680 15907752 12573563 3752333 -1656721 2920398 16469582
5036 16469582 29677288 33678748 30555464 29263983 30324038 23650366 5550712 -12062897
5028 -12062897 -17196502 -14610286 -17772190 -29863494 -42631835 -49562126 -49892404 -43099730
5020 -43099730 -30559401 -21068717 -23786080 -35464799 -43873031 -43464633 -38408555 -31209170
5012c1209170J1477265J3164585O880436o69365m2929N175150N078132L69047
5004A0223151r79518N54039j981649p185399p133414k969374l892403r488692
4996b2853259p587633O237590J9566407J9605634R353182Q61394r10795j210594
4988B3061926o049354j4147765j7347181q598034Q732230K1567560K0678752J0695747
4980C8593881K085804k473751o603067r475738o767035p39112J167656j679605
4972A4109033k207880K053470N090350K838211j205839l227509l912550l759897
4964I777389j559768K85951k619881p202897m330941O345149J2347733N170224
4956A8212959p005795j0769899n356118r24418l003961o688709m992163L092928
$$ plain form
5012 -31209170 -19731905 -6567320 313116 -356249 -399178 4775972 9854104 10223151
5004 10223151 9243633 9797672 7816023 630624 -6502790 -9472164 -13364567 -22853259
4996 -22853259 -30440892 -24203302 -4636895 14968739 24321921 25183315 24272520 23061926
4988 23061926 17012572 2864807 -14482374 -23080408 -14348178 7219382 27898134 38593881
4980 38593881 40679685 38205934 31602867 22127129 15360094 14620982 15788638 14109033
4972 14109033 11901153 13954623 19044973 21883184 20677345 17449836 13537286 9777389
4964 9777389 8217621 8503572 5883691 -1319206 -5650147 695002 13042735 18212959
4956 18212959 11207164 437265 -4918853 -5843271 -8847232 -15535941 -20528104 -17435176
4948a7435176J2492827J5980385R276228m004673j3282246j0399138J574522J0791438
4940D994167Q090702m532287j6169229j7080921p057541N790143J3634655J4433305
4932B102994R663271J605065n029337m491929K207667N768656P13038n779741
4924F759684m463473J368021J675536l074333k158072P835189J6882428J5499420
4916D0324400N787507m184517r323382q706875m983796m015895q380708j1448823
4908d932089n914636L161198M530920p22699k16018Q413028J2021426L029277
4900A9370407q258618j0347628o867816o455297p334703l329701L066130N055146
4892a5102080L158813K502742L331910K858602J797290J432499m20968l293014
$$ plain form
4948 -17435176 -4942349 11038036 20314264 16309591 3027345 -7371793 -5797271 4994167
4940 4994167 13084869 8552582 -7616647 -24697568 -31755109 -25964966 -12330311 2102994
4932 2102994 11766265 13371330 8341993 3850064 6057731 11826387 12539425 6759684
4924 6759684 2296211 3664232 5339768 2265435 107363 7942552 24824980 40324400
4916 40324400 46111907 41927390 32604008 23897133 18913337 14897442 6516734 -4932089
4908 -4932089 -10846725 -7685527 -3154607 -3877306 -4093324 4319704 16341130 19370407
4900 19370407 11111789 764161 -6103655 -12558952 -19893655 -23223356 -20157226 -15102080
4892 -15102080 -11943267 -9440525 -6108615 -3250013 -1452723 -20224 -441192 -3734206
4884c734206o01145R219023J5089402P167747p091455j1872221m430937L251797
4876F998005K294212l704948o811183m081582J729949N315690L257276j279398
4868C718021j325670L555178N489711Q85665k795526J022336P211100P729618
4860B5490433L680657K62205k592343n499755l798987L345000O438120m43955
4852B6881375q076423o976851m072682r157678j4522251p139864O625856J0196571
4844f241947N313277P483303J5380549J1158938o314731j5291996n567861N797504
4836A1717036L811437k425310m37235L924962J565201j418826J887403K377472
4828B1002140q189516j7002946q138695R238912J2585988j86922j0023683o899214
$$ plain form
4884 -3734206 -4335351 4883672 19973074 27140821 20049366 8177145 3746208 6998005
4876 6998005 9292217 5587269 -1223914 -5305496 -3575547 1740143 4997419 3718021
4868 3718021 2392351 5947529 11437240 12322905 9527379 10549715 17760815 25490433
4860 25490433 29171090 29433295 26840952 21341197 17542210 20887210 27325330 26881375
4852 26881375 18804952 11828101 7755419 -1402259 -15924510 -23064374 -16438518 -6241947
4844 -6241947 -928670 6554633 21935182 33094120 26779389 11487393 5919532 11717036
4836 11717036 15528473 13103163 12665928 16590890 18156091 16737265 18624668 21002140
4828 21002140 12812624 -4190322 -12329017 -3090105 9495883 9308961 -714722 -7613936
4820g613936J0689K478662M130772P790932Q523875M614400K196821L659631K769125
4811B8560971l516548q477681o312458q54822J684718J447527J304087O12245
4803A4448039k400281o388585q677122p715680k129905P714030J5611418J3182639
4795B3644553Q73316r993431r890313j629332M989105M927490Q10297k305213
4787A1426472j393201K642133M704773q9233r367279j4272369j0081036k331193
4779a8760933J165594M87266Q68074L125105L289415L95861k171034l382959n829179
4770b0812790q520362n397679M877524J3659032J2969750P085248N962859R758495
4762A9582077Q923359l20744j0264183j4141888j4722061j5133299j0429391K606575
$$ plain form
4820 -7613936 -7603247 -5124585 -993813 6797119 15320994 19935394 22132215 25791846 28560971
4811 28560971 25044423 16566742 10254284 9399462 11084180 12531707 13835794 14448039
4803 14448039 12047758 5659173 -3017949 -10733629 -12863534 -5149504 10461914 23644553
4795 23644553 24517869 14524438 4634125 3004793 7993898 12921388 13731685 11426472
4787 11426472 10033271 12675404 17380177 17290944 7923665 -6348704 -16429740 -18760933
4779 -18760933 -17595339 -17108073 -16239999 -13114894 -9825479 -9429618 -11600652 -14983611 -20812790
4770 -20812790 -29333152 -34730831 -29853307 -16194275 -3224525 3860723 9823582 19582077
4762 19582077 28505436 28184692 17920509 3778621 -10943440 -26076739 -36506130 -33899555
4754c3899555J4181979J1960678L8980m565992N216184J8146080K1303219J4643994
4746D7025567N070017m133101j1616463j3573506q728050k937280k232256m885604
4738C989324n777926m636772m236263m185960k714163j562507k691186k513821
4730b4329274L740085J2969526J6134958R826935P00628k939959m00464J911692
4722A7614127j595333r003581j2178258o158803L525556P034199L718260K882047
4714E838214Q812731J3046675P098111m440559j1388051j2492260j2945018j2219186
4706a8689343n984100J991403K388288m057172n215080M495172J5042702J5187315
4698E159185P548107K345791K289619J732692k177124n282557l624599O44385
$$ plain form
4754 -33899555 -19717576 -7756898 -7717918 -12283910 -7067726 11078354 32381573 47025567
4746 47025567 52095584 47962483 36346020 22772514 14044464 11107184 8874928 3989324
4738 3989324 -1788602 -6425374 -10661637 -14847597 -17561760 -19124267 -21815453 -24329274
4730 -24329274 -20589189 -7619663 8515295 18342230 19042858 16102899 15702435 17614127
4722 17614127 16018794 7015213 -5163045 -11321848 -7796292 -762093 2956167 5838214
4714 5838214 14650945 27697620 34795731 30355172 18967121 6474861 -6470157 -18689343
4706 -18689343 -24673443 -22682040 -20293752 -24350924 -29566004 -25070832 -10028130 5159185
4698 5159185 12707292 15053083 17342702 19075394 16898270 11615713 7991114 8635499
4690H635499K652143J334177j9283O75519R06680j977696m848470k491648K339128
4681G206049k63174j2343193k0975845j3817600L443947J4684362J4821994J2465493
4673E222033J2516654R201931o95561r524992r671216m119439j26193O16393j44443
4664C275167k669220o483733p415063l066831K761357N260078L845243n76490
4656e069492p354813j2026670q442174N85939L745290j659225l322864O460493
4648b7083516J5566243R540602m343102p143138K553807P934306J744383m267530
4640e497945j549208J774404k038204n350635R59977J0233902J0131414K421834
4632A1085539r03451K961993N133426N89637n487461p830557p604527o627850
$$ plain form
4690 8635499 11287642 12621819 12602536 13278055 14184735 12207039 7358569 4866921 7206049
4681 7206049 6942875 -5400318 -26376163 -40193763 -36749816 -22065454 -7243460 5222033
4673 5222033 17738687 26940618 26245057 16720065 7048849 2929410 2803217 3419610 3275167
4664 3275167 605947 -5877786 -13292849 -16359680 -13598323 -8338245 -4493002 -5069492
4656 -5069492 -12424305 -24450975 -32893149 -32307210 -28561920 -30221145 -33544009 -27083516
4648 -27083516 -11517273 -1976671 -6319773 -13462911 -10909104 -2974798 -1230415 -5497945
4640 -5497945 -7047153 -5272749 -7310953 -12661588 -11701611 -1467709 8663705 11085539
4632 11085539 10182088 13144081 18277507 18867144 13379683 5549126 -2055401 -8683251
4624h683251l529213J113761K740311j03939j917685K234804R057308J1162281
4616A2074377O773744J447847O52731L396760L884193j482948r565200j3685533
4608C495971j1261331o146613k203915K260885J0043442J7570333J7537019Q639716
4600C9935507k974365j2437697j9966783k4139476j8904647k759019J4396456
4593b6850024K0467584J4542860N057341k501898q421781j0954216n656317M722357
4585i594094Q578275m0863j1085340j0343205J336164R051049M252766m138808
4577a1984056k998495O741069J2109343O393387k286708l108766K764921N370655
4569A3001350J096418k598370J042183P842153Q545461J113887p955437j2649550
$$ plain form
4624 -8683251 -12212464 -11098703 -8358392 -8462331 -10380016 -8145212 912096 12074377
4616 12074377 18848121 20295968 20948699 24345459 28229652 26746704 17181504 3495971
4608 3495971 -7765360 -13911973 -16115888 -13855003 -3811561 13758772 31295791 39935507
4600 39935507 36961142 24523445 4556662 -19582814 -38487461 -41246480 -26850024
4593 -26850024 -6382440 8160420 13217761 10715863 2294082 -8660134 -14316451 -9594094
4585 -9594094 -1015819 -1056682 -12142022 -22485227 -21149063 -12098014 -7845248 -11984056
4577 -11984056 -14982551 -8241482 3867861 10261248 7974540 4865774 7630695 13001350
4569 13001350 14097768 11499398 12541581 20383734 28929195 30043082 22087645 9438095
4561I438095j2396143q528323j469270O884614J2259572J2110276Q236833L633036
4553C0168690q72698n153012p398529n745897j454468J239642j289862q136413
4545A357453j2896791q581920L864647J3825977J2000940J957786m407694j997722
4537E122676L652146P560160J1245965J4520323J0944919j769666j4297945j6896996
4529B0081582j2568902j0442895j0851437p057877J214335O913004P528693P359637
4521B176140P454572L805908k399856l139174L726624R188753N944813j059173
4513B5698607k966381L33892K417459O37145k232166l933132m945546o177454
4505H832424p715752q335657n137080K788190R722200Q212946L29672l160355
$$ plain form
4561 9438095 -2958048 -11486371 -12955641 -6071027 6188545 18298821 26535654 30168690
4553 30168690 29295992 24142980 16744451 10998554 9544086 10783728 9493866 1357453
4545 1357453 -11539338 -20121258 -16256611 -2430634 9570306 11528092 7120398 5122676
4537 5122676 8774822 16334982 27580947 42101270 53046189 51276523 36978578 20081582
4529 20081582 7512680 -2930215 -13781652 -20839529 -19625194 -12712190 -5183497 2176140
4521 2176140 9630712 13436620 11036764 7897590 11624214 20812967 26757780 25698607
4513 25698607 22732226 23066118 25483577 26120722 23888556 19955424 15009878 8832424
4505 8832424 1116672 -7218985 -12356065 -9567875 154325 8367271 8696943 5536588
4497E536588J978582P125762M531300j428265l899168n648812j1337085j4940152
4489a8081250p648691N684333J1028537M545564m620595r724062j1705699r359836
4481c9881699J104006J3766477J4861343K873806o310688j840739O858128O623824
4473a945542O91654J04870M318734M647522J125459J224214M754502M308072o856
4464A9222629J65188O427103J0523237Q314575M736208J868565n319145j6080310
4456B9858050j8890915p525357P260042J1120605M204268k668341l801266j780941
4448A7776145L47251J204343j385309p235079j0915524q384227k699364K757820
4440h533944J0575502K0757717K3201638J0637525o416869j1810084p421409q607762
$$ plain form
4497 5536588 7515170 14640932 19172232 17743967 13844799 8195987 -3141098 -18081250
4489 -18081250 -25729941 -20045608 -9017071 -4471507 -9092102 -18816164 -30521863 -39881699
4481 -39881699 -38777693 -25011216 -10149873 -7276067 -13586755 -15427494 -8569366 -1945542
4473 -1945542 -1253888 -1149018 3169716 7817238 8942697 10166911 14921413 19229485 19222629
4464 19222629 19387817 25814920 36338157 44652732 49388940 51257505 45938360 29858050
4456 29858050 10967135 3441778 10701820 21822425 26026693 23358352 19557086 17776145
4448 17776145 18123396 19327739 17942430 10707351 -208173 -8592400 -11291764 -8533944
4440 -8533944 2041558 22799275 46000913 56638438 50221569 38411485 30990076 22382314
4432B2382314j7050316j6640516m31579J6199174J7676963Q443773Q42785l933986
4424B7488612j0422609j5034562j1437346k997810K444244M792339P782223Q794100
4416A1409191M057770j416815r94474J537982p23429l841106l82160L985219k300202
4407A1331976j4948266j6904902m485683O597788N103127j875654m609259n250193
4399b5041066q580686j0910786p531563j861106R33591J716411K810541L790034
4391d4674630O484758J4480459K2998091K0824916Q193861k64435J860242J726001
4383C1629263r863840j9188884r692363R599020J4938584J422406j2745489j3170545
4375g071848l635156N890036J0073688O218999m406048j1496553m764816R927918
$$ plain form
4432 22382314 5331998 -11308518 -11740097 4459077 22136040 30579813 31422598 27488612
4424 27488612 17066003 2031441 -9405905 -12403715 -9959471 -5167132 2615091 11409191
4416 11409191 15466961 14050146 13055672 14593654 13870225 10029119 9646959 13632178 11331976
4407 11331976 -3616290 -20521192 -25006875 -18409087 -13305960 -15181614 -19790873 -25041066
4399 -25041066 -33621752 -44532538 -52064101 -53925207 -52991616 -51275205 -48464664 -44674630
4391 -44674630 -38189872 -23709413 -711322 20113594 28307455 28043020 29903262 31629263
4383 31629263 21765423 2576539 -7115824 2483196 17421780 18844186 6098697 -7071848
4375 -7071848 -10707004 -4816968 5256720 11475719 7069671 -4426882 -9191698 736220
4367G36220J5301804N465848p290102j0328992m086440M229126Q970576N783219
4359A8781259n534633j5070731j1026857L101151J1150109P012314J607274K777098
4351A2796984K913404n309970j4450392j4486717q579811m827220j419942P113976
4343b6249688J5956027J5993124R387240N905291O189418J732296q747122j5379268
4335D787318j2025678m822319j965480k875644k139270J318368L853580L162834
4327a0706291J050361O56109K423972L383367J393736m67270K730321R137046
4319I601351J0043855J713327p956789r893690o481951o815094j2301545j4970360
4311c7060896r597934l32523N911296P267435O696787P556416J0074351J0331079
$$ plain form
4367 736220 16038024 21503872 14213770 3884778 -201662 4027464 12998040 18781259
4359 18781259 13246626 -1824105 -12850962 -9749811 1400298 8412612 10019886 12796984
4351 12796984 15710388 10400418 -4049974 -18536691 -27116502 -31943722 -33363664 -26249688
4343 -26249688 -10293661 5699463 15086703 20991994 27181412 28913708 20166586 4787318
4335 4787318 -7238360 -12060679 -14026159 -16901803 -19041073 -17722705 -13869125 -10706291
4327 -10706291 -9655930 -8999821 -6575849 -3192482 -1798746 -2266016 464305 9601351
4319 9601351 19645206 21358533 13401744 3508054 -2973897 -9788991 -22090536 -37060896
4311 -37060896 -46658830 -46991353 -41080057 -33812622 -27115835 -19559419 -9485068 846011
4303H46011M548505l553999m470518L247783P023840k948695j5973979j2932701
4295b4213753N088217J5421037N199052j0450505j0713791K125523R135300K841498
4287e567422n773939o539777k426893R0001J563157M678134O890654N112964K940033
4278I66912N868364J1438770J1102006K235758p460937r577644m729877K00450
4270A0043802J456186J166357K088967L701117M107001K909341J152470M82544
4262B7107785K824492Q139811J1607171O696297o223876j7341560j7421663q649966
4254F738491j255626m88741k140939j214974R50306J008864J38491J576970M415247
4245I728089M867476K533360M44406r14301m153363q113343o365333K964446J0319799
$$ plain form
4303 846011 5394516 1840517 -2630001 617782 7641622 4692927 -11281052 -24213753
4295 -24213753 -19125536 -3704499 1494553 -8955952 -19669743 -17544220 -8408920 -5567422
4287 -5567422 -11341361 -17881138 -20308031 -20218030 -18654873 -13976739 -7086085 -1973121 966912
4278 966912 6835276 18274046 29376052 31611810 24150873 14573229 9843352 10043802
4270 10043802 11499988 12666345 14755312 18456429 22563430 25472771 26625241 27107785
4262 27107785 29932277 38072088 49679259 56375556 50151680 32810120 15388457 6738491
4254 6738491 5482865 4994124 2853185 1638211 2588517 3597381 3735872 5312842 9728089
4245 9728089 14595565 17128925 17573331 16659030 12505667 4392324 -1973009 991437 11311236
4236A1311236M847713r670715j6987716q939321L482867N257441k171263m393721
4228a7263479M130845J2386576R741825J032500k230144Q09720J385125k912149
4220G080819l509325N304229J5934198J6405557N539173o392840j0453610p407081
4212B2501120l359965j772427j985192k756660l878433m706240l814504j037604
4204h09905J842075L614549N306100P413199O758626n16213j2184544j9425557
4196h001670j5561443l741738O438781R014638O045985K826805J884186K377650
4188A283194K684408J719703p83623l318366k732992K491244R056155J1148403
4180B1548126O902268O94972k568121l481866n581193q297909p278103k330315
$$ plain form
4236 11311236 16158949 6488234 -10499482 -19438803 -15955936 -10698495 -12869758 -17263479
4228 -17263479 -13132634 -746058 8995767 10028267 7798123 8607843 9992968 7080819
4220 7080819 3571494 8875723 24809921 41215478 46754651 40361811 29908201 22501120
4212 22501120 19141155 17368728 15383536 12626876 8748443 4042203 227699 -809905
4204 -809905 1032170 4646719 9952819 17366018 24124644 23608431 11423887 -8001670
4196 -8001670 -23563113 -27304851 -20866070 -11851432 -5805447 -2978642 -1094456 1283194
4188 1283194 3967602 5687305 4903682 1585316 -1147676 1343568 10399723 21548126
4180 21548126 28450394 29145366 26577245 23095379 17514186 9216277 1938174 -392141
4172c92141L72078k923824p324452o619434k880667k160553l118557J619643J2199524
4163a1228383J8030815J1199474k651056j1201719r082870r15392N549743N608208
4155E308820o7237n957282o920372m653977n259363r051015q840380j565216N385649
4146c1620373N129598J966928L310305O519007L746195l402510n198105O90282
4138a8858673N751102M317460O99628n48758k085045o298135q291071l325878
4130b8639370L919001M747291j510805o923510n240865J998487Q974854J1224478
4122a1450439P875010J502671l504236m123299q86234L169908M978528K961382
4114E23291k078892o792420p512470l579198K353168P236976R598859R141279
$$ plain form
4172 -392141 -20063 -2943887 -10268339 -16887773 -19768440 -21928993 -25047550 -23427907 -11228383
4163 -11228383 6802432 18001906 15350850 4149131 -4933739 -5849131 -299388 5308820
4155 5308820 5241583 -715699 -7636071 -12290048 -17549411 -26600426 -35440806 -37006022 -31620373
4146 -31620373 -26490775 -24523847 -21213542 -14694535 -10948340 -14350850 -19548955 -18858673
4138 -18858673 -13107571 -8790111 -8090483 -8639241 -10724286 -17022421 -25313492 -28639370
4130 -28639370 -24720369 -19973078 -21483883 -28407393 -33648258 -31649771 -22674917 -11450439
4122 -11450439 -3575429 -2072758 -5576994 -9700293 -10586527 -7416619 -2438091 523291
4114 523291 -1555601 -8348021 -15860491 -19439689 -17086521 -9849545 -250686 8890593
4106H890593O367001K461520j934120o803486r928593o633683L653335J2757672
4098H830239J1497486J586197o297043o670795m616659n249591n483581j008109
4090g411856M631282M688095m7139j678230L976231J1662808J2664668M232087
4082C2717946p246512j1686410m885712O677623J2090971P355644j528214o584878
4074B6910458n594198j479572J833310J559966k051918m537526j837766K966880
4066A7769634K721383k624034m657857M21167M835472J248543m958696m003899
4058A0751713K046460J568248q699971j7561344j3816150k9910J1736295J3502153
4050e02506P099317q03777n463225o049737l642923M82789M099632L780675j516292
$$ plain form
4106 8890593 15257594 17719114 15784994 8981508 -947085 -7580768 -3927433 8830239
4098 8830239 20327725 21913922 15616879 8946084 4329425 -920166 -6403747 -7411856
4090 -7411856 -2780574 1907521 1860382 182152 4158383 15821191 28485859 32717946
4082 32717946 25471434 13785024 8899312 15576935 27667906 35023550 33495336 26910458
4074 26910458 21316260 19836688 21669998 23229964 21178046 16640520 14802754 17769634
4066 17769634 20491017 17866983 13209126 13630293 18465765 19714308 14755612 10751713
4058 10751713 12798173 14366421 5666450 -11894894 -25711044 -25740954 -14004659 -502506
4050 -502506 6596811 5793034 329809 -5719928 -9362851 -8880062 -4780430 -999755 -2516047
4041b516047p279177p692560l197277O26687K030336M779473R043916Q117768
4033C913119j006761j0454952j1409244o028563k383533k098879r90056J738696
4025b8720173L709863O179683J1454012J5055606J0070534q45715p281840n872500
4017C749470m085826p199174j0500618q142988k151361J860709K216170N58961
4009b3694657j581761k740079k310788k876400o612098q742063j752925J2019110
4001c8291661K0065989J5481859N341223r01889l209741n283997n203463k42252
3993a2243932M761546L323480j642530j609030M458233R108775P992803M667263
3985A8816608L122467K412196N92317j475162k599487l518861m538623m063252
$$ plain form
4041 -2516047 -9795224 -17487784 -20685061 -20058374 -18028038 -13248565 -4204649 3913119
4033 3913119 2906358 -7548594 -18957838 -24986401 -27369934 -29468813 -30458869 -28720173
4025 -28720173 -25010310 -18830627 -7376615 7678991 17749525 16903810 9621970 3749470
4017 3749470 -336356 -7535530 -18036148 -26179136 -28330497 -26469788 -24253618 -23694657
4009 -23694657 -25276418 -28016497 -30327285 -33203685 -39815783 -48557846 -50310771 -38291661
4001 -38291661 -18225672 -2743813 2597410 1695521 -1514220 -6798217 -12001680 -12243932
3993 -12243932 -7482386 -4158906 -5801436 -7410466 -2952233 6156542 14149345 18816608
3985 18816608 21939075 24351271 24943588 23468426 20868939 17350078 12811455 8748203
3977H748203j613262R475k071415o300536p418142k585832L893813M205838l087239
3968f219097r281608n654275M237231Q376771K556717m404046l895715J850485
3960a2433537O714944J0206592J2906433R628151k690680j4680473j3742565k454930
3952f546065L602719k204948q792477m695448N422580Q656212K020093n155773
3944g693107m366705L114218R899694J0268868L948871m323992q062145m141234
3936a355532M061935R579687Q711991M447832K247408K975576K167108k642648
3928C0193357o732904m139502K838948N675236J339730m477493p420842r922661
3920G353869j2749880r937058L42640P745494L262168m974224k287442R241499
$$ plain form
3977 8748203 7134941 7144416 5073001 -1227535 -8645677 -11231509 -7337696 -3131858 -6219097
3968 -6219097 -15500705 -21154980 -16917749 -8540978 -5984261 -10388307 -14284022 -12433537
3960 -12433537 -5718593 4487999 17394432 27022583 24331903 9651430 -4091135 -6546065
3952 -6546065 -2943346 -5148294 -13940771 -18636219 -13213639 -4557427 -2537334 -7693107
3944 -7693107 -12059812 -8945594 954100 11222968 15171839 10847847 2785702 -1355532
3936 -1355532 2706403 12286090 20998081 25445913 27693321 30668897 32836005 30193357
3928 30193357 23460453 19320951 22159899 27835135 29174865 24697372 17276530 7353869
3920 7353869 -5396011 -15333069 -14990429 -7244935 -3982767 -8956991 -11244433 -2002934
3912b002934J2789695K645941p134506m490563M113840O728429L924708L562764
3904B0137374N834051M694216l34223l802178l647188k985951l916908n487906
3896A0491287o282109m570476J254207Q176981Q675893M57370q380391r557204
3888B65558n059668j045029K753643Q802934J2220271O521687l848488q068770
3880A2542138m929988l111333n732575o519362k933667j110315l964873n388786
3872b1148761j380422K917990K996157K389048L765635J821803o548548j2908175
3864b8095273q030710L665548J0526780J0277891R738228J0674009P325204j596183
3856A4485494q739539q680074m712159j883868N7315K824842M153160J283082
$$ plain form
3912 -2002934 10786761 13432702 6298196 1807633 5921473 12649902 16574610 20137374
3904 20137374 25971425 30665641 30331418 26529240 22882052 19896101 15979193 10491287
3896 10491287 4209178 -361298 892909 9069890 17745783 18203153 9822762 265558
3888 265558 -4794110 -5839139 -3085496 5717438 17937709 24459396 20610908 12542138
3880 12542138 7612150 4500817 -1231758 -7751120 -10684787 -11795102 -15759975 -21148761
3872 -21148761 -22529183 -19611193 -16615036 -14225988 -10460353 -8638550 -15187098 -28095273
3864 -28095273 -36125983 -32460435 -21933655 -11655764 -1917536 8756473 16081677 14485494
3856 14485494 5745955 -2934119 -7646278 -9530146 -9472831 -6647989 -2494829 -1211747
3848a211747l009969k724192L320539Q817094O520318l184295j1360805r483802
$$ plain form
3848 -1211747 -4221716 -6945908 -3625369 5191725 11712043 8527748 -2833057 -12316859
$$ [...]
##END NTUPLES=NMR SPECTRUM
##END=
