##TITLE=31Pdec_DE-56rm_1h
 
 24 sc
 6.5.2024
##JCAMPDX= 6.0         $$ Bruker NMR JCAMP-DX V2.0
##DATA TYPE= NMR SPECTRUM
##DATA CLASS= NTUPLES
##ORIGIN= UXNMR, Bruker Analytische Messtechnik GmbH
##OWNER= root
$$ XWIN-NMR		Version 3.5
$$ Mon May  6 16:05:31 2024 Russian Standard Time (UT+4h)  she@DPX200
##.OBSERVE FREQUENCY= 81.013821
##.OBSERVE NUCLEUS= ^31P
##.ACQUISITION MODE= SIMULTANEOUS
##.ACQUISITION SCHEME= undefined
##.AVERAGES= 24
##.DIGITISER RES= 16
##SPECTROMETER/DATA SYSTEM= spect
##.PULSE SEQUENCE= zgpg30
##.SOLVENT NAME= CDCl3
##.SHIFT REFERENCE= (INTERNAL, CDCl3, 0, 248.564)
##AUDIT TRAIL= $$ (NUMBER, WHEN, WHO, WHERE, WHAT)
$$ ##TITLE= Audit trail, XWIN-NMR		Version 3.5
$$ ##JCAMPDX= 5.01
$$ ##ORIGIN= Bruker BioSpin GmbH
$$ ##OWNER= she
$$ F:/spectra/data/she/nmr/P31/1/pdata/1/auditp.txt
$$ ##AUDIT TRAIL=  $$ (NUMBER, WHEN, WHO, WHERE, WHAT)
(   1,<2024-05-06 16:03:58.18 +0400>,<she>,<DPX200>,
      <created by zg, POWCHK disabled, PULCHK disabled
       configuration hash MD5:
       00 E9 B6 7A A2 85 ED C7 34 08 36 98 17 FE 4E 26
       data hash MD5: 32K
       47 C0 F8 AE EA 4F 4F 1F C0 01 F3 30 B1 E8 C3 5D>)
(   2,<2024-05-06 16:04:00.90 +0400>,<she>,<DPX200>,
      <Start of raw data processing
       efp BC_mod = 2 LB = 10 FT_mod = 6 PKNL = 1 PHC0 = -13320.99 PHC1 = 267.8834 SI = 64K 
       data hash MD5: 64K
       17 40 3D BD 52 AD C2 50 B6 C8 35 8B EB 72 02 99>)
(   3,<2024-05-06 16:04:27.26 +0400>,<she>,<DPX200>,
      <pk PHC0 = 222.0918 PHC1 = -533 
       data hash MD5: 64K
       29 AD 12 10 FE FE F5 CC 2A 7D 27 8A C0 4F 8A 71>)
(   4,<2024-05-06 16:04:40.85 +0400>,<she>,<DPX200>,
      <abs ABSG = 5 
       data hash MD5: 64K
       BD 8E 01 7A 71 2E 23 8F FE 07 07 9E B5 C6 2C CD>)
(   5,<2024-05-06 16:04:57.93 +0400>,<she>,<DPX200>,
      <pk PHC0 = -8.675249 PHC1 = 0 
       data hash MD5: 64K
       25 6D 0B F4 A4 C9 78 AB 4D F4 CE 76 6F E3 DD 60>)
$$ ##END=
$$ 
$$ hash MD5
$$ 12 C6 90 8D 2B 28 F4 12 65 43 26 44 3C 75 C3 00
##$RELAX= 
##$RELAX= 
##$RELAX= 
##$RELAX= 
##$RELAX= 
##$RELAX= 
##$RELAX= 
##$RELAX= 
##$RELAX= 
$$ Bruker specific parameters
$$ --------------------------
##$DU= <F:/spectra>
##$EXPNO= 1
##$NAME= <P31>
##$PROCNO= 1
##$TYPE= <nmr>
##$USER= <she>
##$AMP= (0..31)
100 100 100 100 100 100 100 100 100 100 100 100 100 100 100 100 100 100 
100 100 100 100 100 100 100 100 100 100 100 100 100 100 
##$AQSEQ= 0
##$AQ_mod= 1
##$AUNM= <au_zg>
##$AUTOPOS= <>
##$BF1= 81.014009
##$BF2= 200.13
##$BF3= 200.13
##$BF4= 200.13
##$BF5= 200.13
##$BF6= 200.13
##$BF7= 200.13
##$BF8= 200.13
##$BYTORDA= 1
##$CFDGTYP= 0
##$CFRGTYP= 5
##$CHEMSTR= <none>
##$CNST= (0..31)
1 1 145 1 1 1 1 1 1 1 1 1 1 1 1 1 1 1 1 1 1 1 1 1 1 1 1 1 1 1 1 1 
##$CPDPRG= <waltz16>
##$CPDPRG1= <>
##$CPDPRG2= <waltz16>
##$CPDPRG3= <>
##$CPDPRG4= <mlev>
##$CPDPRG5= <mlev>
##$CPDPRG6= <mlev>
##$CPDPRG7= <mlev>
##$CPDPRG8= <mlev>
##$CPDPRGB= <>
##$CPDPRGT= <>
##$D= (0..31)
$$ [...]
##$SUBNAM3= <"">
##$SUBNAM4= <"">
##$SUBNAM5= <"">
##$SUBNAM6= <"">
##$SUBNAM7= <"">
##$SUBNAM8= <"">
##$SUBNAM9= <"">
##$SW= 501.771253377433
##$SWIBOX= (0..15)
0 1 3 0 0 0 0 0 0 0 0 0 0 0 0 0 
##$SW_h= 40650.406504065
##$TD= 32768
##$TD0= 1
##$TE= 0
##$TE2= 300
##$TE3= 300
##$TEG= 300
##$TL= (0..7)
0 120 53 12 22 120 120 120 
##$TP= (0..7)
150 150 150 150 150 150 150 150 
##$TP07= 0
##$TPNAME0= <>
##$TPNAME1= <>
##$TPNAME2= <>
##$TPNAME3= <>
##$TPNAME4= <>
##$TPNAME5= <>
##$TPNAME6= <>
##$TPNAME7= <>
##$TPOAL= (0..7)
0.5 0.5 0.5 0.5 0.5 0.5 0.5 0.5 
##$TPOFFS= (0..7)
0 0 0 0 0 0 0 0 
##$TUNHIN= 0
##$TUNHOUT= 0
##$TUNXOUT= 0
##$USERA1= <user>
##$USERA2= <user>
##$USERA3= <user>
##$USERA4= <user>
##$USERA5= <user>
##$V9= 5
##$VALIST= <valist>
##$VCLIST= <CCCCCCCCCCCCCCC>
##$VD= 0
##$VDLIST= <DDDDDDDDDDDDDDD>
##$VPLIST= <PPPPPPPPPPPPPPP>
##$VTLIST= <TTTTTTTTTTTTTTT>
##$WBST= 1024
##$WBSW= 4
##$XGAIN= (0..3)
0 0 0 0 
##$XL= 0
##$YL= 0
##$YMAX_a= 5390
##$YMIN_a= -4462
##$ZGOPTNS= <>
##$ZL1= 120
##$ZL2= 120
##$ZL3= 120
##$ZL4= 120
##$ABSF1= 248.5645
##$ABSF2= -253.2056
##$ABSG= 5
##$ABSL= 3
##$ALPHA= 0
##$AQORDER= 0
##$ASSFAC= 0
##$ASSFACI= 0
##$ASSFACX= 0
##$ASSWID= 0
##$AUNMP= <proc_1d>
##$AZFE= 0.1
##$AZFW= 0.5
##$BCFW= 0
##$BC_mod= 2
##$BYTORDP= 0
##$COROFFS= 0
##$CY= -3
##$DATMOD= 1
##$DC= 0
##$DFILT= <>
##$DTYPP= 0
##$F1P= 0
##$F2P= 0
##$FCOR= 1
##$FTSIZE= 65536
##$FT_mod= 6
##$GAMMA= 0
##$GB= 0
##$INTBC= 1
##$INTSCL= 6.047779e-11
##$ISEN= 30
##$LB= 10
##$LEV0= 0
##$LPBIN= 0
##$MAXI= 10000
##$MC2= 0
##$MEAN= 0
##$ME_mod= 0
##$MI= 50
##$NCOEF= 0
##$NC_proc= -10
##$NLEV= 6
##$NOISF1= 182.463
##$NOISF2= 159.3651
##$NSP= 0
##$NTH_PI= 0
##$NZP= 0
##$OFFSET= 248.5645
##$PC= 4
##$PHC0= -13107.58
##$PHC1= -265.1166
##$PH_mod= 1
##$PKNL= yes
##$PPARMOD= 0
##$PSCAL= 0
##$PSIGN= 0
##$REVERSE= no
##$SF= 81.0140089999694
##$SI= 65536
##$SIGF1= 159.3651
##$SIGF2= -187.1042
##$SINO= 113.3802
##$SIOLD= 16384
##$SREGLST= <1H.CDCl3>
##$SSB= 0
##$STSI= 65536
##$STSR= 0
##$SW_p= 40650.406504065
##$SYMM= 0
##$S_DEV= 0
##$TDeff= 32768
##$TDoff= 0
##$TI= <>
##$TILT= no
##$TM1= 0
##$TM2= 0
##$TOPLEV= 0
##$USERP1= <user>
##$USERP2= <user>
##$USERP3= <user>
##$USERP4= <user>
##$USERP5= <user>
##$WDW= 1
##$XDIM= 65536
##$YMAX_p= 446210113
##$YMIN_p= -33130929
$$ End of Bruker specific parameters
$$ ---------------------------------
##NTUPLES= NMR SPECTRUM
##VAR_NAME=  FREQUENCY,     SPECTRUM/REAL,   SPECTRUM/IMAG
##SYMBOL=    X,             R,               I
##VAR_TYPE=  INDEPENDENT,   DEPENDENT,       DEPENDENT
##VAR_FORM=  AFFN,          ASDF,            ASDF
##VAR_DIM=   65536,         65536,           65536
##UNITS=     HZ,            ARBITRARY UNITS, ARBITRARY UNITS
##FACTOR=    0.620285442955139, 1,           1
##FIRST=     20137.2065510682, 0,            0
##LAST=      -20513.1999529968, 0,           0
##MIN=       -20513.1999529968, -33130929,   0
##MAX=       20137.2065510682, 446210113,    0
$$ Real data points
##PAGE= N=1
##DATA TABLE= (X++(R..R)), XYDATA
$$ [...]
43154G418825K27152L47067M35536M77002M58123L78529K55248J16734q898j02975
43144A0002343j58690j79011j73943j58424j49442j61270k00258k62135l33697
43135H225473l97888m39583m49786m27216l77150l08308k29596j48367p0574k302
43125E374703M8019O8061M2800m0639j86586l86889o21568q63100j081493j247843
43115A105465j336077j325345j205953r87550p02238l95981j10970J29351L22688
43106d506610M78485O05867P07586P81630Q26312Q43272Q36112Q07033P55425
43097B135112O79865N81615M67123L48542K41773J61823J16993J05313J15948
43088D954107J34768J51123J62412J73534J90755K13931K33891K37678K16515
$$ y = [7418825, 7645977, 7993044, 8428580, 8905582, 9363705, 9742234, 9997482, 10114216, 10105318, 10002343, 9843653, 9664642, 9490699, 9332275, 9182833, 9021563, 8821305, 8559170, 8225473, 7827585, 7388002, 6938216, 6511000, 6133850, 5825542, 5595946, 5447579, 5377005, 5374703, 5422722, 5490783, 5533583, 5492944, 5306358, 4919469, 4297901, 3434801, 2353308, 1105465, -230612, -1555957, -2761910, -3749460, -4451698, -4847679, -4958649, -4829298, -4506610, -4028125, -3422258, -2714672, -1933042, -1106730, -263458, 572654, 1379687, 2135112, 2814977, 3396592, 3863715, 4212257, 4454030, 4615853, 4732846, 4838159, 4954107, 5088875, 5239998, 5402410, 5575944, 5766699, 5980630, 6214521, 6452199, 6668714]
43079F668714J68977R7961O688j01882k23363l51381m78352n95283o90265p49169
43069C752645p61450p28527o67108o02386n54395n27297n08763m78961m23739
43060a499981l45873k68939k29164k56285l53736m92093o21352o94124o84738
43051e446285n93871m39041k40310j1986K35498M88947P29745R37940J097843
43042c241520J199239J234150J194227J072403Q67969N91492K66419p3319l88293
43033B722767o39762p96628q42104p76295o11759l64870n1327L09824O88875J044261
43023F82982J330467J509067J555761J461655J231905Q85152M54820r596m45445
43014H656768p87675r86018j020793r08074o90611m19765j38760J24840L56498
$$ y = [6668714, 6837691, 6935652, 6942340, 6840458, 6617095, 6265714, 5787362, 5192079, 4501814, 3752645, 2991195, 2262668, 1595560, 993174, 438779, -88518, -597281, -1076242, -1499981, -1845854, -2114793, -2343957, -2600242, -2953978, -3446071, -4067423, -4761547, -5446285, -6040156, -6479197, -6719507, -6731493, -6495995, -6007048, -5277303, -4339363, -3241520, -2042281, -808131, 386096, 1458499, 2326468, 2917960, 3184379, 3111060, 2722767, 2083005, 1286377, 444273, -332022, -943781, -1308651, -1359978, -1050154, -361279, 682982, 2013449, 3522516, 5078277, 6539932, 7771837, 8656989, 9111809, 9102213, 8656768, 7869093, 6883075, 5862282, 4954208, 4263597, 3843832, 3705072, 3829912, 4186410]
43005D186410N47073O86200P59918P53134O56715M76672K39584j1723k32251l91335
42995G670397m82741n24379n49427n93454o82181q23279j003473j190854j342663
42986D77946j418523j395232j274825j080325q42741n89495l41283j16345O4173
42977f516650J75903J99324J33266L648j43253k61767l26985l39530l15706k75518
42967g667268k36566k10700j99141j89576j61874j01248r438R4432J82884K32220
42957h266275K30797J80301R1110k4373j55908k94479m27438n34062n86625n58652
42947a0345604m36617k28209L7544L18100N69913P61465Q82327R43612R69274
42938f528195R83576J002429J031278J066083J093549J091211J031008Q88146
$$ y = [4186410, 4733483, 5419683, 6179601, 6932735, 7589450, 8066122, 8305706, 8293983, 8061732, 7670397, 7187656, 6663277, 6113850, 5520396, 4838215, 4014936, 3011463, 1820609, 477946, -940577, -2335809, -3610634, -4690959, -5533700, -6123195, -6464478, -6580823, -6516650, -6340747, -6141423, -6008157, -6004509, -6147762, -6409529, -6736514, -7076044, -7391750, -7667268, -7903834, -8114534, -8313675, -8503251, -8665125, -8766373, -8775811, -8681379, -8498495, -8266275, -8035478, -7855177, -7764067, -7788440, -7944348, -8238827, -8666265, -9200327, -9786952, -10345604, -10782221, -11010430, -10972886, -10654786, -10084873, -9323408, -8441081, -7497469, -6528195, -5544619, -4542190, -3510912, -2444829, -1351280, -260069, 770939, 1659085]
42930A659085O52860L39862j0187l39862n91868p25828p27356o07082l93010j21857
42920h65243J66419M30729O31371P37110P35803O41454M90833L30691K03175J36114
42910C638456J38656K00349K93838L82983M35017M31585L73556K78417J72720
42901F345577Q3421L1647L0498Q6048J98479L60955N56746P57818R27896J030519
42891A0409604J039505R47396P67854N30373K69361J2565k26072m46456o56242
42882A2647888q62520j065581j257478j424795j553162j630926j651181j612515
42874A589730j518659j376662j194083r77500p34644m78936k31440j5829J51429
42865d786594K67907L43156L90068M17220M27143M18544L88403L33359K52585
$$ y = [1659085, 2311945, 2651807, 2641620, 2301758, 1709890, 984062, 256706, -350376, -743386, -865243, -698824, -268095, 363276, 1100386, 1836189, 2477643, 2968476, 3299167, 3502342, 3638456, 3777112, 3977461, 4271299, 4654282, 5089299, 5520884, 5894440, 6172857, 6345577, 6428998, 6460645, 6491143, 6577191, 6775670, 7136625, 7693371, 8451189, 9379085, 10409604, 11449109, 12396505, 13164359, 13694732, 13964093, 13976658, 13750586, 13304130, 12647888, 11785368, 10719787, 9462309, 8037514, 6484352, 4853426, 3202245, 1589730, 71071, -1305591, -2499674, -3477174, -4211818, -4690754, -4922194, -4938023, -4786594, -4518687, -4175531, -3785463, -3368243, -2941100, -2522556, -2134153, -1800794, -1548209]
42856a548209J52249M7404m2599j03529j33292j40634j36551j26097j07037p4670
42846b212965k6698L5754J08997J85761K52621K90394K80722K16967J13074L421
42836g51952o9185p2737j528J21496K55695L58390L96441L52075K25985L9140
42826H53820j69195l49637m55615m56433l45895j44231J07217L57831N63289O98977
42816F60128P64639P78135P63291P39858P19665P07275P01599O97177O85482O56426
42806G873675O00336N11191L90971K52491J17621J0537n1159o3578l8797q80K2812
42795I625220J1005m4956j37872k43964l26066l43558k68380j00343J27122L55469
42785H653677N21012N77249N09259L35046R6656j52378l59648m86743n20439m75729
$$ y = [-1548209, -1395960, -1348556, -1391155, -1494684, -1627976, -1768610, -1905161, -2031258, -2138295, -2212965, -2239663, -2203909, -2094912, -1909151, -1656530, -1366136, -1085414, -868447, -755373, -751952, -821137, -893874, -895402, -773906, -518211, -159821, 236620, 588695, 814680, 853820, 684625, 334988, -120627, -577060, -922955, -1067186, -959969, -602138, -38849, 660128, 1424767, 2202902, 2966193, 3706051, 4425716, 5132991, 5834590, 6531767, 7217249, 7873675, 8474011, 8985202, 9376173, 9628664, 9746285, 9756822, 9705663, 9642085, 9603288, 9602408, 9625220, 9636225, 9591269, 9453397, 9209433, 8883367, 8539809, 8271429, 8171086, 8298208, 8653677, 9174689, 9751938, 10261197, 10596243, 10692899, 10540521, 10180873, 9694130, 9173691, 8697962]
42775H697962l86431k88547k07650j56421j38322j49976j80770k14110k33323
42766F742412k28669j99655j51001q6595o688R0382K04491L30967M59769N76258
42756G731671O63195P03893O86320O07452M75945L10813J35480k9750j72040k85073
42746A0827906l65234m09111m14726l85573l34430k83257k57334k75816l44209
42737G758216m53290n84273p15982q29840r11511r51039r44314q96109q21481
42728F50377p41356o72970o21339n77758n25374m47409l34560j90194l1380J16866
42718c375097K33362L12348L67187M22707M99417N98428O96796P57655P49389
42709A262192O61503N07720L16855J20204n5787j89300k60620k54518j69067k3714
$$ y = [8697962, 8311531, 8022984, 7815334, 7658913, 7520591, 7370615, 7189845, 6975735, 6742412, 6513743, 6314088, 6163087, 6076492, 6069804, 6160186, 6364677, 6695644, 7155413, 7731671, 8394866, 9098759, 9785079, 10392531, 10868476, 11179289, 11314769, 11285019, 11112979, 10827906, 10462672, 10053561, 9638835, 9253262, 8918832, 8635575, 8378241, 8102425, 7758216, 7304926, 6720653, 6004671, 5174831, 4263320, 3312281, 2367967, 1471858, 650377, -90979, -763949, -1385288, -1963046, -2488420, -2935829, -3270389, -3460583, -3491963, -3375097, -3141735, -2829387, -2462200, -2039493, -1540076, -941648, -244852, 512803, 1262192, 1923695, 2431415, 2748270, 2868474, 2812687, 2623387, 2362767, 2108249, 1939182, 1915468]
42699A915468J42189K81328L53142L34194K23497M4548j57877l29121m21959m12382
42689A973027l07394j42472L0701J62877K24974K16286J59712Q8401L1523M903
42679B442538Q575L0259N1612N3494J8964o4664k03039l91623o13726q41303j039902
42668e48815j177339j232678j200478j088625r13258o95513m60586k35774m4812
42659g597878R9653J99761K68012L16155L45391L45599L04025K16449R3767l8048
42649e447114j42947j83585j32462J8145K52334N34961Q22367J075000J267204
42640a936097J390879J453110J470510J462830J446534J429187J407434J370296
42632I494683J305104J201474J052228Q54166O10684L34487M7276k24265m54744
$$ y = [1915468, 2057657, 2338985, 2692127, 3026321, 3249818, 3294366, 3136489, 2807368, 2385409, 1973027, 1665633, 1523161, 1553862, 1716739, 1941713, 2157999, 2317711, 2406112, 2437635, 2442538, 2451113, 2481372, 2532984, 2586478, 2605442, 2540778, 2337739, 1946116, 1332390, 491087, -548815, -1726154, -2958832, -4159310, -5247935, -6161193, -6856706, -7317292, -7553066, -7597878, -7498225, -7298464, -7030452, -6714297, -6368906, -6023307, -5719282, -5502833, -5409066, -5447114, -5590061, -5773646, -5906108, -5887963, -5635629, -5100668, -4278301, -3203301, -1936097, -545218, 907892, 2378402, 3841232, 5287766, 6716953, 8124387, 9494683, 10799787, 12001261, 13053489, 13907655, 14518339, 14852826, 14900102, 14675837, 14221093]
42623A4221093o26806p36520p95085q24892q50417q87909r39635r96307j045794
42614F517728j081621j105558j123801j140651j154088j155656j134483j082219
42606b460349r94558q68730p02017m95825k61902k2518J97748L81529N22095O21103
42596d083424O85494P24602P45809P50150P32740O88792O19505N31831M33067
42587A828566L26511K12609R4305j8423j09024j60278j62340j17985m2021M4912
42577A896832J24996J90512K45892L02725L69528M42553N04655N33951N16497
42568E128141M53936L61534K59260J62487P7392K110o8394j37063k01884k56018
42558E781501k89736k92968k58335j84418p7763M7515J71682K71758L25221L16455
$$ y = [14221093, 13594287, 12857767, 12062682, 11237790, 10387373, 9499464, 8559829, 7563522, 6517728, 5436107, 4330549, 3206748, 2066097, 912009, -243647, -1378130, -2460349, -3454907, -4323637, -5025654, -5521479, -5783381, -5805899, -5608151, -5226622, -4704527, -4083424, -3397930, -2673328, -1927519, -1177369, -444629, 244163, 863668, 1395499, 1828566, 2155077, 2367686, 2461991, 2443568, 2334544, 2174266, 2011926, 1893941, 1851920, 1896832, 2021828, 2212340, 2458232, 2760957, 3130485, 3573038, 4077693, 4611644, 5128141, 5582077, 5943611, 6202871, 6365358, 6442750, 6444860, 6376466, 6239403, 6037519, 5781501, 5491765, 5198797, 4940462, 4756044, 4678281, 4725796, 4897478, 5169236, 5494457, 5810912]
42548E810912K43690J21249k5761j70994k94986l88588m51967m90200n07168n00985
42538C345202m64759l92796k87167j58808k2137J11615K36798L50786M50490N31151
42528C700375N87079O13037O06596N70974N15061M48298L74270K90268J94307
42519G900265R2760R72o3409q8810p4694l1235K5382P9377J19854J41880J45859
42508H248201J36752J21982J06902R0952O8855L6399m839m8524q9310j27914j70996
42497H368460k25178k89519l52398l95434m01234l60200k74633j60604m5991L7540
42487E900809O6615L5471m2667j41907k34203l00399l37468l57226l76401m04697
42477C807927m39226m67538m74591m48264l81943k75937j38596J4202J62992K91126
$$ y = [5810912, 6054602, 6175851, 6150090, 5979096, 5684110, 5295522, 4843555, 4353355, 3846187, 3345202, 2880443, 2487647, 2200480, 2041672, 2019535, 2131150, 2367948, 2718734, 3169224, 3700375, 4287454, 4900491, 5507087, 6078061, 6593122, 7041420, 7415690, 7705958, 7900265, 7993025, 7993997, 7930588, 7841778, 7767084, 7735849, 7761231, 7840608, 7960462, 8102342, 8248201, 8384953, 8506935, 8613837, 8704789, 8773644, 8810043, 8805204, 8756680, 8667370, 8539456, 8368460, 8143282, 7853763, 7501365, 7105931, 6704697, 6344497, 6069864, 5909260, 5863269, 5900809, 5967424, 6002895, 5960228, 5818321, 5584118, 5283719, 4946251, 4589025, 4212624, 3807927, 3368701, 2901163, 2426572, 1978308, 1596365, 1320428, 1181832, 1196034, 1359026, 1650152]
42467A650152L89239M54138M83886M75078M25946L42344K40709J45568Q3904P9498
42457D770462J47739K90114M89291P08666R00148J018942J038322R56267P91743
42448A1111694N74963L37469J05661j00693k65092l70086l99164l47376k33613
42439A0413763j02524j0469j491q6648k38553m04545n31028n84400n57400m61781
42429G434924l17320j45403L2932J98412L35660M34631M91256N08423M96677M71976
42419I942168M49570M36742M29113M13385L75373L08927K20460J26308M4465j4721
42409A2731790n3955q7421j32538j99774k88015l89764n01626o29529p82474r60039
42399H706655j145447j310816j430369j491652j497852j461384j393663j297105
$$ y = [1650152, 2039391, 2493529, 2977415, 3452493, 3878439, 4220783, 4461492, 4607060, 4690964, 4770462, 4918201, 5208315, 5697606, 6406272, 7306420, 8325362, 9363684, 10319951, 11111694, 11686657, 12024126, 12129787, 12029094, 11764002, 11393916, 10994752, 10647376, 10413763, 10311239, 10300770, 10299279, 10212631, 9974078, 9569533, 9038505, 8454105, 7896705, 7434924, 7117604, 6972201, 7005133, 7203545, 7539205, 7973836, 8465092, 8973515, 9470192, 9942168, 10391738, 10828480, 11257593, 11670978, 12046351, 12355278, 12575738, 12702046, 12746511, 12731790, 12677835, 12590414, 12457876, 12258102, 11970087, 11580323, 11078697, 10449168, 9666694, 8706655, 7561208, 6250392, 4820023, 3328371, 1830519, 369135, -1024528, -2321633]
42391b321633j163578r80033p38377m44798j24001J84695M39522O11983O97610
42382c838610P14848O93003O57777O23097N91592N59610N21792M73587M13079
42373A409775L43084K71860K10005J64079J31589J01509N9798m363r4329k03350
42363B389657l13512l98618m32577m00144l04521j68634k9849P1064J04813O6502
42353E84181k1278j18461j85023j95795j46349n0995O2616J60107K09068J89825
42343D87896J04593k0929j46129k30714k48996j96893q9735M6099J83005K99592
42333A87789L84158M34285M53415M46260M15585L61795K83775J78958M4005j20373
42323C069652l01549m71988n97532o52449o29187n36099l88325k01472Q331K22045
$$ y = [-2321633, -3485211, -4465244, -5203621, -5648419, -5772420, -5587725, -5148203, -4536220, -3838610, -3123762, -2430759, -1772982, -1149885, -558293, 1317, 523109, 996696, 1409775, 1752859, 2024719, 2234724, 2398803, 2530392, 2631901, 2691699, 2687336, 2593007, 2389657, 2076145, 1677527, 1244950, 844806, 540285, 371651, 341802, 412866, 517679, 584181, 562903, 444442, 259419, 63624, -82725, -133720, -71104, 89003, 298071, 487896, 592489, 571560, 425431, 194717, -54279, -251172, -340907, -294808, -111803, 187789, 571947, 1006232, 1459647, 1905907, 2321492, 2683287, 2967062, 3146020, 3190025, 3069652, 2768103, 2296115, 1698583, 1046134, 416947, -119152, -507477, -708949, -700618, -478573]
42313d78573M17608N72976O70345O99937O62876N72873M55203L40651K54225K03955
42303D372076J78177J55011J17865O5485J0704k8877m0892k4390R099M0295N2005
42292D906558L9262J2452r576j1338J1158N0108R1141J19664J26135J09249P4894
42281E519707K9865k5852j00812k04283l34069m70043n79392o30732o08506n19940
42271B075943l91883k60004j56109r9475r5455j39925k24718l39490m69512n93269
42261f93897o84626p20314o88646n93813m53252k90399j27005K2300J52848K70306
42251c806498L87992N21154O79705Q62188J052849J222924J336756J362366J283503
42242D902939J107666Q65381N99665L49505J34955m7715k16928l88315n61317
$$ y = [-478573, -60965, 512011, 1182356, 1882293, 2545169, 3118042, 3573245, 3913896, 4168121, 4372076, 4550253, 4705264, 4823129, 4888614, 4899318, 4870441, 4829549, 4805159, 4814258, 4854553, 4906558, 4945820, 4958272, 4948696, 4937358, 4948516, 4998624, 5089765, 5209429, 5335564, 5444813, 5519707, 5549572, 5523720, 5422908, 5218625, 4884556, 4414513, 3835121, 3204389, 2595883, 2075943, 1684060, 1424056, 1267947, 1168472, 1073017, 933092, 708374, 368884, -100628, -693897, -1378523, -2098837, -2787483, -3381296, -3834548, -4124947, -4251952, -4229652, -4076804, -3806498, -3418506, -2897352, -2217647, -1355459, -302610, 920314, 2257070, 3619436, 4902939, 6010605, 6875986, 7475651, 7825156, 7960111, 7912396, 7695468, 7307153, 6745836]
42233F745836p19223q40594r11730r31725r09719q58677p89179p05167o03367
42224e23545m77343l24465j51555K4526J81460K97819L56709L45650K56612R0289
42214G6157j37254l93349o37599q35981r69690j033799j030389r64003q41832
42205f767739o74935m76810k60342l7112J79568L71479N16917N97003O02352N36010
42195e413609M12751K56622R6443m1608j41537j99607k18612j99258j36266k2529
42185e607210J42315L45287N59855P52184Q90649R54875R42043Q68874P67658
42176F16530O75664O21387O14597O45527O92169P30024P38975P06240O27096N05265
42166G173474L52905J88700L3204r6967j93034k54864k90289l13904l43659l93688
$$ y = [6745836, 6026613, 5186019, 4274289, 3342564, 2432845, 1574168, 784989, 79822, -523545, -1000888, -1325353, -1476908, -1452382, -1270922, -973103, -616394, -270744, -14132, 76157, -61097, -454446, -1092045, -1928026, -2897716, -3931515, -4961904, -5925907, -6767739, -7442674, -7919484, -8179826, -8216938, -8037370, -7665891, -7148974, -6551971, -5949619, -5413609, -5000858, -4744236, -4647793, -4689401, -4830938, -5030545, -5249157, -5448415, -5584681, -5607210, -5464895, -5119608, -4559753, -3807569, -2916920, -1962045, -1020002, -151128, 616530, 1292194, 1913581, 2528178, 3173705, 3865874, 4595898, 5334873, 6041113, 6668209, 7173474, 7526379, 7715079, 7748283, 7651316, 7458282, 7203418, 6913129, 6599225, 6255566, 5861878]
42156E861878m66223n48514o17615o50131o31737n63171m61146l53444k68964
42147A300933k27031k30995k68171l14238l39624l17023k29421p6129J26763L52745
42137b22191N74923P74233R41784J075226J172258J224854J217206J129215R45907
42128H833415O69427L26864l2801l53340n90181p22906p56041p12025o24159n32060
42118E506193m75241m81549n55647o76918q09674r18323r77779r76139r13094
42109a278171p97954o47384m81070l15260j57423o521J40552K82049M10980N21059
42099b329143O10877O80648P26003P37688P08588O40201N42010M25253K97531
42090C039656J62338K2821j13681k34375l24816l75069l83087l53776k96761k25342
$$ y = [5861878, 5395655, 4847141, 4229526, 3579395, 2947658, 2384487, 1923341, 1569897, 1300933, 1073902, 842907, 574736, 260498, -79126, -396149, -625570, -701699, -574936, -222191, 352732, 1126965, 2068749, 3143975, 4316233, 5541087, 6758293, 7887508, 8833415, 9502842, 9829706, 9796905, 9443565, 8853384, 8130478, 7374437, 6662412, 6038253, 5506193, 5030952, 4549403, 3993756, 3316838, 2507164, 1588841, 611062, -365077, -1278171, -2076125, -2723509, -3204579, -3519839, -3677262, -3683783, -3543231, -3261182, -2850202, -2329143, -1718266, -1037618, -311615, 426073, 1134661, 1774862, 2316872, 2742125, 3039656, 3201994, 3224815, 3111134, 2876759, 2551943, 2176874, 1793787, 1440011, 1143250, 917908]
42080I17908j54443r5327m9978j0410L6315J01498J90188K98370M11392N05277
42070B150790N52398N30035M28016K52772K7282k12477m24438n70349o26295n89208
42060A518526m75293l11691j27664M9371J94015K84154L05619K57283J52374J4447
42050A861141j30363k61164l66026m39667m77830m73681m19159l08988j43861
42041a159598O8517L13968N74047Q29911J065841J269261J427574J525998J550349
42032G465868J493653J361231J170330R45210P11476M92033L04496J59555O0639
42023A4164491M326k0027l0856n1407j00545j81234k75288l49824l72794l29674
42013A2457168k32767j17216k3422K5620L7804M6026Q6443J75544L00335M25524
$$ y = [917908, 763465, 668138, 618160, 607750, 644065, 745563, 935751, 1234121, 1645513, 2150790, 2703188, 3233223, 3661239, 3914011, 3941293, 3728816, 3304378, 2734029, 2107734, 1518526, 1043233, 731542, 603878, 653249, 847264, 1131418, 1437037, 1694320, 1846694, 1861141, 1730778, 1469614, 1103588, 663921, 186091, -287590, -706749, -1015737, -1159598, -1091081, -777113, -203066, 626845, 1692686, 2961947, 4389521, 5915519, 7465868, 8959521, 10320752, 11491082, 12436292, 13147768, 13639801, 13944297, 14103852, 14164491, 14168817, 14148790, 14117934, 14066527, 13965982, 13784748, 13509460, 13159636, 12786842, 12457168, 12224401, 12107185, 12083763, 12109383, 12147187, 12193213, 12279656, 12455200, 12755535, 13181059]
42003A3181059N10872N27911M68435L44038J80434J0149j36026k38539k95773
41994A4552560l22502l39304l59827l84288m01809l97303l57611k75188j50359
41985A1564369P440J79689L40219M58379N05640M66252L47498J81042J0805j26825
41975A3934508k17987k72693l13575l60099m16896m71660n02969m92992m37103
41966A0448534l45012k34566j24153k8497M1543P7984P6272L7594k9790j13517
41956I806392k03926k99199m02909n14274o18978o89436o96134o23147m78476
41947E279913k93906j15004J4842P0986N8299J0217k5136o193Q3651K28939L88937
41936E695545N13790N61242N06157L41584P6571k64475o42386j008565j315526
$$ y = [13181059, 13691931, 14219842, 14688277, 15032315, 15212749, 15222898, 15086872, 14848333, 14552560, 14230058, 13890754, 13530927, 13146639, 12744830, 12347527, 11989916, 11714728, 11564369, 11571809, 11751498, 12091717, 12550096, 13055736, 13521988, 13869486, 14050528, 14061333, 13934508, 13716521, 13443828, 13130253, 12770154, 12353258, 11881598, 11378629, 10885637, 10448534, 10103522, 9868956, 9744803, 9716306, 9757849, 9835833, 9912105, 9949699, 9919909, 9806392, 9602466, 9303267, 8900358, 8386084, 7767106, 7077670, 6381536, 5758389, 5279913, 4986007, 4871003, 4885845, 4956831, 5015130, 5025347, 5000211, 4994018, 5077669, 5306608, 5695545, 6209335, 6770577, 7276734, 7618318, 7694889, 7430414, 6788028, 5779463, 4463937]
41927D463937j527079j623659j603463j481474j285830j050504q07003n79241
41919e494316l81640k17451p6849O1427K22493M24867O73466R59192J263322J562161
41909a003328J829067K034776K149314K147758K018553J770636J435504J061659
41901A3443939P01717L96764J66043P109r6167j64859k19602k77193l48043m36216
41891A3173492n42823o68792q13012r67492j115565j235547j306429j311139j237431
41882C975262j080234q47582n67326k87827o7405M5527L1471r3078k83385m82245
41872C43178o34908o99668o55080n03974k71629L034K80102N29521P35472Q93139
41862A9187J000295J049572J027836R23978P39810M95933K28797j8572k07005
$$ y = [4463937, 2936858, 1313199, -290264, -1771738, -3057568, -4108072, -4915075, -5494316, -5875956, -6093407, -6170256, -6108829, -5886336, -5461469, -4788003, -3828811, -2565489, -1003328, 825739, 2860515, 5009829, 7157587, 9176140, 10946776, 12382280, 13443939, 14145656, 14542420, 14708463, 14715572, 14619405, 14454546, 14234944, 13957751, 13609708, 13173492, 12630669, 11961877, 11148865, 10181373, 9065808, 7830261, 6523832, 5212693, 3975262, 2895028, 2047446, 1480120, 1192293, 1124888, 1170415, 1201886, 1108808, 825423, 343178, -291730, -991398, -1646478, -2150452, -2422081, -2419047, -2138945, -1609424, -873952, 19187, 1019482, 2069054, 3096890, 4020868, 4760678, 5256611, 5485408, 5466836, 5259831]
41853E259831l09086l13024k22995n7337J54340L76157N74495P28223Q34407R04305
41843G929316R51030R76895R69171R07014P74940N73748L22648N3233j98881m01031
41833A2858083n29933n78071n56329m88591m00795l12663k36797j81947j54623
41824I418334j57932j90730k49120l28962m27196n41101o66299p95058r16512
41815E145424j018562j089336j116834j088743r95500q35756o19418l65374r6859
41806b080958J61020L82024N42763O31591O56549O44134O27076O27947O48061
41797B840207O67856O58627N99588M90627L52874K16999J07491L2899j3511m5312
41787E908345p2650r6041j07385r6619n8433N787R0110J86054K82203L63713M14119
$$ y = [5259831, 4950745, 4637721, 4414726, 4357389, 4511729, 4887886, 5462381, 6190604, 7025011, 7929316, 8880346, 9857241, 10826412, 11733426, 12508366, 13082114, 13404762, 13457995, 13259114, 12858083, 12328150, 11750079, 11193750, 10705159, 10304364, 9991701, 9754904, 9572957, 9418334, 9260402, 9069672, 8820552, 8491590, 8064394, 7523293, 6856994, 6061936, 5145424, 4126862, 3037526, 1920692, 831949, -163551, -999307, -1618725, -1984099, -2080958, -1919938, -1537914, -995151, -363560, 292989, 937123, 1564199, 2192146, 2840207, 3508063, 4166690, 4766278, 5256905, 5609779, 5826778, 5934269, 5967168, 5953657, 5908345, 5835695, 5739654, 5632269, 5535650, 5477217, 5483004, 5573114, 5759168, 6041371, 6405084, 6819203]
41776F819203M19254L71622K74550J44945J1489r3959j48817j48474j05725m2519
41766G501569J9264O3107P9416O6300K9719j9176o9964j18157j66173k21163k93525
41755F871217l96191n40891p30539r53271j184409j395546j563804j675910j727547
41746c296891j721376j665775j573639j459731j335776j204794j058520q81466
41738a4197968o61053l98261j12224J63833L93003N46608O13279O02730N43078
41729a2506975M72200M25323M23390M67515N42455O26610P01953P58090P90348
41720g299091P96753P78634P44237P10110O95796P13270P58443Q12035Q50863
41711d38950Q62079Q49907Q29855Q15552Q08932Q00384P76223P26294O47465N44100
$$ y = [6819203, 7238457, 7610079, 7884629, 8029574, 8041063, 7947104, 7798287, 7649813, 7544088, 7501569, 7520833, 7583940, 7663356, 7729656, 7759375, 7740199, 7670235, 7552078, 7385905, 7164742, 6871217, 6475026, 5934135, 5203596, 4250325, 3065916, 1670370, 106566, -1569344, -3296891, -5018267, -6684042, -8257681, -9717412, -11053188, -12257982, -13316502, -14197968, -14859021, -15257282, -15369506, -15205673, -14812670, -14266062, -13652783, -13050053, -12506975, -12034775, -11609452, -11186062, -10718547, -10176092, -9549482, -8847529, -8089439, -7299091, -6502338, -5723704, -4979467, -4269357, -3573561, -2860291, -2101848, -1289813, -438950, 423129, 1273036, 2102891, 2918443, 3727375, 4527759, 5303982, 6030276, 6677741, 7221841]
41701G221841M26855L09246K01712J06692J8977o8652j59091k48374l27396l85527
41691G096283m14369m11021l79822l30881k75339k20298j66883j12513n4996M306
41681D734467N9573J01779J21588J12263P0568m187j09772k37219l67067m72102
41671D009891n27783n23980m70166l92196l23748k95546l24670m07580n20848
41662B23374o29560o98780p03388o34634n02534l32673j57097l246J13659J92335
41652c132544K42890K82306L28597L94037M79336N72031O51051O96372O99141
41643A213217O66495O18111N77077N60918N76519O18346O68477O99883O84866
41634F883909O06692M67711K88777J00615o7350j95374k76263l13068l14014k87951
$$ y = [7221841, 7648696, 7957942, 8159654, 8266346, 8285323, 8216671, 8057580, 7809206, 7481810, 7096283, 6681914, 6270893, 5891071, 5560190, 5284851, 5064553, 4897670, 4785157, 4730161, 4734467, 4794040, 4895819, 5017407, 5129670, 5200238, 5196051, 5086279, 4849060, 4481993, 4009891, 3482108, 2958128, 2487962, 2095766, 1772018, 1476472, 1151802, 744222, 223374, -406186, -1104966, -1808354, -2442988, -2945522, -3278195, -3435292, -3438538, -3324879, -3132544, -2889654, -2607348, -2278751, -1884714, -1405378, -833347, -182296, 514076, 1213217, 1879712, 2497823, 3074900, 3635818, 4212337, 4830683, 5499160, 6199043, 6883909, 7490601, 7958312, 8247089, 8347704, 8280354, 8084980, 7808717, 7495649, 7181635, 6893684]
41624F893684k42294j82733j13143l5395N0129J43516K44727L53337M67449N81898
41614H161175O87420P72013Q23384Q31381P90916P06143N93878M82229M02646
41605A4251185L78523M16248N02856O09961P01095P40435P02294N79674L87572
41596A9269843J57757p2924k73657m24901n18442n56240n49989n19858m90507
41587A6021082m84956n18675n96122p10507q46058r81386j093084j159565j165307
41578H465422j104621r83631q19590o37520m64530l22958k24891j70853j53182
41569C583646j61247j84192k09763k22177k03975j43075m0417Q8218K17377L19709
41559C044104L71816L58921K80853J56865K2311q5513j44169j52880j24776p3358
$$ y = [6893684, 6651390, 6468657, 6355514, 6320119, 6370248, 6513764, 6758491, 7111828, 7579277, 8161175, 8848595, 9620608, 10443992, 11275373, 12066289, 12772432, 13366310, 13848539, 14251185, 14629708, 15045956, 15548812, 16158773, 16859868, 17600303, 18302597, 18882271, 19269843, 19427600, 19354676, 19081019, 18656118, 18137676, 17581436, 17031447, 16511589, 16021082, 15536126, 15017451, 14421329, 13710822, 12864764, 11883378, 10790294, 9630729, 8465422, 7360801, 6377170, 5557580, 4920060, 4455530, 4132572, 3907681, 3736828, 3583646, 3422399, 3238207, 3028444, 2806267, 2602292, 2459217, 2418800, 2507018, 2724395, 3044104, 3415920, 3774841, 4055694, 4212559, 4234870, 4149357, 4005188, 3852308, 3727532, 3654174]
41549C654174n514P5280J62453K44565L09178L48068L60246L52229L35855L23973
41539F160507L25837L44957L80207M28279M85437N47918O10974O66749P02823
41530A0653688P04222O59496N67286M39032K96607J66897P5947M4051Q2094J88574
41520A3877894L46973N25465O82429P78284P88910P13876N75856M11721K58414
41511A8959822J38937N5324p180o7970j39084k19473k95850l47464l52692k95791
41501A7428579j71869J0970K31774M58827O54356P82428Q18381P56191O10239
41492B1579876M10302J92293j0280j70933k72422l10282k97305k63386k46179
41483B0611684k75443l59806m83193o11375p04284p29115o70740n36072l49630
$$ y = [3654174, 3648660, 3723940, 3886393, 4130958, 4440136, 4788204, 5148450, 5500679, 5836534, 6160507, 6486344, 6831301, 7211508, 7639787, 8125224, 8673142, 9284116, 9950865, 10653688, 11357910, 12017406, 12584692, 13023724, 13320331, 13487228, 13563175, 13607226, 13689320, 13877894, 14224867, 14750332, 15432761, 16211045, 16999955, 17713831, 18289687, 18701408, 18959822, 19098759, 19154083, 19146903, 19078933, 18939849, 18720376, 18424526, 18077062, 17724370, 17428579, 17256710, 17267680, 17499454, 17958281, 18612637, 19395065, 20213446, 20969637, 21579876, 21990178, 22182471, 22172191, 22001258, 21728836, 21418554, 21121249, 20857863, 20611684, 20336241, 19976435, 19493242, 18881867, 18177583, 17448468, 16777728, 16241656, 15892026]
41474A5892026j41481O5051K56987M24974N54438O24223O14353N16602L41093
41465A9148266J16229j18317l24099m76862n72342o21373o38626o33383o07393
41456A5272100n59191m90800m12385l41662k97905k93414l26401l78636m19838
41447A1751868m18423l53804k22412l3648J99603M65984P51095J027941J253366
41438A4421570J378544J371087J235368J015409P75789N72566M33721L59382L35584
41429B1899020L46855L78886M14532M32354M12812L48070K46727J28670J4068
41420B4621994q4591j62158k14901k35913k15511j44770j8691J61529L85624O31474
41410B4724086Q65804J050766J154225J159282J069776R10314P19904N40206M03080
$$ y = [15892026, 15750545, 15815596, 16072583, 16497557, 17051995, 17676218, 18290571, 18807173, 19148266, 19264495, 19146178, 18822079, 18345217, 17772875, 17151502, 16512876, 15879493, 15272100, 14712909, 14222109, 13809724, 13468062, 13170157, 12876743, 12550342, 12171706, 11751868, 11333445, 10979641, 10757229, 10723581, 10923184, 11389168, 12140263, 13168204, 14421570, 15800114, 17171201, 18406569, 19421978, 20197767, 20770333, 21204054, 21563436, 21899020, 22245875, 22624761, 23039293, 23471647, 23884459, 24232529, 24479256, 24607926, 24621994, 24537403, 24375245, 24160344, 23924431, 23708920, 23564150, 23545459, 23706988, 24092612, 24724086, 25589890, 26640656, 27794881, 28954163, 30023939, 30934253, 31654157, 32194363, 32597443]
41401C2597443L23626L00781L22338L69980M22572M57724M52412L84699K39398
41392C5870973J6825k61324n55343q20446j022541j148199j203833j205604j167995
41383B8502513j099681j007917r03524p98776p00322o06141n10697m12970l20110
41374B2142375k45525k04616k09867k65514l63604m84807o04405p00253p58894
41365A8304890p78083p65270p32061o86995o31287n60723m71929l67708k57874
41356A3052960j55800p2657j1370L6663Q8566J60828K60151L81082N10562O33142
41346A4884127P32277P90079P90519P26611O07136M58033L17019K23084K04209
41337A9733094K67704L97066N57099P05312Q04660Q31921P79085O50637M61642
$$ y = [32597443, 32921069, 33221850, 33544188, 33914168, 34336740, 34794464, 35246876, 35631575, 35870973, 35887798, 35626474, 35071131, 34250685, 33228144, 32079945, 30876112, 29670508, 28502513, 27402832, 26394915, 25491391, 24692615, 23992293, 23386152, 22875455, 22462485, 22142375, 21896850, 21692234, 21482367, 21216853, 20853249, 20368442, 19764037, 19063784, 18304890, 17526807, 16761537, 16029476, 15342481, 14711194, 14150471, 13678542, 13310834, 13052960, 12897160, 12824503, 12813133, 12849796, 12938362, 13099190, 13359341, 13740423, 14250985, 14884127, 15616404, 16406483, 17197002, 17923613, 18530749, 18988782, 19305801, 19528885, 19733094, 20000798, 20397864, 20954963, 21660275, 22464935, 23296856, 24075941, 24726578, 25188220]
41328B5188220K37150Q488j95638l57608m71244n34844n45977n04366m19162l11834
41318B2093185k11190j44692j32193j83766k99040m65426o56380q33910r57685
41309A8208903r97805r44515q10172o23571m20037k30892p5588M1316J28008J99969
41299A4475616K73360L58650M56297N56664O45282P11007P52845P81750Q16032
41290A9827503Q72205R55770J057103J153968J217911J220982J142150R74017
41282B8421609P28223M35987J42050j06120k69831l27124k73967j19306J20619
41273B8752140M22274P49792J053147J276741J375734J329837J147097Q58304
41265C6965066N07296J40861k00228m87368p05985q53730r37361r69347r63600
$$ y = [25188220, 25425370, 25433858, 25238220, 24880612, 24409368, 23874524, 23328547, 22824181, 22405019, 22093185, 21881995, 21737303, 21605110, 21421344, 21122304, 20656878, 20000498, 19166588, 18208903, 17211098, 16266583, 15456411, 14832840, 14412803, 14181911, 14106323, 14147639, 14275647, 14475616, 14748976, 15107626, 15563923, 16120587, 16765869, 17476876, 18229721, 19011471, 19827503, 20699708, 21655478, 22712581, 23866549, 25084460, 26305442, 27447592, 28421609, 29149832, 29585819, 29727869, 29621749, 29351918, 29024794, 28750827, 28631521, 28752140, 29174414, 29924206, 30977353, 32254094, 33629828, 34959665, 36106762, 36965066, 37472362, 37613223, 37412995, 36925627, 36219642, 35365912, 34428551, 33459204, 32495604]
41256C2495604r30402q73081p89118o75234n32835l70606k03649n0915O7784J35555
41246B8273103J43618R6208J1022q7385j78233k51902l09091l53579l85213l98108
41236B6560440l84070l37556k58095j48849j3621J43330L13143M77761O11073
41227B6963556O87315O91495O24575N01014L42234J70994Q581j26690k21558k69920
41217B9371596k72643k34591j61464n9507O2132J89967L08286M03612M68157N00308
41207C0575853N02881M81137M41662L91952L39507K89612K42660J93578J35074
41198C3593916O3245j8562j00617j71120k20060k40654k30337j93731j45768j09717
41188C2226595j07958j50651k31004l30750m30718n17567n81892o11444n88184
$$ y = [32495604, 31565202, 30692121, 29903003, 29227769, 28694934, 28324328, 28120679, 28069764, 28137548, 28273103, 28416721, 28512929, 28523951, 28436566, 28258333, 28006431, 27697340, 27343761, 26958548, 26560440, 26176370, 25838814, 25580719, 25431870, 25418249, 25561579, 25874722, 26352483, 26963556, 27650871, 28342366, 28966941, 29467955, 29810189, 29981183, 29989764, 29863074, 29641516, 29371596, 29098953, 28864362, 28702898, 28643391, 28705523, 28895490, 29203776, 29607388, 30075545, 30575853, 31078734, 31559871, 32001533, 32393485, 32732992, 33022604, 33265264, 33458842, 33593916, 33657161, 33638599, 33537982, 33366862, 33146802, 32906148, 32675811, 32482080, 32336312, 32226595, 32118637, 31967986, 31736982, 31406232, 30975514, 30457947, 29876055, 29264611, 28676427]
41179B8676427m94558l25731r7918J54272L89940N75593O94073P46896P50532
41170C1069526P27336O93543O50206N83164M72998L08886R7314j38989l69119
41161C4094865n62096o91482p38757o97946n79174m06569k10848k2047J34573
41152C0320519K41960K96384L10225L06934L09792L33315L83865M66373N88525
41143C3557892P56874R67463J198619J412532J566190J626195J580081J439702
41135D4105548J236676J012748Q08593O54480N65411N41535N72282O41824P34324
41126E0873421Q38100R47562J061727J179718J295915J397543J465099J474844
41118F0533929J403847J239067R88141O84543L81090J33747j5834n1995J1405
$$ y = [28676427, 28181869, 27856138, 27758220, 27912492, 28302432, 28878025, 29572098, 30318994, 31069526, 31796862, 32490405, 33140611, 33723775, 34196773, 34505659, 34602973, 34463984, 34094865, 33532769, 32841287, 32102530, 31404584, 30825410, 30418841, 30207993, 30185946, 30320519, 30562479, 30858863, 31169088, 31476022, 31785814, 32119129, 32502994, 32969367, 33557892, 34314766, 35282229, 36480848, 37893380, 39459570, 41085765, 42665846, 44105548, 45342224, 46354972, 47163565, 47818045, 48383456, 48924991, 49497273, 50139097, 50873421, 51711521, 52659083, 53720810, 54900528, 56196443, 57593986, 59059085, 60533929, 61937776, 63176843, 64164984, 64849527, 65230617, 65364364, 65348530, 65296535, 65307940]
41109F5307940J36240K74512L87733M61560N07433N52157O23902P42025R12983
41100F9906485J131430J384900J659244J941885K222369K492450K747258K986344
41092H6472365L212477L428243L632244L816685L966995M063693M086519M020662
41084A16699883L863210L626056L331955L005063K662514K312791J959585J604733
41076A39065790J246909Q79469M91929P5211l72363q39982j301039j714382k033846
41067A35497696k224158k274657k202081k041590j832982j609766j393841j194537
41059A20724084j010338q32503o49566m51150k30653J2830K73953N43748Q15268
41050A19195673J088351J369284J665840J982354K318244K669057L026754L377797
$$ y = [65307940, 65444180, 65718692, 66106425, 66567985, 67075418, 67627575, 68251477, 68993502, 69906485, 71037915, 72422815, 74082059, 76023944, 78246313, 80738763, 83486021, 86472365, 89684842, 93113085, 96745329, 100562014, 104529009, 108592702, 112679221, 116699883, 120563093, 124189149, 127521104, 130526167, 133188681, 135501472, 137461057, 139065790, 140312699, 141192168, 141684097, 141759308, 141386945, 140546963, 139245924, 137531542, 135497696, 133273538, 130998881, 128796800, 126755210, 124922228, 123312462, 121918621, 120724084, 119713746, 118881243, 118231677, 117780527, 117549874, 117562704, 117836657, 118380405, 119195673, 120284024, 121653308, 123319148, 125301502, 127619746, 130288803, 133315557, 136693354]
41042A36693354L700563L965170M137731M187590M092865L840847L425333K846596
41034A66890049K115991J260527L21936o49912j604997k499801l302647l997213
41026A58533933m582138n065541n456848n759614n968772o074220o069538n960521
41018A13596741n766457n512676n220511m903101m569279m230796l906171l617831
41010G5869919l383741l208444l079812k974662k869699k749807k608755k444583
41002E2550416k255599k040037j798340j536049j266180j009845p93347o41486
40994D1209533n69906n80325o60375p87008r31464j064295j159945j200731j180075
40985C3075409j103843r88325q54312p19700n94967m84447l91528l22357k84025
$$ y = [136693354, 140393917, 144359087, 148496818, 152684408, 156777273, 160618120, 164043453, 166890049, 169006040, 170266567, 170588503, 169938591, 168333594, 165833793, 162531146, 158533933, 153951795, 148886254, 143429406, 137669792, 131701020, 125626800, 119557262, 113596741, 107830284, 102317608, 97097097, 92193996, 87624717, 83393921, 79487750, 75869919, 72486178, 69277734, 66197922, 63223260, 60353561, 57603754, 54994999, 52550416, 50294817, 48254780, 46456440, 44920391, 43654211, 42644366, 41851019, 41209533, 40639627, 40059302, 39398927, 38611919, 37680455, 36616160, 35456215, 34255484, 33075409, 31971566, 30983241, 30128929, 29409229, 28814262, 28329815, 27938287, 27615930, 27331905]
40976B7331905k78969l01291l38380l75364l98118l94394l56284k84780j92376
40967B4411949r9548k6638J3600J9395j0k6094l4623j506Q9873K41892M38404
40956B5026694O44549Q12644Q95112Q62617P20244N10785K97504J31615K4243
40947B9926007n6413j59128l13386n08409o99781q35723q83864q43183p38157
40938B4887963o03556m70878l61384k83567k32774j94912j56157j13458p6498
40929B2394779n8400o3898q5838j11338j29098j30595j06957m8698M8232J74308
40919B1882497L03843M02413M42000M15854L43513K61096K01369J76099J72081
40910B4600765J62056J21589M1600o7516j79339k61345k89339k60131j93451j19860
$$ y = [27331905, 27052936, 26751645, 26413265, 26037901, 25639783, 25245389, 24889105, 24604325, 24411949, 24312401, 24285763, 24299363, 24318758, 24318748, 24292654, 24258031, 24256525, 24346398, 24588290, 25026694, 25671243, 26483887, 27378999, 28241616, 28961860, 29472645, 29770149, 29901764, 29926007, 29869594, 29710466, 29397080, 28888671, 28188890, 27353167, 26469303, 25626120, 24887963, 24284407, 23813529, 23452145, 23168578, 22935804, 22740892, 22584735, 22471277, 22394779, 22336379, 22272481, 22186643, 22075305, 21946207, 21815612, 21708655, 21659957, 21708189, 21882497, 22186340, 22588753, 23030753, 23446607, 23790120, 24051216, 24252585, 24428684, 24600765, 24762821, 24884410, 24926010, 24858494, 24679155, 24417810, 24128471, 23868340, 23674889, 23555029]
40900B3555029o2335k4095J0325O3391J50367K69996M03785N23220O00381O16557
40890B6106621N66402M59189L18667J80251Q3496O1343J31175K91711N25455Q04094
40880B9528404J095175J369023J603651J785266J905364J959047J947127J878615
40872D3071672J767666J624544J447672J223938R37555N81621J67013k74150o92341
40863D9855190j033151j254873j341837j305390j173980r81301p59286n34816
40855D1470556l26456j41501K2727J72386L09788M30348N24729N83501O01522
40846D3647600N80604N29489M60296L82399K97058J96309O7082j01199l08561
40837D5751077n39074p61314r36352j031201j030905r42284p87583n92849l78534
$$ y = [23555029, 23492694, 23468599, 23478924, 23542315, 23692682, 23962678, 24366463, 24889683, 25490064, 26106621, 26673023, 27132212, 27450879, 27631130, 27714626, 27775969, 27907144, 28198855, 28724310, 29528404, 30623579, 31992602, 33596253, 35381519, 37286883, 39245930, 41193057, 43071672, 44839338, 46463882, 47911554, 49135492, 50073047, 50654668, 50821681, 50547531, 49855190, 48822039, 47567166, 46225329, 44919939, 43745959, 42764658, 42005372, 41470556, 41144100, 41002599, 41025326, 41197712, 41507500, 41937848, 42462577, 43046078, 43647600, 44228204, 44757693, 45217989, 45600388, 45897446, 46093755, 46160837, 46059638, 45751077, 45212003, 44450689, 43514337, 42483136, 41452231, 40509947, 39722364, 39129515, 38750981]
40828C8750981j57182O1780K64300M27686N25023N36080M56371K97294P8832j76932
40818D1064233m47082p07752r38615j130142j285453j412512j512619j575401
40810C2054657j584112j526222j401982j227239j030344q44007o94205n91352
40802B3155194n29334m92996m68133m47115m28286m12594m00997l93212l86640
40793A9195887l75140l48833k96414k09890q9444N5290K09083L57493M91204O06456
40783A9595692P03435P84841Q54424R14867R66059J005202J028232J031373J013325
40774B7897450R78425R37568R02737Q76736Q46929P90130O86054N29323L32307
40765C4777659J19121q3840k55446l82768m60022m86586m66577m08867l24638
$$ y = [38750981, 38593799, 38655579, 38919879, 39347565, 39872588, 40408668, 40865039, 41162333, 41241165, 41064233, 40617151, 39909399, 38970784, 37840642, 36555189, 35142677, 33630058, 32054657, 30470545, 28944323, 27542341, 26315102, 25284758, 24440751, 23746546, 23155194, 22625860, 22132864, 21664731, 21217616, 20789330, 20376736, 19975739, 19582527, 19195887, 18820747, 18471914, 18175500, 17965610, 17876166, 17931456, 18140539, 18498032, 18989236, 19595692, 20299127, 21083968, 21938392, 22853259, 23819318, 24824520, 25852752, 26884125, 27897450, 28875875, 29813443, 30716180, 31592916, 32439845, 33229975, 33916029, 34445352, 34777659, 34896780, 34812940, 34557494, 34174726, 33714704, 33228118, 32761541, 32352674, 32028036]
40756C2028036k22781j07538J9025J52569K84731M04291M98577N54803N64164
40747C4175877N27948M59799L79436L01798K30659J61283Q8074J0366o6351j31974
40737C6136915j74524j84943j63712j25473r6098j01930j57683k61674m01085
40728C4469793n62409p39090r31297j137878j345620j523968j631644j634102
40720B4963785j522260j320822j080856q60012o99698o09988n69997n43364m98438
40711A7258350m19627l05103j58018J7900K15416M19533O08761P62380Q68574
40702A9268166R28385R53864R62410R70392R88432J019375J058889J097743J124364
40693B8372020J126750J093909J017882Q96425P34841N45815L47727J62371J1415
$$ y = [32028036, 31805255, 31697717, 31716742, 31869311, 32154042, 32558333, 33056910, 33611713, 34175877, 34703825, 35163624, 35543060, 35844858, 36075517, 36236800, 36324874, 36335240, 36268889, 36136915, 35962391, 35777448, 35613736, 35488263, 35392165, 35290235, 35132552, 34870878, 34469793, 33907384, 33168294, 32236997, 31099119, 29753499, 28229531, 26597887, 24963785, 23441525, 22120703, 21039847, 20179835, 19480137, 18870149, 18300152, 17756788, 17258350, 16838723, 16533620, 16375602, 16393502, 16608918, 17028451, 17637212, 18399592, 19268166, 20196551, 21150415, 22112825, 23083217, 24071649, 25091024, 26149913, 27247656, 28372020, 29498770, 30592679, 31610561, 32506986, 33241827, 33787642, 34135369, 34297740, 34309155]
40684C4309155q9411j36424j39647j17320q6646n7260l0368j680L4906Q3448J42193
40673C3910946K02135K50054K74383K69341K34835J74051R1197r939j27122k59721
40663C5010160m06782n63771p19602q55119r44307r60172q84681p17624m77852
40654B8480250j96168R4216L63419N86373P43914Q26095Q36148P91229P17847
40645C3243323O43653N90406N71746N94880O61850P67779Q97982J027850J127134
40636D0126603J167021J126993R99071P88590N12270J95060j33615m44430p12750
40627D3624813r21083j058349j117973j097865j003227q49695o63077m73347l04361
40618C6135836j65218n0040N2981J50498K40185L15705L73495M13836M36282M35617
$$ y = [34309155, 34219744, 34083320, 33943673, 33826353, 33739707, 33682447, 33652079, 33650399, 33685305, 33768753, 33910946, 34113081, 34363135, 34637518, 34906859, 35141694, 35315745, 35406942, 35397003, 35269881, 35010160, 34603378, 34039607, 33320005, 32464886, 31520579, 30560407, 29675726, 28958102, 28480250, 28284082, 28378298, 28741717, 29328090, 30072004, 30898099, 31734247, 32525476, 33243323, 33886976, 34477382, 35049128, 35644008, 36305858, 37073637, 37971619, 38999469, 40126603, 41293624, 42420617, 43419688, 44208278, 44720548, 44915608, 44781993, 44337563, 43624813, 42703730, 41645381, 40527408, 39429543, 38426316, 37576621, 36913544, 36440197, 36135836, 35970618, 35920578, 35973559, 36124057, 36364242, 36679947, 37053442, 37467278, 37903560, 38339177]
40608C8339177M03265L33034K26180R2756m9690j77866k65889k92600k52055j59929
40598C8196383m8383M9908J18488J63414K05814K66842L55336M65128N81552O90802
40588D1045284P85848Q67292R41545J018109J105635J207028J316150J418618
40580D9705509J495586J527734J498673J399759J236459J031875Q22276O45175
40572E9363046N27491M81180N06426N95822P34819R00658J065022J200884J288538
40563F6663886J316837J281455J185323J042636Q82438P46156O77509P09127Q53057
40554G5358424J100239J428182J811605K229940K669134L119000L569448M008216
40546I5294188M420772M791837N108243N362979N559057N709940N834690N950267
$$ y = [38339177, 38742442, 39075476, 39301656, 39394412, 39344722, 39166856, 38900967, 38608367, 38356312, 38196383, 38148000, 38197908, 38316396, 38479810, 38685624, 38952466, 39307802, 39772930, 40354482, 41045284, 41831132, 42698424, 43639969, 44658078, 45763713, 46970741, 48286891, 49705509, 51201095, 52728829, 54227502, 55627261, 56863720, 57895595, 58717871, 59363046, 59890537, 60371717, 60878143, 61473965, 62208784, 63109442, 64174464, 65375348, 66663886, 67980723, 69262178, 70447501, 71490137, 72372575, 73118731, 73796240, 74505367, 75358424, 76458663, 77886845, 79698450, 81928390, 84597524, 87716524, 91285972, 95294188, 99714960, 104506797, 109615040, 114978019, 120537076, 126247016, 132081706, 138031973]
40538A38031973O066461O186521O311624O444940O593069O765088O969789P211255
40530A90580720P484333P773509Q057853Q320524Q556878Q775354Q990393R212761
40522B57752325R444320R680639R918414J0161367J0419578J0701996J1006418
40515C29085057J1312883J1583783J1769878J1818460J1680495J1315558J0695023
40508D09261137R804452Q645428P235895N607421L799745J856035j77294k246395
40500D43786424m286764o226726p998487r552040j0864841j1942081j2807157
40493C80108328j3487179j4000888j4353853j4540715j4551339j4378766j4027862
40486B80767726j3522305j2905471j2232781j1557961j0919539j0333511r794637
$$ y = [138031973, 144098434, 150284955, 156596579, 163041519, 169634588, 176399676, 183369465, 190580720, 198065053, 205838562, 213896415, 222216939, 230773817, 239549171, 248539564, 257752325, 267196645, 276877284, 286795698, 296957065, 307376643, 318078639, 329085057, 340397940, 351981723, 363751601, 375570061, 387250556, 398566114, 409261137, 419065589, 427711017, 434946912, 440554333, 444354078, 446210113, 446032819, 443786424, 439499660, 433272934, 425274447, 415722407, 404857566, 392915485, 380108328, 366621149, 352620261, 338266408, 323725693, 309174354, 294795588, 280767726, 267245421, 254339950, 242107169, 230549208, 219629669, 209296158, 199501521]
40479A99501521r284830q784453q280891p770324p253160o728270o191573n639953
40471A39568067n076710m514249l973129l479042l059097k737354k529219k435156
40463A11764111k435918k493107k558401k589434k564064k484006k366166k228566
40455I2044449k079750j916680j731099j520596j297480j088656r25415q29914
40447H0654859q06646q42022r09341r76072j012047r96910r24097q00258o41369
40438G2746097m67167k94797j33476J6756J61522L07400M59862O23027P97408
40429G4216632R75349J138961J264571J331401J328540J257215J129889R68069
40421H3610627P98431O46919N32975M66663M49074M74518N33896O19426P29175
$$ y = [199501521, 190216691, 181432238, 173151347, 165381023, 158127863, 151399593, 145208020, 139568067, 134491357, 129977108, 126003979, 122524937, 119465840, 116728486, 114199267, 111764111, 109328193, 106835086, 104276685, 101687251, 99123187, 96639181, 94273015, 92044449, 89964699, 88048019, 86316920, 84796324, 83498844, 82410188, 81484773, 80654859, 79848213, 79006191, 78096850, 77120778, 76108731, 75111821, 74187724, 73387466, 72746097, 72278930, 71984133, 71850657, 71867413, 72028935, 72336335, 72796197, 73419224, 74216632, 75191981, 76330942, 77595513, 78926914, 80255454, 81512669, 82642558, 83610627, 84409058, 85055977, 85588952, 86055615, 86504689, 86979207, 87513103, 88132529, 88861704]
40412H8861704Q68037J043226J256513J498176J746862J976411K166236K308512
40404A01725677K406696K466674K488966K470271K413869K339277K281099K275781
40396A20868310K344965K486137K674511K872476L040730L148190L179468L137782
40388A43752569L041433K915607K783703K660652K548232K433738K295432K115034
40380A64546400J890890J642648J403147J200971J043223R09381P61713N66291
40372A73964664L10154L992l27380o56849r63008j234992j474621j693557j905597
40363A66022806k119744k339415k566208k802026l046666l293934l531078l742432
40355A42581303l914064m035777m100565m104673m050237l947898l815078l669777
$$ y = [88861704, 89729741, 90772967, 92029480, 93527656, 95274518, 97250929, 99417165, 101725677, 104132373, 106599047, 109088013, 111558284, 113972153, 116311430, 118592529, 120868310, 123213275, 125699412, 128373923, 131246399, 134287129, 137435319, 140614787, 143752569, 146794002, 149709609, 152493312, 155153964, 157702196, 160135934, 162431366, 164546400, 166437290, 168079938, 169483085, 170684056, 171727279, 172636660, 173398373, 173964664, 174274818, 174278810, 173951430, 173294581, 172331573, 171096581, 169621960, 167928403, 166022806, 163903062, 161563647, 158997439, 156195413, 153148747, 149854813, 146323735, 142581303, 138667239, 134631462, 130530897, 126426224, 122375987, 118428089, 114613011, 110943234]
40347A10943234l524343l383348l245205l105411k961058k816855k689813k607056
40339H6610145k594310k660113k786023k930441l044619l091181l054569k939657
40331F3509232k762428k540085k285937k010393j725060j445132j187660r67325
40323D8585212p93239o67947n87852n45518n34390n52860o02626o81030p74365
40314D2845385q59251r11517r16173q72782p94288o99913o05293n16176m30561
40305C6239431l46843k70102k11578j83840j96424k53435l51965m81557o25567
40296C3318120p62717q66134r02057q35596o46564l46016K2064L98780P34654
40287C0114534J001325J185874J280068J278234J184408J018709Q14966O10154
$$ y = [110943234, 107418891, 104035543, 100790338, 97684927, 94723869, 91907014, 89217201, 86610145, 84015835, 81355722, 78569699, 75639258, 72594639, 69503458, 66448889, 63509232, 60746804, 58206719, 55920782, 53910389, 52185329, 50740197, 49552537, 48585212, 47791973, 47124026, 46536174, 45990656, 45456266, 44903406, 44300780, 43619750, 42845385, 41986134, 41074617, 40158444, 39285662, 38491374, 37791461, 37186168, 36669992, 36239431, 35892588, 35622486, 35410908, 35227068, 35030644, 34777209, 34425244, 33943687, 33318120, 32555403, 31689269, 30787212, 29951616, 29305052, 28959036, 28981100, 29379880, 30114534, 31115859, 32301733, 33581801, 34860035, 36044443, 37063152, 37878118, 38488272]
40279C8488272M31561K88200J70758O0351n9280j93527l36483m76636o04420p17583
40269C7051213q21474r23469j025006j117294j184051j208884j181895j102054
40261B8487086r75174q09855o14691l99239j77794K8733J96998L10705L69085
40252B6415854L88011L92182M03059M29769M67218N00576N12270M88679M25008
40243C0422626L26786K06497P6904n4118j83061l05960m14433m96883n44160n55106
40233B8479092n37679n05376m72286m50024m45808m59334m79648m87026m62530
40224B4179381l99844l10318k17490j46303j15144j34607k10249l43959n30741
40215B1770726p52836r77366j162965j274089j294469j230208j100079r20124
$$ y = [38488272, 38919833, 39208033, 39378791, 39439142, 39379862, 39186335, 38849852, 38373216, 37768796, 37051213, 36229739, 35306270, 34281264, 33163970, 31979919, 30771035, 29589140, 28487086, 27511912, 26702057, 26087366, 25688127, 25510333, 25539066, 25736064, 26046769, 26415854, 26803865, 27196047, 27599106, 28028875, 28496093, 28996669, 29508939, 29997618, 30422626, 30749412, 30955909, 31032813, 30978695, 30795634, 30489674, 30075241, 29578358, 29034198, 28479092, 27941413, 27436037, 26963751, 26513727, 26067919, 25608585, 25128937, 24641911, 24179381, 23779537, 23469219, 23251729, 23105426, 22990282, 22855675, 22645426, 22301467, 21770726, 21017890, 20040524, 18877559, 17603470, 16309001, 15078793, 13978714, 13058590]
40207A3058590o93846m15246q2602K87338O55879R73421J198498J313234J326971
40198A7622237J268278J171611J065745R67786Q83092Q09251P41485O76365O11783
40189B5817633N43778M64241L63470K37163R1535n9793k06069l48356m98765o70409
40179B5734428q66178j074731j275497j447966j578534j661103j693144j672722
40171A4464553j600321j483454j338311j185370j041614r14385p99891o87029
40163E414178n65698m36426l15214k28540j99744k34871l17098m13275m87933
40154B215379n15320m83008l89013k40204n5187J34477K92163L90797M22531L95576
40144B168191L22346K10338O2993j11647k92758m47173n40062n49316m73788l31045
$$ y = [13058590, 12364744, 11949498, 11866896, 12154234, 12810113, 13783534, 14982032, 16295266, 17622237, 18890515, 20062126, 21127871, 22095657, 22978749, 23788000, 24529485, 25205850, 25817633, 26361411, 26825652, 27189122, 27426285, 27517820, 27458027, 27251958, 26903602, 26404837, 25734428, 24868250, 23793519, 22518022, 21070056, 19491522, 17830419, 16137275, 14464553, 12864232, 11380778, 10042467, 8857097, 7815483, 6901098, 6101207, 5414178, 4848480, 4412054, 4096840, 3868300, 3668556, 3433685, 3116587, 2703312, 2215379, 1700059, 1217051, 828038, 587834, 532647, 667124, 959287, 1350084, 1772615, 2168191, 2490537, 2700875, 2763868, 2652221, 2359463, 1912290, 1372228, 822912, 349124, 18079]
40134A8079j48799M3345K19592L62986M70126N52307O29719P19410Q22997R21986
40124D611748R85161R84466R09956P75876O16650M75905L91767L82292M37635
40115A0571456N24824O03197O40181O17793N29593L75901J64088q7041l45277
40106A3594715n70345p24810p84856p46658o27037m58122k76475j10558K6168
40097I322022J32464K10995K62742K87669K88692K74274K57891K54333K73408
40088A1564490L13649L60360L90840L84977L35814K53850J61269P8245J0365n3010
40078A3800849j28828k28666l54885n04007o69112q37209r86200j088393j120862
40069G882687j076085r65619q14634o51261m96938l62082k47215j47085n5405
$$ y = [18079, -130720, -87375, 132217, 495203, 965329, 1517636, 2147355, 2866765, 3689762, 4611748, 5596909, 6581375, 7491331, 8267207, 8883857, 9359762, 9751529, 10133821, 10571456, 11096280, 11699477, 12339658, 12957451, 13487044, 13862945, 14027033, 13939992, 13594715, 13024370, 12299560, 11514704, 10768046, 10141009, 9682887, 9406412, 9295854, 9322022, 9454486, 9665481, 9928223, 10215892, 10504584, 10778858, 11036749, 11291082, 11564490, 11878139, 12238499, 12629339, 13014316, 13350130, 13603980, 13765249, 13843494, 13853859, 13800849, 13672021, 13443355, 13088470, 12584463, 11915351, 11078142, 10091942, 9003549, 7882687, 6806602, 5840983, 5026349, 4375088, 3878150, 3516068, 3268853, 3121768, 3066363]
40060C066363L0878J08135J64370J80892J38409K6308j49145l62584n74962p44109
40050A884555q36306q35840p50028o06865m44942l00215j96254j40905j27428
40041b354228j37925j49675j44277j15102o7585j2716M0069Q5716J23160J55428
40031b577135J90541K40293L15804M22408N57068P08938Q61663R96162J093511
40022B809253J137996J120600J042711R17984P69845O24874N05949M28618L99908
40013I757738M16576M63222N14105N40910N23210M55635L48141K20578R5667o058
40003A3329724o9157q6553o3834k0453J7084K8002O726l7984r1625j41665j79632
39992A2690633j99582j96595j66700j08299k5424O8804J52810K04118K10365J75397
$$ y = [3066363, 3097241, 3205376, 3369746, 3550638, 3689047, 3715355, 3566210, 3203626, 2628664, 1884555, 1048249, 212409, -537619, -1144484, -1589426, -1889641, -2085895, -2226800, -2354228, -2492153, -2641828, -2786105, -2901207, -2968792, -2981508, -2941439, -2855723, -2732563, -2577135, -2386594, -2146301, -1830497, -1408089, -851021, -142083, 719580, 1715742, 2809253, 3947249, 5067849, 6110560, 7028544, 7798389, 8423263, 8929212, 9357830, 9757738, 10174314, 10637536, 11151641, 11692551, 12215761, 12671396, 13019537, 13240115, 13335782, 13329724, 13260567, 13174014, 13110180, 13089727, 13106811, 13134813, 13141539, 13103555, 13011930, 12870265, 12690633, 12491051, 12294456, 12127756, 12019457, 11994033, 12062837, 12215647, 12419765, 12630130, 12805527]
39982A2805527J15559M9599r173n4067q2374r4227r3391q6565p9849p5721p3446
39971A2321872p1285o7611o1289n3984n3743p5572j36217k44817l93878n55247
39961A0608229o85329p40564o96947n61835l70201j68791J096J14550J66952J72433
39951G839593J57101J48027J62823K05385K68969L42826M17731M88716N55351
39942A0586522O20320O87092P57554Q29927Q96640R42754R47456Q90553P61315
39933A7920133N64324L19509N8687j78602l51068m25638l88425k49259l6082K15955
39923A7449534M72733P03779Q82411R86984J003485R28048P68993N48432L01995
39914B4046394P4246r0780j61256j26620j15J86031L90488N74028P08528P81353
$$ y = [12805527, 12921086, 12970685, 12961512, 12907445, 12825071, 12730844, 12637453, 12550888, 12471039, 12395318, 12321872, 12250587, 12182976, 12121687, 12067703, 12013960, 11938388, 11802171, 11557354, 11163476, 10608229, 9922900, 9182336, 8485389, 7923554, 7553353, 7384562, 7385658, 7500208, 7667160, 7839593, 7996694, 8144721, 8307544, 8512929, 8781898, 9124724, 9542455, 10031171, 10586522, 11206842, 11893934, 12651488, 13481415, 14378055, 15320809, 16268265, 17158818, 17920133, 18484457, 18803966, 18862653, 18684051, 18332983, 17907345, 17518920, 17269661, 17233579, 17449534, 17922267, 18626046, 19508457, 20495441, 21498926, 22426974, 23195967, 23744399, 24046394, 24120640, 24029860, 23868604, 23741984, 23741869, 23927900, 24318388, 24892416, 25600944, 26382297]
39904B6382297P93913P55404O74966N56654L99964K05350j9034k53997m72358
39895B9023159o47465p62830q17494q24042q00528p61198p11543o49814n72556
39886B2475689m79038l72259k58107j45071m3806L5346Q6109J08095J06060Q9580
39876B1602598P4469Q1973J31506K29611L63691N06173O26416P03102P31010P19370
39866B5769919O83068O32576N70740M98829M24783L63960L31116L31945L61979
39857B9968915M12385M76023N48968O27078P00784P52711P62271P16197O17131
39848C5582463M81652L28158J65490p331j90767l74184n34482o44570o85501o55457
39838C3465471n71000m59646l47185k47236j59231p4117J8718J27629K56762M03194
$$ y = [26382297, 27176210, 27931614, 28606580, 29163234, 29563198, 29768548, 29749514, 29495517, 29023159, 28375694, 27612864, 26795370, 25971328, 25170800, 24409602, 23698059, 23048245, 22475689, 21996651, 21624392, 21366285, 21221214, 21177408, 21212754, 21298863, 21406958, 21513018, 21602598, 21677067, 21759040, 21890546, 22120157, 22483848, 22990021, 23616437, 24319539, 25050549, 25769919, 26452987, 27085563, 27656303, 28155132, 28579915, 28943875, 29274991, 29606936, 29968915, 30381300, 30857323, 31406291, 32033369, 32734153, 33486864, 34249135, 34965332, 35582463, 36064115, 36392273, 36557763, 36550432, 36359665, 35985481, 35450999, 34806429, 34120928, 33465471, 32894471, 32434825, 32087640, 31840404, 31681173, 31607056, 31625774, 31753403, 32010165, 32413359]
39828C2413359N54729O92250P96794Q56936Q71781Q48622P96787P20462O14118
39819C9165838M64070K56630j0786l21040o35769r03890j078267j132842j069916
39810C4734028r13785o96988m49275j94489M6799K54139M07977M95372N16770
39801C4200548M87121M28672L60999K96319K41688K02546J82904J83369K00536
39792C6784702K28743K62532K98349L34948L72582M11706M52142M93278N34981
39783D0173963N78916O29617O93339P73631Q66142R57288J028193J060527J040519
39774D7802135R60796Q21122O28199L94729J39168j13727l34762m96776n82674
39765D9218210n89229n24922m05547k51415q6134O5239J80018K43463K54208K25922
$$ y = [32413359, 32968088, 33660338, 34457132, 35314068, 36185849, 37034471, 37831258, 38551720, 39165838, 39629908, 39886538, 39875752, 39554712, 38918943, 38015053, 36936786, 35803944, 34734028, 33820243, 33123255, 32673980, 32479491, 32526290, 32780429, 33188406, 33683778, 34200548, 34687669, 35116341, 35477340, 35773659, 36015347, 36217893, 36400797, 36584166, 36784702, 37013445, 37275977, 37574326, 37909274, 38281856, 38693562, 39145704, 39638982, 40173963, 40752879, 41382496, 42075835, 42849466, 43715608, 44672896, 45701089, 46761616, 47802135, 48762931, 49584053, 50212252, 50606981, 50746149, 50632422, 50297660, 49800884, 49218210, 48628981, 48104059, 47698512, 47447097, 47360963, 47426202, 47606220, 47849683, 48103891, 48329813]
39755D8329813J82065J45233J27587J28040J35897J36340J14460N8029m0281j81954
39745D9135229l63401n76963q10412j046053j261948j435776j549190j590904
39737D0500582j558798j460576j310730j123438r06804o64873m06116j48846Q3593
39728C3003994K73963M17936N20703N87540O16743N99395N24206L82918J73576
39719C7100974r7670m14561p49562j067086j332180j520156j620774j636026j576220
39710B7086739j458368j305466j143176r93615q69718p72667o91855o06250m88649
39701A8756975l15108p7807K06199M97599P48313R17102R79088R28392P78068
39692B3418821N58747L13303Q6176q8591j94738k33818k18992j65545q2188L1560
$$ y = [48329813, 48511878, 48657111, 48784698, 48912738, 49048635, 49184975, 49299435, 49357464, 49317183, 49135229, 48771828, 48194865, 47384453, 46338400, 45076452, 43640676, 42091486, 40500582, 38941784, 37481208, 36170478, 35047040, 34140236, 33475363, 33069247, 32920401, 33003994, 33277957, 33695893, 34216596, 34804136, 35420879, 36020274, 36544480, 36927398, 37100974, 37003304, 36588743, 35839181, 34772095, 33439915, 31919759, 30298985, 28662959, 27086739, 25628371, 24322905, 23179729, 22186114, 21316396, 20543729, 19851874, 19245624, 18756975, 18441867, 18364060, 18570259, 19067858, 19816171, 20733273, 21712361, 22640753, 23418821, 23977568, 24290871, 24377047, 24288456, 24093718, 23859900, 23640908, 23475363, 23393175, 23424735]
39682B3424735J78888L53566N31443O73776P42199P16157O01633M26533K27268
39673B7876198L5583j28440k56984l51672m19769m70775n14176n58322o09346
39664B4602297o69544p36511q04869q70234r32500r95689j063861j135665j200991
39655A6192433j242812j243997j195719j102543r81443q55529p45184o59372n90416
39646G575418n15841m08734k52402n0434J75136L96456N93523P58508Q88337R73926
39636A0133893R97554R42226Q05572O06638L81520J73506K4543l2227J7264J57512
39626A4208001L43121N15227O27150O62419O33976N68266M87263M00196L07916
39617A8753535K14320J35153R6880J25513K32408M05846O13177Q11532R61022
$$ y = [23424735, 23603623, 23957189, 24488632, 25162408, 25904607, 26620764, 27222397, 27648930, 27876198, 27911781, 27783341, 27526357, 27174685, 26754916, 26284141, 25769965, 25211643, 24602297, 23932753, 23196242, 22391373, 21521139, 20588639, 19592950, 18529089, 17393424, 16192433, 14949621, 13705624, 12509905, 11407362, 10425919, 9570390, 8825206, 8165834, 7575418, 7059577, 6650843, 6398441, 6348007, 6523143, 6919599, 7513122, 8271630, 9159967, 10133893, 11131447, 12073673, 12879245, 13485883, 13867403, 14040909, 14065452, 14033225, 14050489, 14208001, 14551122, 15066349, 15693499, 16355918, 16989894, 17558160, 18045423, 18445619, 18753535, 18967855, 19103008, 19199888, 19325401, 19557809, 19963655, 20576832, 21388364, 22349386]
39608B2349386J034063J018535R16915P44428N26360K92704P0670j20615k69464
39599B6562982l66711m02582l69813k71685j28379K5019J50125K20107K28303
39590B5647366J86250J15505M0997j1810k0267K8391J30530K67787M18177N68098
39580B7371024P15266Q61309J002954J130873J236624J319981J389327J454423
39572C6481781J516955J565189J576184J524613J393447J180577Q98224N66770
39564D6703740K07789j59321n15845q39579j102689j275960j339339j292971j160582
39555C9225243r81550p95987o31574m98587l93484l06787k30560j62460j05211
39546C5119043o2792l6664k5665k9663n3552j07438k01411l36008m92268o28730
$$ y = [22349386, 23383449, 24401984, 25318899, 26063327, 26589687, 26882391, 26953061, 26832446, 26562982, 26196271, 25793689, 25423876, 25152191, 25023812, 25048831, 25198956, 25419063, 25647366, 25833616, 25949121, 25990118, 25978308, 25958041, 25986432, 26116962, 26384749, 26802926, 27371024, 28086290, 28947599, 29950553, 31081426, 32318050, 33638031, 35027358, 36481781, 37998736, 39563925, 41140109, 42664722, 44058169, 45238746, 46136970, 46703740, 46911529, 46752208, 46236363, 45396784, 44294095, 43018135, 41678796, 40385825, 39225243, 38243693, 37447706, 36816132, 36317545, 35924061, 35617274, 35386714, 35224254, 35119043, 35056251, 35019587, 34993922, 34964259, 34910707, 34803269, 34601858, 34265850, 33773582, 33144852]
39536C3144852o92574o43138m73645k15001Q0384L61037N90280P48695Q31536
39527C3732426Q45690Q05696P28088O26067N07000L73234K25121O4127j06613
39518C7800836k84951m72769o75625q98644j141516j395087j640128j849369j994337
39509B7448410k055675k031870j941039j814348j683175j565184j456214j333752
39501A3567153j170408r48344o65894l36068J7167L61242O58469Q73997R86622
39492A3343936R96655R26063Q10367O86205N80689N07562M70204M66136M87867
39483A9275684N21310N47964N53260N34772N01995M67760M39816M19119M02898
39474B3664578L87056L66886L38315K99518K50472J90763J19608L9392m0793j05794
$$ y = [33144852, 32452278, 31809140, 31335495, 31120494, 31200878, 31561915, 32152195, 32900890, 33732426, 34578116, 35383812, 36111900, 36737967, 37244967, 37618201, 37843322, 37907449, 37800836, 37515885, 37043116, 36367491, 35468847, 34327331, 32932244, 31292116, 29442747, 27448410, 25392735, 23360865, 21419826, 19605478, 17922303, 16357119, 14900905, 13567153, 12396745, 11448401, 10782507, 10446439, 10463606, 10824848, 11483317, 12357314, 13343936, 14340591, 15266654, 16077021, 16763226, 17343915, 17851477, 18321681, 18787817, 19275684, 19796994, 20344958, 20898218, 21432990, 21934985, 22402745, 22842561, 23261680, 23664578, 24051634, 24418520, 24756835, 25056353, 25306825, 25497588, 25617196, 25656588, 25615795, 25510001]
39464B5510001j39355j30654p9810J42Q7435J61660K14648K55178L03869L80468
39454B6563582M90227O17858P34253Q12778Q43922Q38165Q16424P96374P83461
39445C3297044P70081P41379O83740N91434M68391L25260J74516K6296j13541
39436C6964600k42289l56199m45129m89153m60246l31067r0284K42226O12061
39427C5404520R46636J184461J298615J299555J219034J090073R36081P70920
39419D4149895O02642M33756K57981N9350j81507m76582q22682j200978j581306
39410D1240569j927290k202309k377636k439532k389184k235136j986005j651562
39402B4031915j251134q20396m08269o3761J79607L12393L46560L05044K11747
$$ y = [25510001, 25370646, 25239992, 25160182, 25160324, 25247759, 25409419, 25624067, 25879245, 26183114, 26563582, 27053809, 27671667, 28405920, 29218698, 30062620, 30900785, 31717209, 32513583, 33297044, 34067125, 34808504, 35492244, 36083678, 36552069, 36877329, 37051845, 37078141, 36964600, 36722311, 36366112, 35920983, 35431830, 34971584, 34640517, 34550233, 34792459, 35404520, 36351156, 37535617, 38834232, 40133787, 41352821, 42442894, 43378975, 44149895, 44752537, 45186293, 45444274, 45503624, 45322117, 44845535, 44022853, 42821875, 41240569, 39313279, 37110970, 34733334, 32293802, 29904618, 27669482, 25683477, 24031915, 22780781, 21960385, 21552116, 21488355, 21667962, 21980355, 22326915, 22631959, 22843706]
39393B2843706Q7268n0590j85537l02176l84671m15346l76930k59998p0620J69117
39383B1054223M29165O81697R06069J087353J212611J269464J248632J149284
39375B9038498R83486P75140N51999L35365J34570n1136k26604l94917n52811
39366C0593590o88189p82461q18849p91682p09023n86816m41524k88765j47415
39357B5338866m1508N557j8886j10475k49839m09774n61581o78469p38269p27410
39347B1808212o44559n01326l19698j28042M3070J65557K19368J98402J14946
39338B0955930l49j05926j63213j49945o4024Q3859K80782N14864P69529J017200
39328B3138707J221426J347114J370911J285737J100445Q38205N33426K24960
$$ y = [22843706, 22930974, 22880384, 22694847, 22392671, 22008000, 21592654, 21215724, 20955726, 20885106, 21054223, 21483388, 22165085, 23071154, 24158507, 25371118, 26640582, 27889214, 29038498, 30021984, 30797124, 31349123, 31684488, 31819058, 31767922, 31541318, 31146401, 30593590, 29905401, 29122940, 28304091, 27512409, 26803386, 26216570, 25775046, 25486281, 25338866, 25297358, 25302915, 25284029, 25173554, 24923715, 24513941, 23952360, 23273891, 22535622, 21808212, 21163653, 20662327, 20342629, 20214587, 20257657, 20423214, 20642582, 20840984, 20955930, 20955581, 20849655, 20686442, 20536497, 20472473, 20556332, 20837114, 21351978, 22121507, 23138707, 24360133, 25707247, 27078158, 28363895, 29464340, 30302545, 30835971, 31060931]
39320C1060931n2804k75492m28147n02076m93763m06140k49619m2026J91673M20575
39310B9223112O12025P38749P86207P57167O71517N59831M51806L65416L03712
39301C4469542K59727K22649J79919J17389K2876j06541k58985m08848n24801
39292C3972927n81316n68844m97687l93065k83793j90850j21268o9132k1974L0594
39282C1275592Q9971J46540J83417J83964J39463N3683n7741j73351k75182l56539
39272C1209817m23302m87321n56541o29821p00740p66124q30466r01906r83889
39263B4929707j069507j142286j182866j179086j134253j066407r95846r29140
39255A6230316q53186p44842n87352l80665j40960J05702L30330N07666O23162
$$ y = [31060931, 31008127, 30732635, 30304488, 29802412, 29308649, 28902509, 28652890, 28610864, 28802537, 29223112, 29835137, 30573886, 31360093, 32117260, 32788777, 33348608, 33800414, 34165830, 34469542, 34729269, 34951918, 35131837, 35249226, 35272102, 35165561, 34906576, 34497728, 33972927, 33391611, 32822767, 32325080, 31932015, 31648222, 31457372, 31336104, 31266972, 31244998, 31275592, 31365563, 31512103, 31695520, 31879484, 32018947, 32072630, 32014889, 31841538, 31566356, 31209817, 30786515, 30299194, 29742653, 29112832, 28412092, 27645968, 26815502, 25913596, 24929707, 23860200, 22717914, 21535048, 20355962, 19221709, 18155302, 17159456, 16230316, 15377130, 14632288, 14044936, 13664271, 13523311, 13629013, 13959343, 14467009, 15090171]
39246A5090171O77465O84403O62499O25660N79475N24632M63323M03340L57894
39237B0068862L42285L69052M42939N57510O95950Q36496R59734J053094J109801
39228B6435723J123922J087074R91898Q41448O56396M71619L22056K27118J83885
39219C2341139J71569J61837J28459N4216o3516k08102l43813m25751m18850l16049
39209C1081139j43175N3335K27511L50649M16509M36030M27202M05929L81580
39200C3636709L57407L32934L06124K76184K47620K32302K45308K96410L84943
39191C6315941N02395O37493P76177Q96987R70809R70582Q85639P29211N33658
39182D3218892L37636J73551O0754N272M322N2163J43087K69403M17488N67883
$$ y = [15090171, 15767636, 16452039, 17114538, 17740198, 18319673, 18844305, 19307628, 19710968, 20068862, 20411147, 20780199, 21223138, 21780648, 22476598, 23313094, 24272828, 25325922, 26435723, 27559645, 28646719, 29638617, 30480065, 31136461, 31608080, 31930136, 32157254, 32341139, 32512708, 32674545, 32803004, 32857220, 32793704, 32585602, 32241789, 31816038, 31397188, 31081139, 30937964, 30991299, 31218810, 31569459, 31985968, 32421998, 32849200, 33255129, 33636709, 33994116, 34327050, 34633174, 34909358, 35156978, 35389280, 35634588, 35930998, 36315941, 36818336, 37455829, 38232006, 39128993, 40099802, 41070384, 41956023, 42685234, 43218892, 43556528, 43730079, 43790833, 43796105, 43800427, 43852590, 43995677, 44265080, 44682568, 45250451]
39172D5250451P01861Q09844Q93820R60753J012156J039149J028222R73560Q85287
39163E3555103P85869O97320O29926N81142N43809N15919N04734N23307N82528
39154E8919657O84178Q19625R74261J132844J280910J403066J483382J510803
39146F8208726J486634J428152J364944J329108J343737J415076J532060J672947
39138G9781384J815645J947689K072610K209866K386895K626370K935678L304242
39130I9080379L708326M118750M508096M856262N153384N398504N594489N742490
39122A38160680N839130N876157N840338N712491N467368N076793M516860L777405
39114A80267222K870078J831295P17675m05100j475555k446063l285394l976292
$$ y = [45250451, 45952312, 46762156, 47655976, 48616729, 49628885, 50668034, 51696256, 52669816, 53555103, 54340972, 55038292, 55668218, 56249360, 56793169, 57309088, 57813822, 58337129, 58919657, 59603835, 60423460, 61397721, 62530565, 63811475, 65214541, 66697923, 68208726, 69695360, 71123512, 72488456, 73817564, 75161301, 76576377, 78108437, 79781384, 81597029, 83544718, 85617328, 87827194, 90214089, 92840459, 95776137, 99080379, 102788705, 106907455, 111415551, 116271813, 121425197, 126823701, 132418190, 138160680, 143999810, 149875967, 155716305, 161428796, 166896164, 171972957, 176489817, 180267222, 183137300, 184968595, 185686270, 185281170, 183805615, 181359552, 178074158, 174097866]
39106A74097866m513044m901805n161440n321097n414070n471237n516622n564575
39098A32233976n617180n662754n678211n636850n519571n324479n068945m781790
39090H8944196m489623m206542l934266l671065l420702l193844l002261k851728
39082F0174165k738773k651967k575865k495477k399407k280252k132652j952035
39074D0947737j736537j490744j226835r61005p08261m80619k89492j47636o6171
39065C3840437m7117p6848j25748j55906j34511m7538R2947K52594L88956M69326
39055C4456592M83566M46316L88496L42753L29195L46989L74299L76183L18157
39046C7862546J81351k7115k74826n17120p15698q52542r33188r80529j023412
$$ y = [174097866, 169584822, 164683017, 159521577, 154200480, 148786410, 143315173, 137798551, 132233976, 126616796, 120954042, 115275831, 109638981, 104119410, 98794931, 93725986, 88944196, 84454573, 80248031, 76313765, 72642700, 69221998, 66028154, 63025893, 60174165, 57435392, 54783425, 52207560, 49712083, 47312676, 45032424, 42899772, 40947737, 39211200, 37720456, 36493621, 35532616, 34824355, 34343736, 34054244, 33906608, 33840437, 33793320, 33716472, 33590724, 33434818, 33300307, 33252769, 33345716, 33598310, 33987266, 34456592, 34940158, 35386474, 35774970, 36117723, 36446918, 36793907, 37168206, 37544389, 37862546, 38043897, 38016782, 37741956, 37224836, 36509138, 35656596, 34723408, 33742879, 32719467]
39037C2719467j083290j162062j236605j265529j208040j045804p94705m98647
39029B4424785k09431L4331K17200L43513M27379M83932N24734N55819N76768
39020B7379030N80791N56099M88541L65617J82072n4195l19090n75639p84021
39011B7819205r14160r54572r13454q13150o81889n45692m21852l15822k23668
39002B2034946j38913n8994J2855P0213J08119J28186J42187J70481K33393L40478
38992B3042951M85947O53222Q23210R79186J106840J192815J225057J195844J106830
38983C1811902R72928Q20072O74382N47844M30862K98561J27546q7759l28973
38974C5267365n59801p39176q34705q32540p42528n97281m42969l22586k58670
$$ y = [32719467, 31636177, 30474115, 29237510, 27971981, 26763941, 25718137, 24923432, 24424785, 24215354, 24249685, 24466885, 24810398, 25237777, 25721709, 26246443, 26802262, 27379030, 27959821, 28515920, 29004461, 29370078, 29552150, 29497955, 29178865, 28603226, 27819205, 26905045, 25950473, 25037019, 24223869, 23541980, 22996288, 22574436, 22258614, 22034946, 21896033, 21837039, 21849894, 21920107, 22028226, 22156412, 22298599, 22469080, 22702473, 23042951, 23528898, 24182120, 25005330, 25984516, 27091356, 28284171, 29509228, 30705072, 31811902, 32784830, 33604902, 34279284, 34827128, 35257990, 35556551, 35684097, 35596338, 35267365, 34707564, 33968388, 33133683, 32301143, 31558615, 30961334, 30518365, 30195779, 29937109]
38965B9937109k45886k58924k70016k62973k34419j84936j11274p514J27673K86309
38955B8775149M53472O13305P52982Q62529R32618R53527R17151Q21734O76021
38946C5758488M99072L15644J51921L5473l710O1368K40640N13358Q27903J119440
38936C9519597J335176J450954J470086J409737J287815J119185R19676P10382
38928D9222608N17050L64687K70844K40767K66407L29729M08654M82611N35496
38919E2638853N56824N43316N01316M47263M02975L86306M02178M39518M75901
38910E6794450M86841M54716L73082K45332Q0254j10546l10645m95242o32499
38901E6885743o92498o59068n36991l51252j40846M9792J81429K32394K08249
$$ y = [29937109, 29691223, 29432299, 29162283, 28899310, 28664891, 28479955, 28368681, 28361167, 28488840, 28775149, 29228621, 29841926, 30594908, 31457437, 32390055, 33343582, 34260733, 35082467, 35758488, 36257560, 36573204, 36725125, 36760598, 36756888, 36818256, 37058896, 37572254, 38400157, 39519597, 40854773, 42305727, 43775813, 45185550, 46473365, 47592550, 48512226, 49222608, 49739658, 50104345, 50375189, 50615956, 50882363, 51212092, 51620746, 52103357, 52638853, 53195677, 53738993, 54240309, 54687572, 55090547, 55476853, 55879031, 56318549, 56794450, 57281291, 57736007, 58109089, 58354421, 58434675, 58324129, 58013484, 57518242, 56885743, 56193245, 55534177, 54997186, 54645934, 54505088, 54554880, 54736309, 54968703, 55176952]
38892E5176952J41649P9615O4177J17309K36932M02329N83135P48242Q73905R49075
38882E9373320R74766R57832R05391Q25602P32726O48260N93505N78450N96444
38873F6186296O29196O57667O70136O62914O36379N91907N31958M61178L86430
38864G1414061L16262K60471K28356K24827K47904K91696L53355M36441N46109
38855G4319482O80610Q28034R72177J102995J223776J350166J501101J685899
38847H3664240J894329K096149K251729K328041K310373K204001K028253J810050
38839A00587165J580891J374739J222420J142972J137591J191297J281585J388839
38831A10907499J503245J626593J769677J946559K167170K430960K725169L028983
$$ y = [55176952, 55318601, 55398216, 55462393, 55579702, 55816634, 56218963, 56802098, 57550340, 58424245, 59373320, 60348086, 61305918, 62211309, 63036911, 63769637, 64417897, 65011402, 65589852, 66186296, 66815492, 67473159, 68143295, 68806209, 69442588, 70034495, 70566453, 71027631, 71414061, 71730323, 71990794, 72219150, 72443977, 72691881, 72983577, 73336932, 73773373, 74319482, 75000092, 75828126, 76800303, 77903298, 79127074, 80477240, 81978341, 83664240, 85558569, 87654718, 89906447, 92234488, 94544861, 96748862, 98777115, 100587165, 102168056, 103542795, 104765215, 105908187, 107045778, 108237075, 109518660, 110907499, 112410744, 114037337, 115807014, 117753573, 119920743, 122351703, 125076872, 128105855]
38823A28105855L320825L584228L810555M000292M163658M317866M478843M651018
38815A60433140M822661M970589N070672N107183N076909M987578M852095M681695
38807B00002522M482315M256730M009609L749050L481255L202051K893491K531029
38799B28608052K099173J605655J082722N71731R9998l33890p56116j199295j683398
38790B30094632k206751k748167l275661l757318m171118m509853m778443m986044
38782A99661277n139400n242082n298372n317582n315483n311617n322319n351801
38774A57362621n386972n400886n363285n250828n051187m762208m391521l959018
38766A17796716l498855l055820k674101k382786k186194k065542j990814j934477
$$ y = [128105855, 131426680, 135010908, 138821463, 142821755, 146985413, 151303279, 155782122, 160433140, 165255801, 170226390, 175297062, 180404245, 185481154, 190468732, 195320827, 200002522, 204484837, 208741567, 212751176, 216500226, 219981481, 223183532, 226077023, 228608052, 230707225, 232312880, 233395602, 233967333, 234067331, 233733441, 232977325, 231778030, 230094632, 227887881, 225139714, 221864053, 218106735, 213935617, 209425764, 204647321, 199661277, 194521877, 189279795, 183981423, 178663841, 173348358, 168036741, 162714422, 157362621, 151975649, 146574763, 141211478, 135960650, 130909463, 126147255, 121755734, 117796716, 114297861, 111242041, 108567940, 106185154, 103998960, 101933418, 99942604, 98008127]
38758I8008127j878515j813941j738444j656252j577800j514828j471647j439346
38750H4917354j398797j331632j232191j112926r99900r21184q94960r23534r94355
38741G5107875j084701j167677j220475j234551j221638j208314j220897j272067
38733F5477555j358655j468110j584489j690247j767813j804254j795800j747764
38725E2260423j670481j575217j472129j369454j273135j186639j110184j039194
38717D1563990r64271q74757p63872o31112m81398l25027j79813p0134j7948l0127
38707C7225531r3218j81558k71994l53069m22617m78578n12628n12708m72526
38698C3926635l99911l16402k47345k09621k05250k23149k45100k51944k29302
$$ y = [98008127, 96129612, 94315671, 92577227, 90920975, 89343175, 87828347, 86356700, 84917354, 83518557, 82186925, 80954734, 79841808, 78841908, 77920724, 77025764, 76102230, 75107875, 74023174, 72855497, 71635022, 70400471, 69178833, 67970519, 66749622, 65477555, 64118900, 62650790, 61066301, 59376054, 57608241, 55803987, 54008187, 52260423, 50589942, 49014725, 47542596, 46173142, 44900007, 43713368, 42603184, 41563990, 40599719, 39724962, 38961090, 38329978, 37848580, 37523553, 37343740, 37273606, 37255658, 37225531, 37132313, 36950755, 36678761, 36325692, 35903075, 35424497, 34911869, 34399161, 33926635, 33526724, 33210322, 32962977, 32753356, 32548106, 32324957, 32079857, 31827913, 31598611]
38689C1598611j72644q8682R656J11597K12348L08681L92264M50014M72389M59942
38679C3754176M19822L56136K66128J47098N905j39180k64314l45717l61702k95667
38669C3542685j43992P5604L22674N41707O75494O80473N41587K81885l9714l45362
38659C6133041n64628o58598o29941n14053l57559j98513n9305M8712J18543J45366
38649C3463065J27225O4784l9363j79709l46212n24862p00113q56501r79300j056953
38639B8972061j086032j074325j037464r90319r39672q83383q14989p28543o20086
38630B0797248m86891l27786j45931M7807K33994L88000M87304N19768M88498
38621B2002011M09890L05861J95443R0832j108p4991j24744j45106j35337j01640
$$ y = [31598611, 31425967, 31337285, 31346941, 31458538, 31670886, 31979567, 32371831, 32821845, 33294234, 33754176, 34173998, 34530134, 34796262, 34943360, 34949265, 34810085, 34545771, 34200054, 33838352, 33542685, 33398693, 33474297, 33796971, 34338678, 35014172, 35694645, 36236232, 36518117, 36478403, 36133041, 35568413, 34909815, 34279874, 33765821, 33408262, 33209749, 33150444, 33199156, 33317699, 33463065, 33590290, 33655074, 33615711, 33436002, 33089790, 32564928, 31864815, 31008314, 30029014, 28972061, 27886029, 26811704, 25774240, 24783921, 23844249, 22960866, 22145877, 21417334, 20797248, 20310357, 19982571, 19836640, 19884447, 20118441, 20506441, 20993745, 21513513, 22002011, 22411901, 22717762, 22913205, 23004037, 23002929, 22927938, 22803194, 22658088, 22522751, 22421111]
38611B2421111n5611r704K6799M9148N6599N1897M0654K9531K3086K1296K0330
38600B2675136J7503J7763L6105R2196J99840L59031N55876P68902R76616J162565
38590B6861533J316510J431473J499442J511682J466761J380299J285824J222815
38582C7976339J219270J279290J380790J482549J538059J511909J392026J191723
38574D8971955R41220O74688M19762J93179J728j54650k80913l86808m85911n91035
38564D9303215p07070q26294r30371r98197j014670r75527q86994p62340o18407
38555D1583345m73848l48541k62278k31044k61486l46915m69095o06593p44889
38546C7838656q80947j018701j159259j293601j403362j468956j478637j431559
$$ y = [22421111, 22365500, 22355796, 22382595, 22431743, 22488342, 22540239, 22580893, 22610424, 22633510, 22654806, 22675136, 22692639, 22710402, 22746507, 22838703, 23038543, 23397574, 23953450, 24722352, 25698968, 26861533, 28178043, 29609516, 31108958, 32620640, 34087401, 35467700, 36753524, 37976339, 39195609, 40474899, 41855689, 43338238, 44876297, 46388206, 47780232, 48971955, 49913175, 50587863, 51007625, 51200804, 51202532, 51047882, 50766969, 50380161, 49894250, 49303215, 48596145, 47769851, 46839480, 45841283, 44826613, 43851086, 42964092, 42201752, 41583345, 41109497, 40760956, 40498678, 40267634, 40006148, 39659233, 39190138, 38583545, 37838656, 36957709, 35939008, 34779749, 33486148, 32082786, 30613830, 29135193, 27703634]
38538B7703634j333047j187530r96653p64378n03404k36408Q510K04414L31929
38529B3227067L85291L76227L31496K83202K57298K66977L12448L83573M62641
38520B6286220N28043N60352N49560M99273M23756L37514K43254J27800k8704
38511B9527068k35366m77647p18377r11143j017084j016818r14572p34867n13487
38502B2987707k86033p8972R3088K24090L11399L53301L50293L07256K32763J35189
38492B4630081J8585j18914k84028m85288p27318j002563j284899j532195j700159
38483A7513302j761126j716425j594834j438352j283820j150166j036084r26576
38475F605919q03419o55515m86157l13706j63229n1914K2907Q4506J65199K89725
$$ y = [27703634, 26370587, 25183057, 24186404, 23422026, 22918622, 22682214, 22690724, 22895138, 23227067, 23612358, 23988585, 24320081, 24603283, 24860581, 25127558, 25440006, 25823579, 26286220, 26814263, 27374615, 27924175, 28423448, 28847204, 29184718, 29427972, 29555772, 29527068, 29291702, 28814055, 28095678, 27184535, 26167451, 25150633, 24236061, 23501194, 22987707, 22701674, 22622702, 22715790, 22939880, 23251279, 23604580, 23954873, 24262129, 24494892, 24630081, 24648666, 24529752, 24245724, 23760436, 23033118, 22030555, 20745656, 19213461, 17513302, 15752176, 14035751, 12440917, 11002565, 9718745, 8568579, 7532495, 6605919, 5802500, 5146985, 4660828, 4347122, 4183893, 4131979, 4154886, 4239392, 4404591, 4694316]
38465D694316M63775O73529Q94481J102049J277435J408293J487842J514014J486989
38456A5002723J405772J268364J077770Q48303O04625L73349J73946J4353j09029
38447B0660176k08206k97255l84480m68452n41512n97348o35595o60145o73899
38438A6193284o75309o60081o26777n80813n31558m83790m31791l63107k69606
38429A1570452j56030l8991O1865J33392J73195J87856J88312J86520J94559K23541
38419A2724671K79549L58056M42009N06859N30199M99960M17068K92808J43960
38410A6195139j1241j55255k72455l50916l85189l78841l44758l01942k69679
38401A3724863k61432k80965l21226l65282l89331l68940k87891j44942M6379
$$ y = [4694316, 5158091, 5831620, 6726101, 7828150, 9105585, 10513878, 12001720, 13515734, 15002723, 16408495, 17676859, 18754629, 19602932, 20207557, 20580906, 20754852, 20769205, 20660176, 20451970, 20154715, 19770235, 19301783, 18760271, 18162923, 17527328, 16867183, 16193284, 15517975, 14857894, 14231117, 13650304, 13118746, 12634956, 12203165, 11840058, 11570452, 11414422, 11375431, 11437296, 11570688, 11743883, 11931739, 12120051, 12306571, 12501130, 12724671, 13004220, 13362276, 13804285, 14311144, 14841343, 15341303, 15758371, 16051179, 16195139, 16183898, 16028643, 15756188, 15405272, 15020083, 14641242, 14296484, 13994542, 13724863, 13463431, 13182466, 12861240, 12495958, 12106627, 11737687, 11449796, 11304854, 11351233]
38392A1351233K64546M87374O95143Q70689J000317J075615J092714J048622R39619
38383A8825872P66059N40014K87183L9266j77371l48191m69813n46696n89155
38374A8327168o11615o28519o48367o69472o80249o64697o11595n23274m18258
38365A2871122l24743k68936k66384l20355m23983n60864p04130q18647q69509
38356H313571q34265p12850n29815l26925j48993k9530J6493r193r4247k18775
38346E425471l53874m61415n01306m44758k84738l6883K67303N88255Q84141J117482
38336F199678J264500J322619J308973J249020J163165J060880R44358Q15181
38328A5328374O76633N31098L78392K19446O2304p6599j78788k33354k42804k22042
$$ y = [11351233, 11615779, 12103153, 12798296, 13668985, 14669302, 15744917, 16837631, 17886253, 18825872, 19591931, 20131945, 20419128, 20458394, 20281023, 19932832, 19463019, 18916323, 18327168, 17715553, 17087034, 16438667, 15769195, 15088946, 14424249, 13812654, 13289380, 12871122, 12546379, 12277443, 12011059, 11690704, 11266721, 10705857, 10001727, 9183080, 8313571, 7479306, 6766456, 6236641, 5909716, 5760723, 5731193, 5747686, 5738493, 5644246, 5425471, 5071597, 4610182, 4108876, 3664118, 3379380, 3342497, 3609800, 4198055, 5082196, 6199678, 7464178, 8786797, 10095770, 11344790, 12507955, 13568835, 14513193, 15328374, 16005007, 16536105, 16914497, 17133943, 17196247, 17119648, 16940860, 16707506, 16464702, 16242660]
38318A6242660j91897j70693j67530j80276j99282k14589k23174k33343k63986
38309A4397890l37010m64562o37722q24420r78771j056764j030571q95668o68305
38300G504097l75519m4748K99471O31270R19245J129196J233095J218148J091530
38291A3605785Q79442O20672L56388J20757o3527j85314k43964k48085k12485
38282A4629669j53681q6510k2703L0185O9247R3895J01847Q8403N0564r229q4672
38271A4707015j69681k58959l45310m19396m74173n09519n32304n52559n79088
38262A0866026o16261o62103p08060p40798p45971p13428o42338n42778m30821
38253E063468l19463k12524j06056N750J26071K53963L83598N03762O00106O60333
$$ y = [16242660, 16050763, 15880070, 15712540, 15532264, 15332982, 15118393, 14895219, 14661876, 14397890, 14060880, 13596318, 12958596, 12134176, 11155405, 10098641, 9068070, 8172402, 7504097, 7128578, 7083830, 7383301, 8014571, 8933816, 10063012, 11296107, 12514255, 13605785, 14485227, 15105899, 15462287, 15583044, 15519517, 15334203, 15090239, 14842154, 14629669, 14475988, 14389478, 14366775, 14396960, 14466207, 14560102, 14661949, 14750352, 14800916, 14791687, 14707015, 14537334, 14278375, 13933065, 13513669, 13039496, 12529977, 11997673, 11445114, 10866026, 10249765, 9587662, 8879602, 8138804, 7392833, 6679405, 6037067, 5494289, 5063468, 4744005, 4531481, 4425425, 4431175, 4557246, 4811209, 5194807, 5698569, 6298675, 6959008]
38243F959008O78253O53674N90586M98142L93821L03472K55139K69894L55187
38234A0957176N02119O84981Q63228R88948J020353R35928P41736M68793J62978
38225A7326240j28106l67371n36012o33846o73002o69464o37368n87632n29462
38216A2563977m72476m27833m07480m21780m77147n74815p10405q72717j041155
38207G158169j183560j258465j225381j061573p76627m13721l4411L04234N66502
38198B075167P42117Q40687Q83336Q94831Q96697R02393R16450R37192R59645
38189A0048515R75960R74631R41957Q66465P42920N72217L58124J05461j77375
38180A5408875m73809p56933r92571j147123j197830j141415r96257p95650n75845
$$ y = [6959008, 7637261, 8290935, 8881521, 9379663, 9773484, 10076956, 10332095, 10601989, 10957176, 11459295, 12144276, 13007504, 13996452, 15016805, 15952733, 16694469, 17163262, 17326240, 17198134, 16830763, 16294751, 15660905, 14987903, 14318439, 13681071, 13093439, 12563977, 12091501, 11663668, 11256188, 10834408, 10357261, 9782446, 9072041, 8199324, 7158169, 5974609, 4716144, 3490763, 2429190, 1652563, 1238842, 1204431, 1508665, 2075167, 2817284, 3657971, 4541307, 5436138, 6332835, 7235228, 8151678, 9088870, 10048515, 11024475, 11999106, 12941063, 13807528, 14550448, 15122665, 15480789, 15586250, 15408875, 14935066, 14178133, 13185562, 12038439, 10840609, 9699194, 8702937, 7907287, 7331442]
38171G331442l66297j86446m6771N0611J12466J52454J84542K14818K37545K39026
38161G923390K07645J43901O3200j1614o3431q9245r6461r0630o6565j1605Q2518
38150G991103K10802L56701N01680O34116P52516Q63694R78155J103706J238740
38141A4631213J369316J474073J535715J551576J535623J510809J497924J507382
38133B6613631J535831J565870J568561J510258J363272J116277P80052L87227
38125C6440979j3409l68273o35017p97513q71280q95509r16370r70887j077813
38116B9894908j236469j431146j637739j829532j980272k065509k064453j963419
38108A5686369j759553j463190j098558p03060l23687q593K05716L06385L07880
$$ y = [7331442, 6965145, 6778699, 6731928, 6782539, 6895005, 7047459, 7232001, 7446819, 7684364, 7923390, 8131035, 8274936, 8338136, 8326522, 8263091, 8173846, 8077385, 7986755, 7920190, 7908585, 7991103, 8201905, 8558606, 9060286, 9694402, 10446918, 11310612, 12288767, 13392473, 14631213, 16000529, 17474602, 19010317, 20561893, 22097516, 23608325, 25106249, 26613631, 28149462, 29715332, 31283893, 32794151, 34157423, 35273700, 36053752, 36440979, 36427570, 36059297, 35424280, 34626767, 33755487, 32859978, 31943608, 30972721, 29894908, 28658439, 27227293, 25589554, 23760022, 21779750, 19714241, 17649788, 15686369, 13926816, 12463626, 11365068, 10662008, 10338321, 10329728, 10535444, 10841829, 11149709]
38099A1149709K42961J44901L2436r2027k30935l78272n16118o22299o80446o85135
38089H364775o42293n67910m84411m12647l62197l26798k88450k26691j27189
38080D926189J3227J85222L69298N41453O79746P68915Q02218P81356P14866O15060
38070A0397550M94865L66820K43689J37582N6190j084m2831q0486j21698j65946
38060A1284651k04285k23689k14749j78870j29387q4735n8525n4196o7183r0844
38050I978188j20577j54170j89595k22383k44545k46625k22223j71773j03317
38041H302980l1159K5964M8998K7098l2982j04718j50698j36913m3396J32294
38031H037468L76198O60742R49158J201948J384397J473683J464163J369087J216547
$$ y = [11149709, 11392670, 11537571, 11570007, 11477980, 11247045, 10868773, 10352655, 9730356, 9049910, 8364775, 7722482, 7154572, 6670161, 6257514, 5895317, 5568519, 5280069, 5053378, 4926189, 4939416, 5124638, 5493936, 6035389, 6715135, 7484050, 8286268, 9067624, 9782490, 10397550, 10892415, 11259235, 11502924, 11640506, 11696696, 11695612, 11652781, 11572295, 11450597, 11284651, 11080366, 10856677, 10641928, 10463058, 10333671, 10248936, 10190411, 10136215, 10069032, 9978188, 9857611, 9703441, 9513846, 9291463, 9046918, 8800293, 8578070, 8406297, 8302980, 8271821, 8297785, 8346783, 8373881, 8340899, 8236181, 8085483, 7948570, 7905174, 8037468, 8413666, 9074408, 10023566, 11225514, 12609911, 14083594, 15547757, 16916844, 18133391]
38022A8133391J039821Q65756P06744N59751M11782K48083N8853j57421l93744
38013B1473016o36006q64743j056234j183496j219691j146177r63033o95285l89226
38004A3319125j00423J20087K36461K35086J28182m8072k42831m05071m97371
37995A2745173n04090m32933l11089j76652o5917m74J8930P507j5578l7024n1200
37984A1176653n6824n4817m9785n1577p2893j22868k00649k93681l81868m43989
37974I447702m61248m17554l01422j13215J25955L72352N69644O67407O38757
37965A0528378M87823K43323n6747l78409o95272r85051j227592j408045j520838
37956D987570j569516j563088j512143j425822j309478j164440r91152p93506
$$ y = [18133391, 19173212, 20038968, 20745712, 21305463, 21717245, 21965328, 22024181, 21866760, 21473016, 20837010, 19972267, 18916033, 17732537, 16512846, 15366669, 14403636, 13708351, 13319125, 13218702, 13338789, 13575250, 13810336, 13938518, 13890446, 13647615, 13242544, 12745173, 12241083, 11808150, 11497061, 11320409, 11254492, 11254018, 11272948, 11280455, 11264877, 11227853, 11176653, 11119829, 11065012, 11015227, 10963650, 10890757, 10767889, 10567240, 10273559, 9891691, 9447702, 8986454, 8568900, 8267478, 8154263, 8280218, 8652570, 9222214, 9889621, 10528378, 11016201, 11259524, 11202777, 10824368, 10129096, 9144045, 7916453, 6508408, 4987570, 3418054, 1854966, 342823, -1082999, -2392477, -3556917, -4548069, -5341575]
37948e341575n81014l68163j73112j6083Q4643J19928R6450L6966k8481p6587
37938f247028j01476j14649j33726j67431k06952k29324k10635j40545k8625J01414
37928g478977K24959L27653M08418M75735N42345O21119P21690Q47027R90838
37919b319193J137433J265664J356991J404128J413782J399777J370780J321836
$$ y = [-5341575, -5922589, -6290752, -6463864, -6479947, -6395304, -6275376, -6178926, -6141960, -6170441, -6247028, -6348504, -6463153, -6596879, -6764310, -6971262, -7200586, -7411221, -7551766, -7580391, -7478977, -7254018, -6926365, -6517947, -6042212, -5499867, -4878748, -4157058, -3310031, -2319193, -1181760, 83904, 1440895, 2845023, 4258805, 5658582, 7029362, 8351198]
$$ [...]
##END NTUPLES=NMR SPECTRUM
##END=
