##TITLE=31Pdec_DE-56k_TFA_CD
 CDCl3
 64 sc
 24.6.2024
##JCAMPDX= 6.0         $$ Bruker NMR JCAMP-DX V2.0
##DATA TYPE= NMR SPECTRUM
##DATA CLASS= NTUPLES
##ORIGIN= UXNMR, Bruker Analytische Messtechnik GmbH
##OWNER= root
$$ XWIN-NMR		Version 3.5
$$ Mon Jun 24 16:31:19 2024 Russian Standard Time (UT+4h)  she@DPX200
##.OBSERVE FREQUENCY= 81.013821
##.OBSERVE NUCLEUS= ^31P
##.ACQUISITION MODE= SIMULTANEOUS
##.ACQUISITION SCHEME= undefined
##.AVERAGES= 64
##.DIGITISER RES= 16
##SPECTROMETER/DATA SYSTEM= spect
##.PULSE SEQUENCE= zgpg30
##.SOLVENT NAME= CDCl3
##.SHIFT REFERENCE= (INTERNAL, CDCl3, 0, 248.564)
##AUDIT TRAIL= $$ (NUMBER, WHEN, WHO, WHERE, WHAT)
$$ ##TITLE= Audit trail, XWIN-NMR		Version 3.5
$$ ##JCAMPDX= 5.01
$$ ##ORIGIN= Bruker BioSpin GmbH
$$ ##OWNER= she
$$ F:/spectra/data/she/nmr/P31/1/pdata/1/auditp.txt
$$ ##AUDIT TRAIL=  $$ (NUMBER, WHEN, WHO, WHERE, WHAT)
(   1,<2024-06-24 16:30:40.51 +0400>,<she>,<DPX200>,
      <created by zg, POWCHK disabled, PULCHK disabled
       configuration hash MD5:
       00 E9 B6 7A A2 85 ED C7 34 08 36 98 17 FE 4E 26
       data hash MD5: 32K
       7F 51 86 47 1C 2C 40 0D 8F 2F BE B1 CE A7 95 19>)
(   2,<2024-06-24 16:30:42.92 +0400>,<she>,<DPX200>,
      <Start of raw data processing
       efp BC_mod = 2 LB = 10 FT_mod = 6 PKNL = 1 PHC0 = 3622.076 PHC1 = -8582.159 SI = 64K 
       data hash MD5: 64K
       EF AE A6 9A E2 44 CF 16 D0 49 DC A5 F8 F2 D8 24>)
(   3,<2024-06-24 16:30:48.90 +0400>,<she>,<DPX200>,
      <abs ABSG = 5 
       data hash MD5: 64K
       AC 04 48 5A E4 55 B0 CD 5F 67 60 68 58 3D 43 1F>)
$$ ##END=
$$ 
$$ hash MD5
$$ 9A 09 CE 88 80 2B B8 4A D7 12 E9 D0 78 EE 02 C8
##$RELAX= 
##$RELAX= 
##$RELAX= 
##$RELAX= 
##$RELAX= 
##$RELAX= 
##$RELAX= 
##$RELAX= 
##$RELAX= 
$$ Bruker specific parameters
$$ --------------------------
##$DU= <F:/spectra>
##$EXPNO= 1
##$NAME= <P31>
##$PROCNO= 1
##$TYPE= <nmr>
##$USER= <she>
##$AMP= (0..31)
100 100 100 100 100 100 100 100 100 100 100 100 100 100 100 100 100 100 
100 100 100 100 100 100 100 100 100 100 100 100 100 100 
##$AQSEQ= 0
##$AQ_mod= 1
##$AUNM= <au_zg>
##$AUTOPOS= <>
##$BF1= 81.014009
##$BF2= 200.13
##$BF3= 200.13
##$BF4= 200.13
##$BF5= 200.13
##$BF6= 200.13
##$BF7= 200.13
##$BF8= 200.13
##$BYTORDA= 1
##$CFDGTYP= 0
##$CFRGTYP= 5
##$CHEMSTR= <none>
##$CNST= (0..31)
1 1 145 1 1 1 1 1 1 1 1 1 1 1 1 1 1 1 1 1 1 1 1 1 1 1 1 1 1 1 1 1 
##$CPDPRG= <waltz16>
##$CPDPRG1= <>
##$CPDPRG2= <waltz16>
##$CPDPRG3= <>
##$CPDPRG4= <mlev>
##$CPDPRG5= <mlev>
##$CPDPRG6= <mlev>
##$CPDPRG7= <mlev>
##$CPDPRG8= <mlev>
##$CPDPRGB= <>
##$CPDPRGT= <>
##$D= (0..31)
0 1 0 0 0 0 0 0 0 0 0 0.03 2e-05 3e-06 0 0 0 0 0 0 0 0 0 0 0 0 0 0 0 0 
0 0 
##$DATE= 1719232239
##$DBL= (0..7)
120 120 120 11 120 120 24 19 
##$DBP= (0..7)
150 150 150 150 150 150 150 150 
##$DBP07= 0
##$DBPNAM0= <>
##$DBPNAM1= <>
##$DBPNAM2= <>
##$DBPNAM3= <>
##$DBPNAM4= <>
##$DBPNAM5= <>
##$DBPNAM6= <>
##$DBPNAM7= <>
##$DBPOAL= (0..7)
0.5 0.5 0.5 0.5 0.5 0.5 0.5 0.5 
##$DBPOFFS= (0..7)
0 0 0 0 0 0 0 0 
$$ [...]
##$SUBNAM3= <"">
##$SUBNAM4= <"">
##$SUBNAM5= <"">
##$SUBNAM6= <"">
##$SUBNAM7= <"">
##$SUBNAM8= <"">
##$SUBNAM9= <"">
##$SW= 501.771253377433
##$SWIBOX= (0..15)
0 1 3 0 0 0 0 0 0 0 0 0 0 0 0 0 
##$SW_h= 40650.406504065
##$TD= 32768
##$TD0= 1
##$TE= 0
##$TE2= 300
##$TE3= 300
##$TEG= 300
##$TL= (0..7)
0 120 53 12 22 120 120 120 
##$TP= (0..7)
150 150 150 150 150 150 150 150 
##$TP07= 0
##$TPNAME0= <>
##$TPNAME1= <>
##$TPNAME2= <>
##$TPNAME3= <>
##$TPNAME4= <>
##$TPNAME5= <>
##$TPNAME6= <>
##$TPNAME7= <>
##$TPOAL= (0..7)
0.5 0.5 0.5 0.5 0.5 0.5 0.5 0.5 
##$TPOFFS= (0..7)
0 0 0 0 0 0 0 0 
##$TUNHIN= 0
##$TUNHOUT= 0
##$TUNXOUT= 0
##$USERA1= <user>
##$USERA2= <user>
##$USERA3= <user>
##$USERA4= <user>
##$USERA5= <user>
##$V9= 5
##$VALIST= <valist>
##$VCLIST= <CCCCCCCCCCCCCCC>
##$VD= 0
##$VDLIST= <DDDDDDDDDDDDDDD>
##$VPLIST= <PPPPPPPPPPPPPPP>
##$VTLIST= <TTTTTTTTTTTTTTT>
##$WBST= 1024
##$WBSW= 4
##$XGAIN= (0..3)
0 0 0 0 
##$XL= 0
##$YL= 0
##$YMAX_a= 1775
##$YMIN_a= -9578
##$ZGOPTNS= <>
##$ZL1= 120
##$ZL2= 120
##$ZL3= 120
##$ZL4= 120
##$ABSF1= 248.5645
##$ABSF2= -253.2056
##$ABSG= 5
##$ABSL= 3
##$ALPHA= 0
##$AQORDER= 0
##$ASSFAC= 0
##$ASSFACI= 0
##$ASSFACX= 0
##$ASSWID= 0
##$AUNMP= <proc_1d>
##$AZFE= 0.1
##$AZFW= 0.5
##$BCFW= 0
##$BC_mod= 2
##$BYTORDP= 0
##$COROFFS= 0
##$CY= -3
##$DATMOD= 1
##$DC= 0
##$DFILT= <>
##$DTYPP= 0
##$F1P= 0
##$F2P= 0
##$FCOR= 1
##$FTSIZE= 65536
##$FT_mod= 6
##$GAMMA= 0
##$GB= 0
##$INTBC= 1
##$INTSCL= 6.047779e-11
##$ISEN= 30
##$LB= 10
##$LEV0= 0
##$LPBIN= 0
##$MAXI= 10000
##$MC2= 0
##$MEAN= 0
##$ME_mod= 0
##$MI= 50
##$NCOEF= 0
##$NC_proc= -12
##$NLEV= 6
##$NOISF1= 182.463
##$NOISF2= 159.3651
##$NSP= 0
##$NTH_PI= 0
##$NZP= 0
##$OFFSET= 248.5645
##$PC= 4
##$PHC0= 3622.076
##$PHC1= -8582.159
##$PH_mod= 1
##$PKNL= yes
##$PPARMOD= 0
##$PSCAL= 0
##$PSIGN= 0
##$REVERSE= no
##$SF= 81.0140089999694
##$SI= 65536
##$SIGF1= 159.3651
##$SIGF2= -187.1042
##$SINO= 113.3802
##$SIOLD= 16384
##$SREGLST= <1H.CDCl3>
##$SSB= 0
##$STSI= 65536
##$STSR= 0
##$SW_p= 40650.406504065
##$SYMM= 0
##$S_DEV= 0
##$TDeff= 32768
##$TDoff= 0
##$TI= <>
##$TILT= no
##$TM1= 0
##$TM2= 0
##$TOPLEV= 0
##$USERP1= <user>
##$USERP2= <user>
##$USERP3= <user>
##$USERP4= <user>
##$USERP5= <user>
##$WDW= 1
##$XDIM= 65536
##$YMAX_p= 398163886
##$YMIN_p= -334247204
$$ End of Bruker specific parameters
$$ ---------------------------------
##NTUPLES= NMR SPECTRUM
##VAR_NAME=  FREQUENCY,     SPECTRUM/REAL,   SPECTRUM/IMAG
##SYMBOL=    X,             R,               I
##VAR_TYPE=  INDEPENDENT,   DEPENDENT,       DEPENDENT
##VAR_FORM=  AFFN,          ASDF,            ASDF
##VAR_DIM=   65536,         65536,           65536
##UNITS=     HZ,            ARBITRARY UNITS, ARBITRARY UNITS
##FACTOR=    0.620285442955139, 1,           1
##FIRST=     20137.2065510682, 0,            0
##LAST=      -20513.1999529968, 0,           0
##MIN=       -20513.1999529968, -334247204,  0
##MAX=       20137.2065510682, 398163886,    0
$$ Real data points
##PAGE= N=1
##DATA TABLE= (X++(R..R)), XYDATA
$$ [...]
##PAGE= N=2
##DATA TABLE= (X++(I..I)), XYDATA
$$ plain form
12269 -22847783 -17685453 -12610806 -8026517 -4264928 -1559743 -32820 298452 -497001
12261 -497001 -2267973 -4756402 -7566697 -10177731 -12027899 -12651866 -11807469 -9534150 -6123443
12252 -6123443 -2025679 2262737 6295182 9736418 12384251 14151683 15022898 15012181 14152734
12243 14152734 12515915 10233769 7494860 4505020 1431460 -1636063 -4678477 -7694165
12235 -7694165 -10632935 -13361269 -15676108 -17347997 -18165498 -17972468 -16705801 -14433905
12227 -14433905 -11378428 -7895888 -4409730 -1309541 1143534 2866568 3946800 4590243
12219 4590243 5047532 5531861 6151322 6891584 7669416 8428277 9212328 10176138 11540757
12210 11540757 13534386 16337398 20023471 24492146 29419811 34275041 38418732 41254981
$$ packed form
12269b2847783N162330N074647M584289L761589K705185J526923L31272p95453
12261d97001j770972k488429k810295k611034j850168o23967Q44397K273319L410707
12252f123443M097764M288416M032445L441236K647833J767432Q71215j0717q59447
12243A4152734j636819k282146k738909k989840l073560l067523l042414l015688
12235g694165k938770k728334k314839j671889q17501J93030J266667K271896
12227a4433905L055477L482540L486158L100189K453075J723034J080232O43443
12219D590243M57289M84329O19461P40262P77832P58861P84051R63810J364619
12210A1540757J993629K803012L686073M468675M927665M855230M143691K836249
$$ plain form
12202 41254981 42367220 41597741 39076597 35219225 30682973 26256017 22687151 20515505
12194 20515505 19965255 20929270 23026503 25707067 28377401 30510881 31712605 31732921 30451597
12185 30451597 27856748 24023384 19082735 13182256 6458313 -947947 -8826658 -16829871
12177 -16829871 -24464359 -31182888 -36542754 -40351152 -42719220 -43991620 -44581298 -44792504
12169 -44792504 -44724826 -44298913 -43367213 -41836669 -39752574 -37325698 -34892934 -32811245 -31324108
12160 -31324108 -30473377 -30103641 -29936670 -29653912 -28949702 -27564213 -25318075 -22146502 -18106309
12151 -18106309 -13334050 -7967652 -2080904 4315563 11195504 18409429 25625259 32365886
12143 32365886 38127464 42507090 45263010 46282907 45507521 42884764 38389712 32084927
$$ packed form
12202D1254981J112239p69479k521144l857372m536252m426956l568866k171646
12194B0515505n50250R64015K097233K680564K670334K133480J201724K0316j281324
12185C0451597k594849l833364m940649n900479o723943p406260p878711q003213
12177a6829871p634488o718529n359866l808398k368068j272400n89678k11206
12169d4792504O7678M25913R31700J530544K084095K426876K432764K081689J487137
12160c1324108Q50731L69736J66971K82758P04210J385489K246138L171573M040193
12151a8106309M772259N366398N886748O396467O879941P213925P215830O740627
12143C2365886N761578M379626K755920J019897p75386k622757m495052o304785
$$ plain form
12135 32084927 24174830 15028226 5160751 -4829575 -14365995 -22994749 -30432887 -36546938
12127 -36546938 -41295837 -44683681 -46745197 -47562870 -47302725 -46246650 -44795097 -43426762
12119 -43426762 -42625933 -42802937 -44231113 -47014547 -51092310 -56276132 -62309156 -68925832
12111 -68925832 -75889026 -82986876 -89995840 -96645149 -102621655 -107624237 -111442636 -114024806
12103 -114024806 -115501294 -116140220 -116228978 -115933755 -115233050 -113990272 -112127362 -109777053 -107304187
12094 -107304187 -105178654 -103772794 -103187910 -103187897 -103261693 -102779696 -101176738 -98097781 -93473525
12085 -93473525 -87527951 -80737068 -73752816 -67292717 -61997847 -58285640 -56246782 -55626974
12077 -55626974 -55896751 -56378224 -56388818 -55369240 -52969640 -49075510 -43771562 -37263750 -29795148
$$ packed form
12135C2084927p910097r146604r867475r990326r536420q628754p438138o114051
12127c6546938m748899l387844k061516q17673K60145J056075J451553J368335
12119d3426762Q00829j77004j428176k783434m077763n183822o033024o616676
12111f8925832o963194p097850p008964o649309n976506n002582l818399k582170
12103a14024806j476488o38926q8758K95223P00705J242778J862910K350309K472866
12094a07304187K125533J405860N84884J3p3796M81997J602958L078957M624256
12085i3473525N945574O790883O984252O460099N294870L712207K038858O19808
12077e5626974k69777m81473j0594J019578K399600L894130N303948O507812P468602
$$ plain form
12068 -29795148 -21592426 -12861537 -3816995 5297219 14224861 22737126 30649739 37794443
12060 37794443 43970208 48920360 52360640 54050767 53884003 51962500 48625716 44414361
12052 44414361 39982696 35993023 33017709 31451188 31430463 32786003 35064812 37648594
12044 37648594 39935977 41512916 42240803 42241060 41803076 41257884 40853144 40660060 40540207
12035 40540207 40185030 39213097 37287422 34209083 29954847 24654203 18534034 11870365
12027 11870365 4962487 -1885992 -8391616 -14305677 -19400762 -23446689 -26218016 -27548176
12019 -27548176 -27397471 -25892005 -23322235 -20115358 -16788766 -13877036 -11832534 -10924110
12011 -10924110 -11173615 -12362028 -14110259 -16007109 -17736029 -19156403 -20319756 -21426411
$$ packed form
12068b9795148Q202722Q730889R044542R114214Q927642Q512265P912613P144704
12060C7794443O175765M950152L440280J690127j66764j921503l336784m211355
12052D4414361m431665l989673k975314j566521k0725J355540K278809K583782
12044C7648594K287383J576939P27887K57m37984n45192m04740j93084j19853
12035D0540207l55177r71933j925675l078339m254236n300644o120169o663669
12027A1870365o907878o848479o505624n914061n095085m045927k771327j330160
12019b7548176J50705J505466K569770L206877L326592K911730K044502R08424
12011a0924110k49505j188413j748231j896850j728920j420374j163353j106655
$$ plain form
12003 -21426411 -22740133 -24482522 -26735815 -29389738 -32160771 -34682410 -36624981 -37783700
11995 -37783700 -38097104 -37610280 -36430130 -34701857 -32592863 -30257385 -27786193 -25177061
11987 -25177061 -22352189 -19211243 -15686728 -11777978 -7560372 -3176608 1181406 5290536
11979 5290536 8906966 11771200 13619183 14211104 13377992 11071583 7395164 2597177
11971 2597177 -2975635 -8950863 -15002920 -20900457 -26515040 -31794131 -36717130 -41259924
11963 -41259924 -45384887 -49053246 -52240876 -54941516 -57160205 -58913446 -60243097 -61226656
11955 -61226656 -61957774 -62495545 -62818115 -62824293 -62392745 -61463588 -60091646 -58441083 -56725352
11946 -56725352 -55124733 -53727410 -52529447 -51491081 -50606512 -49939648 -49612240 -49762560 -50491499
$$ packed form
12003b1426411j313722j742389k253293k653923k771033k521639j942571j158719
11995c7783700l13404M86824J180150J728273K108994K335478K471192K609132
11987b5177061K824872L140946L524515L908750M217606M383764M358014M109130
11979E290536L616430K864234J847983N91921q33112k306409l676419m797987
11971B597177n572812n975228o052057n897537n614583n279091m922999m542794
11963d1259924m124963l668359l187630k700640k218689j753241j329651r83559
11955f1226656p31118n37771l22570o178M31548R29157J371942J650563J715731
11946e6725352J600619J397323J197963J038366Q84569O66864L27408j50320p28939
$$ plain form
11937 -50491499 -51799665 -53529746 -55353559 -56838405 -57579712 -57337778 -56110198 -54108185
11929 -54108185 -51653845 -49050833 -46490007 -44028643 -41637120 -39271951 -36933378 -34689932
11921 -34689932 -32672973 -31050108 -29987446 -29611747 -29978875 -31046875 -32655053 -34525215
11913 -34525215 -36304948 -37648976 -38301994 -38140858 -37164782 -35459356 -33169353 -30493308
11905 -30493308 -27684773 -25034771 -22820763 -21230420 -20291064 -19842760 -19571694 -19080260 -17947913
11896 -17947913 -15760090 -12128970 -6745361 534202 9605484 20084365 31337773 42565630
11888 42565630 52920213 61649180 68232215 72466286 74467631 74595951 73337140 71183206
11880 71183206 68531373 65614757 62483538 59056247 55230961 51000395 46501978 41978346
$$ packed form
11937e0491499j308166j730081j823813j484846p41307K41934J227580K002013
11929e4108185K454340K603012K560826K461364K391523K365169K338573K243446
11921c4689932K016959J622865J062662L75699l67128j068000j608178j870162
11913c4525215j779733j344028o53018J61136R76076J705426K290003K676045
11905c0493308K808535K650002K214008J590343R39356M48304K71066M91434J132347
11896a7947913K187823L631120N383609P279563R071282J0478881J1253408J1227857
11888D2565630J0354583Q728967O583035M234071K001345J28320j258811k153934
11880G1183206k651833k916616l131219l427291l825286m230566m498417m523632
$$ plain form
11872 41978346 37686593 33818019 30464206 27628942 25267707 23331289 21789999 20628409
11864 20628409 19825048 19341595 19129080 19138123 19321361 19630364 20013049 20411117 20755926 20966657
11854 20966657 20954943 20635588 19942995 18854504 17413530 15732497 13957871 12204450 10494755
11845 10494755 8746811 6829536 4661374 2293926 -72879 -2152442 -3667026 -4417194
11837 -4417194 -4292354 -3236548 -1216025 1770387 5639161 10175279 15042970 19860619
11829 19860619 24294577 28118740 31222001 33580687 35220729 36185479 36517897 36261411
11821 36261411 35476864 34264808 32775791 31191229 29673526 28314157 27123278 26076375
11813 26076375 25182040 24514411 24186561 24290440 24848438 25805167 27058215 28501154 30042462
$$ packed form
11872D1978346m291753l868574l353813k835264k361235j936418j541290j161590
11864B0628409q03361m83453k12515R043J83238L09003L82685L98068L44809K10731
11854B0966657j1714l19355o92593j088491j440974j681033j774626j753421j709695
11845A0494755j747944j917275k168162k367448k366805k079563j514584p50168
11837d417194J24840J055806K020523K986412L868774M536118M867691M817649
11829A9860619M433958L824163L103261K358686J640042R64750L32418k56486
11821C6261411p84547j212056j489017j584562j517703j359369j190879j046903
11813B6076375q94335o67629l27850J03879N57998R56729J253048J442939J541308
$$ plain form
11804 30042462 31582733 32972548 33997397 34414882 34024548 32730432 30574710 27744107
11796 27744107 24550157 21373599 18572737 16384897 14866169 13894718 13224826 12558429
11788 12558429 11609639 10153662 8054195 5261490 1785333 -2332075 -7015160 -12122654
11780 -12122654 -17414268 -22560273 -27217417 -31147320 -34309522 -36862607 -39066626 -41151346
11772 -41151346 -43229144 -45279676 -47179529 -48746612 -49794237 -50192473 -49913108 -49031650
11764 -49031650 -47689008 -46042495 -44231662 -42363291 -40509653 -38717776 -37028888 -35499900
11756 -35499900 -34212361 -33259044 -32714372 -32611172 -32947988 -33732083 -35035247 -37024354 -39939488
11747 -39939488 -44023404 -49436274 -56195865 -64157811 -73016594 -82303805 -91394985 -99567419
$$ packed form
11804C0042462J540271J389815J024849M17485l90334j294116k155722k830603
11796B7744107l193950l176558k800862k187840j518728r71451o69892o66397
11788A2558429r48790j455977k099467k792705l476157m117408m683085n107494
11780a2122654n291614n146005m657144l929903l162202k553085k204019k084720
11772d1151346k077798k050532j899853j567083j047625l98236K79365Q81458
11764d9031650J342642J646513J810833J868371J853638J791877J688888J528988
11756c5499900J287539R53317N44672J03200l36816p84095j303164j989107k915134
11747c9939488m083916n412870o759591p961946q858783r287211r091180q172434
$$ plain form
11739 -99567419 -106130512 -110586814 -112738588 -112678831 -110678890 -107048761 -102055921 -95939840
11731 -95939840 -88985363 -81572954 -74146432 -67113308 -60751863 -55188369 -50443532 -46495898
11723 -46495898 -43314525 -40855273 -39048437 -37807982 -37074160 -36877282 -37387963 -38908776
11715 -38908776 -41782580 -46244784 -52292784 -59638594 -67751784 -75948260 -83485262 -89662028
11707 -89662028 -93936363 -96032803 -95989337 -94114615 -90885484 -86844374 -82530856 -78434930
11699 -78434930 -74939958 -72245992 -70305328 -68822303 -67345555 -65426479 -62775186 -59349535
11691 -59349535 -55355908 -51183359 -47306823 -44185401 -42169403 -41426585 -41901381 -43322380
11683 -43322380 -45264980 -47256534 -48891138 -49917682 -50282820 -50134094 -49796044 -49719922 -50394537
$$ packed form
11739i9567419o563093m456302k151774N9757J999941L630129M992840O116081
11731i5939840O954477P412409P426522P033124O361445N563494M744837L947634
11723d6495898L181373K459252J806836J240455P33822J96878n10681j520813
11715c8908776k873804m462204o048000p345810q113190q196476p537002o176766
11707h9662028m274335k096440M3466J874722L229131M041110M313518M095926
11699g8434930L494972K693966J940664J483025J476748J919076K651293L425651
11691e9349535L993627M172549L876536L121422K015998P42818m74796j420999
11683d3322380j942600j991554j634604j026544l65138J48726L38050P6122o74615
$$ plain form
11674 -50394537 -52214725 -55338301 -59596356 -64518481 -69481972 -73923643 -77515703 -80228373
11666 -80228373 -82262551 -83897518 -85332551 -86596454 -87558877 -88022305 -87834354 -86956670 -85455791
11657 -85455791 -83426401 -80899159 -77799798 -73995106 -69400628 -64084341 -58311203 -52510303
11649 -52510303 -47169330 -42675675 -39158172 -36417935 -34008217 -31424762 -28287163 -24412146
11641 -24412146 -19776653 -14443142 -8516233 -2149141 4426025 10885384 16846534 21944520
11633 21944520 25916929 28660609 30240860 30848042 30702668 29933492 28492697 26177573
11625 26177573 22764884 18179538 12597223 6440734 304871 -5134480 -9203440 -11314307
11617 -11314307 -11057469 -8282189 -3132820 3977405 12439106 21530592 30492163 38602052
$$ packed form
11674e0394537j820188l123576m258055m922125m963491m441671l592060k712670
11666h0228373k034178j634967j435033j263903r62423m63428J87951Q77684J500879
11657h5455791K029390K527242L099361L804692M594478N316287N773138N800900
11649e2510303N340973M493655L517503K740237K409718K583455L137599L875017
11641b4412146M635493N333511N926909O367092O575166O459359N961150N097986
11633B1944520L972409K743680J580251O07182j45374p69176j440795k315124
11625B6177573l412689m585346n582315o156489o135863n439351m068960k110867
11617a1314307K56838K775280N149369P110225Q461701R091486Q961571Q109889
$$ plain form
11609 38602052 45273927 50164993 53245664 54783692 55243499 55150532 54976700 55072006 55639608
11600 55639608 56747330 58368600 60430386 62832838 65425967 67974178 70160909 71653796
11592 71653796 72195572 71661965 70053996 67439869 63892355 59464527 54217558 48280116
11584 48280116 41901449 35466612 29459842 24376784 20600405 18276585 17242560 17052275
11576 17052275 17103777 16827633 15866419 14173873 11993000 9730911 7803529 6529228 6097670
11567 6097670 6579450 7931084 9986579 12460649 14986651 17188101 18761990 19543232
11559 19543232 19523659 18820047 17613860 16093951 14413600 12653588 10791510 8698845
11551 8698845 6184678 3074706 -710532 -5111877 -9937565 -14914416 -19756773 -24209006
$$ packed form
11609C8602052O671875M891066L080671J538028M59807r2967j73832R5306N67602
11600E5639608J107722J621270K061786K402452K593129K548211K186731J492887
11592G1653796N41776n33607j607969k614127l547514m427828n246969n937442
11584D8280116o378667o434837o006770n083058l776379k323820j034025j90285
11576A7052275N1502k76144r61214j692546k180873k262089j927382j274301m31558
11567F097670M81780J351634K055495K474070K526002K201450J573889P81242
11559A9543232j9573p03612j206187j519909j680351j760012j862078k092665
11551H698845k514167l109972l785238m401345m825688m976851m842357m452233
$$ plain form
11543 -24209006 -28034561 -30978863 -32773849 -33223663 -32330850 -30369097 -27834249 -25282619
11535 -25282619 -23130348 -21505391 -20218861 -18869029 -17026772 -14409322 -10963249 -6840056
11527 -6840056 -2307912 2342689 6865292 11085239 14884971 18151750 20718177 22346806
11519 22346806 22792856 21924634 19833265 16863144 13540338 10430758 7989792 6462429
11511 6462429 5866208 6050511 6791037 7867628 9094698 10310460 11356143 12075624 12346300
11502 12346300 12128014 11498785 10644135 9790227 9110979 8663062 8382734 8131124 7749284
11493 7749284 7104814 6143112 4949274 3786400 3058862 3188766 4456454 6882251 10200379
11484 10200379 13929272 17507281 20444153 22434831 23400132 23456242 22846934 21874834 20847313
$$ packed form
11543b4209006l825555k944302j794986m49814Q92813J961753K534848K551630
11535b5282619K152271J624957J286530J349832J842257K617450L446073M123193
11527f840056M532144M650601M522603M219947L799732L266779K566427J628629
11519B2346806M46050q68222k091369k970121l322806l109580k440966j527363
11511F462429n96221J84303P40526J076591J227070J215762J045683P19481K70676
11502A2346300k18286o29229q54650q53908o79248m47917k80328k51610l81840
11493G749284o44470r61702j193838j162874p27538J29904J267688K425797L318128
11484A0200379L728893L578009K936872J990678R65301N6110o09308r72100j027521
$$ plain form
11475 20847313 20035567 19645537 19806026 20579440 21993419 24082084 26916105 30598674 35220368
11466 35220368 40795682 47220137 54268445 61619391 68881620 75616433 81374404 85751797
11458 85751797 88446734 89291553 88260139 85464018 81140171 75620060 69280375 62500334
11450 62500334 55652157 49119019 43299344 38558145 35131760 33043020 32090189 31923717
11442 31923717 32163691 32493390 32699149 32670049 32382805 31882798 31260922 30628258 30094514
11433 30094514 29753568 29674406 29892767 30399503 31128770 31959435 32742185 33346392 33703243
11424 33703243 33826220 33808938 33807011 34001635 34541638 35480188 36741571 38146759 39493576
11415 39493576 40650121 41604226 42433167 43209888 43907422 44361745 44306562 43447272 41532769
$$ packed form
11475B0847313q11746l90030J60489P73414J413979K088665K834021L682569M621694
11466C5220368N575314O424455P048308P350946P262229O734813N757971M377393
11458H5751797K694937Q44819j031414k796121m323847n520111o339685o780041
11450F2500334o848177o533138n819675m741199l426385k088740r52831j66472
11442C1923717K39974L29699K05759k9100k87244n00007o21876o32664n33744
11433C0094514l40946p9162K18361N06736P29267Q30665P82750O04207L56851
11424C3703243J22977j7282j927J94624N40003R38550J261383J405188J346817
11415C9493576J156545R54105Q28941P76721O97534M54323n5183q59290j914503
$$ plain form
11406 41532769 38404793 34025710 28494063 22055580 15106158 8168473 1825014 -3383214
11398 -3383214 -7055504 -8992924 -9212475 -7919156 -5439243 -2125407 1729630 5922654
11390 5922654 10297637 14670489 18779834 22292442 24851322 26144157 25980916 24366760
11382 24366760 21536050 17910875 13985300 10186531 6779838 3854167 1379920 -699225
11374 -699225 -2384700 -3584324 -4126831 -3818144 -2518198 -216576 2918369 6545280 10221394
11365 10221394 13512829 16091503 17782309 18562407 18535468 17897866 16904349 15841124 15011769
11356 15011769 14726364 15271750 16849891 19498380 23030696 27036420 30960450 34244561
11348 34244561 36482353 37527701 37513660 36774530 35703794 34609545 33629892 32735820 31797603
$$ packed form
11406D1532769l127976m379083n531647o438483o949422o937685o343459n208228
11398c383214l672290j937420k19551J293319K479913L313836L855037M193024
11390E922654M374983M372852M109345L512608K558880J292835j63241j614156
11382B4366760k830710l625175l925575l798769l406693k925671k474247k079145
11374f99225j685475j199624n42507L08687J299946K301622L134945L626911L676114
11365A0221394L291435K578674J690806P80098k6939o37602r93517j063225q29355
11356A5011769k85405N45386J578141K648489L532316M005724L924030L284111
11348C4244561K237792J045348j4041p39130j070736j094249r79653q94072r38217
$$ plain form
11339 31797603 30663372 29214946 27399872 25248564 22869159 20407922 17990043 15682750
11331 15682750 13506951 11474143 9598194 7859698 6151465 4251797 1845937 -1415840
11323 -1415840 -5839424 -11591393 -18596022 -26463425 -34509166 -41900392 -47890829 -52038697
11315 -52038697 -54300922 -54974303 -54545649 -53541460 -52424635 -51533224 -51048044 -50997439 -51309799
11306 -51309799 -51895022 -52709516 -53767266 -55095871 -56672226 -58384292 -60046794 -61461792
11298 -61461792 -62487116 -63077191 -63283001 -63214694 -62975494 -62587870 -61953058 -60879521 -59165838
11289 -59165838 -56672189 -53325787 -49075927 -43866251 -37667351 -30544210 -22696506 -14434034
11281 -14434034 -6098166 2029489 9788778 17151239 24190324 31046435 37909625 45004087
$$ packed form
11339C1797603j134231j448426j815074k151308k379405k461237k417879k307293
11331A5682750k175799k032808j875949j738496j708233j899668k405860l261777
11323a415840m423584n751969p004629p867403q045741p391226n990437m147868
11315e2038697k262225o73381M28654J004189J116825Q91411M85180N0605l12360
11306e1309799n85223q14494j057750j328605j576355j712066j662502j414998
11298f1461792j025324n90075k05810O8307K39200L87624O34812J073537J713683
11289e9165838K493649L346402M249860N209676O198900P123141P847704Q262472
11281a4434034Q335868Q127655P759289P362461P039085O856111O863190P094462
$$ plain form
11273 45004087 52540168 60629568 69204974 77993945 86563299 94414525 101098705 106318876
11265 106318876 109986317 112207880 113214648 113275479 112639153 111516154 110081028 108475836
11257 108475836 106812876 105180947 103648551 102253853 100989256 99805395 98645100 97484178
11249 97484178 96346210 95286448 94367907 93647091 93164839 92935494 92943634 93163277 93601379
11240 93601379 94351447 95632037 97778184 101165876 106091368 112667497 120789576 130167480
11232 130167480 140377904 150900319 161138274 170452554 178232563 184011597 187593877
11225 187593877 189128086 189072229 188051652 186667339 185323334 184123380 182864959 181129390
11217 181129390 178424196 174312715 168495294 160852676 151469722 140633238 128794148 116510041
$$ packed form
11273D5004087P536081Q089400Q575406Q788971Q569354P851226O684180N220171
11265A06318876L667441K221563J006768O0831o36326j122999j435126j605192
11257A08475836j662960j631929j532396j394698j264597j183861j160295j160922
11249I7484178j137968j059762r18541p20816m82252k29345Q140K19643M38102
11240I3601379P50068J280590K146147L387692M925492O576129Q122079R377904
11232A30167480J0210424J0522415J0237955R314280P780009N779034L582280
11225A87593877J534209n5857j020577j384313j344005j199954j258421j735569
11217A81129390k705194m111481n817421p642618r382954j0836484j1839090j2284107
$$ plain form
11209 116510041 104391910 93051673 83031064 74720369 68309296 63799895 61064109
11202 61064109 59901742 60072329 61306853 63316925 65807996 68491214 71090208 73347882
11194 73347882 75038410 75978821 76029829 75089258 73098645 70077850 66173964 61689182 57059330
11185 57059330 52780184 49301474 46921546 45719943 45555334 46129765 47091300 48135647
11177 48135647 49075844 49864586 50568203 51308164 52202838 53341789 54796770 56638849 58928020
11168 58928020 61677263 64826465 68252407 71803959 75335440 78728670 81907886 84839502
11160 84839502 87501961 89838793 91739569 93078778 93791146 93932158 93689960 93346714 93203005
11151 93203005 93486013 94273221 95463772 96806961 97969570 98614371 98468194 97365254 95258998
$$ packed form
11209A16510041j2118131j1340237j0020609q310695o411073m509401k735786
11202F1064109j162367J70587J234524K010072K491071K683218K598994K257674
11194G3347882J690528R40411N1008r40571j990613l020795l903886m484782m629852
11185E7059330m279146l478710k379928j201603j64609N74431R61535J044347
11177D8135647R40197P88742P03617P39961Q94674J138951J454981J842079K289171
11168E8928020K749243L149202L425942L551552L531481L393230L179216K931616
11160H4839502K662459K336832J900776J339209P12368J41012k42198l43246j43709
11151I3203005K83008P87208J190551J343189J162609O44801j46177j102940k106256
$$ plain form
11142 95258998 92206959 88339437 83819418 78800799 73402116 67714936 61842860 55938866
11134 55938866 50211009 44898444 40242990 36471858 33782099 32307471 32061928 32878915
11126 32878915 34386012 36055274 37339315 37851249 37508865 36573729 35569349 35118527 35764289
11117 35764289 37831528 41365721 46157918 51831042 57936830 64020596 69650519 74440496
11109 74440496 78088467 80420465 81415514 81200432 80022128 78207550 76117625 74105992
11101 74105992 72498438 71596717 71684867 73004914 75691496 79697765 84768625 90494855
11093 90494855 96427379 102191705 107551493 112412980 116795417 120792775 124533056 128130604
11085 128130604 131632431 134971229 137942667 140219312 141402220 141099560 139011388 134992117
$$ packed form
11142I5258998l052039l867522m520019n018619n398683n687180n872076n903994
11134E5938866n727857n312565m655454l771132k689759j474628k45543Q16987
11126C2878915J507097J669262J284041N11934l42384r35136j004380m50822O45762
11117C5764289K067239L534193M792197N673124O105788O083766N629923M789977
11109G4440496L647971K331998R95049k15082j178304j814578k089925k011633
11101G4105992j607554r01721Q8150J320047K686582M006269N070860N726230
11093I0494855N932524N764326N359788M861487M382437L997358L740281L597548
11085A28130604L501827L338798K971438K276645J182908l02660k088172m019271
$$ plain form
11077 134992117 129065182 121386976 112189391 101742415 90354601 78393595 66297225
11070 66297225 54560390 43697364 34182677 26381402 20495276 16551117 14431338 13919995
11062 13919995 14741863 16595727 19191774 22287776 25705221 29314977 33002701 36635534
11054 36635534 40046524 43040721 45417416 47000483 47671159 47399469 46267252 44469492
11046 44469492 42282091 40001515 37884884 36122445 34845374 34136520 34012552 34388220
11038 34388220 35069592 35808702 36401430 36777099 37037649 37434009 38290322 39901290 42439122
11029 42439122 45905166 50141241 54890225 59880880 64907203 69871482 74769274 79620748
11021 79620748 84383592 88894630 92872880 95988651 97975943 98746408 98457567 97501160
$$ packed form
11077A34992117n926935p678206r197585j0446976j1387814j1961006j2096370
11070F6297225j1736835j0863026r514687p801275n886126l944159k119779n11343
11062A3919995Q21868J853864K596047L096002L417445L609756L687724L632833
11054C6635534L410990K994197K376695J583067O70676k71690j132217j797760
11046D4469492k187401k280576k116631j762439j277071p08854j23968L75668
11038C4388220O81372P39110N92728L75669K60550L96360Q56313J610968K537832
11029D2439122L466044M236075M748984M990655N026323M964279M897792M851474
11021G9620748M762844M511038L978250L115771J987292P70465k88841r56407
$$ plain form
11013 97501160 96406711 95689299 95694906 96501235 97912044 99543803 100961785 101802020 101831059
11004 101831059 100938407 99094637 96312656 92625138 88071156 82689509 76527247 69664664
10996 69664664 62239782 54452973 46550606 38803156 31492576 24910875 19356569 15106186
10988 15106186 12349520 11113477 11228085 12369353 14158245 16261260 18454339 20643543
10980 20643543 22845316 25129954 27550580 30098938 32711930 35308043 37810319 40135446
10972 40135446 42167126 43746140 44692830 44851591 44134351 42547897 40206379 37336151
10964 37336151 34271627 31433023 29279982 28240684 28618986 30495387 33664095 37657291
10956 37657291 41869594 45732994 48861277 51108355 52538190 53344548 53769880 54056731
$$ packed form
11013I7501160j094449p17412N607Q06329J410809J631759J417982Q40235K9039
11004A01831059q92652j843770k781981l687518m553982n381647o162262o862583
10996F9664664p424882p786809p902367p747450p310580o581701n554306m250383
10988A5106186k756666j236043J14608J141268J788892K103015K193079K189204
10980B0643543K201773K284638K420626K548358K612992K596113K502276K325127
10972D0135446K031680J579014R46690J58761p17240j586454k341518k870228
10964C7336151l064524k838604k153041j039298L78302J876401L168708L993196
10956C7657291M212303L863400L128283K247078J429835Q06358M25332K86851
$$ plain form
10948 54056731 54433337 55109465 56260606 58002677 60375305 63342734 66803573 70597698
10940 70597698 74511328 78292556 81687603 84494769 86617867 88094634 89083913 89813783
10932 89813783 90509332 91324611 92298490 93344241 94275007 94864517 94935426 94446624 93528796
10923 93528796 92429420 91385453 90499391 89693377 88756438 87443221 85575230 83119236
10915 83119236 80228512 77227394 74529709 72516704 71427661 71306049 72008633 73260128
10907 73260128 74732084 76122536 77206253 77836869 77921447 77416393 76367412 74955480 73487484
10898 73487484 72316268 71739206 71938812 72988143 74895834 77647193 81209656 85499973
10890 85499973 90340296 95439669 100417627 104859018 108380246 110693662 111658940 111307520
$$ packed form
10948E4056731L76606O76128J151141J742071K372628K967429L460839L794125
10940G0597698L913630L781228L395047K807166K123098J476767R89279P29870
10932H9813783O95549Q15279R73879J045751R30766N89510P0909m88802r17828
10923I3528796j099376j043967q86062q06014r36939j313217j867991k455994
10915H3119236k890724l001118k697685k013005j089043j21612P02584J251495
10907G3260128J471956J390452J083717O30616Q4578n05054j048981j411932j467996
10898G3487484j171216n77062J99606J049331J907691K751359L562463M290317
10890H5499973M840323N099373M977958M441391L521228K313416R65278l51420
$$ plain form
10882 111307520 109832906 107552266 104848107 102097168 99603065 97559304 96054069 95094989
10874 95094989 94622087 94504576 94546382 94521710 94235591 93583808 92582061 91344160 90014867
10865 90014867 88694311 87398054 86066759 84602038 82899178 80871537 78479563 75767605
10857 75767605 72888902 70092539 67666382 65858765 64810816 64515495 64804778 65373648
10849 65373648 65856953 65947553 65496079 64524601 63145252 61448282 59441347 57072877 54306387
10840 54306387 51180700 47810440 44335087 40869681 37503286 34337307 31512839 29190271
10832 29190271 27493352 26457785 26012981 26001214 26223373 26492872 26676711 26711239 26596108
10823 26596108 26379064 26141773 25989161 26036351 26382094 27066359 28032034 29121791 30121308
$$ packed form
10882A11307520j474614k280640k704159k750939k494103k043761j505235r59080
10874I5094989m72902j17511M1806k4672k86119o51783j001747j237901j329293
10865I0014867j320556j296257j331295j464721j702860k027641k391974k711958
10857G5767605k878703k796363k426157j807617j047949k95321K89283N68870
10849F5373648M83305R0600m51474r71478j379349j696970k006935k368470k766490
10840E4306387l125687l370260l475353l465406l366395l165979k824468k322568
10832B9190271j696919j035567m44804j1767K22159K69499J83839L4528j15131
10823B6596108k17044k37291j52612M7190L45743O84265R65675J089757R99517
$$ plain form
10814 30121308 30828767 31121213 30998936 30593985 30130343 29846524 29926494 30483586 31591102
10805 31591102 33307112 35654491 38572904 41893996 45372495 48758610 51863632 54575940
10797 54575940 56824857 58533792 59612607 60002157 59736195 58970009 57947643 56915853
10789 56915853 56022698 55254448 54455812 53436055 52106119 50565448 49089949 48038885
10781 48038885 47740589 48403758 50059762 52523664 55383354 58049512 59881570 60354948
10773 60354948 59202964 56483279 52560943 48027086 43574444 39849423 37310469 36132703
10765 36132703 36189261 37108963 38379186 39455665 39858136 39249727 37499628 34717998 31246881
10756 31246881 27596846 24330940 21916594 20591940 20304692 20754500 21515568 22181077 22477984
$$ packed form
10814C0121308P07459K92446j22277m04951m63642k83819P9970N57092J107516
10805C1591102J716010K347379K918413L321092L478499L386115L105022K712308
10797E4575940K248917J708935J078815L89550k65962p66186j022366j031790
10789E6915853q93155p68250p98636j019757j329936j540671j475499j051064
10781D8038885k98296O63169J656004K463902K859690K666158J832058M73378
10773F0354948j151984k719685l922336m533857m452642l725021k538954j177766
10765C6132703N6558R19702J270223J076479M02471o08409j750099k781630l471117
10756C1246881l650035l265906k414346j324654k87248M49808P61068O65509K96907
$$ plain form
10747 22477984 22326470 21835095 21236392 20790314 20697746 21051766 21825061 22879880 23994979
10738 23994979 24908979 25373875 25208123 24338067 22812205 20774864 18409842 15892776 13383735
10729 13383735 11047914 9061674 7578131 6666727 6262775 6158538 6052309 5647463 4759135
10720 4759135 3368225 1590492 -413211 -2524265 -4705690 -6989186 -9431109 -12060715
10712 -12060715 -14839826 -17652054 -20332287 -22726120 -24746609 -26393902 -27727753 -28814323
10704 -28814323 -29681433 -30303996 -30618359 -30547730 -30017910 -28954041 -27269761 -24873587 -21706823
10695 -21706823 -17798667 -13305640 -8511347 -3785776 480556 3946419 6370622 7627759
10687 7627759 7694150 6628808 4569170 1734228 -1591681 -5112135 -8598425 -11961271
$$ packed form
10747B2477984j51514m91375n98703m46078r2568L54020P73295J054819J115099
10738B3994979R14000M64896j65752q70056j525862k037341k365022k517066k509041
10729A3383735k335821j986240j483543r11404m03952j04237j06229m04846q88328
10720D759135j390910j777733k003703k111054k181425k283496k441923k629606
10712a2060715k779111k812228k680233k393833k020489j647293j333851j086570
10704b8814323q67110o22563l14363P0629N29820J063869J684280K396174L166764
10695b1706823L908156M493027M794293M725571M266332L465863K424203J257137
10687G627759O6391j065342k059638k834942l325909l520454l486290l362846
$$ plain form
10679 -11961271 -15274502 -18727633 -22517235 -26719818 -31201930 -35608065 -39432568 -42144820
10671 -42144820 -43315753 -42701618 -40273433 -36209601 -30869017 -24742729 -18378539 -12294945
10663 -12294945 -6916739 -2545917 652240 2671814 3685627 4017843 4045379 4064584 4201446
10654 4201446 4418396 4598113 4633626 4468644 4087157 3488689 2681539 1702794 654411
10645 654411 -269962 -799545 -655829 353693 2278191 5041602 8517272 12600863 17234463
10636 17234463 22377735 27959565 33854837 39913121 46027116 52192558 58509430 65115262
10628 65115262 72093281 79417157 86966301 94596248 102213532 109803900 117395219 124981765
10620 124981765 132462174 139627403 146192243 151837922 156248778 159156323 160404199 160014095
$$ packed form
10679a1961271l313231l453131l789602m202583m482112m406135l824503k712252
10671d2144820j170933O14135K428185M063832N340584O126288O364190O083594
10663a2294945N378206M370822L198157K019574J013813L32216K7536J9205J36862
10654D201446K16950J79717L5513j64982l81487n98468q07150r78745j048383
10645F54411r24373n29583J43716J009522J924498K763411L475670M083591M633600
10636A7234463N143272N581830N895272O058284O113995O165442O316872O605832
10628F5115262O978019P323876P549144P629947P617284P590368P591319P586546
10620A24981765P480409P165229O564840N645679M410856K907545J247876l90104
$$ plain form
10612 160014095 158209835 155376910 151977781 148466137 145233118 142594238 140805304 140083013
10604 140083013 140605540 142484162 145718217 150155148 155474419 161209522 166814596 171762148
10596 171762148 175637704 178200613 179404916 179388356 178429761 176872069 175027310 173096963
10588 173096963 171130405 169020581 166526805 163316586 159015350 153253847 145721380 136244738
10580 136244738 124883265 111980120 98104517 83886188 69826908 56197849 43075129
10573 43075129 30474855 18491313 7357086 -2586258 -10957373 -17393050 -21586925 -23333561
10565 -23333561 -22595961 -19587438 -14834552 -9171732 -3622045 835165 3531279 4283590
10557 4283590 3388156 1441206 -908691 -3157263 -5025704 -6440633 -7467868 -8241637
$$ packed form
10612A60014095j804260k832925l399129l511644l233019k638880j788934p22291
10604A40083013N22527J878622L234055M436931N319271N735103N605074M947552
10596A71762148L875556K562909J204303j6560r58595j557692j844759j930347
10588A73096963j966558k109824k493776l210219m301236n761503p532467r476642
10580A36244738j1361473j2903145j3875603j4218329j4059280j3629059j3122720
10573D3075129j2600274j1983542j1134227r943344q371115o435677m193875j746636
10565b3333561P37600L008523M752886N662820N549687M457210K696114P52311
10557D283590q95434j946950k349897k248572j868441j414929j027235p73769
$$ plain form
10549 -8241637 -8900981 -9540843 -10196725 -10869287 -11559570 -12274432 -12995291 -13640137 -14048733
10540 -14048733 -13999716 -13257319 -11638553 -9072218 -5611560 -1392391 3426148 8695308
10532 8695308 14280741 20062128 25939862 31831811 37643780 43227164 48360133 52779033
10524 52779033 56253252 58668826 60083930 60737080 61006500 61330780 62115085 63658775 66128322
10515 66128322 69565317 73898752 78944795 84401158 89847724 94762295 98569241 100739559
10507 100739559 100926122 99073008 95436424 90503436 84846929 78974423 73216043 67668477
10499 67668477 62184426 56393012 49753259 41640259 31425679 18496407 2208959 -18143814
10491 -18143814 -43260423 -73607539 -109058635 -148485357 -189520976 -228781117 -262639715
$$ packed form
10549h241637o59344o39862o55882o72562o90283p14862p20859o44846m08596
10540a4048733M9017P42397J618766K566335L460658M219169M818539N269160
10532H695308N585433N781387N877734N891949N811969N583384N132969M418900
10524E2779033L474219K415574J415104O53150K69420L24280P84305J543690K469547
10515F6128322L436995M333435N046043N456363N446566M914571L806946K170318
10507A00739559J86563j853114l636584m932988n656507n872506n758380n547566
10499F7668477n484051n791414o639753q113000j0214580j2929272j6287448k0352773
10491a8143814k5116609l0347116l5451096l9426722m1035619l9260141l3858598
$$ plain form
10484 -262639715 -288262400 -304352047 -311243539 -310435731 -303944559 -293804369 -281811678
10477 -281811678 -269445384 -257864919 -247911326 -240078579 -234478982 -230859030 -228694387 -227333914
10469 -227333914 -226132949 -224533755 -222091525 -218478152 -213499549 -207126115 -199492898 -190834428
10461 -190834428 -181384552 -171319980 -160792644 -150011978 -139293172 -129021622 -119555097
10454 -119555097 -111128875 -103819091 -97575894 -92299289 -87919886 -84455332 -82020752 -80780182
10446 -80780182 -80853271 -82228411 -84739340 -88118754 -92085176 -96398582 -100848866 -105194426
10438 -105194426 -109111415 -112215418 -114163092 -114766648 -114030845 -112082906 -109054376 -105003814
10430 -105003814 -99921504 -93791328 -86659184 -78673427 -70088590 -61238693 -52492580 -44206945
$$ packed form
10484b62639715k5622685j6089647o891492Q07808O491172J0140190J1992691
10477b81811678J2366294J1580465R953593P832747N599597L619952K164643J360473
10469b27333914J200965J599194K442230L613373M978603O373434P633217Q658470
10461a90834428R449876J0064572J0527336J0780666J0718806J0271550R466525
10454a19555097Q426222P309784O243197N276605M379403L464554K434580J240570
10446h0780182p3089j375140k510929l379414l966422m313406m450284m345560
10438a05194426l916989l104003j947674o03556P35803J947939L028530M050562
10430a05003814N082310O130176P132144P985757Q584837Q849897Q746113Q285635
$$ plain form
10422 -44206945 -36693113 -30206881 -24955874 -21104736 -18759768 -17935013 -18524055 -20303072
10414 -20303072 -22967954 -26183100 -29615826 -32950875 -35903200 -38249681 -39879241 -40836517
10406 -40836517 -41327983 -41672658 -42203230 -43151542 -44575328 -46377151 -48417700 -50661161 -53263560
10397 -53263560 -56549204 -60886572 -66525406 -73466829 -81412050 -89794666 -97873520 -104859757
10389 -104859757 -110056338 -112980156 -113428202 -111469384 -107384883 -101596678 -94599190 -86885329
10381 -86885329 -78874313 -70878508 -63136456 -55886177 -49411416 -44009716 -39895016 -37106135
10373 -37106135 -35495027 -34807201 -34792257 -35265320 -36095307 -37161358 -38328709 -39455963 -40414022
10364 -40414022 -41099928 -41443418 -41407543 -40984983 -40197815 -39107460 -37823312 -36482574 -35189050
$$ packed form
10422d4206945P513832O486232N251007L851138K344968Q24755n89042j779017
10414b0303072k664882l215146l432726l335049k952325k346481j629560r57276
10406d0836517m91466l44675n30572r48312j423786j801823k040549k243461k602399
10397e3263560l285644m337368n638834o941423p945221q382616q078854o986237
10389a04859757n196581k923818m48046J958818M084501N788205O997488P713861
10381h6885329Q011016P995805P742052P250279O474761N401700M114700K788881
10373c7106135J611108O87826J4944m73063q29987j066051j167351j127254r58059
10364d0414022o85906l43490L5875M22560P87168J090355J284148J340738J293524
$$ plain form
10355 -35189050 -33941384 -32610137 -31000688 -28975933 -26564900 -23995567 -21646650 -19956300
10347 -19956300 -19324550 -20026220 -22146928 -25562061 -29970534 -34970232 -40144565 -45131878
10339 -45131878 -49661857 -53556753 -56710735 -59071695 -60642918 -61499258 -61795638 -61750575 -61604891
10330 -61604891 -61566900 -61755595 -62154013 -62592511 -62783275 -62405980 -61208643 -59073581 -56026152
10321 -56026152 -52204398 -47816268 -43090201 -38217210 -33301704 -28346911 -23275860 -17963136
10313 -17963136 -12261594 -6032798 809964 8258378 16186726 24361126 32480192 40239248
10305 40239248 47396364 53810657 59440564 64316529 68505304 72066943 75006521 77243229
10297 77243229 78621731 78961385 78114660 76013380 72698798 68331953 63175121 57544538
$$ packed form
10355c5189050J247666J331247J609449K024755K411033K569333K348917J690350
10347a9956300O31750p01670k120708l415133m408473m999698n174333m987313
10339d5131878m529979l894896l153982k360960j571223q56340k96380M5063J45684
10330f1604891L7991j88695l98418m38498j90764L77295J197337K135062L047429
10321e6026152L821754M388130M726067M872991M915506M954793N071051N312724
10313a7963136N701542O228796O842762P448414P928348Q174400Q119066P759056
10305D0239248P157116O414293N629907M875965M188775L561639K939578K236708
10297G7243229J378502L39654q46725k101280l314582m366845n156832n630583
$$ plain form
10289 57544538 51751025 46049160 40609413 35522337 30834986 26601347 22916437 19916014
10281 19916014 17748112 16530752 16300093 16950799 18188338 19529761 20378074 20157959 18466321
10272 18466321 15182129 10494050 4830391 -1288534 -7416100 -13287535 -18828814 -24088430
10264 -24088430 -29150419 -34068581 -38826643 -43321916 -47379903 -50799117 -53404024 -55082789
10256 -55082789 -55803553 -55606988 -54565309 -52714775 -50007824 -46337361 -41632778 -35966072
10248 -35966072 -29600811 -22962367 -16552072 -10841169 -6174511 -2705263 -371986 1082155
10240 1082155 2056741 3018574 4411261 6557860 9575993 13342524 17541709 21787966
10232 21787966 25761204 29284065 32317956 34908144 37120778 38994525 40510768 41580888
$$ packed form
10289E7544538n793513n701865n439747n087076m687351m233639l684910l000423
10281A9916014k167902j217360k30659O50706J237539J341423Q48313k20115j691638
10272A8466321l284192m688079n663659o118925o127566n871435n541279n259616
10264b4088430n061989m918162m758062m495273m057987l419214k604907j678765
10256e5082789p20764J96565J041679J850534K706951L670463M704583N666706
10248c5966072O365261O638444O410295N710903M666658L469248K333277J454141
10240A082155R74586R61833J392687K146599L018133L766531M199185M246257
10232B1787966L973238L522861L033891K590188K212634J873747J516243J070120
$$ plain form
10224 41580888 42050211 41723196 40418373 38048997 34696473 30627904 26231301 21888083
10216 21888083 17839292 14110563 10535237 6858604 2852208 -1631482 -6669359 -12288714
10208 -12288714 -18455968 -25049877 -31866130 -38669585 -45262328 -51521192 -57383407 -62798979
10200 -62798979 -67693584 -71973951 -75564667 -78434098 -80584560 -82025238 -82760381 -82798162
10192 -82798162 -82161335 -80889495 -79042423 -76714805 -74059105 -71303939 -68751903 -66740974
10184 -66740974 -65566848 -65390920 -66177607 -67695905 -69592159 -71512619 -73231127 -74725645
10176 -74725645 -76166009 -77826261 -79979743 -82832182 -86506377 -91057979 -96497903 -102804485
10168 -102804485 -109910283 -117656549 -125735206 -133665393 -140847351 -146694677 -150794063 -153015543
$$ packed form
10224D1580888M69323l27015j304823k369376l352524m068569m396603m343218
10216B1888083m048791l728729l575326l676633m006396m483690n037877n619355
10208a2288714o167254o593909o816253o803455o592743o258864n862215n415572
10200f2798979m894605m280367l590716k869431k150462j440678p35143l7781
10192h2798162O36827J271840J847072K327618K655700K755166K552036K010929
10184f6740974J174126J75928p86687j518298j896254j920460j718508j494518
10176g4725645j440364j660252k153482k852439l674195m551602n439924o306582
10168a02804485p105798p746266q078657p930187p181958n847326m099386k221480
$$ plain form
10160 -153015543 -153515882 -152635952 -150754583 -148181254 -145130960 -141759652 -138203487 -134583873
10152 -134583873 -130986322 -127449682 -123992927 -120671670 -117625595 -115077492 -113278876 -112437737
10144 -112437737 -112670935 -113990909 -116304076 -119404859 -122980576 -126651823 -130045655 -132869191
10136 -132869191 -134952271 -136251028 -136821330 -136774200 -136226505 -135263384 -133924705 -132213275 -130109591
10127 -130109591 -127579901 -124579894 -121069968 -117053778 -112629008 -108017659 -103545666 -99571024
10119 -99571024 -96392728 -94182892 -92964817 -92628390 -92956774 -93647160 -94330076 -94601161 -94068614
10110 -94068614 -92407986 -89418684 -85079058 -79580556 -73304429 -66725271 -60281009 -54281783
10102 -54281783 -48898148 -44201333 -40193408 -36793916 -33807129 -30922176 -27771834 -24023355
$$ packed form
10160a53015543n00339Q79930J881369K573329L050294L371308L556165L619614
10152a34583873L597551L536640L456755L321257L046075K548103J798616Q41139
10144a12437737k33198j319974k313167l100783l575717l671247l393832k823536
10136a32869191k083080j298757n70302M7130N47695R63121J338679J711430K103684
10127a30109591K529690L000007L509926M016190M424770M611349M471993L974642
10119i9571024L178296K209836J218075L36427l28384o90386o82916k71085N32547
10110i4068614J660628K989302M339626N498502O276127O579158O444262N999226
10102e4281783N383635M696815M007925L399492K986787K884953L150342L748479
$$ plain form
10094 -24023355 -19449537 -13952274 -7551511 -364771 7413924 15536637 23719153 31648239
10086 31648239 38990110 45415178 50632819 54419042 56641218 57298518 56566131 54793321
10078 54793321 52426722 49899227 47557048 45652840 44369118 43825552 44062141 45021200
10070 45021200 46545282 48387688 50228487 51704463 52470700 52291389 51118175 49098864
10062 49098864 46496719 43564265 40446679 37163515 33663875 29910267 25936419 21844104
10054 21844104 17747812 13716908 9763185 5874597 2053932 -1670543 -5255043 -8643444
10046 -8643444 -11753271 -14458062 -16586308 -17950962 -18412490 -17957293 -16748060 -15102571
10038 -15102571 -13400244 -11971592 -11039924 -10737404 -11150560 -12328349 -14231832 -16675062
$$ packed form
10094b4023355M573818N497263O400763P186740P778695Q122713Q182516P929086
10086C1648239P341871O425068N217641L786223K222176O57300p32387j772810
10078E4793321k366599k527495k342179j904208j283722n43566K36589R59059
10070D5021200J524082J842406J840799J475976P66237j79311j173214k019311
10062D9098864k602145k932454l117586l283164l499640l753608l973848m092315
10054B1844104m096292m030904l953723l888588l820665l724475l584500l388401
10046h643444l109827k704791k128246j364654m61528M55197J209233J645489
10038a5102571J702327J428652R31668L02520m13156j177789j903483k443230
$$ plain form
10030 -16675062 -19332395 -21840175 -23941815 -25584857 -26910191 -28148286 -29495850 -31049052
10022 -31049052 -32821382 -34814595 -37082616 -39745149 -42948880 -46805637 -51342499 -56485546
10014 -56485546 -62079415 -67926436 -73820508 -79560183 -84946779 -89784808 -93891970 -97109850
10006 -97109850 -99306682 -100377747 -100255521 -98931022 -96474219 -93040567 -88861176 -84224085
9998 -84224085 -79456157 -74909085 -70944590 -67912418 -66123652 -65829527 -67209107 -70354723
9990 -70354723 -75244036 -81706915 -89411825 -97890278 -106595951 -114977071 -122535773 -128855844
9982 -128855844 -133599292 -136494031 -137341600 -136056345 -132719779 -127616516 -121219334 -114109781
9974 -114109781 -106853567 -99879691 -93412418 -87472904 -81934112 -76604326 -71316931 -65996899
$$ packed form
10030a6675062k657333k507780k101640j643042j325334j238095j347564j553202
10022c1049052j772330j993213k268021k662533l203731l856757m536862n143047
10014e6485546n593869n847021n894072n739675n386596m838029m107162l217880
10006i7109850k196832j071065J22226J324499K456803L433652M179391M637091
9998h4224085M767928M547072L964495L032172J788766K94125j379580l145616
9990g0354723m889313o462879p704910q478453q705673q381120p558702o320071
9982a28855844m743448k894739q47569J285255L336566N103263O397182P109553
9974a14109781P256214O973876O467273N939514N538792N329786N287395N320032
$$ plain form
9966 -65996899 -60672441 -55429386 -50347422 -45463884 -40773569 -36238052 -31783596 -27297731
9958 -27297731 -22648413 -17729270 -12502925 -7008656 -1333167 4417935 10111661 15549864
9950 15549864 20444499 24435004 27142880 28247805 27574081 25162661 21286341 16387006
9942 16387006 10964171 5465403 206529 -4670073 -9185173 -13454020 -17592849 -21658313
9934 -21658313 -25646297 -29526862 -33281440 -36930891 -40553782 -44285005 -48283940 -52677994
9926 -52677994 -57503405 -62668951 -67960781 -73086644 -77732474 -81598792 -84410420 -85922097
9918 -85922097 -85939880 -84350849 -81137099 -76359796 -70119831 -62514535 -53608574 -43425468
9910 -43425468 -31954771 -19166816 -5025244 10519822 27573977 46367214 67312502
$$ packed form
9966f5996899N324458N243055N081964M883538M690315M535517M454456M485865
9958b7297731M649318M919143N226345N494269N675489N751102N693726N438203
9950A5549864M894635L990505K707876J104925o73724k411420l876320m899335
9942A6387006n422835n498768n258874m876602m515100m268847m138829m065464
9934b1658313l987984l880565l754578l649451l622891l731223l998935m394054
9926e2677994m825411n165546n291830n125863m645830l866318k811628j511677
9918h5922097j7783J589031L213750M777303O239965P605296Q905961J0183106
9910d3425468J1470697J2787955J4141572J5545066J7054155J8793237K0945288
$$ plain form
9903 67312502 91021229 118267549 149900442 186686877 229062081 276771586 328423453
9896 328423453 381083976 430238563 470481656 496943810 506857370 500382610 480248744
9889 480248744 450561583 415550873 378783227 342861479 309388647 279052654 251808708
9882 251808708 227138804 204324902 182674049 161666802 141027332 120730078 100961554
9875 100961554 82045071 64336562 48127491 33605328 20881756 10040925 1156943
9868 1156943 -5721285 -10589954 -13506283 -14614413 -14182694 -12628029 -10499628 -8412365
9860 -8412365 -6940303 -6499813 -7267547 -9174687 -11983093 -15400758 -19172740 -23109977 -27071319
9851 -27071319 -30947265 -34677576 -38286858 -41892365 -45657347 -49711005 -54085235 -58702464
$$ packed form
9903F7312502K3708727K7246320L1632893L6786435M2375204M7709505N1651867
9896C28423453N2660523M9154587M0243093K6462154R913560o474760k0133866
9889D80248744k9687161l5010710l6767646l5921748l3472832l0335993k7243946
9882B51808708k4669904k2813902k1650853k1007247k0639470k0297254j9768524
9875A00961554j8916483j7708509j6209071j4522163j2723572j0840831q883982
9868A156943o878228m868669k916329j108130M31719J554665K128401K087263
9860h412365J472062M40490p67734j907140k808406l417665l771982l937237l961342
9851b7071319l875946l730311l609282l605507l764982m053658m374230m617229
$$ plain form
9843 -58702464 -63405171 -67988749 -72213035 -75807881 -78506514 -80112323 -80562708 -79949475
9835 -79949475 -78491884 -76489089 -74271595 -72146697 -70327436 -68856128 -67560822 -66088507
9827 -66088507 -64025466 -61055850 -57073748 -52194458 -46684401 -40874037 -35098362 -29664623
9819 -29664623 -24829384 -20778507 -17613137 -15342324 -13882241 -13068966 -12696023 -12577987 -12616606
9810 -12616606 -12823208 -13262512 -13939776 -14711487 -15295061 -15381193 -14782174 -13537458 -11931025
9801 -11931025 -10414116 -9462124 -9426757 -10449505 -12461885 -15243765 -18493764 -21889409 -25140187
9792 -25140187 -28037854 -30495521 -32559236 -34380601 -36154304 -38040819 -40100383 -42260845
9784 -42260845 -44338597 -46121623 -47489363 -48503290 -49407521 -50544214 -52250132 -54792964
$$ packed form
9843e8702464m702707m583578m224286l594846k698633j605809m50385O13233
9835g9949475J457591K002795K217494K124898J819261J471308J295306J472315
9827f6088507K063041K969616L982102M879290N510057N810364N775675N433739
9819b9664623M835239M050877L165370K270813J460083Q13275L72943J18036l8619
9810a2616606k06602m39304o77264p71711n83574q6132N99019J244716J606433
9801a1931025J516909R51992L5367j022748k012380k781880l249999l395645l250778
9792b5140187k897667k457667k063715j821365j773703j886515k059564k160462
9784d2260845k077752j783026j367740j013927r04231j136693j705918k542832
$$ plain form
9776 -54792964 -58347982 -62979776 -68609068 -74977761 -81643787 -88036888 -93585331 -97878821
9768 -97878821 -100791307 -102494668 -103357330 -103789960 -104118050 -104522137 -105031798 -105537330 -105807116
9759 -105807116 -105532715 -104416495 -102267988 -99048311 -94842348 -89804006 -84132016 -78083467
9751 -78083467 -71986407 -66219059 -61158224 -57120458 -54319303 -52852407 -52716541 -53830763
9743 -53830763 -56046643 -59145794 -62845163 -66825355 -70775623 -74437226 -77632515 -80276463
9735 -80276463 -82369274 -83967355 -85134901 -85891944 -86186796 -85915607 -84984974 -83383189 -81217238
9726 -81217238 -78692931 -76048220 -73473134 -71051660 -68742599 -66392812 -63767511 -60591663
9718 -60591663 -56603958 -51614560 -45545328 -38440171 -30456981 -21860348 -13015735 -4365032
$$ packed form
9776e4792964l555018m631794n629292o368693o666026o393101n548443m293490
9768i7878821k912486j703361q62662m32630l28090m04087n09661n05532k69786
9759a05807116K74401J116220K148507L219677M205963N038342N671990O048549
9751g8083467O097060N767348N060835M037766K801155J466896J35866j114222
9743e3830763k215880l099151l699369l980192l950268l661603l195289k643948
9735h0276463k092811j598081j167546p57043k94852K71189R30633J601785K165951
9726h1217238K524307K644711K575086K421474K309061K349787K625301L175848
9718f0591663L987705M989398O069232P105157P983190Q596633Q844613Q650703
$$ plain form
9710 -4365032 3634031 10596604 16289495 20650208 23721806 25537174 26034414 25073029 22548880
9701 22548880 18534234 13354479 7555885 1778695 -3407158 -7632357 -10771887 -12896201
9693 -12896201 -14174562 -14794346 -14932965 -14769501 -14494503 -14291221 -14300746 -14606309 -15257560 -16320434
9683 -16320434 -17914555 -20205323 -23346873 -27407473 -32327341 -37942371 -44062996 -50559504
9675 -50559504 -57402718 -64637709 -72303362 -80337383 -88520005 -96498981 -103895630 -110438396
9667 -110438396 -116047875 -120824781 -124948670 -128544165 -131589213 -133919261 -135329937 -135724687
9659 -135724687 -135225608 -134181310 -133056080 -132246258 -131913662 -131923308 -131916593 -131475066 -130287364
9650 -130287364 -128246925 -125457939 -122173051 -118707047 -115364252 -112392315 -109950525 -108077663
$$ packed form
9710d365032P999063O962573N692891M360713L071598J815368M97240r61385k524149
9701B2548880m014646n179755n798594n777190n185853m225199l139530k124314
9693a2896201j278361o19784j38619J63464K74998K03282r525l05563o51251j062874
9683a6320434j594121k290768l141550m060600m919868n615030o120625o496508
9675e0559504o843214p234991p665653q034021q182622p978976p396649o542766
9667a10438396n609479m776906m123889l595495l045048k330048j410676l94750
9659a35724687M99079J044298J125230Q09822L32596r646O715M41527J187702
9650a30287364K040439K788986L284888L466004L342795K971937K441790J872862
$$ plain form
9642 -108077663 -106664322 -105454294 -104095146 -102229765 -99591531 -96060002 -91658724 -86513705
9634 -86513705 -80809490 -74765143 -68624846 -62647528 -57089936 -52184837 -48110295 -44945618
9626 -44945618 -42628558 -40947856 -39594539 -38255241 -36697667 -34805065 -32556287 -29983018
9618 -29983018 -27138193 -24088063 -20922243 -17771520 -14820602 -12298119 -10433177 -9391590
9610 -9391590 -9222533 -9837394 -11020390 -12462209 -13812596 -14744913 -15014788 -14496476 -13196809
9601 -13196809 -11254632 -8923584 -6528470 -4397590 -2792899 -1864473 -1642957 -2066166 -3024566
9592 -3024566 -4408672 -6148908 -8245452 -10781633 -13905013 -17765033 -22421158 -27761745
9584 -27761745 -33478240 -39116875 -44192655 -48317689 -51288925 -53106343 -53930901 -54010674 -53598659
$$ packed form
9642a08077663J413341J210028J359148J865381K638234L531529M401278N145019
9634h6513705N704215O044347O140297N977318N557592M905099M074542L164677
9626d4945618K317060J680702J353317J339298J557574J892602K248778K573269
9618b9983018K844825L050130L165820L150723K950918K522483J864942J041587
9610i391590J69057o14861j182996j441819j350387r32317k69875N18312J299667
9601a3196809J942177K331048K395114K130880J604691R28426K21516m23209r58400
9592c024566j384106j740236k096544k536181l123380l860020m656125n340587
9584b7761745n716495n638635n075780m125034k971236j817418q24558p9773M12015
$$ plain form
9575 -53598659 -52878603 -51917268 -50658818 -48960822 -46656156 -43622885 -39844678 -35440341
9567 -35440341 -30648214 -25779683 -21180340 -17225035 -14332191 -12955034 -13517603 -16298549
9559 -16298549 -21300558 -28162329 -36164377 -44345319 -51694766 -57353737 -60757922 -61696856
9551 -61696856 -60301055 -56981771 -52337534 -47035461 -41689340 -36771727 -32584953 -29281182
9543 -29281182 -26901507 -25416663 -24772146 -24937833 -25942689 -27867940 -30788811 -34683754
9535 -34683754 -39355211 -44413133 -49347403 -53663119 -57011053 -59252298 -60442763 -60764591
9527 -60764591 -60440967 -59661780 -58540003 -57109473 -55355459 -53251969 -50783896 -47955831
9519 -47955831 -44806255 -41435101 -38025009 -34826167 -32101705 -30071383 -28896871 -28706643
$$ packed form
9575e3598659P20056R61335J258450J697996K304666L033271L778207M404337
9567c5440341M792127M868531M599343L955305K892844J377157n62569k780946
9559a6298549n002009o861771q002048q180942p349447n658971l404185r38934
9551f1696856J395801L319284M644237N302073N346121M917613M186774L303771
9543b9281182K379675J484844O44517j65687j004856j925251k920871l894943
9535c4683754m671457n057922m934270m315716l347934k241245j190465l21828
9527f0764591L23624P79187J121777J430530J754014K103490K468073K828065
9519d7955831L149576L371154L410092L198842K724462K030322J174512J90228
$$ plain form
9511 -28706643 -29608297 -31640758 -34679458 -38364353 -42120796 -45292052 -47340699 -48036832
9503 -48036832 -47547579 -46380363 -45200878 -44608599 -44966085 -46335785 -48513656 -51106475 -53601005
9494 -53601005 -55409704 -55919445 -54581719 -51049942 -45315487 -37766654 -29122996 -20263119
9486 -20263119 -12019071 -5018691 379330 4064581 6109696 6704918 6112708 4632199
9478 4632199 2550184 72386 -2736235 -5955195 -9735291 -14184538 -19285650 -24893751
9470 -24893751 -30796776 -36774645 -42608747 -48049955 -52793461 -56499739 -58861298 -59684946
9462 -59684946 -58957593 -56879161 -53859522 -50480167 -47420595 -45352522 -44816592 -46112603
9454 -46112603 -49242839 -53934845 -59734995 -66128706 -72635435 -78853514 -84467336 -89244765
$$ packed form
9511b8706643r01654k032461l038700l684895l756443l171256k048647o96133
9503d8036832M89253J167216J179485N92279l57486j369700k177871k592819k494530
9494e3601005j808699n09741J337726L531777N734455P548833Q643658Q859877
9486b0263119Q244048P000380N398021L685251K045115N95222n92210j480509
9478D632199k082015k477798k808621l218960l780096m449247n101112n608101
9470b4893751n903025n977869n834102n441208m743506l706278k361559q23648
9462e9684946P27353K078432L019639L379355L059572K068073N35930j296011
9454d6112603l130236m692006n800150o393711o506729o218079n613822m777429
$$ plain form
9446 -89244765 -93038730 -95786843 -97499585 -98237395 -98080106 -97084967 -95231462 -92374885 -88255142
9437 -88255142 -82594624 -75260720 -66406466 -56496615 -46194227 -36175173 -26978021 -18951928
9429 -18951928 -12281403 -7023079 -3118981 -408697 1319731 2241892 2425124 1828140 376892
9420 376892 -1931564 -4953040 -8371788 -11723868 -14466180 -16096789 -16310925 -15133959 -12955794
9411 -12955794 -10432331 -8294225 -7153972 -7395600 -9178170 -12520662 -17395604 -23763429
9403 -23763429 -31529030 -40465381 -50177061 -60143709 -69818467 -78719066 -86469928 -92803044
9395 -92803044 -97549629 -100636676 -102075592 -101930561 -100277788 -97181060 -92698175 -86911297
9387 -86911297 -79961513 -72067437 -63516086 -54629878 -45729420 -37112631 -29052501 -21796793
$$ packed form
9446h9244765l793965k748113j712742p37810J57289R95139J853505K856577M119743
9437h8255142N660518P333904Q854254R909851J0302388J0019054R197152Q026093
9429a8951928O670525N258324L904098K710284J728428R22161J83232n96984j451248
9420C76892k308456l021476l418748l352080k742312j630609k14136J176966K178165
9411a2955794K523463K138106J140253k41628j782570l342492m874942o367825
9403b3763429p765601q936351r711680r966648r674758q900599p750862o333116
9395i2803044m746585l087047j438916J45031J652773L096728M482885N786878
9387h6911297O949784P894076Q551351Q886208Q900458Q616789Q060130P255708
$$ plain form
9379 -21796793 -15553705 -10464959 -6581725 -3857945 -2165502 -1325260 -1141773 -1430243 -2031292
9370 -2031292 -2814439 -3669360 -4483015 -5110847 -5362972 -5020829 -3875026 -1757844 1443678
9361 1443678 5780393 11217339 17595128 24606195 31813774 38707430 44759600 49458961
9353 49458961 52339486 53047956 51458096 47769997 42500641 36323796 29824776 23308663
9345 23308663 16772907 10045881 2990244 -4350281 -11723014 -18745354 -25040154 -30370366
9337 -30370366 -34718615 -38272036 -41313568 -44071264 -46597048 -48723600 -50110775 -50365205
9329 -50365205 -49192940 -46523307 -42547036 -37656734 -32329096 -27002364 -21984441 -17413658
9321 -17413658 -13290637 -9575329 -6297180 -3606569 -1735243 -898894 -1207951 -2635582
$$ packed form
9379b1796793O243088N088746L883234K723780J692443Q40242J83487k88470o01049
9370b031292p83147q54921q13655o27832k52125L42143J145803K117182L201522
9361A443678M336715N436946O377789P011067P207579O893656O052170M699361
9353D9458961K880525P08470j589860l688099n269356o176845o499020o516113
9345B3308663o535756o727026p055637p340525p372733p022340o294800n330212
9337c0370366m348249l553421l041532k757696k525784k126552j387175k54430
9329e0365205J172265K669633L976271M890302N327638N326732N017923M570783
9321a7413658M123021L715308L278149K690611J871326Q36349l09057j427631
$$ plain form
9313 -2635582 -5049573 -8275516 -12142159 -16480578 -21095198 -25750359 -30192032 -34185073
9305 -34185073 -37544061 -40160961 -42033209 -43268711 -44045971 -44554739 -44971302 -45483266 -46317581
9296 -46317581 -47719858 -49883157 -52867360 -56553400 -60658412 -64814030 -68679809 -72045167
9288 -72045167 -74890175 -77406451 -79977897 -83094989 -87189116 -92441888 -98675624 -105396056
9280 -105396056 -111963591 -117799874 -122534954 -126047502 -128409490 -129788572 -130363653 -130274396
9272 -130274396 -129592651 -128305770 -126321677 -123505362 -119736099 -114966512 -109274663 -102900553
9264 -102900553 -96240603 -89771466 -83913270 -78893253 -74681025 -71022507 -67541770 -63857892
9256 -63857892 -59685337 -54914205 -49664559 -44284979 -39263939 -35067850 -31979455 -30025921
$$ packed form
9313b635582k413991l225943l866643m338419m614620m655161m441673l993041
9305c4185073l358988k616900j872248j235502p77260n08768m16563n11964q34315
9296d6317581j402277k163299k984203l686040m105012m155618l865779l365358
9288g2045167k845008k516276k571446l117092m094127n252772o233736o720432
9280a05396056o567535n836283m735080l512548k361988j379082n75081Q9257
9272a30274396O81745J286881J984093K816315L769263M769587N691849O374110
9264a02900553O659950O469137N858196N020017M212228L658518L480737L683878
9256f3857892M172555M771132N249646N379580N021040M196089L088395J953534
$$ plain form
9248 -30025921 -29033976 -28766676 -29046582 -29789987 -30948083 -32415488 -33976833 -35322076 -36114740
9239 -36114740 -36077614 -35064346 -33095740 -30351704 -27124043 -23745153 -20510390 -17614574
9231 -17614574 -15125985 -13011123 -11197818 -9643024 -8370900 -7460396 -6982230 -6916370 -7108373
9222 -7108373 -7306997 -7260750 -6800189 -5856166 -4432685 -2582445 -398299 2005019 4535052
9213 4535052 7170049 9974157 13060428 16513776 20308796 24262827 28048922 31264507
9205 31264507 33529527 34583870 34360491 33018689 30930934 28625101 26686966 25631932
9197 25631932 25772670 27131992 29447140 32270293 35119077 37610408 39530872 40835573
9189 40835573 41598449 41947301 42009171 41879928 41625126 41310517 41041753 40977397 41293171 42117096
$$ packed form
9248c0025921R91945K67300k79906p43405j158096j467405j561345j345243p92664
9239c6114740L7126J013268J968606K744036L227661L378890L234763K895816
9231a7614574K488589K114862J813305J554794J272124R10504M78166O5860j92003
9222g108373j98624M6247M60561R44023J423481J850240K184146K403318K530033
9213D535052K634997K804108L086271L453348L795020L954031L786095L215585
9205C1264507K265020J054343k23379j341802k087755k305833j938135j055034
9197B5631932J40738J359322K315148K823153K848784K491331J920464J304701
9189D0835573P62876L48852O1870j29243k54802l14609k68764o4356L15774Q23925
$$ plain form
9179 42117096 43486340 45361974 47685957 50421717 53526791 56862753 60108477 62753364
9171 62753364 64196681 63912905 61612305 57337241 51462118 44597198 37435621 30610320
9163 30610320 24613044 19779507 16310092 14299874 13769427 14688495 16977450 20480913
9155 20480913 24932259 29942901 35041109 39755630 43706169 46650903 48467388 49091924
9147 49091924 48472913 46581065 43476785 39392186 34765731 30186030 26254750 23430525
9139 23430525 21923211 21671855 22403226 23752596 25413193 27255192 29353226 31908985
9131 31908985 35118665 39058632 43636995 48616702 53683827 58521554 62861605 66514012
9123 66514012 69392678 71537009 73103195 74303122 75304907 76139384 76657724 76564888 75524593
$$ packed form
9179D2117096J369244J875634K323983K735760L105074L335962L245724K644887
9171F2753364J443317k83776k300600m275064n875123o864920p161577o825301
9163C0610320n997276m833537l469415k010218n30447R19068K288955L503463
9155B0480913M451346N010642N098208M714521L950539K944734J816485O24536
9147D9091924o19011j891848l104280m084599m626455m579701l931280k824225
9139B3430525j507314k51356P31371J349370J660597J841999K098034K555759
9131C1908985L209680L939967M578363M979707N067125M837727M340051L652407
9123F6514012K878666K144331J566186J199927J001785Q34477N18340r2836j040295
$$ plain form
9114 75524593 73298285 69855189 65395051 60267643 54833120 49346127 43931212 38649695
9106 38649695 33589900 28906056 24788977 21407044 18856547 17131155 16113696 15605054
9098 15605054 15390761 15307536 15264131 15215330 15133918 15016222 14905026 14882575 15014064 15281152
9088 15281152 15571952 15753553 15779989 15756393 15920060 16562942 17942518 20206782 23340295
9079 23340295 27141677 31244851 35182497 38475913 40730513 41709902 41357102 39751804
9071 39751804 37034031 33345534 28816251 23583617 17817511 11732328 5576365 -405118
9063 -405118 -6021806 -11176998 -15867034 -20138643 -24025706 -27496245 -30434251 -32664880
9055 -32664880 -34012163 -34364657 -33722665 -32210252 -30051245 -27524071 -24915273 -22481491
$$ packed form
9114G5524593k226308l443096m460138n127408n434523n486993n414915n281517
9106C8649695n059795m683844m117079l381933k550497j725392j017459n08642
9098A5605054k14293q3225m3405m8801q1412j17696j11196k2451J31489K67088
9088A5281152K90800J81601K6436k3596J63667O42882J379576K264264L133513
9079B3340295L801382M103174L937646L293416K254600R79389l52800j605298
9071C9751804k717773l688497m529283n232634n766106o085183o155963n981483
9063d05118n616688n155192m690036m271609l887063l470539k938006k230629
9055c2664880j347283l52494O41992J512413K159007K527174K608798K433782
$$ plain form
9047 -22481491 -20417593 -18831730 -17739000 -17080177 -16750658 -16618330 -16531047 -16334506 -15909146
9038 -15909146 -15207097 -14266726 -13206288 -12215203 -11549377 -11512218 -12395317 -14374677 -17398399
9029 -17398399 -21130628 -25003096 -28367700 -30682125 -31646213 -31246716 -29721073 -27475377
9021 -27475377 -24983981 -22683427 -20873260 -19650286 -18909208 -18419136 -17939028 -17307228 -16465599
9012 -16465599 -15436692 -14302971 -13212228 -12389751 -12126579 -12735582 -14485381 -17521074 -21783947
9003 -21783947 -26963919 -32528981 -37841753 -42312868 -45513101 -47199960 -47275401 -45725341
8995 -45725341 -42583566 -37935509 -31951408 -24917589 -17227156 -9312339 -1544954 5836710
8987 5836710 12729140 19098350 24902542 30066407 34531047 38340028 41683727 44848204
$$ packed form
9047b2481491K063898J585863J092730O58823L29519J32328Q7283J96541M25360
9038a5909146P02049R40371J060438R91085O65826L7159q83099j979360l023722
9029a7398399l732229l872468l364604k314425r64088L99497J525643K245696
9021b7475377K491396K300554J810167J222974P41078M90072M80108O31800Q41629
9012a6465599J028907J133721J090743Q22477K63172o09003j749799l035693m262873
9003b1783947n179972n565062n312772m471115l200233j686859p5441J550060
8995d5725341L141775M648057N984101P033819P690433P914817P767385P381664
8987E836710O892430O369210N804192N163865M464640L808981L343699L164477
$$ plain form
8979 44848204 48087771 51500798 54984894 58289296 61122526 63253051 64560500 65031769
8971 65031769 64724708 63726089 62113645 59918966 57097988 53533574 49087756 43686064
8963 43686064 37388399 30408890 23079699 15779898 8857379 2566313 -2967887 -7755451
8955 -7755451 -11924612 -15678253 -19223449 -22688734 -26062655 -29182593 -31774680 -33522691
8947 -33522691 -34145209 -33470960 -31499417 -28421693 -24579502 -20366896 -16113420 -12003789
8939 -12003789 -8076112 -4300377 -689034 2635738 5469126 7628486 9059681 9868476
8931 9868476 10258856 10425208 10467734 10374672 10069478 9484748 8612943 7503584 6219342 4798470
8921 4798470 3264937 1682770 209287 -899213 -1341012 -857069 684712 3238413 6571930
$$ packed form
8979D4848204L239567L413027L484096L304402K833230K130525J307449M71269
8971F5031769l07061r98619j612444k194679k820978l564414m445818n401692
8963D3686064o297665o979509p329191p299801o922519o291066n534200m787564
8955g755451m169161l753641l545196l465285l373921l119938k592087j748011
8947c3522691o22518O74249J971543L077724L842191M212606M253476M109631
8939a2003789L927677L775735L611343L324772K833388K159360J431195Q08795
8931I868476L90380J66352M2526r3062l05194n84730q71805j109359j284242j420872
8921D798470j533533j582167j473483j108500m41799M83943J541781K553701L333517
$$ plain form
8912 6571930 10294443 13908749 16884957 18751624 19182918 18047013 15398470 11434345
8904 11434345 6449024 803225 -5099728 -10836776 -15988183 -20172934 -23114066 -24720740
8896 -24720740 -25131310 -24668022 -23718571 -22617106 -21588086 -20758062 -20195380 -19937071 -19988209
8887 -19988209 -20304263 -20778562 -21251731 -21542014 -21480449 -20936350 -19830121 -18136649 -15882566
8878 -15882566 -13143414 -10047072 -6776712 -3552351 -582576 1986623 4085235 5687456
8870 5687456 6770784 7301545 7242960 6559128 5209526 3156383 398142 -2991200 -6848330
8861 -6848330 -10939811 -14995595 -18740142 -21924185 -24367821 -26010030 -26936902 -27354722 -27496981
8852 -27496981 -27496292 -27284082 -26575558 -24955261 -22027518 -17565730 -11596435 -4386453 3648512
$$ packed form
8912F571930L722513L614306K976208J866667M31294j135905k648543l964125
8904A1434345m985321n645799n902953n737048n151407m184751k941132j606674
8896b4720740m10570M63288R49451J101465J029020Q30024N62682K58309n1138
8887a9988209l16054m74299m73169k90283O1565N44099J106229J693472K254083
8878a5882566K739152L096342L270360L224361K969775K569199K098612J602221
8870E687456J083328N30761n8585o83832j349602k053143k758241l389342l857130
8861f848330m091481m055784l744547l184043k443636j642209r26872m17820j42259
8852b7496981O89K12210P08524J620297K927743M461788N969295P209982Q034965
$$ plain form
8843 3648512 12056402 20428572 28435204 35839997 42509950 48406817 53545119 57933856
8835 57933856 61541572 64306457 66176739 67151261 67302334 66780599 65807983 64660130 63631005
8826 63631005 62970473 62802506 63061522 63495325 63750508 63500749 62551539 60879778 58613767
8817 58613767 55984174 53268472 50732519 48566364 46821841 45377157 43960664 42244767
8809 42244767 39974925 37065383 33613958 29853266 26099521 22733410 20184211 18868939
8801 18868939 19087595 20930150 24244892 28667815 33685466 38719102 43231064 46831914
8793 46831914 49340391 50764489 51223729 50866680 49822845 48188960 46030173 43387697
8785 43387697 40298530 36823332 33057686 29106134 25036847 20865159 16591718 12263355
$$ packed form
8843C648512Q407890Q372170Q006632P404793O669953N896867N138302M388737
8835E7933856L607716K764885J870282R74522J51073n21735r72616j147853j029125
8826F3631005o60532j67967K59016M33803K55183k49759r49210j671761k266011
8817E8613767k629593k715702k535953k166155j744523j444684j416493j715897
8809D2244767k269842k909542l451425l760692l753745l366111k549199j315272
8801A8868939K18656J842555L314742M422923N017651N033636M511962L600850
8793D6831914K508477J424098M59240l57049j043835j633885k158787k642476
8785D3387697l089167l475198l765646l951552m069287m171688m273441m328363
$$ plain form
8777 12263355 7999241 3963145 316798 -2804268 -5290071 -7055078 -8045431 -8238569
8769 -8238569 -7627052 -6208596 -4011879 -1155290 2102424 5362729 8148342 10001283
8761 10001283 10587178 9780745 7706716 4712646 1275192 -2120782 -5077535 -7326191
8753 -7326191 -8720919 -9205531 -8771486 -7427514 -5199029 -2156535 1552221 5695276 9984567
8744 9984567 14130730 17910250 21226397 24138147 26836707 29575197 32582663 35993605
8736 35993605 39803914 43852203 47834190 51365806 54092120 55801210 56483521 56304637
8728 56304637 55512718 54334351 52903136 51236897 49261701 46873816 44018560 40751552
8720 40751552 37254070 33802013 30711871 28285477 26757277 26239380 26673166 27817725
$$ packed form
8777A2263355m264114m036096l646347l121066k485803j765007r90353j93138
8769h238569O11517J418456K196717K856589L257714L260305K785613J852941
8761A0001283N85895q06433k074029k994070l437454l395974k956753k248656
8753g326191j394728m84612M34045J343972K228485L042494L708756M143055M289291
8744I984567M146163L779520L316147K911750K698560K738490L007466L410942
8736C5993605L810309M048289L981987L531616K726314J709090O82311j78884
8728E6304637p91919j178367j431215j666239j975196k387885k855256l267008
8720D0751552l497482l452057l090142k426394j528200n17897M33786J144559
$$ plain form
8712 27817725 29306905 30772297 31977295 32884454 33616763 34348154 35203657 36225979 37402146
8703 37402146 38703653 40104017 41570876 43046466 44425320 45535751 46143237 45998121
8695 45998121 44924461 42906589 40117872 36870261 33512264 30324926 27455655 24912180
8687 24912180 22622479 20538201 18724288 17372499 16724137 16954080 18094323 20039882
8679 20039882 22620550 25687758 29171107 33086419 37504722 42505316 48129069 54329709
8671 54329709 60917754 67519503 73602368 78596655 82069459 83848504 84022007 82836136
8663 82836136 80580742 77534817 73969974 70163645 66388317 62884328 59842429 57407277
8655 57407277 55689923 54772663 54703249 55487062 57082192 59394133 62269450 65496983 68823098
$$ packed form
8712B7817725J489180J465392J204998R07159P32309P31391Q55503J022322J176167
8703C7402146J301507J400364J466859J475590J378854J110431O07486j45116
8695D5998121j073660k017872k788717l247611l357997l187338k869271k543475
8687B4912180k289701k084278j813913j351789o48362K29943J140243J945559
8679B0039882K580668L067208L483349L915312M418303N000594N623753O200640
8671E4329709O588045O601749O082865M994287L472804J779045J73503j185871
8663H2836136k255394l045925l564843l806329l775328l503989l041899k435152
8655E7407277j717354r17260o9414P83813J595130K311941K875317L227533L326115
$$ plain form
8646 68823098 71975296 74686564 76725339 77939039 78299514 77921615 77039955 75959812 75007511
8637 75007511 74485663 74620719 75498078 77002175 78793176 80349642 81087171 80525503 78435592
8628 78435592 74889343 70181547 64670829 58635288 52221542 45500291 38576994 31680456
8620 31680456 25170813 19457491 14874104 11588562 9603786 8836443 9205077 10668344
8612 10668344 13213415 16834389 21521806 27244711 33904629 41279772 49008724 56648265
8604 56648265 63790150 70176413 75747507 80599746 84887097 88729287 92166299 95161480
8596 95161480 97638892 99539682 100873181 101729039 102235371 102487892 102495246 102169128 101361505
8587 101361505 99936739 97853592 95215593 92253320 89242761 86407039 83852360 81556981
$$ packed form
8646F8823098L152198K711268K038775J213700L60475l77899q81660j080143r52301
8637G5007511n21848J35056Q77359J504097J791001J556466P37529n61668k089911
8628G8435592l546249m707796n510718o035541o413746o721251o923297o896538
8620C1680456o509643n713322m583387l285542j984776p67343L68634J463267
8612A0668344K545071L620974M687417N722905O659918P375143P728952P639541
8604E6648265P141885O386263N571094M852239M287351L842190L437012K995181
8596I5161480K477412J900790J333499Q55858N06332K52521P354l26118q07623
8587A01361505j424766k083147k637999k962273l010559k835722k554679k295379
$$ plain form
8579 81556981 79401395 77216487 74824634 72054409 68731929 64680954 59766982 53984713
8571 53984713 47543021 40887837 34631078 29399834 25657626 23563364 22919131 23221632
8563 23221632 23794090 23956578 23193266 21277285 18311966 14661218 10786854 7062688 3648640
8554 3648640 468929 -2718712 -6210110 -10247208 -14947861 -20279189 -26059466 -31973066
8546 -31973066 -37603198 -42498831 -46271254 -48681899 -49677621 -49361296 -47922342 -45564137
8538 -45564137 -42454418 -38706400 -34384266 -29522603 -24154051 -18341923 -12208764 -5948590
8530 -5948590 180574 5879306 10846504 14841851 17754163 19630965 20638163 20972346
8522 20972346 20783222 20142348 19050139 17457227 15290445 12485580 9024455 4963607
$$ packed form
8579H1556981k155586k184908k391853k770225l322480m050975m913972n782269
8571E3984713o441692o655184o256759n231244l742208k094262o44233L02501
8563B3221632N72458J62488p63312j915981k965319l650748l874364l724166l414048
8554C648640l179711l187641l491398m037098m700653n331328n780277n913600
8546c1973066n630132m895633l772423k410645r95722L16325J438954K358205
8538d5564137L109719L748018M322134M861663N368552N812128O133159O260174
8530e948590O129164N698732M967198L995347K912312J876802J007198L34183
8522B0972346j89124o40874j092209j592912k166782k804865l461125m060848
$$ plain form
8514 4963607 435067 -4396807 -9414657 -14618363 -20127585 -26096052 -32579872 -39432858
8506 -39432858 -46279174 -52567479 -57679214 -61056353 -62319408 -61352551 -58335952 -53712776
8498 -53712776 -48097966 -42159972 -36512561 -31634873 -27818115 -25139601 -23477254 -22572329
8490 -22572329 -22123167 -21872774 -21653990 -21375746 -20966177 -20321297 -19312000 -17855433 -15989122
8481 -15989122 -13866073 -11648607 -9367762 -6850195 -3764556 247012 5435149 11870991
8473 11870991 19444386 27903011 36900024 46033517 54875471 62999300 70021821 75665371
8465 75665371 79819987 82571814 84182047 85027669 85517317 85983012 86561121 87114069 87254372
8456 87254372 86479965 84353992 80634439 75301845 68503742 60475137 51483945 41810739
$$ packed form
8514D963607m528540m831874n017850n203706n509222n968467o483820o852986
8506c9432858o846316o288305n111735l377139j263055R66857L016599M623176
8498e3712776N614810N937994N647411M877688L816758K678514J662347R04925
8490b2572329M49162K50393K18784K78244M09569O44880J009297J456567J866311
8481a5989122K123049K217466K280845K517567L085639M011568N188137O435842
8473A1870991P573395Q458625Q997013R133493Q841954Q123829P022521N643550
8465G5665371M154616K751827J610233Q45622M89648M65695N78109N52948J40303
8456H7254372p74407k125973l719553n332594o798103q028605q991192r673206
$$ plain form
8448 41810739 31743940 21577611 11621890 2236742 -6132543 -12966084 -17752543 -20111635
8440 -20111635 -19883266 -17129125 -12051136 -4881482 4189786 15010582 27393972 41026409
8432 41026409 55417682 69923891 83827331 96430813 107136175 115504735 121305616
8425 121305616 124539460 125408735 124222362 121268676 116728472 110688438 103252012 94675798
8417 94675798 85442731 76230289 67796202 60831383 55818127 52920046 51937332 52360147
8409 52360147 53516945 54761858 55622013 55852380 55399139 54314607 52677431 50554795 48014619
8400 48014619 45170142 42224745 39483526 37311694 36045867 35890881 36844694 38682493
8392 38682493 41007735 43354028 45304285 46589528 47143192 47105944 46784171 46566524 46817289
$$ packed form
8448D1810739j0066799j0166329r955721r385148q369285o833541m786459k359092
8440b0111635K28369K754141N077989P169654R071268J0820796J2383390J3632437
8432D1026409J4391273J4506209J3903440J2603482J0705362Q368560N800881
8425A21305616L233844Q69275j186373k953686m540204o040034p436426q576214
8417I4675798r233067r212442q434087o964819n013256k898081r82714M22815
8409E2360147J156798J244913Q60155K30367m53241j084532j637176k122636k540176
8400D8014619k844477k945397k741219k171832j265827j54986R53813J837799
8392C8682493K325242K346293J950257J285243N53664l7248l21773k17647K50765
$$ plain form
8383 46817289 47788429 49588653 52205122 55534754 59395101 63532355 67663443 71554313
8375 71554313 75088980 78277452 81193171 83884484 86324421 88429906 90120799 91357340
8367 91357340 92124808 92393913 92108997 91222531 89747280 87783778 85500386 83070214 80591861
8358 80591861 78036710 75261223 72088870 68422177 64324866 60029354 55861028 52108321
8350 52108321 48894092 46107025 43424589 40414077 36663289 31886895 25975533 18986807
8342 18986807 11104895 2606125 -6146058 -14686621 -22455735 -28867632 -33440037 -35924128
8334 -35924128 -36352943 -34973096 -32108602 -28051089 -23035070 -17278676 -11026702 -4555924
8326 -4555924 1846740 7901319 13335602 17886702 21322263 23476637 24278042 23750061 21995024
$$ packed form
8383D6817289R71140J800224K616469L329632L860347M137254M131088L890870
8375G1554313L534667L188472K915719K691313K439937K105485J690893J236541
8367I1357340P67468K69105k84916q86466j475251j963502k283392k430172k478353
8358H0591861k555151k775487l172353l666693m097311m295512m168326l752707
8350E2108321l214229k787067k682436l010512l750788m776394n911362o988726
8342A8986807p881912q498770q752183q540563p769114o411897m572405k484091
8334c5924128m28815J379847K864494M057513N016019N756394O251974O470778
8326d555924O402664O054579N434283M551100L435561K154374Q01405n27981j755037
$$ plain form
8317 21995024 19178309 15519274 11276061 6712906 2057654 -2530026 -6964879 -11214812
8309 -11214812 -15258198 -19031908 -22392174 -25114389 -26941441 -27658549 -27151784 -25418190
8301 -25418190 -22530622 -18591262 -13709472 -8013457 -1677255 5059985 11888362 18428820
8293 18428820 24244475 28878086 31923411 33108269 32348997 29753470 25587095 20237070
8285 20237070 14197289 8063156 2499998 -1845646 -4480338 -5180029 -4012321 -1242032
8277 -1242032 2821141 7937316 13957176 20764989 28201806 36017915 43871240 51361284
8269 51361284 58075023 63621623 67647137 69840409 69951300 67834754 63516126 57255014
8261 57255014 49572449 41207535 32993381 25683568 19793715 15521021 12766397 11235839
$$ packed form
8317B1995024k816715l659035m243213m563155m655252m587680m434853m249933
8309a1214812m043386l773710l360266k722215j827052p17108N06765J733594
8301b5418190K887568L939360M881790N696015O336202O737240O828377O540458
8293A8428820N815655M633611L045325J184858p59272k595527m166375n350025
8285B0237070o039781o134133n563158m345644k634692o99691J167708K770289
8277a242032M063173N116175O019860O807813P436817P816109P853325P490044
8269E1361284O713739N546600M025514K193272J10891k116546m318628o261112
8261E7255014p682565q364914q214154p309813n889853m272694k754624j530558
$$ plain form
8253 11235839 10571121 10464510 10732220 11336019 12348343 13867442 15913954 18363556 20964943
8244 20964943 23449246 25679123 27752771 29996011 32837308 36627235 41491462 47278993
8236 47278993 53610985 59992657 65942747 71108206 75342117 78724122 81509286 84015707
8228 84015707 86493431 89030620 91531213 93756813 95398705 96151410 95780082 94180950
8220 94180950 91419660 87719599 83386674 78697865 73815992 68784716 63601886 58310571
8212 58310571 53042239 48001047 43433444 39624046 36906736 35644038 36148806 38574809
8204 38574809 42833502 48581688 55287629 62348378 69211968 75458760 80817492 85126454
8196 85126454 88280338 90208243 90902211 90475614 89205124 87515476 85895596 84769421
$$ packed form
8253A1235839o64718j06611K67710O03799J012324J519099K046512K449602K601387
8244B0964943K484303K229877K073648K243240K841297L789927M864227N787531
8236D7278993O331992O381672N950090N165459M233911L382005K785164K506421
8228H4015707K477724K537189K500593K225600J641892P52705l71328j599132
8220I4180950k761290l700061m332925m688809m881873n031276n182830n291315
8212E8310571n268332n041192m567603l809398k717310j262698N04768K426003
8204C8574809M258693N748186O705941P060749O863590O246792N358732M308962
8196H5126454L153884J927905O93968m26597j270490j689648j619880j126175
$$ plain form
8188 84769421 84370675 84678089 85445241 86310270 86926970 87057698 86609159 85630217 84291988
8179 84291988 82850202 81586186 80741786 80474625 80844171 81815569 83266808 85004087 86800379
8170 86800379 88454293 89838044 90900101 91621551 91965891 91867469 91265793 90148886 88562966
8161 88562966 86580980 84259375 81614568 78622762 75224955 71326704 66806004 61549493
8153 61549493 55514529 48785074 41585789 34245320 27126625 20543608 14671460 9464287
8145 9464287 4619476 -364704 -6031839 -12765422 -20626768 -29296081 -38135576 -46353316
8137 -46353316 -53210475 -58186956 -61032061 -61695876 -60218497 -56673119 -51196530 -44058734
8129 -44058734 -35694770 -26657164 -17505078 -8685132 -463054 7063914 13890377 20012132
$$ packed form
8188H4769421l98746L07414P67152Q65029O16700J30728m48539r78942j338229
8179H4291988j441786j264016q44400k67161L69546R71398J451239J737279J796292
8170H6800379J653914J383751J062057P21450L44340r8422o01676j116907j585920
8161H8562966j981986k321605k644807k991806l397807l898251m520700n256511
8153F1549493o034964o729455p199285p340469p118695o583017n872148n207173
8145I464287m844811m984180n667135o733583p861346q669313q839495q217740
8137d6353316o857159m976481k845105o63815J477379L545378N476589P137796
8129d4058734Q363964R037606R152086Q819946Q222078P526968O826463O121755
$$ plain form
8121 20012132 25370523 29853436 33346231 35807146 37328000 38138363 38536197 38775551 38975632
8112 38975632 39103819 39036485 38655108 37921438 36895906 35699711 34451585 33219950 32016843
8103 32016843 30831373 29674826 28601588 27685082 26959020 26361805 25723125 24801845 23348198
8094 23348198 21156874 18106274 14205159 9652112 4869527 459634 -2925476 -4747274
8086 -4747274 -4711602 -2838105 527716 4761552 9081891 12739159 15214842 16345920 16317954
8077 16317954 15534720 14429265 13298257 12215961 11041189 9499991 7315363 4346637
8069 4346637 689875 -3303215 -7095070 -10088809 -11768739 -11823704 -10227863 -7251130 -3386000
8060 -3386000 787216 4748236 8151965 10883648 13043800 14873064 16654880 18647217
$$ packed form
8121B0012132N358391M482913L492795K460915J520854Q10363L97834K39354K00081
8112C8975632J28187o7334l81377p33670j025532j196195j248126j231635j203107
8103C2016843j185470j156547j073238r16506p26062n97215o38680r21280j453647
8094B3348198k191324l050600l901115m553047m782585m409893l385110j821798
8086d747274L5672J873497L365821M233836M320339L657268K475683J131078k7966
8077A6317954p83234j105455j131008j082296j174772j541198k184628k968726
8069D346637l656762l993090l791855k993739j679930n4965J595841K976733L865130
8060c386000M173216L961020L403729K731683K160152J829264J781816J992337
$$ plain form
8052 18647217 21070050 24125687 27998866 32803202 38495290 44819497 51336016 57529269
8044 57529269 62942634 67281246 70458119 72587450 73932298 74812700 75496027 76111957 76632401
8035 76632401 76925670 76855147 76372298 75563866 74641706 73885820 73556671 73798962 74578057 75695189
8025 75695189 76885562 77938926 78764505 79373906 79818014 80125758 80266534 80140685 79600485
8016 79600485 78494230 76713758 74235455 71164092 67778547 64542289 62033898 60800925
8008 60800925 61201463 63313115 66948717 71756475 77338090 83318660 89349992 95087735
8000 95087735 100196027 104389007 107470723 109338515 109956127 109326696 107482421 104487213
7992 104487213 100445988 95519736 89942723 84031740 78177795 72815798 68371678 65191995
$$ packed form
8052A8647217K422833L055637L873179M804336N692088O324207O516519O193253
8044E7529269N413365M338612L176873K129331J344848Q80402O83327O15930N20444
8035G6632401K93269p0523m82849q08432r22160p55886l29149K42291P79095J117132
8025G5695189J190373J053364Q25579O09401M44108L07744J40776j25849n40200
8016G9600485j106255j780472k478303l071363l385545l236258k508391j232973
8008F0800925M00538K111652L635602M807758N581615N980570O031332N737743
8000I5087735N108292M192980L081716J867792O17612o29431j844275k995208
7992A04487213m041225m926252n577013n910983n853945n361997m444120l179683
$$ plain form
7984 65191995 63471570 63202642 64165721 65968527 68122501 70132442 71571157 72122914 71599935
7975 71599935 69947094 67243496 63697701 59629084 55429688 51503707 48191254 45701000
7967 45701000 44084459 43264990 43101091 43450333 44216127 45377442 46999411 49213279 52160939
7958 52160939 55920591 60443220 65522120 70799577 75803070 80004410 82900680 84110588
7950 84110588 83462334 81039912 77172364 72378829 67286342 62518864 58559095 55626329
7942 55626329 53641540 52309625 51267883 50214827 48973648 47501035 45865450 44202568
7934 44202568 42654355 41315942 40218206 39349531 38690219 38224944 37918812 37675838 37319068
7925 37319068 36620136 35371827 33470750 30975182 28114116 25236283 22711054 20825190
$$ packed form
7984F5191995j720425k68928R63079J802806K153974K009941J438715N51757n22979
7975G1599935j652841k703598l545795m068617m199396l925981l312453k490254
7967D5701000j616541q19469j63899L49242P65794J161315J621969K213868K947660
7958E2160939L759652M522629N078900N277457N003493M201340K896270J209908
7950H4110588o48254k422422l867548m793535n092487m767478l959769k932766
7942E5626329j984789j331915j041742j053056j241179j472613j635585j662882
7934D4202568j548213j338413j097736q68675o59312m65275l06132k42974l56770
7925C7319068o98932j248309j901077k495568k861066k877833k525229j885864
$$ plain form
7917 20825190 19727806 19438286 19882544 20917516 22343197 23929983 25471713 26840627
7909 26840627 28013577 29060171 30102732 31261481 32598019 34073853 35538945 36750660
7901 36750660 37407142 37180417 35755919 32901838 28574701 23021196 16805230 10714984
7893 10714984 5574601 2041736 472663 891373 3048059 6523064 10828638 15476248
7885 15476248 20002001 23965506 26949949 28590476 28640904 27055575 24033696 19980381
7877 19980381 15387789 10690788 6158629 1850232 -2370826 -6771077 -11639593 -17159238
7869 -17159238 -23295931 -29746897 -35973229 -41318149 -45179013 -47164069 -47158850 -45280940 -41781957
7860 -41781957 -36982799 -31271636 -25117875 -19042639 -13539507 -8987118 -5589882 -3350093
$$ packed form
7917B0825190j097384k89520M44258J034972J425681J586786J541730J368914
7909B6840627J172950J046594J042561J158749J336538J475834J465092J211715
7901C6750660O56482k26725j424498k854081m327137n553505o215966o090246
7893A0714984n140383l532865j569073M18710K156686L475005M305574M647610
7885A5476248M525753L963505K984443J640527N0428j585329l021879m053315
7877A9980381m592592m697001m532159m308397m221058m400251m868516n519645
7869a7159238o136693o450966o226332n344920l860864j985056N219J877910L498983
7860d1781957M799158N711163O153761O075236N503132M552389L397236K239789
$$ plain form
7852 -3350093 -2062876 -1340756 -685938 386152 2199728 4800593 7920505 11048333 13586073
7843 13586073 15030302 15112115 13851319 11517938 8528578 5322880 2258275 -460997
7835 -460997 -2817020 -4960804 -7125253 -9478316 -11979964 -14329821 -16047079 -16641461 -15784078
7826 -15784078 -13405415 -9703292 -5082480 -52293 4897242 9412918 13350530 16771166
7818 16771166 19865853 22852561 25904625 29145048 32689191 36676948 41244115 46441356
7810 46441356 52165634 58165252 64119224 69738303 74836924 79362559 83390342 87086060
7802 87086060 90641827 94210689 97878887 101688548 105678587 109894199 114342371 118914575
7794 118914575 123322542 127089408 129616347 130313252 128750582 124775821 118556579 110551036
$$ packed form
7852c350093J287217P22120O54818J072090J813576K600865L119912L127828K537740
7843A3586073J444229Q1813j260796k333381k989360l205698l064605k719272
7835d60997k356023k143784k164449k353063k501648k349857j717258n94382Q57383
7826a5784078K378663L702123M620812N030187M949535M515676L937612L420636
7818A6771166L094687K986708L052064L240423L544143L987757M567167N197241
7810D6441356N724278N999618N953972N619079N098621M525635M027783L695718
7802H7086060L555767L568862L668198L809661L990039M215612M448172M572204
7794A18914575M407967L766866K526939O96905j562670l974761o219242q005543
$$ plain form
7786 110551036 101433190 91997815 83054158 75312163 69273010 65143787 62798624 61807138
7778 61807138 61538701 61321236 60602652 59061579 56645281 53545064 50128254 46841237 44100947
7769 44100947 42200056 41247735 41154111 41657762 42395336 43007613 43258866 43125453 42803885
7760 42803885 42613115 42819825 43470188 44321639 44913504 44732199 43378367 40660080 36591908
7751 36591908 31328070 25074165 18012197 10256297 1844537 -7234926 -16994117 -27391688
7743 -27391688 -38294274 -49459620 -60539863 -71104977 -80685102 -88818562 -95088510 -99150737
7735 -99150737 -100774529 -99902491 -96696877 -91530984 -84921176 -77433873 -69601704 -61860795
7727 -61860795 -54514314 -47733183 -41593810 -36125105 -31327345 -27152245 -23473447 -20092799
$$ packed form
7786A10551036r117846r435375q943657p741995o039153m129223k345163r91486
7778F1807138k68437k17465p18584j541073k416298l100217l416810l287017k740290
7769D4100947j900891r52321r3624N03651P37574O12277K51253j33413l21568
7760D2803885j90770K06710O50363Q51451N91865j81305j353832k718287m068172
7751C6591908n263838o253905p061968p755900q411760r079463r759191j0397571
7743b7391688j0902586j1165346j1080243j0565114r580125q133460o269948m062227
7735i9150737j623792Q72038L205614N165893O609808P487303P832169P740909
7727f1860795P346481O781131O139373N468705M797760M175100L678798L380648
$$ plain form
7719 -20092799 -16804946 -13495240 -10209484 -7144540 -4565707 -2708635 -1718053 -1624943 -2333293
7710 -2333293 -3609915 -5104323 -6417011 -7193571 -7202764 -6378409 -4832917 -2851249 -857686
7701 -857686 657743 1252407 659591 -1113644 -3771898 -6826421 -9769309 -12248489 -14167755
7692 -14167755 -15685186 -17132493 -18893435 -21272733 -24384884 -28097768 -32059220 -35805893
7684 -35805893 -38915853 -41142035 -42468571 -43068144 -43190678 -43051194 -42778726 -42439532 -42093407
7675 -42093407 -41826583 -41739128 -41912356 -42394253 -43208586 -44356560 -45784107 -47332336 -48725343
7666 -48725343 -49634892 -49802451 -49148156 -47800780 -46039687 -44197382 -42580618 -41431294 -40910985
7657 -40910985 -41088084 -41923992 -43268325 -44876259 -46458439 -47758106 -48620682 -49008369 -48947311
$$ packed form
7719b0092799L287853L309706L285756L064944K578833J857072R90582R3110p08350
7710b333293j276622j494408j312688p76560r193Q24355J545492J981668J993563
7701h57686J515429N94664n92816j773235k658254l054523k942888k479180j919266
7692a4167755j517431j447307j760942k379298l112151l712884l961452l746673
7684c5805893l109960k226182j326536n99573j22534J39484K72468L39194L46125
7675d2093407K66824Q7455j73228m81897q14333j147974j427547j548229j393007
7666d8725343r09549j67559O54295J347376J761093J842305J616764J149324N20309
7657d0910985j77099q35908j344333j607934j582180j299667q62576l87687O1058
$$ plain form
7648 -48947311 -48453529 -47502983 -46066811 -44171808 -41926697 -39485882 -36973162 -34423654
7640 -34423654 -31796842 -29060907 -26284672 -23659955 -21431680 -19781777 -18734510 -18124815
7632 -18124815 -17636532 -16893472 -15569857 -13482848 -10644638 -7268816 -3729064 -472877
7624 -472877 2082912 3627191 3970632 3018513 740829 -2831884 -7582560 -13265924 -19482829
7615 -19482829 -25705557 -31358708 -35917573 -38980703 -40308351 -39840073 -37688468 -34094790
7607 -34094790 -29360257 -23797933 -17733406 -11532826 -5610491 -385961 3802451 6790795
7599 6790795 8639742 9607684 10053983 10318858 10632321 11080440 11627579 12169664 12579348
7590 12579348 12713824 12395199 11408879 9555912 6746282 3079751 -1137589 -5456932 -9401586
$$ packed form
7648d8947311M93782R50546J436172J895003K245111K440815K512720K549508
7640c4423654K626812K735935K776235K624717K228275J649903J047267O09695
7632a8124815M88283P43060J323615K087009K838210L375822L539752L256187
7624d72877K555789J544279L43441r52119k277684l572713m750676n683364o216905
7615a9482829o222728n653151m558865l063130j327648M68278K151605L593678
7607c4094790M734533N562324O064527O200580N922335N224530M188412K988344
7599F790795J848947R67942M46299K64875L13463M48119N47139N42085M09684
7590A2579348J34476l18625r86320j852967k809630l666531m217340m319343l944654
$$ plain form
7581 -9401586 -12576101 -14723700 -15733630 -15639779 -14638172 -13100682 -11540659 -10521734 -10548044
7572 -10548044 -11978269 -14973685 -19469837 -25173895 -31608973 -38217545 -44495757 -50093776
7564 -50093776 -54826512 -58601321 -61336763 -62954412 -63460305 -63050678 -62149001 -61324500 -61115726
7555 -61115726 -61837104 -63458318 -65615861 -67755046 -69336183 -70008134 -69680139 -68490080 -66720477
7546 -66720477 -64711985 -62784352 -61153122 -59854511 -58724076 -57462123 -55760866 -53422717
7538 -53422717 -50409872 -46816216 -42796192 -38496782 -34024338 -29451859 -24847402 -20294974
7530 -20294974 -15891584 -11723602 -7833603 -4187702 -657686 2961626 6893070 11303326
7522 11303326 16260802 21745302 27681588 33952589 40381743 46717285 52655820 57907153
$$ packed form
7581i401586l174515k147599j009930R3851J001607J537490J560023J018925k6310
7572a0548044j430225k995416m496152n704058o435078o608572o278212n598019
7564e0093776m732736l774809k735442j617649n05893M09627R01677Q24501K08774
7555f1115726p21378j621214k157543k139185j581137o71951L27995J190059J769603
7546f6720477K008492J927633J631230J298611J130435J261953J701257K338149
7538e3422717L012845L593656M020024M299410M472444M572479M604457M552428
7530b0294974M403390M167982L889999L645901L530016L619312L931444M410256
7522A1303326M957476N484500N936286O271001O429154O335542N938535N251333
$$ plain form
7514 57907153 62267367 65662526 68145182 69848322 70916643 71444103 71448035 70897097 69782777
7505 69782777 68195012 66352322 64558648 63102834 62150771 61678273 61461598 61114695 60157869
7496 60157869 58109758 54592425 49428155 42702000 34771802 26219525 17750230 10061911
7488 10061911 3725855 -883665 -3596972 -4412423 -3446809 -891236 3027037 8079454
7480 8079454 14059277 20777751 28029425 35545205 42964759 49850883 55745344 60247235
$$ packed form
7514E7907153M360214L395159K482656J703140J068321N27460L932n50938j114320
7505F9782777j587765j842690j793674j455814r52063m72498k16675l46903r56826
7496F0157869k048111l517333n164270o726155p930198q552277q469295p688319
7488A0061911o336056m609520k713307q15451R65614K555573L918273N052417
7480H079454N979823O718474P251674P515780P419554O886124N894461M501891
$$ [...]
##END NTUPLES=NMR SPECTRUM
##END=
