##TITLE=31Pdec_DE-56k_TFA_2
 CDCl3, 64 sc
 25.6.2024
##JCAMPDX= 6.0         $$ Bruker NMR JCAMP-DX V2.0
##DATA TYPE= NMR SPECTRUM
##DATA CLASS= NTUPLES
##ORIGIN= UXNMR, Bruker Analytische Messtechnik GmbH
##OWNER= root
$$ XWIN-NMR		Version 3.5
$$ Tue Jun 25 16:18:57 2024 Russian Standard Time (UT+4h)  she@DPX200
##.OBSERVE FREQUENCY= 81.013821
##.OBSERVE NUCLEUS= ^31P
##.ACQUISITION MODE= SIMULTANEOUS
##.ACQUISITION SCHEME= undefined
##.AVERAGES= 64
##.DIGITISER RES= 17
##SPECTROMETER/DATA SYSTEM= spect
##.PULSE SEQUENCE= zgpg30
##.SOLVENT NAME= DMSO
##.SHIFT REFERENCE= (INTERNAL, DMSO, 0, 182.463)
##AUDIT TRAIL= $$ (NUMBER, WHEN, WHO, WHERE, WHAT)
$$ ##TITLE= Audit trail, XWIN-NMR		Version 3.5
$$ ##JCAMPDX= 5.01
$$ ##ORIGIN= Bruker BioSpin GmbH
$$ ##OWNER= she
$$ F:/spectra/data/she/nmr/P31/2/pdata/1/auditp.txt
$$ ##AUDIT TRAIL=  $$ (NUMBER, WHEN, WHO, WHERE, WHAT)
(   1,<2024-06-25 16:18:06.01 +0400>,<she>,<DPX200>,
      <continue with go, POWCHK disabled, PULCHK disabled
       configuration hash MD5:
       00 E9 B6 7A A2 85 ED C7 34 08 36 98 17 FE 4E 26
       data hash MD5: 32K
       9E 34 62 C1 93 46 B1 56 CF 00 80 2B 85 88 03 CD>)
(   2,<2024-06-25 16:18:09.73 +0400>,<she>,<DPX200>,
      <Start of raw data processing
       efp BC_mod = 2 LB = 1.5 FT_mod = 6 PKNL = 1 PHC0 = 2773.943 PHC1 = 203.8862 SI = 64K 
       data hash MD5: 64K
       1C 31 29 6C 5C 8F 80 63 9A 9E 20 A9 0C 7A 55 DF>)
(   3,<2024-06-25 16:18:25.12 +0400>,<she>,<DPX200>,
      <pk PHC0 = 63.31222 PHC1 = -144.6 
       data hash MD5: 64K
       7C 21 48 D2 29 BA FA 8C BE C4 84 85 0D C1 9F 89>)
(   4,<2024-06-25 16:18:28.18 +0400>,<she>,<DPX200>,
      <abs ABSG = 5 
       data hash MD5: 64K
       55 79 12 2B 55 AC 73 39 C3 EA 20 EC C8 43 86 81>)
$$ ##END=
$$ 
$$ hash MD5
$$ E1 D2 91 B6 C0 3C 29 32 47 9B 6E E8 30 EA 10 51
##$RELAX= 
##$RELAX= 
##$RELAX= 
##$RELAX= 
##$RELAX= 
##$RELAX= 
##$RELAX= 
##$RELAX= 
$$ Bruker specific parameters
$$ --------------------------
##$DU= <F:/spectra>
##$EXPNO= 2
##$NAME= <P31>
##$PROCNO= 1
##$TYPE= <nmr>
##$USER= <she>
##$AMP= (0..31)
100 100 100 100 100 100 100 100 100 100 100 100 100 100 100 100 100 100 
100 100 100 100 100 100 100 100 100 100 100 100 100 100 
##$AQSEQ= 0
##$AQ_mod= 1
##$AUNM= <au_zg>
##$AUTOPOS= <>
##$BF1= 81.014009
##$BF2= 200.13
##$BF3= 200.13
##$BF4= 200.13
##$BF5= 200.13
##$BF6= 200.13
##$BF7= 200.13
##$BF8= 200.13
##$BYTORDA= 1
##$CFDGTYP= 0
##$CFRGTYP= 5
##$CHEMSTR= <none>
##$CNST= (0..31)
1 1 145 1 1 1 1 1 1 1 1 1 1 1 1 1 1 1 1 1 1 1 1 1 1 1 1 1 1 1 1 1 
##$CPDPRG= <waltz16>
##$CPDPRG1= <>
##$CPDPRG2= <waltz16>
##$CPDPRG3= <>
##$CPDPRG4= <mlev>
##$CPDPRG5= <mlev>
##$CPDPRG6= <mlev>
##$CPDPRG7= <mlev>
##$CPDPRG8= <mlev>
##$CPDPRGB= <>
##$CPDPRGT= <>
##$D= (0..31)
0 1 0 0 0 0 0 0 0 0 0 0.03 2e-05 3e-06 0 0 0 0 0 0 0 0 0 0 0 0 0 0 0 0 
0 0 
##$DATE= 1719317801
##$DBL= (0..7)
120 120 120 11 120 120 24 19 
##$DBP= (0..7)
150 150 150 150 150 150 150 150 
##$DBP07= 0
##$DBPNAM0= <>
##$DBPNAM1= <>
$$ [...]
##$SUBNAM3= <"">
##$SUBNAM4= <"">
##$SUBNAM5= <"">
##$SUBNAM6= <"">
##$SUBNAM7= <"">
##$SUBNAM8= <"">
##$SUBNAM9= <"">
##$SW= 369.568048894756
##$SWIBOX= (0..15)
0 1 3 0 0 0 0 0 0 0 0 0 0 0 0 0 
##$SW_h= 29940.119760479
##$TD= 32768
##$TD0= 1
##$TE= 0
##$TE2= 300
##$TE3= 300
##$TEG= 300
##$TL= (0..7)
0 120 53 12 22 120 120 120 
##$TP= (0..7)
150 150 150 150 150 150 150 150 
##$TP07= 0
##$TPNAME0= <>
##$TPNAME1= <>
##$TPNAME2= <>
##$TPNAME3= <>
##$TPNAME4= <>
##$TPNAME5= <>
##$TPNAME6= <>
##$TPNAME7= <>
##$TPOAL= (0..7)
0.5 0.5 0.5 0.5 0.5 0.5 0.5 0.5 
##$TPOFFS= (0..7)
0 0 0 0 0 0 0 0 
##$TUNHIN= 0
##$TUNHOUT= 0
##$TUNXOUT= 0
##$USERA1= <user>
##$USERA2= <user>
##$USERA3= <user>
##$USERA4= <user>
##$USERA5= <user>
##$V9= 5
##$VALIST= <valist>
##$VCLIST= <CCCCCCCCCCCCCCC>
##$VD= 0
##$VDLIST= <DDDDDDDDDDDDDDD>
##$VPLIST= <PPPPPPPPPPPPPPP>
##$VTLIST= <TTTTTTTTTTTTTTT>
##$WBST= 1024
##$WBSW= 4
##$XGAIN= (0..3)
0 0 0 0 
##$XL= 0
##$YL= 0
##$YMAX_a= 3039
##$YMIN_a= -13266
##$ZGOPTNS= <>
##$ZL1= 120
##$ZL2= 120
##$ZL3= 120
##$ZL4= 120
##$ABSF1= 182.463
##$ABSF2= -187.1042
##$ABSG= 5
##$ABSL= 3
##$ALPHA= 0
##$AQORDER= 0
##$ASSFAC= 0
##$ASSFACI= 0
##$ASSFACX= 0
##$ASSWID= 0
##$AUNMP= <proc_1d>
##$AZFE= 0.1
##$AZFW= 0.5
##$BCFW= 0
##$BC_mod= 2
##$BYTORDP= 0
##$COROFFS= 0
##$CY= -3
##$DATMOD= 1
##$DC= 0
##$DFILT= <>
##$DTYPP= 0
##$F1P= 0
##$F2P= 0
##$FCOR= 1
##$FTSIZE= 65536
##$FT_mod= 6
##$GAMMA= 0
##$GB= 0
##$INTBC= 1
##$INTSCL= 9.790993e-09
##$ISEN= 30
##$LB= 1.5
##$LEV0= 0
##$LPBIN= 0
##$MAXI= 10000
##$MC2= 0
##$MEAN= 0
##$ME_mod= 0
##$MI= 50
##$NCOEF= 0
##$NC_proc= -10
##$NLEV= 6
##$NOISF1= 182.463
##$NOISF2= 159.3651
##$NSP= 0
##$NTH_PI= 0
##$NZP= 0
##$OFFSET= 182.463
##$PC= 4
##$PHC0= 2837.255
##$PHC1= 59.28619
##$PH_mod= 1
##$PKNL= yes
##$PPARMOD= 0
##$PSCAL= 0
##$PSIGN= 0
##$REVERSE= no
##$SF= 81.0140089999434
##$SI= 65536
##$SIGF1= 159.3651
##$SIGF2= -187.1042
##$SINO= 113.3802
##$SIOLD= 16384
##$SREGLST= <1H.CDCl3>
##$SSB= 0
##$STSI= 65536
##$STSR= 0
##$SW_p= 29940.119760479
##$SYMM= 0
##$S_DEV= 0
##$TDeff= 32768
##$TDoff= 0
##$TI= <>
##$TILT= no
##$TM1= 0
##$TM2= 0
##$TOPLEV= 0
##$USERP1= <user>
##$USERP2= <user>
##$USERP3= <user>
##$USERP4= <user>
##$USERP5= <user>
##$WDW= 1
##$XDIM= 65536
##$YMAX_p= 401485543
##$YMIN_p= -91748578
$$ End of Bruker specific parameters
$$ ---------------------------------
##NTUPLES= NMR SPECTRUM
##VAR_NAME=  FREQUENCY,     SPECTRUM/REAL,   SPECTRUM/IMAG
##SYMBOL=    X,             R,               I
##VAR_TYPE=  INDEPENDENT,   DEPENDENT,       DEPENDENT
##VAR_FORM=  AFFN,          ASDF,            ASDF
##VAR_DIM=   65536,         65536,           65536
##UNITS=     HZ,            ARBITRARY UNITS, ARBITRARY UNITS
##FACTOR=    0.456856943014862, 1,           1
##FIRST=     14782.0589164792, 0,            0
##LAST=      -15158.0608439998, 0,           0
##MIN=       -15158.0608439998, -91748578,   0
##MAX=       14782.0589164792, 401485543,    0
$$ Real data points
##PAGE= N=1
##DATA TABLE= (X++(R..R)), XYDATA
$$ [...]
4121c0456679j2237333j092107O447265J0917202J5445671J5566274P694534j349968
4113A0934859l383632m57152Q13140k22536p64172r91267j178298J044577M458123
4104A0253642K558453n628547j0671866n404234M983268J1884679J3886816J1551565
4096C3413776J551924j4432017k4126393j9377560r039213n583487o089456K62983
4088d3419443J1946751J7458232J4436969J1015903R373255L570590m929300n121006
4080A4331951N297839J2731040O040447p650590j3406204p931630p10388M03442
4072I105907k598960l624616j405804k38788k500989l392521K731161J1301273
4064I376663J0037602l919656j6781764j4741543j681815P954948Q525170N587421
$$ plain form
4121 -30456679 -42694012 -43786119 -37338854 -26421652 -10975981 4590293 12284827 10934859
4113 10934859 7551227 7094075 7907215 7684679 6920507 5929240 4750942 5795519 10253642
4104 10253642 12812095 7183548 -3488318 -8892552 -3909284 7975395 21862211 33413776
4096 33413776 34965700 20533683 -3592710 -22970270 -32009483 -37592970 -43682426 -43419443
4088 -43419443 -31472692 -14014460 422509 11438412 20811667 24382257 19452957 14331951
4080 14331951 19629790 32360830 38401277 30750687 17344483 9412853 8702465 9105907
4072 9105907 6506947 2882331 1476527 1237739 -1263250 -4655771 -1924610 9376663
4064 9376663 19414265 15494609 -1287155 -16028698 -17710513 -9755565 -1230395 4357026
4056D357026L366956J219383L72443K938886N195745K313541j665300L33151M554280
4047B2986111J603774n485888m000108N776080P501073n614052j7895034j3330423
4039h458467K239751J1864310J0166991M041610j225179m912555n292114j543511
4031F880836K079219J959175J278674L622624N178199R10365n629150o469574
4023I810368m44125O153702P591570K644828n713020j0410164n246019N842633
4015A0229773J0769219N278571r14437M6763J696740m343811j2652054j2749498
4007b638734o686198m588094p247596o666287j216576K825627L338510L626361
3999a9252987L152073m27104j393172P948295K1264809K2888819J0503516j330887
$$ plain form
4056 4357026 7723982 8943365 9315808 12254694 17450439 19763980 18098680 18431831 22986111
4047 22986111 24589885 19103997 15103889 20879969 28381042 22766990 4871956 -8458467
4039 -8458467 -6218716 5645594 15812585 19854195 18629016 13716461 8424347 6880836
4031 6880836 8960055 10919230 12197904 15820528 20998727 21909092 16279942 9810368
4023 9810368 9366243 15519945 23111515 25756343 20043323 9633159 4387140 10229773
4015 10229773 20998992 26277563 25363126 25409889 27106629 22762818 10110764 -2638734
4007 -2638734 -9324932 -13913026 -21160622 -27826909 -29043485 -26217858 -22879348 -19252987
3999 -19252987 -16100914 -16528018 -17921190 -9972895 11291914 34180733 44684249 43353362
3991D3353362l666737m185629r953090j4080790r116340j615364j812289p146627
3983h223504p324763P485Q741861J4709963J6951193J2480901k1135j2866300
3975B4455701j5070550o119676K936015L147591l070427p449589o051133j969969
3967i192037k86789k003322l016789M08448N863626P169628K662436k570102l766348
3958d731249j821291K9189O34455j1674j813019k293326K189838J0130227J4394467
3949A6707617J1261226N251151J597536o34782l494960m121317j53055L607693
3941C0021109J398298l916122n064967j855489n12870k712285l378759Q5827L679197
3932A7743939L405786k2327m479944q740325j0090363n590986J922365M621956
$$ plain form
3991 43353362 39686625 35500996 25547906 11467116 2350776 735412 -1076877 -8223504
3983 -8223504 -15548267 -15540782 -6798921 7911042 24862235 37343136 37322001 24455701
3975 24455701 9385151 3265475 6201490 9349081 6278654 -1170935 -7222068 -9192037
3967 -9192037 -9478826 -11482148 -14498937 -14090489 -8226863 -1057235 1605201 -964901 -4731249
3958 -4731249 -6552540 -6523351 -5888896 -5900570 -7713589 -10006915 -7817077 2313150 16707617
3949 16707617 27968843 33219994 34817530 34182748 30687788 26566471 26413416 30021109
3941 30021109 31419407 27503285 22438318 20582829 20069959 17357674 13978915 14064742 17743939
3932 17743939 21149725 21127398 16647454 7907129 -2183234 -7774220 -5851855 -1229899
3924a229899l09467o133593n645694o49608K154306J576080K553223P133801J0316430
3915I765579O823012j338289p059137o678918l365088j505250n89476K802289
3907a145278Q363296J1103853P810608J574271j842264m95292K121716P85682
3899B8276592o277277j4246461j4814190o024571K247533j105206j2110597j4543356
3891c8597533k262984J0918156J0691614K370811N66159N797482O024612j275830
3883e767513m783422P79883N791192K748040j333295J605106N988196K536527
3875G564714n404856p693523l955543j624811q93811M651530J2702287J1622863
3867A6968850j011707j1540577q725051N52942K908862j503416j644359N120795
$$ plain form
3924 -1229899 -1539366 -7672959 -13318653 -13968261 -11813955 -10237875 -7684652 -550851 9765579
3915 9765579 16588591 15250302 8191165 1512247 -1852841 -3358091 -3947567 -1145278
3907 -1145278 7218018 18321871 26132479 27706750 25864486 25369194 27490910 28276592
3899 28276592 21999315 7752854 -7061336 -13085907 -10838374 -11943580 -24054177 -38597533
3891 -38597533 -40860517 -29942361 -19250747 -16879936 -16313777 -10516295 -4491683 -5767513
3883 -5767513 -10550935 -9771052 -3979860 -1231820 -2565115 -960009 5028187 7564714
3875 7564714 2159858 -5533665 -9489208 -11114019 -12007830 -7356300 5345987 16968850
3867 16968850 15957143 4416566 -4308485 -3755543 -846681 -2350097 -3994456 1126339
3859A126339Q588573K294564o109356o855912k791491l475310q448758o911072
3851b2582423M686273J4585538J1176779l03429m976148J268038Q210159P849393
3843A9914180M325467L953999M541119J215587l800209n406040n292714q608283
3835A0843106j3280627j1844415l606655M072425P769587J1759906J6512216J3389124
3827C5614667j807296j7443965j8251329n528600M896003M208302r4787J144489
3819B737484M616708J739562o481635j0671768p080596j994733j312266k963781
3811b1411025k611425o88500J021963M870115J2555948J7645799J1442235k886659
3803A9938451j0498607l410519P932985Q275006j801797p520321j187750P416399
$$ plain form
3859 1126339 9714912 12009476 5900120 -955792 -3747283 -7222593 -15671351 -22582423
3851 -22582423 -17896150 -3310612 7866167 7562738 2586590 3854628 12064787 19914180
3843 19914180 24239647 28193646 32734765 33950352 30150143 24744103 19451389 10843106
3835 10843106 -2437521 -14281936 -17888591 -13816166 -6046579 5713327 22225543 35614667
3827 35614667 33807371 16363406 -1887923 -7416523 -2520520 1687782 1592995 2737484
3819 2737484 7354192 9093754 2612119 -8059649 -15140245 -17134978 -18447244 -21411025
3811 -21411025 -24022450 -24710950 -23688987 -18818872 -6262924 11382875 22825110 19938451
3803 19938451 9439844 6029325 13962310 22237316 20435519 12915198 11727448 19143847
3795A9143847N328579n852898j2809828q195847R84837L440061k563267q294496
3787h819012n655911M012401J2670846J4523724J0037209K575300n243847j1283302
3779A2817408j3737844j3365339j2887353j1895940o073028M729942J1551539
3772b8860615N865566p604019j4569990p940056N381983J4968425J7124370J2881983
3764b752353L450830p644370j3469793j0230960j903806N213061R061418J0050016
3756h225957P643728L094427J178035M219996P884974P238470L047845j949849
3748B4131669p539713j1617226q188293K345583P668363q61873j2337313r347249
3740a5746052N771110J2958421L703583p489575o079312K696445O105200M309830
$$ plain form
3795 19143847 24472426 18619528 5809700 -2386147 -1401310 2038751 -524516 -8819012
3787 -8819012 -14474923 -10462522 2208324 16732048 26769257 29344557 24100710 12817408
3779 12817408 -920436 -14285775 -27173128 -39069068 -45142096 -40412154 -28860615
3772 -28860615 -22995049 -30599068 -45169058 -53109114 -47727131 -32758706 -15634336 -2752353
3764 -2752353 698477 -6945893 -20415686 -30646646 -32550452 -27337391 -18275973 -8225957
3756 -8225957 -582229 2512198 3690233 7910229 15795203 23033673 26081518 24131669
3748 24131669 16591956 4974730 -3213563 -867980 6800383 5938510 -6398803 -15746052
3740 -15746052 -9974942 2983479 6687062 -802513 -6881825 -4185380 1919820 6229650
3732F229650O380551J2841939J4502242O607598n111318j2216283j1270351m753635
3724A3210393Q88664l47740p395743j1818590p701032Q87019N946938N719905
3716f10186M447830M998311O384818O498104L598228k574736q357577q292095
3708F092697k598497J763444O41308j852885j028150J367994K321651K856020
3700I563582K649574k744773j2002656j3975745l518507O779999L229404p586464
3692a7605586r066304r57943K268708k636028l134938N048876R063665J760157
3684a5259393m185312L258307J4535120J2145582l513786j5796219j4399485m036511
3676b7251697O928118J5278239J9845662J8033309Q420268n981015j7733647j8659985
$$ plain form
3732 6229650 12610201 25452140 39954382 46561980 41450662 29234379 17964028 13210393
3724 13210393 14099057 13751317 6355574 -5463016 -13164048 -12277029 -6330091 -610186
3716 -610186 3837644 8835955 15220773 21718877 25317105 22742369 14384792 6092697
3708 6092697 3494200 5257644 5898952 4046067 3017917 4385911 6707562 9563582
3700 9563582 12213156 9468383 -2534273 -16510018 -20028525 -13248526 -10019122 -17605586
3692 -17605586 -26671890 -27629833 -25361125 -27997153 -31132091 -26083215 -17019550 -15259393
3684 -15259393 -19444705 -16186398 -1651278 10494304 6980518 -8815701 -23215186 -27251697
3676 -27251697 -20323579 -5045340 14800322 32833631 41253899 35272884 17539237 -1120748
3668a120748p448178N671379P813119p24396o177669k7495R845345J1824013O373229
3659B6028599J671931k7813k571041o338566p283695l938487J128498N229406
3651A3898832O060368J384174o594234j0066503m493733M557721Q589350O371721
3643A9707696J968883k388700n271378l287234L042783N475897j451953j0309586
3635G486408j0168599k527685J779283j100469m773836m120463n04674L758687
3627a0171348P447820P879115M432967K752033O894230J0259152M617773m761453
3619B9350289n482083J995591M700892j848540p537329n557597k105738k898822
3611A0616663l330431O81688L556994k1814n531438o848105n662970n405656m266282
$$ plain form
3668 -1120748 -8568926 -2897547 4915572 4191176 -1986493 -2013988 7831357 19655370 26028599
3659 26028599 27700530 27672717 25101676 18763110 11479415 7540928 8669426 13898832
3651 13898832 19959200 21343374 14749140 4682637 188904 4746625 13335975 19707696
3643 19707696 21676579 19287879 14016501 10729267 13772050 19247947 17795994 7486408
3635 7486408 -2682191 -5209876 -3430593 -4531062 -9304898 -13425361 -13930035 -10171348
3627 -10171348 -2723528 5155587 9588554 12340587 19234817 29493969 34111742 29350289
3619 29350289 23868206 25863797 30564689 28716149 21178820 15621223 13515485 10616663
3611 10616663 7286232 7967920 11524914 11503100 5971662 -876443 -6539413 -11945069 -16211351
3602a6211351j889059m430346j4025426k0645360j4081561J539095J3844162J7394449
3594c8505397J4522983P078582k847628q559497n320651J464292L438774J647320
3586b7081222K853018O684799O549165J806239j135621j32927n74105n926952
3578a6957606j2514515j5133822j1703788k102168J0731801J8129250J2070680
3571a7480168l198476j2634227p184926N712708J1947224P068485j201755m253661
3563b1224796j737607J003403J350463K104502N607783Q702038P037944K354809
3555E198539K02008R83289l16974m632860o340636k850539O31624l54444l329293
3546a0809286n225444p015427p158119L35452J4209435K1665864J4929981L490117
$$ plain form
3602 -16211351 -18100410 -22530756 -36556182 -57201542 -71283103 -69744008 -55899846 -38505397
3594 -38505397 -23982414 -16903832 -19751460 -28310957 -33631608 -32167316 -28728542 -27081222
3586 -27081222 -24228204 -17543405 -10994240 -9188001 -10323622 -10456549 -11030654 -16957606
3578 -16957606 -29472121 -44605943 -56309731 -58411899 -47680098 -29550848 -17480168
3571 -17480168 -20678644 -33312871 -40497797 -34785089 -22837865 -15769380 -16971135 -21224796
3563 -21224796 -22962403 -21959000 -20608537 -18504035 -12896252 -4194214 2843730 5198539
3555 5198539 5400547 6383836 6066862 1434002 -4906634 -7757173 -7125549 -7479993 -10809286
3546 -10809286 -16034730 -23050157 -30208276 -29872824 -15663389 6002475 20932456 24422573
3538B4422573m37268L88683k547896n924639k322344J798848m968395j6107924
3530e698362j4034757P53656Q899597L249541j384589L970560P029032j786101
3522I98577r725252k102186J2698539J6285201P888852J433698J922401J598769
3514C0998599l768499r501971j1634580j0287118n045676K922631O608118J133527
3506A425031o372115m865613M721935J1315827R214914K091918o125647j3834193
3498b427943j6722796j0961024j205384M240857N493780Q383790J1104186N712267
3490C617733o229236j2066627n624073M410346P923276N626006L237804K206693
3482C101922J602153K077049K906895J027623l182449n207743m421424n795830
$$ plain form
3538 24422573 23985305 24373988 21826092 15901453 13579109 15377957 10409562 -5698362
3530 -5698362 -19733119 -18979463 -10079866 -6830325 -8214914 -4244354 2784678 998577
3522 998577 -8726675 -10828861 1869678 18154879 26043731 27477429 29399830 30998599
3514 30998599 27230100 17728129 6093549 -4193569 -9239245 -6316614 291504 1425031
3506 1425031 -4947084 -9812697 -5090762 6225065 15439979 17531897 11406250 -2427943
3498 -2427943 -19150739 -30111763 -31317147 -27076290 -21582510 -13198720 -2094534 3617733
3490 3617733 -2611503 -14678130 -20302203 -15891857 -7968581 -2342575 895229 3101922
3482 3101922 4704075 6781124 9688019 10715642 7533193 2325450 -2095974 -7891804
3474g891804j0343736j1545316n642666J779964M173853K085738j460752n922908
3466c4767627q671952m116358N990600R963854K264978n831507j713293R424127
3458b7457178J2839707O489332J389764J971649M59326p332429j3434631r888535
3450c4962995M565Q067525J1798103J3205669J2438733P915227J42497p720341
3442A0888983j1342658p207365K933462J0060118O444452l194942o350401l79434
3434A852215L013050m670553j5343901j6302781q919084m955381p258792n698464
3426e8283691N829282J8050760J7555818M067657r411154j1682612l869930M731725
3418c3012145P227515L999674l59601j810699J423701Q642057J5652677J6042894
$$ plain form
3474 -7891804 -18235540 -29780856 -35423522 -33643558 -29469705 -27383967 -28844719 -34767627
3466 -34767627 -43439579 -47555937 -41565337 -31601483 -29336505 -35168012 -36881305 -27457178
3458 -27457178 -14617471 -8128139 -6738375 -4766726 -4307400 -11639829 -25074460 -34962995
3450 -34962995 -34958430 -26890905 -15092802 -1887133 10551600 18466827 18609324 10888983
3442 10888983 -453675 -7661040 -4727578 5332540 11776992 8582050 2231649 1852215
3434 1852215 4865265 194712 -15149189 -31451970 -40371054 -45326435 -52585227 -58283691
3426 -58283691 -52454409 -34403649 -16847831 -12780174 -22191328 -33873940 -37743870 -33012145
3418 -33012145 -25784630 -21784956 -22144557 -23955256 -22531555 -13889498 1763179 17806073
3410A7806073P695595k131566l208430M504575R393386L638705n213969m937469
3402B7546900K756564M017372o255483j5548875j0787087L561947J1874945O993438
3394B4159721m551179j3829826j7184853j3696429m559570L304960J884837o161487
3386c0633826q463894k11248Q020728O514883J791516M986723J1544419P339552
3378H88853o636245j2039074J10889J4808036J3540923j486191j3649515j4218915
3370a8681239p346742J359278R300989J2722879R160947L298100J268132M88190
3362A1570534n484267j3651264j4201071o326295L76599J960040N340113J3653437
3354f762174J8445828J2850628K351785m759177q568701j1693624j1193127n194016
$$ plain form
3410 17806073 25501668 23370102 20161672 24666247 34059633 37698338 32484369 27546900
3402 27546900 30303464 34320836 28065353 12516478 1729391 5291338 17166283 24159721
3394 24159721 19608542 5778716 -11406137 -25102566 -29662136 -26357176 -24472339 -30633826
3386 -30633826 -39097720 -39308968 -31288240 -24773357 -22981841 -17995118 -6450699 888853
3378 888853 -5747392 -17786466 -17675577 -2867541 10673382 9187191 -4462324 -18681239
3370 -18681239 -26027981 -24668703 -15367714 -2644835 6516112 9814212 11082344 11570534
3362 11570534 6086267 -7564997 -21766068 -28092363 -27715764 -25755724 -20415611 -6762174
3354 -6762174 11683654 24534282 26886067 22126890 13558189 1864565 -9328562 -14522578
3346a4522578J48573l36314j863519Q40457K729724j631284m785168K833013J4145962
3337b441134J3579662J668738n272125n86398M633544K213217j261374K28560
3329A2762690Q77748l343792m022725M474676J0908289L152466j0017779r700213
3321E091360M325069J2151450K229984j3058839j5199958k488185J1225593J4339764
3313A8616238P912591J116590N99267M058950L543726m326670j3196256j4626657
3305C697779q833251l703132m568098r495192j3518575j2500629l968058R631321
3297d3257835J8641101J4277336P07019p722487m249549K007560J91879o259040
3289b5664016n558910L889011J0655736P338109J589094M251973J2078037J1295038
$$ plain form
3346 -14522578 -14374005 -14710319 -16573838 -15733381 -13003657 -14634941 -19420109 -16587096 -2441134
3337 -2441134 11138528 12807266 7535141 6948743 11582287 13795504 12534130 12762690
3329 12762690 13640438 10296646 6273921 10748597 21656886 24809352 14791573 5091360
3321 5091360 9416429 21567879 23797863 10739024 -4460934 -6949119 4276474 18616238
3313 18616238 26528829 27645419 28244686 32303636 35847362 31520692 18324436 3697779
3305 3697779 -5135472 -8838604 -13406702 -22901894 -36420469 -48921098 -52889156 -43257835
3297 -43257835 -24616734 -10339398 -9632379 -17354866 -21604415 -19596855 -19404976 -25664016
3289 -25664016 -31222926 -27333915 -16678179 -9340070 -7750976 -3499003 8579034 19874072
3281A9874072j980374j4192888j1933487r7199N696100R99741l597153n96101
3273e827289L777269J673047l620844m962093l919335o232703r565169o434679
3265c5111796K922211J0806350J3948603J4768611J1263868k208933k1200419
3258d811505k9752719j8798876K228158J7609262K1531284J6905064O906274m136665
3250G680277q371386k637017M919171M972904K11790l10459L348810K682576l988694
3241H507972p770136l057263L990195N016437O11384k945860l185445k753880
3233a586596m009553o230277o865779l677014K532783O582384L654728l428981
3225a3028305o057290j347274L171634P56790l596597r20953N646503K994457
$$ plain form
3281 19874072 17893698 3700810 -8232677 -8329876 -2633776 -1634035 -5231188 -5827289
3273 -5827289 -2050020 -376973 -3997817 -8959910 -12879245 -19111948 -28677117 -35111796
3265 -35111796 -32189585 -21383235 -7434632 7333979 18597847 16388914 -4811505
3258 -4811505 -34564224 -53363100 -51134942 -33525680 -11994396 4910668 11816942 7680277
3250 7680277 -691109 -3328126 1591045 6563949 6775739 6465280 9814090 12496666 8507972
3241 8507972 737836 -2319427 1670768 6687205 7298589 4352729 1167284 -1586596
3233 -1586596 -5596149 -11826426 -18692205 -22369219 -19836436 -13254052 -9599324 -13028305
3225 -13028305 -19085595 -20432869 -17261235 -16504445 -20101042 -21021995 -15375492 -12381035
3217a2381035j1118711j9669671p604682J4580042K0957904M111846j3691374
3210b4815681r335985J1506297K4034243J6761574Q45999j0310679j5277406j5857007
3202b2448645r627189Q58154M217351l501604q975147o80732J1141803R286713
3194a9729296k233239l933270P239104J2856634L572385o183023l377064K774980
3186i012789l64880m727802M638123K1237240K3603975P045749j0417687j4785021
3178A7216908j1228414q664293n327074K471042R396748Q344064J247290m643017
3170H813254n637220j817165N133727R761192N910553k898175m259410N656853
3162B0663609J4062007R187582k613069q111711p789170j1176721j6518637j1769483
$$ plain form
3217 -12381035 -23499746 -43169417 -50774099 -36194057 -15236153 -11124307 -24815681
3210 -24815681 -34151666 -22645369 1388874 18150448 18996447 8685768 -6591638 -22448645
3202 -22448645 -32075834 -31217680 -27000329 -30501933 -39477080 -40157812 -29016009 -19729296
3194 -19729296 -21962535 -25895805 -18656701 -5800067 -2227682 -8410705 -11787769 -9012789
3186 -9012789 -9377669 -14105471 -9467348 11769892 35373867 42419616 32001929 17216908
3178 17216908 5988494 -2675799 -8002873 -5531831 3864917 12208981 13456271 8813254
3170 8813254 3176034 1358869 6492596 16253788 22164341 19266166 15006756 20663609
3162 20663609 34725616 43913198 41300129 33188418 25399248 14222527 -2296110 -14065593
3154a4065593L676316J4185820R582825j366503n653279l256502j794598k879817
3146a571331k915571j397639J94810L242744P859826Q284832R43242o393584l228818
3137E018511P315507J0969084K445377o417077k894232R429545J5826211R059645
3129E0752571l042693p879082j804480P059308P650611k929555j6160043j9924202
3121A3722435j0482610L228351Q062695j7175j1682201j4394202o298424K585764
3113a5275367L729919M93825J331082O349585P925075L807181P17549K328861
3105A1407710K477352l815519r861488o160068M793711J1440660Q573489J282574
3097B0138421n177151j0304368j2570936q093878J347764O233334K83561j0839530
$$ plain form
3154 -14065593 -10389277 3796543 13379368 12012865 6359586 3103084 1308486 -1571331
3146 -1571331 -4486902 -5884541 -5689731 -2446987 5412839 13697671 14640913 8247329 5018511
3137 5018511 12334018 23303102 25748479 19331402 16437170 25866715 41692926 50752571
3129 50752571 47709878 39830796 38026316 45085624 52736235 49806680 33646637 13722435
3121 13722435 3239825 6468176 14530871 14513696 2831495 -11562707 -17861131 -15275367
3113 -15275367 -11545448 -11051623 -9720541 -3370956 4554119 8361300 9078849 11407710
3105 11407710 13885062 10069543 208055 -5952013 -1158302 10282358 18855847 20138421
3097 20138421 14961270 4656902 -7914034 -16007912 -14660148 -8426814 -8143253 -18982783
3089a8982783j6096676j1282679j120785Q230581J4711063J8942609K0275459
3082A4676789J5846923M164824j0588708j9983381j8915970j0488645k063561
3075b7351729J319679j447197p944390j1205281l919328J0724273J7742927P732257
3067a4348789q868464j4312602o772563L51415J49923o07261K801443M708051
3059c6898847J704820Q42540P466305J5023595J5244100J0147877N997472L018100
3051B2545962p84864k899711j939938l212835r755647j4268719r661757j739123
3043b1716632o46599m432031k792592N629214J1377556Q801254K130861l081556
3035d730525n344884l972101Q00812M195656J649277k827744j461280M274618
$$ plain form
3089 -18982783 -35079459 -46362138 -47482923 -39252342 -24541279 -5598670 14676789
3082 14676789 30523712 34688536 24099828 4116447 -14799523 -25288168 -27351729
3075 -27351729 -26032050 -27479247 -35423637 -46628918 -50548246 -39823973 -22081046 -14348789
3067 -14348789 -23217253 -37529855 -44302418 -43951003 -43801080 -44408341 -41606898 -36898847
3059 -36898847 -35194027 -34351487 -26885182 -11861587 3382513 13530390 19527862 22545962
3051 22545962 21761098 18861387 16921449 13708614 3952967 -10315752 -19977509 -21716632
3043 -21716632 -22363231 -26795262 -29587854 -23958640 -12581084 -3779830 -1648969 -4730525
3035 -4730525 -10075409 -14047510 -13246698 -9051042 -7401765 -10229509 -11690789 -7416171
3027g416171M896215j828794o847719m158172Q2307j993586p562042p693109m53229
3018c2974300O514304N718917j376949o126690k829700L965354N050128l64893
3010b2423829k740756L597936J1241262J1069118O248159N292015O268030M70865
3002A9022800r951717j1865054j083658R899873R454657K337766Q76619P349759
2994B6041045J2289055P322388n248630j4869451j3326502m022738P86953n365633
2986C606487j4723694j6300979j0635511n731392k733105L324815J0705328J1502976
2978b0985075N594971K045648M603604P055376N320901K912168J631945j780184
2970F399354o546993o747978k524823q12597k102530N20478O071958M569753l940692
$$ plain form
3027 -7416171 -2519956 -4348750 -11196469 -15354641 -15272334 -17265920 -24827962 -32521071 -32974300
3018 -32974300 -26459996 -20741079 -22118028 -28244718 -31074418 -27109064 -22058936 -22423829
3010 -22423829 -25164585 -21566649 -10325387 743731 6991890 12283905 18551935 19022800
3002 19022800 9071083 -2793971 -3877629 6022244 15476901 17814667 18691286 26041045
2994 26041045 38330100 45652488 40403858 25534407 12207905 8185167 8972120 3606487
2986 3606487 -11117207 -27418186 -38053697 -43785089 -46518194 -43193379 -32488051 -20985075
2978 -20985075 -15390104 -13344456 -8740852 -1685476 3635425 6547593 8179538 6399354
2970 6399354 -147639 -6895617 -9420440 -10233037 -12335567 -11815089 -5743131 -1173378 -5114070
2961e114070n974852K458373P121317P9836m855060M674272J7186575J5310624
2953C0887015K626767n875293q736210j3784733j8259400j3845445n131114k995579
2945c5113992m627548K94566Q261348P269903j93931q69739M998904N423675J593446
2936a2963368O884460J9171044J9254395K583689j1650699j1269259p356108r215293
2928d561139o736978P310854J8672567J3724713K989073L118062R749283Q508834
2920E2775269J007851j493028j049832p543282j6551589j5099080o238351n651649
2912A56309j3931654j4007730O39843J5388859J7800480J3253594R699778L747626
2904C2747105p685243j5877582j2501667l117912K513937M673812P440253O942242
$$ plain form
2961 -5114070 -11088922 -8630549 -1509232 -1429396 -6284456 -1610184 15576391 30887015
2953 30887015 33513782 27638489 18902279 5117546 -13141854 -26987299 -32118413 -35113992
2945 -35113992 -39741540 -39446974 -31185626 -23915723 -24109654 -24979393 -19980489 -14556814 -12963368
2936 -12963368 -6078908 13092136 32346531 34930220 23279521 12010262 4654154 -4561139
2928 -4561139 -11298117 -3987263 14685304 28410017 31399090 34517152 44266435 52775269
2920 52775269 53783120 52290092 51240260 43696978 27145389 12046309 5807958 156309
2912 156309 -13775345 -27783075 -27143232 -11754373 6046107 19299701 28999479 32747105
2904 32747105 25061862 9184280 -3317387 -6435299 -3921362 752450 8192703 15134945
2896A5134945j473891j0828828j0764450m119525j816904l971089p70872Q016599
2888a0594015J0194294J541097o025464m177961k467596j1549414k2806188j9440828
2880f5326075k147077J1672543J2730566R076852Q928352Q635261L352775k034302
2872a5111105p11696N215860R021157Q414355M370518k458498p985685m738173
2864c983267O642121J3194535O229401m624877n059719K129557K453791o510544
2856A0470998j1906940o321419K759722O743632N833492J548243p291129j5620300
2848a3783701j2242678L136045J4387231R891927r40389k688443L427998M784977
2840E972967r18381l706275O09137L996916N335o631200q280014n074855k927688
$$ plain form
2896 15134945 13661054 2832226 -7932224 -12051749 -13868653 -17839742 -18610614 -10594015
2888 -10594015 -399721 1141376 -4884088 -9062049 -11529645 -23079059 -45885247 -65326075
2880 -65326075 -67473152 -55800609 -43070043 -33993191 -25064839 -16429578 -13076803 -15111105
2872 -15111105 -15822801 -10606941 -1585784 6828571 11199089 8740591 754906 -3983267
2864 -3983267 2658854 15853389 22082790 17457913 12398194 14527751 16981542 10470998
2856 10470998 -1435942 -7757361 -4997639 1745993 7579485 9127728 1836599 -13783701
2848 -13783701 -26026379 -22890334 -8503103 1388824 448435 -2240008 1187990 5972967
2840 5972967 5054586 1348311 1957448 5954364 5959699 -671501 -8951515 -14026370 -16954058
2831a6954058m923919p815554n485594M325885J5208176J6377517N482388n690080
2823E24761m087630P800896J5100353J0323572J884518K15783L085242R74089
2815C5821584p375997j2701030q551017k35084K927582J01390j764348J43472
2807H366552Q1502n976885j1628010p911104L243742J0907383R570188L924761
2799A0578129j033676n708047q991105n079615O612436J5640370J2372176Q59060
2791B5249728p434557q610331p332549o408180m269657j331818j69628O71550
2783i635442N069013J0671029R556060k22217j0338997j2429938p296445r29484
2775a5556421L681417O863942Q124799O387794L118883J649289L079242M532601
$$ plain form
2831 -16954058 -21877977 -29693531 -35179125 -30853240 -15645064 732453 6214841 524761
2823 524761 -3562869 4238027 19338380 29661952 31546470 31762253 34847495 35821584
2815 35821584 28445587 15744557 7193540 6958456 9886038 9987428 8223080 8366552
2807 8366552 8448054 2471169 -9156841 -17067945 -13824203 -2916820 6653368 10578129
2799 10578129 9544453 3836406 -5154699 -10234314 -3621878 12018492 24390668 25249728
2791 25249728 17815171 9204840 1872291 -4535889 -8805546 -10137364 -10306992 -9635442
2783 -9635442 -4566429 6104600 15660660 15438443 5099446 -7330492 -14626937 -15556421
2775 -15556421 -11875004 -5011062 3113737 9501531 12620414 14269703 17348945 21881546
2767B1881546J999152n298164j3463362j7430955j6097061j2689772r705778n928698
2759e6733092R1530O383532R840948R763100O688373Q69262m699387l537413O443925
2750b4889222J6710230J6166124M699518p187743j1589278r565551m633671J925484
2742a8364109O800377L573699q485217j9360317j8006316n000097Q912474J4967071
2734c4962435J2847937O837010R42646j627928J042080O826545R622712N150353
2726F678920l639076q969408o454534L66167M203795J668882l856674n951265
2718a5953193j115043P706471J2901524R552265K097615L47160O302559R325027
2710C1164385r3851j5364082k0723953j1793068O2523M584817L731430K947696
$$ plain form
2767 21881546 23880698 18582534 5119172 -12311783 -28408844 -41098616 -50804394 -56733092
2759 -56733092 -56641562 -50258030 -40417082 -30653982 -23965609 -23096347 -27795734 -31333147 -24889222
2750 -24889222 -8178992 7987132 12686650 5498907 -6090371 -15655922 -20289593 -18364109
2742 -18364109 -11563732 -7990033 -16475250 -35835567 -53841883 -58841980 -49929506 -34962435
2734 -34962435 -22114498 -15277488 -14334842 -15962770 -14920690 -8094145 1528567 6678920
2726 6678920 3039844 -5929564 -12384098 -12017931 -7814136 -6145254 -10001928 -15953193
2718 -15953193 -17068236 -9361765 3539759 13092024 15189639 15536799 21839358 31164385
2710 31164385 31070534 15706452 -5017501 -16810569 -16748046 -12163229 -8431799 -5484103
2702e484103J739154j283010l018526k499716m710382j0341946j0398278m11617
2694c6408424Q454198M567232m859178l961095O683216J1055536K782324o751140
2686a8437331p623168l957207k607129k181669M05120L127853M988579R509199
2678a6775753J5657652J4309569J398484j2652450j4472257l543656R805636J6983305
2670A0710530J5758696P712042k159493p071254n424582k977500m150572o096349
2662F301518n754633o418052j0700784j2745220n974533M897141Q444646J918172
2654b0031745n705411o100341l24561N783277R164127J0134140R111351N812314
2646G843151J149484j828137o46642K266891P42887o441647j1095406n813371
$$ plain form
2702 -5484103 -3744949 -5027959 -8046485 -10546201 -15256583 -25598529 -35996807 -36408424
2694 -36408424 -27954226 -23386994 -28246172 -32207267 -25524051 -14468515 -11686191 -18437331
2686 -18437331 -26060499 -30017706 -32624835 -34806504 -34401384 -31273531 -26284952 -16775753
2678 -16775753 -1118101 13191468 14589952 1937502 -12534755 -16078411 -6272775 10710530
2670 10710530 26469226 34181268 32021775 24950521 19525939 16548439 12397867 6301518
2662 6301518 546885 -5871167 -16571951 -29317171 -35291704 -30394563 -21949917 -20031745
2654 -20031745 -25737156 -31837497 -32162058 -26378781 -17214654 -7080514 2030837 7843151
2646 7843151 8992635 7164498 6517856 8784747 9527634 3085987 -8009419 -13822790
2638a3822790L805025N974355R95737J114633R580235J3089152K496844j0963001
2630A2270190j1387165j123142N016137K269978j290139j116385j047818k090698
2622A500958M73495O697276R808893P116689L305331L92436n578821j4224327
2614I491930j7093344r881844l43276K304357m71530j290374J516562L909287
2606a1858232M242760M648162N826318N866760L828769O96512k798595o397793
2598D054661q865219q649961n656705j013978L967354P530631P730873M573119
2590C670775Q48836o14676n5900l19082l411708p420943p144982J27177Q783750
2581e536753Q923761l78584o521005J037045J4044076J4500335K24042j0825068
$$ plain form
2638 -13822790 -10017765 -4043410 -3047673 -1933040 7647195 20736347 23233191 12270190
2630 12270190 883025 -240117 4776020 7045998 5755859 4639474 3591656 1500958
2622 1500958 1974453 8671729 18480622 25597311 28902642 29295078 23716257 9491930
2614 9491930 -7601414 -17483258 -17826534 -15522177 -15993707 -17284081 -15767519 -11858232
2606 -11858232 -7615472 -2967310 2859008 8725768 12554537 13251049 10452454 4054661
2598 4054661 -4810558 -13460519 -19117224 -20131202 -16163848 -8633217 -902344 3670775
2590 3670775 4519611 3904935 3849035 3529953 118245 -7302698 -14447680 -14320503 -5536753
2581 -5536753 3387008 3008424 -3512581 -2475536 11568540 26068875 26292917 15467849
2573A5467849o073136M106454L588624m909596o179496K058912O137576r14789
2565A3282398r069439q538989m162608m405492o456266k786030M669488Q182931
2557i284007P359748P107318N762572k087001j1900709j1847847j207580O926648
2549i170858N216269J194002J054510j347383r456547j1739861R64721J6470910
2541f814237J7208052P952333P803304J8042153K0010652O719086n783321n766420
2533E9371602l813073j1460815j9544063j4116794j482283O19953r994852j8164413
2525a8584738j3378037K9470J2643693J8375013J5019234O515094J963240L079536
2517B5662505k322271k2398135m2145876l8335794j2209007R956486J1637329
$$ plain form
2573 15467849 9394713 13501167 17089791 12180195 6000699 8059611 14197187 13282398
2565 13282398 4212959 -4326030 -8488638 -12894130 -19350396 -22136426 -17466938 -9284007
2557 -9284007 -1924259 5183059 10945631 8858630 -3042079 -14889926 -16097506 -9170858
2549 -9170858 -3954589 -2760587 -1706077 -3053460 -12510007 -24249868 -23285147 -6814237
2541 -6814237 10393815 18346148 26149452 44191605 64202257 70921343 65138022 59371602
2533 59371602 55558529 44097714 24553651 10436857 8954574 9574527 -420325 -18584738
2525 -18584738 -31962775 -31933305 -19289612 -914599 14104635 20619729 22582969 25662505
2517 25662505 23340234 942099 -41203777 -79539571 -91748578 -81792092 -70154763
2510g0154763M663480O523346J4581877J4543960M377198l772835j866390M944068
2502b6160059P753238M898622J366847R72176J669288j162804p461631j1010664
2494b9134987p284517M2664M430415N760235Q671928J3251086J4073620Q597478
2486A8407922M70167n992804r335113r136271o069507l182285j754380K104718
2478a4487553R944152J3255821L403248j2348206j7164532q268298j178286o371160
2470c3214814j4648785j2683278j673571Q448981J3913235J6041099J2854150
2463a0962983L006139o506799p261242j746692K76010l736203o512108k424914
2455c5868792N572193J1048102J0960191P011413L729552M780080Q621761R331203
$$ plain form
2510 -70154763 -65491283 -58967937 -44386060 -29842100 -25464902 -29237737 -31104127 -26160059
2502 -26160059 -18406821 -13508199 -12141352 -11169176 -9499888 -10662692 -18124323 -29134987
2494 -29134987 -36419504 -36376840 -31946425 -26186190 -17514262 -4263176 9810444 18407922
2486 18407922 18878089 12885285 3550172 -5586099 -11655606 -14837891 -16592271 -14487553
2478 -14487553 -4543401 8712420 12115668 -232538 -17397070 -25665368 -26843654 -33214814
2470 -33214814 -47863599 -60546877 -62220448 -53771467 -39858232 -23817133 -10962983
2463 -10962983 -7956844 -14463643 -21724885 -23471577 -23195567 -26931770 -33443878 -35868792
2455 -35868792 -30296599 -19248497 -8288306 -1276893 2452659 7232739 15854500 25185703
2447B5185703L843388m275401j0245300j3178367j2972901p243877L773566J3198002
2439a915187J3872883O698449j122604l682258K96600P593184J1061334N146664
2431C7949065n714047j0056743m757570l35823n250244j2650795j0978155j097755
2423a2892067O874743Q617117P037974K905355m544606j0174751p783950j459595
2415a1419780r24227n779476n845652J858110Q246853P052483L392698L050877
2407c68114L350088O31638j739490K37561L397190L102179J880501N134495J0846053
2398B6472101J0196807j242611j6461522k2273551j2114027N197349J1766283
2391A540829N5836j5919365j5580497K622561J8990481J7252265K144011j1191804
$$ plain form
2447 25185703 29029091 24753690 14508390 1330023 -11642878 -18886755 -15113189 -1915187
2439 -1915187 11957696 18656145 17533541 13851283 14147883 21741067 32802401 37949065
2431 37949065 32235018 22178275 17420705 17084882 11834638 -816157 -11794312 -12892067
2423 -12892067 -6017324 2599793 9637767 12543122 7998516 -2176235 -9960185 -11419780
2415 -11419780 -12344007 -18123483 -23969135 -22111025 -13864172 -6811689 -3418991 -368114
2407 -368114 2981974 3613612 1874122 2111683 5508873 8611052 10491553 15626048 26472101
2398 26472101 36668908 35426297 18964775 -3308776 -15422803 -10225454 1540829
2391 1540829 1596665 -14322700 -29903197 -27280636 -8290155 8962110 11106121 -85683
2383h5683j5507738j2415978l762845P884913J4854529J0756214J94160n598745
2375c681173k115508N642668J1820017J3820581R275870k249670j3727146j5437958
2367C347681p865320k060762l713865m988544J851454J0071445P048092o430691
2359b740510j5640214j0955187J289241R105087Q444518K988769k895707n833184
2351a6237187l160766L246602O529993L674007R71269M326597Q148360K793237
2343A0292112r044488j3969527o862444K210697L435166j61198j012033P55439
2335a4356276Q48136M5369J692422M251220L976992J894925J337300J522119P584
2326A219791j716760j713026k984295p819974j0445551m439951N127296P266622
$$ plain form
2383 -85683 -15593421 -28009399 -31772244 -23887331 -9032802 1723412 1917572 -3681173
2375 -3681173 -5796681 -154013 11666004 25486585 34762455 32512785 18785639 3347681
2367 3347681 -4517639 -6578401 -10292266 -15280810 -13429356 -3357911 3690181 -2740510
2359 -2740510 -18380724 -29335911 -28046670 -18941583 -10497065 -7508296 -10404003 -16237187
2351 -16237187 -19397953 -16151351 -9621358 -5947351 -4976082 -649485 7498875 10292112
2343 10292112 1247624 -12721903 -19584347 -17373650 -13938484 -14099682 -15111715 -14356276
2335 -14356276 -13508140 -13462771 -11770349 -7519129 -3542137 -1647212 -309912 1212207 1219791
2326 1219791 -496969 -2209995 -5194290 -13014264 -23459815 -27899766 -22772470 -15505848
2318a5505848J786058n28281M561530Q306440L868851k328952n28590P869649
2310G500857J2462417O988109m500728j2555066j1005205l013754J031402m656760
2302g748728j2091620q240918O739648J7936569J5017187M913461o2139M65371
2294A6928831k557163j1738355j8526989j4831061l658934M186176K249328m223593
2286c2171760m125022N571667J4390255J1015142o43846n115891M189042J5990087
2278I099674J6052628M286459q203536j3704516j3155602j0157574o339234k179505
2270b4301206J916181N534115P373846N758627J371919k793522n366491p293331
2262a7799862p610991l430601L288627M430165l876409j3410742j2295563K96866
$$ plain form
2318 -15505848 -13719790 -14248071 -9686541 -1380101 2488750 159798 -368792 7500857
2310 7500857 19963274 26951383 22450655 9895589 -1109616 -4123370 -3091968 -7748728
2302 -7748728 -19840348 -28081266 -21341618 -3405049 11612138 16525599 16463460 16928831
2294 16928831 14371668 2633313 -15893676 -30724737 -34383671 -30197495 -27948167 -32171760
2286 -32171760 -36296782 -30725115 -16334860 -5319718 -5963564 -11079455 -6890413 9099674
2278 9099674 25152302 29438761 21235225 7530709 -5624893 -15782467 -22121701 -24301206
2270 -24301206 -22385025 -16850910 -9477064 -3718437 -2346518 -5140040 -10506531 -17799862
2262 -17799862 -25410853 -28841454 -25552827 -21122662 -24999071 -38409813 -50705376 -50408510
2254e0408510J2749947J3840892L495134q737323j2926021o482973N206078J4836891
2246b8425885J9088533J8006037J1574460J159820p640169r775240p811109p497467
2238a1321020o946816O33553J2448172J5739508O457107l012367k310771J216884
2230A2904250m256847j4899635j7477030j0565857n633245q466066j2212208r852579
2222g0459217k938221L987684Q819541R909720O454558K488126L487969P943151
2214c0306689R171269N947024L586473L647474J176472n400769r798700o895603
2206b8873049M48281O951076J1091605J2603384J0117934N030422K024282K083857
2198B1477792M71534m758584q102977m878229J297797M299250L972114L535698
$$ plain form
2254 -50408510 -37658563 -23817671 -20322537 -29059860 -41985881 -48468854 -43262776 -28425885
2246 -28425885 -9337352 8668685 20243145 21402965 13762796 3987556 -3823553 -11321020
2238 -11321020 -18267836 -17634283 -5186111 10553397 17010504 13998137 11687366 12904250
2230 12904250 8647403 -6252232 -23729262 -34295119 -39928364 -48394430 -60606638 -70459217
2222 -70459217 -73397438 -69409754 -60590213 -50680493 -44225935 -41737809 -38249840 -30306689
2214 -30306689 -21135420 -15188396 -11601923 -7954449 -6777977 -12178746 -21977446 -28873049
2206 -28873049 -28424768 -21473692 -10382087 2221297 12339231 17369653 19393935 21477792
2198 21477792 21949326 17190742 9087765 4209536 5507333 9806583 13778697 17314395
2190A7314395K837248L5264l273572m286520l735216l228818q04778M999321R210176
2181A9067500N474157l980730j0268612r841003p931128q891243r771870o555947
2173c2698876j327632J116000L10552n44581j17885K85958L53909J498715M231023
2164b6892817P454686R861067R774794N141872k875131p813569m519046K449025
2156g419119L146766l757831q258415l611570L662588M410331P81181P38579L572217
2147f735273J994562l394383l851963K448917O908251M866614J998836K031339
2139F266900j93287o818656r504572k859684M586409L353146j757475j182885
2131h110104K470894P52136l436814m23941P769786R536437L417519j16005K341357
$$ plain form
2190 17314395 20151643 20186907 16913335 12626815 8891599 5662781 4858003 9857324 19067500
2181 19067500 24541657 20560927 10292315 451312 -7479816 -16371059 -26142929 -32698876
2173 -32698876 -34026508 -32910508 -32599956 -33144537 -33262422 -32976464 -32622555 -31123840 -26892817
2164 -26892817 -19438131 -9577064 197730 5339602 2464471 -5349098 -9868144 -7419119
2156 -7419119 -4272353 -8030184 -16288599 -19900169 -16237581 -11827250 -11046069 -10307490 -6735273
2147 -6735273 -4740711 -8135094 -11987057 -9538140 -2629889 2236725 4235561 6266900
2139 6266900 6073613 -745043 -10249615 -13109299 -8522890 -5169744 -6927219 -8110104
2131 -8110104 -5639210 -4887074 -8323888 -8747829 -978043 8558394 11975913 11859908 14201265
2122A4201265K357442k896129m419298J460736M763220q74329o100214j673856
2114F818837N005049J725735q597223j3075240q488488k820637l53713K015519
2106a7770161M260544J157862o943170j1058746n322470M983999J0923034J0095419
2098i673689N684062R9770n351790p161069j949349P197646J1424737O074905
2090F345223k899831o487806m599516m548112p883527p191873M92624O173803
2082b0599015K445194l313593k86658P173412O213632k434397n294249N63608
2074a5532066K800704l047782l906602P761266J7815592J1643494j477145k526997
2066A3530464P198424Q988256l577050j5930405j5092160n772359M69801N03521
$$ plain form
2122 14201265 16558707 13662578 9243280 10704016 15467236 14592907 8492693 6818837
2114 6818837 11823886 13549621 4952398 -8122842 -16611330 -19431967 -19785680 -17770161
2106 -17770161 -13509617 -12351755 -19294925 -30353671 -35676141 -30692142 -19769108 -9673689
2098 -9673689 -3989627 -3889857 -9241647 -16402716 -18352065 -11154419 270318 6345223
2090 6345223 3445392 -3042414 -7641930 -12190042 -20073569 -27265442 -26772818 -20599015
2082 -20599015 -18153821 -21467414 -21754072 -14580660 -8367028 -10801425 -16095674 -15532066
2074 -15532066 -12731362 -15779144 -19685746 -11924480 5891112 17534606 16057461 13530464
2066 13530464 20728888 29717144 26140094 10209689 -4882471 -10654830 -10185029 -9681508
2058i681508j435233j807723M68782M874609Q089441N976856o02569n031939j737254
2049h86538P907587J6271433J5002697K635860j1318021j4374742o485255j412535
2041G340486p467977j4380148q377825O235537J3003399P248560L10518K56024
2033D168574K264282R71202m80143Q68744O31692m583989r484057p424381L7284
2024a3030792O230203P394248L631273l211705q679390p433017J85556P063109
2016g850515P571959K969657l065543q615938j0746252n151303O718454J5232765
2008b936716J2543612J849030p298984r966858q478269o730979n519554k506917
2000b9045635M594471J3673784J8118666J4488067Q497498P487214Q436679K094716
$$ plain form
2058 -9681508 -11116741 -12924464 -12455682 -7581073 508368 6485224 5882655 850716 -886538
2049 -886538 7021049 23292482 38295179 40931039 29613018 15238276 8753021 7340486
2041 7340486 -127491 -14507639 -22885464 -16649927 -3646528 3602032 3912550 4168574
2033 4168574 6432856 7404058 6923915 7792659 8424351 3840362 -5643695 -13068076 -13030792
2024 -13030792 -6800589 593659 4224932 1013227 -7666163 -15099180 -14913624 -7850515
2016 -7850515 -278556 2691101 -374442 -8990380 -19736632 -24887935 -18169481 -2936716
2008 -2936716 9606896 11455926 4156942 -5809916 -14288185 -21019164 -26538718 -29045635
2000 -29045635 -24451164 -10777380 7341286 21829353 30326851 37814065 46250744 48345460
1992D8345460j0454531j5865147p274087M745295O648927n14818n970690n594764
1984A4065645m400901n900601p445645n669950p99383M342995O373105L908937
1976D474202K91296N43586L501402J952340o056297j1944445p812190K389501
1968a2660605R102896R955949R249580Q281449M173343k838784p776374p113450
1960A0374004k707066J36255l209505j1718057j6597721r652421L906434Q772554
1952b0695523J35261q417812n072326K419804J041294m420491O04399J3775435
1944b0629959J6407345K618203r992903n618555Q255921J3977067P422770k014970
1936A0424919p482820r350558p721482j223896O389834O862555k059722j1235574
$$ plain form
1992 48345460 37890929 22025782 14751695 19496990 26145917 25631099 19660409 14065645
1984 14065645 9664744 3764143 -3681502 -9351452 -10150835 -5807840 565265 4474202
1976 4474202 4765498 5309084 8810486 10762826 4706529 -7237916 -15050106 -12660605
1968 -12660605 -3557709 6398240 15647820 23929269 28102612 25263828 17487454 10374004
1960 10374004 7666938 7803193 4593688 -7124369 -23722090 -33374511 -29468077 -20695523
1952 -20695523 -20560262 -28978074 -34050400 -31630596 -30589302 -35009793 -34405394 -20629959
1944 -20629959 -4222614 -1604411 -11597314 -17215869 -8959948 5017119 12439889 10424919
1936 10424919 2942099 -6408459 -14129941 -15353837 -8964003 -2101448 -4161170 -15396744
1928a5396744r391355K954859J2457517Q368024l303893o764331K096856R604330
1920F25263M516078m622490k609464Q174721J0723483p46914j2487115j1741878
1912h168316k703635L498594L825053J477203j964374m843125k687667N264344
1904f301923J1598358R007604p74490j0518199j5118656j2211532j715519J0569463
1896a5464894J5432262J1429959P118504P347887N576072l377145j1667784r309093
1888G085768m3204M437040J270598l446712p263417j2109101j4514017p601338
1880c2184383O288742J5871570J5984566J3000041J2606167J1139765L422963
1873D6129431p673960j4591083j3906349p964606n70564N705680R130373P783023
$$ plain form
1928 -15396744 -24788099 -21833240 -9375723 -1007699 -4311592 -11075923 -8979067 625263
1920 625263 5141341 518851 -2090613 6084108 16807591 16060677 3573562 -8168316
1912 -8168316 -10871951 -7373357 -3548304 -2071101 -4035475 -8878600 -11566267 -6301923
1904 -6301923 5296435 14304039 13529549 3011350 -12107306 -24318838 -26034357 -15464894
1896 -15464894 -32632 11397327 18515831 25863718 31439790 28062645 16394861 7085768
1888 7085768 7042564 11479604 12750202 9303490 2040073 -10069028 -24583045 -32184383
1880 -32184383 -25895641 -10024071 5960495 18960536 31566703 42706468 46129431
1873 46129431 38455471 23864388 9958039 1993433 1422869 7128549 16258922 24041945
1865B4041945R773j2320350k1215597j7887199l317734J0996653J6203583J4808898
1857A1319972J2407013Q052853m6160o228501m600797K86993J00416m129950n906232
1848A1255607n684888p403605p193861k4015N891648j444878j4847543j3683788
1840c3135323M600474J8429683J3965597L517876K105968M439276j69907n861598
1832G892046j532657O829143M621323o353096r822459l42115R449251Q110835
1824A8852271p87872o517659l625068N185356J1971799R441201q05571q259196
1816B5455261o932302m005577p999219j4111277j1213784O57038J0365343J0807469
1808C022952M579680k687197n511189J019533J3580453J7493601L467747j5793260
$$ plain form
1865 24041945 24051718 11731368 -9484229 -27371428 -30689162 -19692509 -3488926 11319972
1857 11319972 23726985 31779838 31733678 25505177 20904380 21191373 21291789 17161839 11255607
1848 11255607 5570719 -1832886 -9026747 -9050762 -3159114 -4603992 -19451535 -33135323
1840 -33135323 -28534849 -10105166 3860431 7378307 9484275 13923551 13753644 7892046
1832 7892046 6359389 13188532 17809855 11456759 1634300 1292185 10741436 18852271
1824 18852271 18064399 11546740 7921672 13107028 25078827 34520028 33714457 25455261
1816 25455261 18522959 14517382 6518163 -7593114 -18806898 -18149860 -7784517 3022952
1808 3022952 7602632 4915435 -595754 423779 14004232 31497833 34965580 19172320
1800A9172320j9196778n452989O773347O164682M72092q70909Q8841q89655j584808
1791D676143m11057r65509l671696l075589J457248K569812k567269o764420m825769
1782a3578106p34198K095506O663146J2727350J2756413M561342k905365l691389
1774A7894699l667463p349941q022365j116706M327239J12334n359524l1040J1016323
1765G803556J2964196M280673k764077j887398J092164J210328O48013J109869
1757B4457324L78212k068860l902374m677740n215587l768695N68058L201650
1749H971988q983n016761n120938q85387K960547O293974J0716195J2228275O414084
1740C6552994k527808p206529p698805p736457n600116M48227L525525k112395
$$ plain form
1800 19172320 -24458 -5477447 1295900 7460582 7932674 7061765 7150606 6260951 4676143
1791 4676143 4265086 3299577 -372119 -3447708 -1990460 579352 -1987917 -8752337 -13578106
1782 -13578106 -14312304 -12216798 -5553652 7173698 19930111 24491453 21586088 17894699
1774 17894699 14227236 6877295 -1145070 -2261776 2065463 2177797 -3181727 -3212767 7803556
1765 7803556 20767752 25048425 22284348 20396950 21489114 22699442 23347455 24457324
1757 24457324 24835536 22766676 18864302 14186562 8970975 5202280 5770338 8971988
1749 8971988 8963005 3946244 -1174694 -2060081 900466 7194440 17910635 30138910 36552994
1740 36552994 34025186 26818657 19119852 11383395 5783279 6231506 9757031 7644636
1732G644636p869518k125312R264132J0030756j254737j0086157r564131p425995
1724a1386326q221567n935536K198797J0133591J4337909J6158276J2059346j725795
1716B7618695j4522089j0827740M930142J6771637L1088713O9585465J17877906
1709B42522729J18202036M0760778o3874024j16264839r6212880m9166649j8856832
1702E7110319r209818p887134j0227654j1990523n890143M078435M193286o019700
1694A4157068j0311974j439103P529497N184468j675219k600053Q1778k90696
1686A0635766j652222J028821N652578P367142O168370L821017Q760l822121m182739
1677B5025372k438730l403829m818888M54119Q655330N826771r118854j7086123
$$ plain form
1732 7644636 -224882 -2350194 6913938 16944694 15689957 5603800 -3960331 -11386326
1724 -11386326 -19607893 -25543429 -23344632 -13211041 1126868 17285144 29344490 27618695
1716 27618695 13096606 2268866 7199008 23970645 55059358 124644823 242522729
1709 242522729 360724765 401485543 337611519 221346680 125133800 75967151 57110319
1702 57110319 47900501 40013367 29785713 17795190 11905047 15983482 20176768 14157068
1694 14157068 3845094 2405991 9935488 15119956 13444737 10844684 10926462 10635766
1686 10635766 8983544 10012365 15664943 23032085 29200455 33021472 33030232 29208111 25025372
1677 25025372 22586642 19182813 14363925 14818044 23473374 29300145 20181291 3095168
1669C095168n388910J1785257J3552929K104104m320292q44227K20920p135068
1661A3069881j3113203q999033N55770P053591R169896R009843O117914J149252
1653B4013911q55731L189904Q710801Q865136L104259l207628n719600m695083
1645C3405969k941824k309553j838863J101563O853135J1105317Q826368P38538
1637E4940650o715803q659479o666817n301190o116116o991564n959444l537267
1629D992970j668722j954920m723299q205590q587351l169527N138330Q761196
1621i416913L986055k870383k513253M040309N570555k959947j0858233n225465
1613b0247275J0710304K1647009K0269022J3202035O981143m94129j0646821j6937848
$$ plain form
1669 3095168 -2293742 9491515 23044444 25148548 20828256 19984029 20204949 13069881
1661 13069881 -43322 -9042355 -8486585 -1432994 7736902 16746745 22864659 24013911
1653 24013911 23158180 26348084 35058885 43924021 47028280 43820652 38101052 33405969
1645 33405969 30464145 28154592 26315729 27417292 34270427 45375744 54202112 54940650
1637 54940650 48224847 39565368 32898551 27597361 21481245 14489681 8530237 4992970
1629 4992970 3324248 1369328 -3353971 -11559561 -20146912 -23316439 -18178109 -9416913
1621 -9416913 -5430858 -8301241 -10814494 -6774185 -1203630 -4163577 -15021810 -20247275
1613 -20247275 -9536971 12110038 32379060 45581095 52562238 52068109 41421288 24483440
1605B4483440j4196045p680505m825215l876568M69689M886471J501227p439487
1597f676993r763461k90053J0954743J1352518R13337q819990p295709O286814
1589c338794K3121038L0990664K3635578P131705n295318p386781o184539j1025201
1581E1648352j9200385j8763876n847585P719411Q571424j015467p122165l635502
1573A2354207J143441n64481l946144j344365L574870K210090k566583M64664
1565A1325699J1189686J5344825N855070n633400o458426j457920l061294j0847990
1557A6256250j3716309q203346j910471P4791M57826R57373q35971l749304k088953
1548a2758114M217451P265126L197013j142912J187612O360758N656324k067835
$$ plain form
1605 24483440 10287395 2606890 -2218325 -6094893 -5625204 -738733 762494 -6676993
1597 -6676993 -16440454 -16730507 -5775764 5576754 6490091 -2329899 -9625608 -3338794
1589 -3338794 19782244 50772908 74408486 81540191 76244873 68858092 62673553 51648352
1581 51648352 32447967 13684091 7836506 15555917 24127341 23111874 15989709 12354207
1573 12354207 13497648 12933167 8987023 7642658 11217528 13427618 10861035 11325699
1565 11325699 22515385 37860210 43715280 38081880 31623454 30165534 27104240 16256250
1557 16256250 2539941 -5663405 -7573876 -7499085 -7041259 -6083886 -6919857 -10669161 -12758114
1548 -12758114 -8540663 -1275537 1921476 778564 1966176 8326934 13983258 11915423
1540A1915423r754230j1622960q227775l041459K114462P719836J3910676J7575314
1532B0589287J3941531L618351m348076k032940N666159O118169l290223j0771651
1524B9490607p021801J677990L476129k491602p575271p308617m780564k174606
1516C292265K259760P970622J0048008N791986j377936o343722o903755l195261
1508A1541967L121448P717256O079276l65213m187282j012101M187687L464982
1500C0548020l124718p083082k318526P009244J1402166O845917j848821p901481
1492C3528719r537958q800413o526251k331571J535356J148014l043726n320823
1484F51347k436764J251719q61m581957n406923O04226R102957J3945354J2450144
$$ plain form
1540 11915423 2161193 -9461767 -17689542 -20731001 -18616539 -10896703 3013973 20589287
1532 20589287 34530818 38149169 33801093 31768153 37434312 43552481 40262258 29490607
1524 29490607 22468806 24146796 27622925 25131323 17556052 10247435 5466871 3292265
1516 3292265 5552025 13522647 23570655 29362641 27984705 21640983 14737228 11541967
1508 11541967 14663415 22380671 28459947 28094734 23907452 22895351 27083038 30548020
1500 30548020 27423302 20340220 18021694 25030938 36433104 43279021 41430200 33528719
1492 33528719 23990761 15190348 8664097 6332526 7867882 9015896 5972170 651347
1484 651347 -1785417 -533698 -534559 -5116516 -10523439 -9919213 -816256 13129098 25579242
1475B5579242N415861l769093r540333q130873k770220j206705o142344j1612146
1467a2176611j1066061n357248M66016M689750Q407168R757388M930772m456010
1459d804836j0364365p377560N21708N045652L453848M77887J264153M977227
1451f806286O065531J006454o869509j0147966n739950R22564K720193N81707
1443a8267262J355499N485000M103132o868913j6455031j1375651M308196J3100452
1435b4614578P835664J88011J654045P112647N333030k594007o109040k081450
1427a3275678J939395J40371n026954q518942p159618O21823J1262862J3755361
1419f261380J263064j5164349j6877233l807509L641385n289098j4555664n605645
$$ plain form
1475 25579242 30995103 27226010 17685677 9554804 6784584 5577879 -564465 -12176611
1467 -12176611 -23242672 -28599920 -28133904 -23444154 -15036986 -5279598 -348826 -4804836
1459 -4804836 -15169201 -22546761 -22025053 -16979401 -13525553 -13047666 -11783513 -6806286
1451 -6806286 -740755 265699 -6603810 -16751776 -22491726 -21569162 -18848969 -18267262
1443 -18267262 -16911763 -11426763 -7323631 -14192544 -30647575 -42023226 -37715030 -24614578
1435 -24614578 -16778914 -16590903 -14936858 -7824211 -2491181 -5085188 -11194228 -13275678
1427 -13275678 -11336283 -11195912 -16222866 -24741808 -31901426 -31279603 -20016741 -6261380
1419 -6261380 -4998316 -20162665 -37039898 -40847407 -37206022 -42495120 -57050784 -62656429
1411f2656429J3767634K1085741J2090983L448916M589139N758507j764553r921497
1403a3601559p109388M189450J2796224J4358666J2184149P751213k81250r642766
1395B0644739j4450221j1442476k197617Q939337J5706031J2430900P78353r241780
1387B1167266j0547011p976235r523311j2144564n737618R441114J9852438J6364067
1379B0896146O084371J162919K609257K264039l330718q674669p950699k007418
1371A1053228L742686M535727o87441q271972j2132804r774405n238045l374056
1363b0147082l102845n87290K765254J788335k909157l969457J802642Q102040
1355a6257560Q561783N512686M041553K858180j634559o248906m913641J55015
$$ plain form
1411 -62656429 -48888795 -27803054 -15712071 -12263155 -7674016 -1915509 -3680062 -13601559
1403 -13601559 -20710947 -16521497 -3725273 10633393 22817542 30568755 30287505 20644739
1395 20644739 6194518 -5247958 -7445575 1493762 17199793 29630693 30409046 21167266
1387 21167266 10620255 2644020 -6879291 -19023855 -24761473 -15320359 4532079 20896146
1379 20896146 26980517 28143436 30752693 33016732 29686014 21011345 13060646 11053228
1371 11053228 14795914 19331641 18644200 10372228 -1760576 -11534981 -16773026 -20147082
1363 -20147082 -23249927 -23837217 -21071963 -19283628 -22192785 -26162242 -24359600 -16257560
1355 -16257560 -7695777 -2183091 1858462 4716642 3082083 -3166823 -8080464 -7925449
1347g925449P51219l561516l970106K591242O844963J210953p877058r370689
1339b1306441l143149K475534M231327N513587O783771M326470j325206m479897
1331f924004l036180n02575J728239N879955R806986O704628l274198r895760
1323D87091o999260j707858k338916m684359J3982Q909455J0794515L243098m664532
1314C053216o671378n652182m054091J104879R454307J3072180P491166k81755
1306A7516342j648931J397560J278057k697312n107256m715527n293115p100243
1298f370425n902617j151727K504009L449478N373262Q674006P381438l67393
1290A3590031n773685r96315P191968M893655q629498j7840235j1169104L428493
$$ plain form
1347 -7925449 -7174230 -10735746 -14705852 -12114610 -5269647 -4058694 -11935752 -21306441
1339 -21306441 -24449590 -21974056 -17742729 -12229142 -5445371 -1118901 -2444107 -6924004
1331 -6924004 -9960184 -10462759 -8734520 -2854565 6952421 13657049 10382851 487091
1323 487091 -6512169 -8220027 -10558943 -15243302 -15229320 -6319865 4474650 7717748 3053216
1314 3053216 -3618162 -9270344 -13324435 -12219556 -2765249 10306931 17798097 17516342
1306 17516342 15867411 17264971 18543028 15845716 10738460 6022933 729818 -6370425
1298 -6370425 -12273042 -13424769 -10920760 -7471282 -2098020 6575986 13957424 13590031
1290 13590031 7816346 6820031 14011999 18905654 10276156 -7564079 -18733183 -15304690
1282a5304690R095379J528073p458521o579624J786374P373483O019628L376184
1274a63714N837421J1707477J3179198N989653m857347j0162800o878384j643013
1266A3008491l009947j1474944j8938613j7342866o136580P840138J5405959J0987870
1258i660492k330713j2952659j0242290L700661J4913309J2746232J067524q428283
1250a1186711j0121855p050368l083148P47381L271775L418719L929628Q607822
1242a1466757J4867319J5416448R064821L047302J828585R65221l281050n703361
1234B4738528r18444N354965L174660o160314j0911154m955849N047190R266929
1226B4636511M426242o602058j7496668j9732431r292968N209451R035325k62139
$$ plain form
1282 -15304690 -6209311 -4681238 -12139759 -18719383 -16933009 -9559526 -3539898 -163714
1274 -163714 5673707 17381184 30560382 36550035 31692688 21529888 14651504 13008491
1266 13008491 9998544 -1476400 -20415013 -37757879 -43894459 -36054321 -20648362 -9660492
1258 -9660492 -11991205 -24943864 -35186154 -31485493 -16572184 -3825952 -2758428 -11186711
1250 -11186711 -21308566 -28358934 -31442082 -30694701 -27422926 -24004207 -20074579 -11466757
1242 -11466757 3400562 18817010 27881831 30929133 32757718 33722939 30441889 24738528
1234 24738528 23820084 29175049 32349709 26189395 15278241 10322392 15369582 24636511
1226 24636511 29062753 22460695 4964027 -14768404 -24061372 -18851921 -9816596 -10078735
1218a0078735q657148m777004M992234P941960M027805K637685M982164K840455
1210C909416m920528p464216J474130J2250955J2189630L160695k433310L52416
1202A8519188M189611K206905l084334o137096o686538p058936n978123j085642
1194e114965M650230N384698J200341j471131K70749J337346k315159n268862
1186a326753N12805J2558326J8344301R918400o589430j7630694j5232638k721527
1178b167210Q834034R018417k942501j5777144j6454913m827515N800610M878922
1170a3637300l214241o880256k728302K461250K746153l23876j864292P26808
1162b2714056O848414J3037099J3691154O074655l903209n498347L987111J3249343
$$ plain form
1218 -10078735 -18735883 -23512887 -18520653 -10578693 -6550888 -3913203 1068961 3909416
1210 3909416 -1011112 -8475328 -7001198 5249757 17439387 20600082 18166772 18519188
1202 18519188 22708799 24915704 21831370 15694274 9007736 1948800 -4029323 -5114965
1194 -5114965 -464735 4919963 6120304 4649173 4919922 6257268 3942109 -1326753
1186 -1326753 -813948 11744378 30088679 40007079 33417649 15786955 554317 -2167210
1178 -2167210 6666824 15685241 12742740 -3034404 -19489317 -24316832 -18516222 -13637300
1170 -13637300 -16851541 -23731797 -26460099 -23998849 -21252696 -21576572 -23440864 -22714056
1162 -22714056 -15865642 -2828543 10862611 16937266 13034057 7535710 11522821 24772164
1154B4772164Q510146r337461k3243504j7988827K210481J7346338J3148791m343685
1146A1074443j7626954j7348056q318081J325701Q935706J4094900J4631462J0586027
1138A7355148O422070M212057k54023r018368j5029316j1073880j413095L870274
1130d929133K961973J723124J688771o91530l821210j764193L403706K115353
1122F86861o290810r693304j696351P195246N299210k971193n863749k738004
1114a6072094j892963m756917m806306p88533O57602l107315n699128j301406
1106c7767060P441321J3372580J1819930L085419p130072j0132051k701772P122989
1098a4888716Q509937J373848m952981n306959k647526R99611P094390J2200786
$$ plain form
1154 24772164 33282310 23944849 701345 -17287482 -15077001 2269337 15418128 11074443
1146 11074443 -6552511 -23900567 -32218648 -30892947 -21957241 -7862341 6769121 17355148
1138 17355148 23777218 27989275 27735252 18716884 3687568 -7386312 -8799407 -4929133
1130 -4929133 -1967160 -244036 1444735 753205 -3068005 -4832198 -1428492 686861
1122 686861 -5603949 -15297253 -16993604 -9798358 -4499148 -7470341 -13334090 -16072094
1114 -16072094 -17965057 -22721974 -27528280 -28316813 -27659211 -30766526 -36465654 -37767060
1106 -37767060 -30325739 -16953159 -5133229 -2047810 -9177882 -19309933 -22011705 -14888716
1098 -14888716 -6378779 -5004931 -9957912 -15264871 -17912397 -16912786 -9818396 2382390
1090B382390Q427473k766887p952935m38541P990268L896145p154580q999519
1082d616186J005490R666382Q077785Q94082n283857r812591j1125889m649463
1074a5844247O272418Q670586k265975j3057390r737827K111471P317518M862285
1066a1671161O366992J3138144J2187442r43382j1453817o371019O011195R302106
1058A6566500K607869k108449l50900J484141O72374J805458M821413K847620
1050B8346026m264144o517798J26426N198058m41010r199003p555401L732720
1042I425874J1350719Q443141J179580l344412n949383r879884j3846362j3874940
1034a6495667p994886K201518J0960106R942943l650495j9798460k2982806r484287
$$ plain form
1090 2382390 10809863 8042976 90041 -348500 7641768 11537913 4383333 -4616186
1082 -4616186 -3610696 6055686 14133471 15027553 9743696 -68895 -11194784 -15844247
1074 -15844247 -9571829 -901243 -3167218 -16224608 -25962435 -23850964 -16533446 -11671161
1066 -11671161 -5304169 7833975 20021417 19078035 7624218 1253199 7264394 16566500
1058 16566500 19174369 17065920 16715020 18199161 18871535 20676993 25498406 28346026
1050 28346026 24081882 17564084 17690510 22888568 22447558 13248555 5693154 9425874
1042 9425874 20776593 29219734 30399314 27054902 21105519 11225635 -2620727 -16495667
1034 -16495667 -24490553 -22289035 -11328929 -1385986 -5036481 -24834941 -47817747 -57302034
1026e7302034P777698J4450663R820817L321557J034878J070813l88123m000358
1018b4214089p672271q163059k819100O808396J3588223J0947268R88150o905838
1010a7442320o746383k058839N76117P34605K682885O243282N242891k421263
1002a3189025q209594k297661J2151372K0674212J4829550K033945n034701l664704
994A7293394o43936l89043n74365J051878K132581k9892m015122o456580o124930
985B243985m335147l281968m714872q085899r495940m986925M200701J1742463
977a6713602J2420508O633375j201837o529770p047584l969869j326048j671669
969a9406496k665429p43405K433519J616691l353257n581064l62144P743167J0594188
$$ plain form
1026 -57302034 -49524336 -35073673 -25252856 -21931299 -20896421 -19825608 -20213731 -24214089
1018 -24214089 -31886360 -40049419 -42868519 -36060123 -22471900 -11524632 -10536482 -17442320
1010 -17442320 -24188703 -26247542 -25671425 -24936820 -22253935 -16010653 -10767762 -13189025
1002 -13189025 -21398619 -23696280 -11544908 9129304 23958854 25992799 20958098 17293394
994 17293394 16649458 16260415 15686050 16737928 18870509 18840617 14825495 8368915 2243985
985 2243985 -2091162 -5373130 -10088002 -18173901 -27669841 -32656766 -28456065 -16713602
977 -16713602 -4293094 2340281 1138444 -5391326 -12438910 -16408779 -17734827 -19406496
969 -19406496 -22071925 -22815330 -20381811 -18765120 -22118377 -27699441 -28061585 -20318418 -9724230
960i724230O345527k2353l926523m840223l541011J25581N421388R069776P626350
951F534282J468239m833116p159796o376774o334046p218631m329080M115627
943b4133295J1396953R385752l32119p782819o887382j196664L129377M562607
935a1857590M671815M147545K848200N96079l261451p843980q751859l377850
927b2829091K193789q28938r822437j1582440q72277J1149131J2860452P404086
919a2327725L907739K224494k421142o228338j833593O698338P882028J310855
911g87344j735370K199515K986885m495690r856878l960700N152645M542980l414824
902i368781o058556j332175R8279o311463j0759667m094771Q287496J3919112
$$ plain form
960 -9724230 -3378703 -3401056 -7327579 -12167802 -15708813 -15583232 -10161844 -1092068 6534282
951 6534282 8002521 3169405 -3990391 -10367165 -16701211 -23919842 -28248922 -24133295
943 -24133295 -12736342 -3350590 -3682709 -11465528 -18352910 -19549574 -16420197 -11857590
935 -11857590 -7185775 -3038230 -190030 406049 -2855402 -10699382 -19451241 -22829091
927 -22829091 -20635302 -21464240 -31286677 -42869117 -43741394 -32592263 -19731811 -12327725
919 -12327725 -8419986 -6195492 -8616634 -14844972 -16678565 -9980227 -2098199 -787344
911 -787344 -2522714 -323199 2663686 -1832004 -11688882 -15649582 -10496937 -5953957 -9368781
902 -9368781 -15427337 -16759512 -16661233 -22972696 -33732363 -37827134 -29539638 -15620526
894a5620526R039248O83915l751257l199615n20253J455488J185615o42849r79191
885a2349425J886873M489238J718310n080042p955614k780743M392166N570524
877a0108713J771867l54283l73663m060909j0997216j1693458j750432R095755
869b8471052R412229J911710j707551J993043N815874N330879M325317N488746
861D099195N206577J169712k748749l417322l238881l589789o26179O603653J0613688
852A4071905N339784m039545r106177j0710956j3920737j5349867q209166K083060
844c9841699K201996p109652q866842L758468J3852891N447845j0404147j0784340
836e1745480M986858J5484477J0120608K258096M548812R325663M355589n674256
$$ plain form
894 -15620526 -6581278 -5897363 -9648620 -12848235 -13368488 -11913000 -10727385 -11370234 -12349425
885 -12349425 -10462552 -5973314 -4255004 -9335046 -17290660 -20071403 -15679237 -10108713
877 -10108713 -8336846 -8691129 -9064792 -13125701 -24122917 -35816375 -37566807 -28471052
869 -28471052 -19058823 -17147113 -18854664 -16861621 -11045747 -5714868 -1389551 4099195
861 4099195 9305772 10475484 7726735 4309413 1070532 -2519257 -3145436 3458217 14071905
852 14071905 19411689 15372144 6265967 -4444989 -18365726 -33715593 -41924759 -39841699
844 -39841699 -37639703 -44749355 -53616197 -49857729 -36004838 -30556993 -40961140 -51745480
836 -51745480 -46758622 -31274145 -21153537 -18895441 -14346629 -5020966 -665377 -6339633
828f339633p572664r57367L540733K748574L202114O334076N224342j884844o479016
819b183685k194703O209741R977523N804737l802680j2620496j2120901N47132
811a0383332J4169115J2879713k776902j4683404j1764663m150550n013136r920292
803c1643451o425593M220857R466484N535269J066787J552818K859183J572173
795a1795473O82164K104745K618881O07855m41814J667326L909903L194927O49064
786C197578j027470l84076K966839O979985O437443q63382q150994o524298K649402
777E281027R063571O942724j0674o667904j1119700j1001260m403338L723278
769h192276M785092j450370o150692m570319j139972N31311K803591N982626N321803
$$ plain form
828 -6339633 -13912297 -14869664 -11328931 -8580357 -5378243 955833 6180175 4295331 -2183685
819 -2183685 -4378388 1831353 11808876 17613613 13810933 1190437 -10930464 -10383332
811 -10383332 3785783 16665496 13888594 -794810 -12559473 -16710023 -21723159 -31643451
803 -31643451 -38069044 -33848187 -24381703 -18846434 -17779647 -16226829 -13367646 -11795473
795 -11795473 -11113309 -9008564 -6389683 -5781828 -6223642 -4556316 -646413 2548514 3197578
786 3197578 2170108 1786032 4752871 11732856 18170299 17306917 9155923 2631625 5281027
777 5281027 14344598 21287322 21276648 14608744 3489044 -7512216 -11915554 -8192276
769 -8192276 -3407184 -4857554 -11008246 -15578565 -16718537 -16187226 -13383635 -7401009 -2079206
760b079206K80653l046772k978784n094360r418919p125808L220216R296161M281007
751a2665812o26300M984774J2135278Q170466P8378L053585J3133675J2540786
743D0804830m00485q414941m098580o31648p438291j3886845p685939M904437
735C152538R574486M916653P76330J556419K058332k357488r342697j2694714
727b360141q039299K670755J0512624P658588k102136o677955j982380K331503
719B011559k046356q821801o467858M315731J1481372Q265725Q13703j864117
711G687958O44564J940231q73238k637044K647915J1724063J3385354K241541
703C6761344j2553695j7183609r366223J073116N753557M672862Q70762l106907
$$ plain form
760 -2079206 -1798553 -4845325 -7824109 -12918469 -22337388 -29463196 -26242980 -16946819 -12665812
751 -12665812 -13292112 -8307338 3827940 11998406 12076784 15130369 28264044 40804830
743 40804830 40404345 31989404 27890824 27259176 19820885 5934040 -1751899 3152538
735 3152538 12727024 17643677 18420007 19976426 22034758 19677270 10334573 -2360141
727 -2360141 -10399440 -7728685 2783939 10442527 8340391 1662436 -319944 2011559
719 2011559 -34797 -8856598 -15324456 -11008725 472647 8738372 9552075 7687958
711 7687958 8332522 10272753 9399515 6762471 9410386 21134449 34519803 36761344
703 36761344 24207649 7024040 -2342183 -1269067 4484490 9157352 10028114 6921207
695F921207k901910M398381J2728899J1539724K96002j0216372j3124330j1616180
687a974579p255816M364544J9716915K3091906P515113j1351496j5284538q133251
679A0688798n963445j0729939j0923404l676774K125631L825981Q236260J4944835
671H527943J3335367J182013q697519p071078r98551p36039n037798p240089o322192
662a3057943l879776J561190R179277J2108470O936218O26251O34086M184770
654A8292543M490391J462154j230107l775036p033163p370320k713745J719342
646C842059J866532K787394Q738322J1862834L033122j0687680j3392175l345312
638D705096N318019M137632m36613j680944k494227n372572m824396K626296J0228136
$$ plain form
695 6921207 4019297 8417678 21146577 32686301 32982303 22765931 9641601 -1974579
687 -1974579 -9230395 -4865851 14851064 37942970 45458083 34106587 18822049 10688798
679 10688798 4725353 -6004586 -16927990 -20604764 -18479133 -14653152 -6416892 8527943
671 8527943 21863310 23045323 14347804 7276726 6278175 5542136 504338 -6735751 -13057943
662 -13057943 -16937719 -15376529 -6197252 5911218 12847436 13473687 14107773 18292543
654 18292543 22782934 24245088 23014981 19239945 12206782 4836462 2122717 3842059
646 3842059 5708591 8495985 17234307 29097141 32130263 21442583 8050408 4705096
638 4705096 10023115 14160747 13724134 12043190 9548963 4176391 -648005 1978291 12206427
629A2206427J0441549N238334L16814l662510p089617o038933N76468M502730
621A6491262j663302j1812469j3400048m761339L877375N481300L136305J570020
613a080896O21207l44967J181163N988030R353746O220349k016306q460612p422773
604D038941N78560R162833J1331497N642545l302417j0923342j6180325j7245190
596a6896898r157782P783438K1006772J6634740j922978j5339575j1565105J02466
588i354922L052452n225160j2831647j0494938j081507O912417Q604649M537498
580a5881158j565565m909039k876634K001565M549061L465385K893707O035144
572f287534R709659Q038949N04153o703275q002826m802539k835189m322011n233116
$$ plain form
629 12206427 22647976 27886310 28203124 24540614 17450997 11412064 11988532 16491262
621 16491262 14827960 3015491 -10384557 -15145896 -11268521 -5787221 -2650916 -1080896
613 -1080896 -459689 -804656 376507 6364537 15718283 21938632 19922326 11461714 4038941
604 4038941 4617501 13780334 25111831 30754376 27451959 16528617 348292 -16896898
596 -16896898 -26054680 -18271242 2735530 19370270 17447292 2107717 -9457388 -9354922
588 -9354922 -6302470 -11527630 -24359277 -34854215 -35935722 -29023305 -20418656 -15881158
580 -15881158 -17446723 -22355762 -25232396 -23230831 -18681770 -15216385 -12322678 -6287534
572 -6287534 3422125 11461074 11965227 5261952 -2740874 -7543413 -10378602 -14700613 -19933729
563a9933729r02437P402950J3124426J1399831M401430p69957N10358N565942
555B0798814P981026N813432L597632M453653L863315l556359j3326795j5062930
547A4561788p947477l149408o633991q929284k27119J2106500J2946411K129562
539A4856982n552356k407340L634294M782923M125019N129503L130076l928717
531B3770384o835602J429018J1156817P628728o890489j5910069j2124817n175558
523b951588m225921m865352R47530J0545745J3748095O458499m848969j0671084
515D136955o933780K575248R463781P687734n18459o544191m655572J900052N507918
506A2619686L470128J89581J21918J400551q36130n678209n609835K697250J0802196
$$ plain form
563 -19933729 -20836166 -13433216 -308790 11091041 15492471 14722514 15232872 20798814
555 20798814 28779840 34593272 38190904 42644557 46507872 42951513 29624718 14561788
547 14561788 6614311 3464903 -3169088 -12098372 -12325491 -218991 12727420 14856982
539 14856982 9304626 6897286 10531580 15314503 19439522 24569025 27699101 23770384
531 23770384 16934782 18363800 29520617 37149345 30258856 14348787 2223970 -2951588
523 -2951588 -7177509 -12042861 -11095331 -549586 13198509 19657008 14808039 4136955
515 4136955 -2796825 -221577 9242204 16929938 16411479 9867288 5211716 7111768 12619686
506 12619686 16089814 16279395 16401313 17801864 16965734 11287525 5677690 8374940 19177136
497A9177136Q027938l042398q904601m178759J184446j656360o553719l721420
489C32263K996633K596826l644720l392170O030885J2041134N802365n133581
481A7629635r306346o503595l008095o8865L962530O048397K616616k225136j686394
472G458747K381867J696120n425913j1187935r355898k354894M151210P592114
464e044582P199527J999539o455868j3155005j4640438j2331453q660313l137471
456e4226064M824532J2126210J4822741J3007354R356010M469705k108364p237610
448d965486n861714J505120P525144O540506Q76107l441391l512940L86514O911978
439E963838J1518185P094541o459035j6936652j2938737m48152M136051k268828
$$ plain form
497 19177136 27205074 24162676 15258075 11079316 12263762 10607402 4053683 332263
489 332263 3328896 5925722 2281002 -1111168 4919717 16960851 22763216 17629635
481 17629635 8323289 1819694 -1188401 -1257266 2705264 8753661 11370277 9145141 7458747
472 7458747 9840614 11536734 6110821 -5077114 -14433012 -16787906 -12636696 -5044582
464 -5044582 2154945 4154484 -2301384 -15456389 -30096827 -42428280 -51088593 -54226064
456 -54226064 -49401532 -37275322 -22452581 -9445227 -89217 4380488 2272124 -4965486
448 -4965486 -10827200 -9322080 -1796936 4743570 5619677 2178286 -1334654 -948140 5963838
439 5963838 17482023 24576564 18117529 1180877 -11757860 -12206012 -8069961 -10338789
431a0338789n124862M288550J4229146J0308273k772110r638492o972257l685256
423i705797k605425K455539J1204703J3316336M462999o039165q960691o747949
415b619450n736064n484527k494302K163064N284133O381056N076237p30963r057730
406g218546j2178834o736799j49677n31036n104625n679519j437063J705206J867813
397c5463080L130544P085288R463989O449338j70539n175130m744938L51397M538552
388a4534579K447179l764959n403763J470378R801506J0915864O052895K753289
380I737810L109795K738002k01349k468327k626047l766233p291718q982158m350781
371a4101006M517567J0053395P081310r29469m576375O25729P290938M632884
$$ plain form
431 -10338789 -15463651 -11175101 3054045 13362318 10590208 951716 -6020541 -9705797
423 -9705797 -12311222 -9855683 1349020 14665356 19128355 13089190 4128499 -2619450
415 -2619450 -8355514 -13840041 -16334343 -14171279 -8887146 -2506090 2570147 1839184 -7218546
406 -7218546 -19397380 -26134179 -26283856 -26814892 -31919517 -37599036 -39036099 -37330893 -35463080
397 -35463080 -32332536 -25247248 -15783259 -9333921 -9504460 -14679590 -19424528 -19073131 -14534579
388 -14534579 -12087400 -15852359 -21256122 -19785744 -9984238 931626 6984521 9737810
380 9737810 12847605 15585607 15384258 12915931 10289884 6523651 -768067 -9750225 -14101006
371 -14101006 -9583439 469956 7551266 6621797 2045422 2671151 9962089 14594973
363A4594973o057165j1356408m104007N654122M280879o817068j3984220q953990
355b6742884M021915J5885995K0023018J4007730J801201p031387o971120l635412
347A1359056m895376q414620o586413o55661J008266k370098k723809K286657
339a0991998N086753J649388j741326J53601L088988J891496r57881j448819j465026
330d734824l621183m834660j593743L261021M929416L534326J568396q75984l221193
321e588428j635275N106430J1264345J1365899P802082N575052L808553q43902
313C6854756n987247o202044j892784J677250K921073M631473O621851M500034
305D3124362k961318j0529374j2584162r252779n066839l349749k542749K158406
$$ plain form
363 14594973 8537808 -2818600 -6922607 -1268485 3012394 -3804674 -17788894 -26742884
355 -26742884 -22720969 -6834974 13188044 27195774 28996975 21965588 14994468 11359056
347 11359056 6463680 -1950940 -8537353 -9193014 -8184748 -10554846 -13278655 -10991998
339 -10991998 -5905245 -4255857 -5997183 -5843582 -2754594 -863098 -1820979 -3269798 -4734824
330 -4734824 -8356007 -13190667 -14784410 -11523389 -6593973 -3059647 -1491251 -2367235 -5588428
321 -5588428 -7223703 -2117273 9147072 20512971 28315053 33890105 37698658 36854756
313 36854756 30867509 24665465 22772681 24449931 27371004 32002477 38624328 43124362
305 43124362 40163044 29633670 17049508 7796729 2729890 -619859 -3162608 -1004202
297a004202J1906161J8972056J3059607m666862j9105650j7580355m414163O291396
289C457988P907568M111075j318598p510621j0639827n941971K517994M009456
281c406936l163627p318524m41318Q827715P654487j652567n403353P40452O182928
272B019257K642303l121692o0813J0294571J6069456J1614819L460091r62767
264D1955225k729586n884992q797962p356204l417923l025207o932468r381375
256e570492o948699k617232M27859L043906N621656N294398J645759r3351L338237
247D142041O927933M761781m8932j66007L548537K912687m122662r460897p113462
238A381019k104433k125213n562763m410536L007355Q717328N629430k989061
$$ plain form
297 -1004202 10901959 29874015 42933622 38266760 19161110 1580755 -2833408 3457988
289 3457988 11365556 15476631 14158033 6647412 -3992415 -9934386 -7416392 -3406936
281 -3406936 -6570563 -13889087 -14330405 -5502690 2151797 499230 -4904123 -4163671 2019257
272 2019257 4661560 1539868 1479055 11773626 27843082 39457901 42917992 41955225
264 41955225 39225639 33340647 24542685 17186481 13768558 10743351 3810883 -5570492
256 -5570492 -12519191 -15136423 -14708564 -11664658 -6043002 -748604 897155 803804 4142041
247 4142041 11069974 15831755 15782823 15616816 19165353 22078040 17955378 8494481 1381019
238 1381019 -723414 -2848627 -8411390 -12821926 -9814571 -1097243 4532187 1543126
230A543126p382635k970865M721426P318297L633262J9596J106941L721545K261279
221A3971972k629216m952992k216287J241283J041734j132650r71857J789454
213F141441L737382L381495K526002K116481M96362k866012n080460l694365o21477
204F136849P86053R41847K393820L785358O46195o486270j0147818n753280J068526
195f628720J980956k522408n228466l592089j546059m62143L205957R173461J0498172
186D878661M221369j787653J113645R895911J3938833Q755661m57535p198985
178C3359907r785417r820570r450292r998136j0031010o265008L75639K910228
170a8704659k152661o819486j096576J1132120J5386019P017118j878812p35333
$$ plain form
230 1543126 -5839509 -8810374 -4088948 3229349 6862611 6882207 7989148 11710693 13971972
221 13971972 11342756 6389764 4173477 5414760 6456494 5323844 4351987 6141441
213 6141441 9878823 13260318 15786320 17902801 18399163 15533151 10452691 6758326 6136849
204 6136849 6922902 7864749 10258569 14043927 14690122 8203852 -1943966 -7697246 -6628720
195 -6628720 -4647764 -7170172 -12398638 -15990727 -17536786 -17998929 -14792972 -5619511 4878661
186 4878661 9100030 7312377 8426022 18321933 32260766 41016427 40558892 33359907
178 33359907 23574490 13753920 4303628 -5694508 -15725518 -21990526 -21614887 -18704659
170 -18704659 -20857320 -27676806 -28773382 -17641262 -2255243 4761875 2883063 2147730
162B147730L753764j016547j2598382j5498906l745161R336895Q472800l624390
154a2772197j0707749m322816O904688J0237336M557163j289056k041403j338568
146a0772602l362794n457872k699066L899636Q460588Q198264O030551N253964
138I550669N314210L851516J71900m616380q901411j0768472q613603l067771
130a7079342K639908N506357N538920N036274N620502O699806O564630M316846
122B4843901O68898k701515m291466l541276j163797J009451J215968n26126k447088
113A3066950l434790m473504o482000p771919n622596q972N914778Q612496O268614
104F069057j68750n937519n053981K224089P096650K882312m284595l185058M844594
$$ plain form
162 2147730 5901494 4884947 -7713435 -23212341 -26957502 -17620607 -9147807 -12772197
154 -12772197 -23479946 -27802762 -20898074 -10660738 -6103575 -7392631 -9434034 -10772602
146 -10772602 -14135396 -19593268 -22292334 -18392698 -9932110 -1733846 4296705 9550669
138 9550669 14864879 18716395 18888295 14271915 5370504 -5397968 -14011571 -17079342
130 -17079342 -14439434 -8933077 -3394157 1642117 7262619 13962425 20527055 24843901
122 24843901 25512799 22811284 18519818 14978542 13814745 14824196 16040164 15514038 13066950
113 13066950 9632160 5158656 -1323344 -9095263 -14717859 -14726831 -8812053 -199557 6069057
104 6069057 5900307 -37212 -5091193 -2867104 4229546 7111858 2827263 -357795 4486799
95D486799O043628n425381j7539909j6730321n374516M671129Q433596Q363127
87a3071848M829637k412886o737794q39343R996286J2151123K679704o320310
79B74569n094831J772262N055722L762947K291333J682366P38416J147623M436883
70A6067290O587453K215109p072997j3968365j4591745j1471017p490995k081446
62c1806713M801148R319658Q190672M348485L733947O429080N690503j808570
54H898210r111713p452970R08428N209840J398534k955297j363294J917425K71279
45b279558l816103l199899K076023N245110L267000j17414r36357J083208M178152
36E500162N311812J146449o764613j0449391n059528K924801L799794j827374
$$ plain form
95 4486799 10530427 5105046 -12434863 -29165184 -34539700 -29868571 -21434975 -13071848
87 -13071848 -8242211 -10655097 -17392891 -18232234 -8235948 3915175 6594879 274569
79 274569 -4820262 -3048000 2007722 5770669 8062002 9744368 10482784 11630407 16067290
70 16067290 22654743 24869852 17796855 3828490 -10763255 -22234272 -29725267 -31806713
62 -31806713 -27005565 -17685907 -9495235 -5146750 -1412803 5016277 10706780 8898210
54 8898210 -213503 -7666473 -6758045 -1548205 -149671 -3104968 -4468262 -2550837 -2279558
45 -2279558 -6095661 -9295560 -7219537 -1974427 1292573 1175159 238802 1322010 5500162
36 5500162 10811974 11958423 5193810 -5255581 -10315109 -7390308 -3590514 -5417888
28e417888n279093l069334Q04895M035304P783215R803391N713861k118780o306691
19E948880n903967o630022q764776n556193L778227J0164914P848204J939524
11B824791j256630k059497j319974L542280J0825613J2244230M880718k764063
3B6917468l027309N30403J291678
0B5712240
$$ plain form
28 -5417888 -10696981 -13766315 -12961420 -8926116 -1142901 8660490 14374351 12255571 5948880
19 5948880 44913 -6585109 -15349885 -20906078 -17127851 -6962937 885267 2824791
11 2824791 1568161 -491336 -1811310 1730970 12556583 24800813 29681531 26917468
3 26917468 23890159 24420562 25712240
0 25712240
$$ Imaginary data points
##PAGE= N=2
##DATA TABLE= (X++(I..I)), XYDATA
65535B1299498j67640J12202O0719L147035P740425N479570m929519j2081260
65527B0661030p939968m07992p52801o561498p400218j245345M928340O576340
65519G857888M647534J007939j583379P11846N936405M774544o311120j6466881
65511E74776j4231324m196257P67963q43672N07426P908768J3333860J0956225
65503A4777765M514358l62698k676154l176011j980727n45479n81953q09923N31460
65494I690638J441919l91120k515165k126573k169128n691286p856168k743517
65486a2360400M892569N276607p15310l127602Q6565K31882n812746r087261l505070
65477b4120766L620032L120444k440712m606258k240786q04637k178500k724680
$$ plain form
65535 21299498 21131858 21244060 21304779 24451814 32192239 37671809 32742290 20661030
65527 20661030 12721062 12313070 11560269 4998771 -2401447 -3646792 1281548 7857888
65519 7857888 12505422 13513361 11929982 12641828 18578233 23352777 17041657 574776
65511 574776 -13656548 -17852805 -17084842 -17928514 -17421088 -9512320 3821540 14777765
65503 14777765 19292123 18929425 16253271 13077260 11096533 10551054 9969101 9159178 9690638
65494 9690638 11132557 10741437 8226272 6099699 3930571 -1760715 -9616883 -12360400
65486 -12360400 -7467831 -2191224 -2906534 -6034136 -5947571 -5715689 -11528435 -20615696 -24120766
65477 -24120766 -20500734 -17380290 -19821002 -24427260 -26668046 -27472683 -29651183 -32375863
65469c2375863j02673L755502O330313P292959P353243O669469M873577K047635
65461E844162l76295m99683J387697K651039K404210L274000O425219P963376
65453B9073725M451442r22893k833821j819754j984279l349013l338864l503786
65445A5772757o743163r565680o217752K69348J240254l017646l042537L173446
65437h130973N222568k761632j1083797q264938K660526J0347463J1105940R519080
65429H614237P861471M475644M73133n99527N11851q11036n600568r539390q908706
65420c522891m099519K580451Q584139J0768528P304540O16217m273500m767395
65412A3190570k378314j3901L78465j823298n490265p733458o313931k494395
$$ plain form
65469 -32375863 -32478536 -28723034 -22392721 -15099762 -7746519 -1077050 3796527 5844162
65461 5844162 5467867 4968184 6355881 9006920 11411130 14685130 21110349 29073725
65453 29073725 33525167 32602274 29768453 27948699 25964420 22615407 19276543 15772757
65445 15772757 9029594 -536086 -6753838 -6484490 -5244236 -8261882 -11304419 -8130973
65437 -8130973 -2908405 -5670037 -16753834 -25018772 -22358246 -12010783 -904843 8614237
65429 8614237 16475708 20951352 21424485 20824958 21336809 20525773 14925205 5385815 -3522891
65420 -3522891 -7622410 -5041959 3542180 14310708 21615248 22231465 17957965 13190570
65412 13190570 10812256 10798355 11176820 9353522 3863257 -3870201 -10184132 -12678527
65404a2678527k76502k189128o123569o874129j628054N955157Q733384M197089
65396a0884279k278280l985117m57217L843304N617812M040853j045743p464543
65388a2613210r797482n782127j319075k720230o444277m546426J711542L793152
65380c7718133R92133J908466Q711524J2160433P137948J346120J499973K088927
65372a872609k741734o348476p37923P254303M979638n269286r059173k142208
65364a5937468M202476J999618k286381k65385N360279P070513M296678J639301
65356F079631N7283l156284p682800r168302m884932K752662Q301793P533080
65348a67869P53804o743774r049282n856134k744468l899373o682324n850446
$$ plain form
65404 -12678527 -12955029 -15144157 -21267726 -28141855 -29769909 -23814752 -15081368 -10884279
65396 -10884279 -13162559 -17147676 -17604893 -13761589 -8143777 -4102924 -5148667 -12613210
65388 -12613210 -22410692 -28192819 -29511894 -32232124 -38676401 -43222827 -41511285 -37718133
65380 -37718133 -36726000 -34817534 -26106010 -13945577 -6807629 -5461509 -3961536 -1872609
65372 -1872609 -4614343 -10962819 -11700742 -4446439 533199 -4736087 -13795260 -15937468
65364 -15937468 -11734992 -9735374 -12021755 -12287140 -6926861 143652 4440330 6079631
65356 6079631 6136914 2980630 -4702170 -13870472 -18755404 -16002742 -7700949 -167869
65348 -167869 585935 -6157839 -15207121 -21063255 -23807723 -27707096 -34389420 -40239866
65340d0239866j437796J212500p42413l517226k152878K715084O453165O972921
65332c0736509N904443M106387Q42985j891399J94513O172308Q208130K010119
65324e189023n743076o444752j920746q4695j394363O45627O282076P570485J805164
65315d473303l232039j829364P72337j980025o849972o508541j075429L144763
65307b2031573L043239P13227j320360j678528Q65991N596200Q956769Q531745
65299B676710N484987J102605m989137j0842256j1584844o123321M34866M029051
65291a9811339N757996O126738K623085k964563l160809L653504Q779671O834314
65283G838597M586345P970099J0328924M613308k376867j837944o13656j0081227
$$ plain form
65340 -40239866 -41677662 -40465162 -41207575 -44724801 -46877679 -44162595 -37709430 -30736509
65332 -30736509 -24832066 -20725679 -19882694 -21774093 -21579580 -15407272 -7199142 -5189023
65324 -5189023 -10932099 -17376851 -19297597 -19382292 -20776655 -20131028 -13848952 -6278467 -4473303
65315 -4473303 -7705342 -9534706 -8762369 -10742394 -17592366 -24100907 -25176336 -22031573
65307 -22031573 -18988334 -18275107 -19595467 -21273995 -20408004 -14811804 -5855035 2676710
65299 2676710 8161697 9264302 4275165 -6567091 -18151935 -24275256 -23840390 -19811339
65291 -19811339 -14053343 -7926605 -5303520 -8268083 -11428892 -7775388 1004283 7838597
65283 7838597 12424942 20395041 30723965 35337273 32960406 31122462 30508806 20427579
65275B0427579k3198854k2033618o513986M191388J085980l209497K031330Q814746
65267a8404932O392053q97349l092563q70952j063423l886112m678834k422076
65259b8924188J389973O491820J0068388O470833k578498n694778K166218R653580
65251i56652M706328p187902j1723754o755331k052002k097424k236499l86272
65243b8689508R8644m23929K403055O712097N195023j322640k146982O965638
65235a1208602J5599939J2773115J240997q562928j1779971r394336j931118Q114894
65227e148010J1933676K788208j2007115j6724640o414553P133284J1158915O572576
65219g07659K406216J712213K68217l122325l118951L290535R996564Q342159
$$ plain form
65275 20427579 -2771275 -24804893 -31318879 -27127491 -26041511 -29251008 -27219678 -18404932
65267 -18404932 -12012879 -12910228 -16002791 -16873743 -17937166 -21823278 -26502112 -28924188
65259 -28924188 -27534215 -21042395 -10974007 -4503174 -7081672 -12776450 -10610232 -956652
65251 -956652 3749676 -3438226 -15161980 -21917311 -23969313 -26066737 -28303236 -28689508
65243 -28689508 -28590864 -29014793 -26611738 -19899641 -14704618 -16027258 -18174240 -11208602
65235 -11208602 4391337 17164452 18405449 9842521 -1937450 -11331786 -13262904 -5148010
65227 -5148010 6785666 9573874 -2433241 -19157881 -25572434 -18439150 -7280235 -707659
65219 -707659 1698557 3410770 3678987 556662 -2562289 728246 10724810 19066969
65211A9066969j426358r478140p780169O27443N599128J773729o083197r950052
65203g650647q035658m968866m042393l253851K833L958081M961846K840875P39408
65194a5448372P48529K320117L970331M041982J166227l144667m157206L5891
65186a0467168M018544J737299l646577l160848M547849J0447818P813489P56107
65178A2046513l213559k714415l90185K663677N043682K760345n050580j1851818
65170g06340j0991027m374231J245582L448174M314628M612435L547443J781841
65162B878505m86556n440519j2273350j3613285m082112J0311648J8209415J6162322
65154A1666068R447570K545025l588938o971275n651695k586525k230701l304905
$$ plain form
65211 19066969 17640611 8162471 382302 1009745 6608873 8382602 2299405 -7650647
65203 -7650647 -15686305 -20655171 -24697564 -27951415 -27948582 -23990501 -19028655 -16187780 -15448372
65194 -15448372 -14699843 -12379726 -8409395 -4367413 -3201186 -6345853 -10503059 -10467168
65186 -10467168 -6448624 -4711325 -8357902 -11518750 -6970901 3476917 11290406 12046513
65178 12046513 8832954 6118539 5728354 8392031 13435713 16196058 11145478 -706340
65170 -706340 -11697367 -16071598 -14826016 -11377842 -7063214 -2450779 1096664 2878505
65162 2878505 2391949 -3048570 -15321920 -28935205 -33017317 -22705669 -4496254 11666068
65154 11666068 21113638 23658663 20069725 13098450 7446755 4860230 2629529 -675376
65146f75376j806436Q45921O23670k69464L458527R455575R854342L802795j760918
65137B3528636l740068n321976o740716m359527J50545P08239j900476j140561
65129A184096J740551j355414q505102p208486L854079Q642274j433344j1746605
65121a4827951o372318P092328J0359718K647712j553241K321050M048624j431560
65113B284362n661384j974597L751681L469915j033503k797724n33027J145387
65105a348890m38466k681383k088299N39581R13250k421722m510143J80397R168097
65096b687578J3728587R643844J224482n978666j0310712j0580703n076944K755779
65088g281911N018247m303m768463m144368k334416l184124k608241K108087M345464
$$ plain form
65146 -675376 -2481812 -1635891 -1012221 -1281685 2176842 11632417 21486759 25289554 23528636
65137 23528636 19788568 14466592 7725876 3366349 3516894 4225133 2324657 1184096
65129 1184096 2924647 1569233 -6935869 -14144355 -10290276 -1648002 -3081346 -14827951
65121 -14827951 -21200269 -14107941 -3748223 -1100511 -2653752 -332702 3715922 2284362
65113 2284362 -3377022 -5351619 -1599938 1869977 836474 -1961250 -2494277 -1348890
65105 -1348890 -1787356 -4468739 -6557038 -6017457 -5104207 -7525929 -12036072 -11855675 -2687578
65096 -2687578 11041009 20684853 21909335 15930669 5619957 -4960746 -10037690 -7281911
65088 -7281911 -2263664 -2267967 -7036430 -11180798 -13515214 -16699338 -19307579 -17199492 -12854028
65079a2854028j018387o464657k675290N358150N314142k979474p501585k343002
65071b5164131N337162P355031M077051O77614J122184O310738J2163460J0760467
65063B2639576k40708j1474181j2307922m951287j42917j301627k305693L58879
65055i725880L146110L374129K610934J277659k223086o296966p227188n532130
65047b0596418m534668l666844n60362J948218n91883n247502n392631j684425
65039d0326515N37310K618654R370358J5802199J1209367k315517j0088127o713535
65031a9905806k858120n148538n108119L230621R702010M659755k628423K458203
65023a5598417J5485739J8293588N914391o872555p162232K86421K947612k674649
$$ plain form
65079 -12854028 -13872415 -20337072 -23012362 -17654212 -12340070 -15319544 -22821129 -25164131
65071 -25164131 -19826969 -12471938 -8394887 -7717273 -6595089 -284351 11879109 22639576
65063 22639576 22398868 10924687 -1383235 -6334522 -6477439 -7779066 -10084759 -9725880
65055 -9725880 -6579770 -3205641 -594707 682952 -1540134 -7837100 -15064288 -20596418
65047 -20596418 -25131086 -28797930 -29358292 -27410074 -28001957 -33249459 -38642090 -40326515
65039 -40326515 -39789205 -37170551 -27800193 -11997994 -788627 -3104144 -13192271 -19905806
65031 -19905806 -22763926 -27912464 -33020583 -29789962 -20087952 -15428197 -18056620 -15598417
65023 -15598417 -112678 18180910 24095301 17222746 10060514 10346935 13294547 10619898
65015A0619898r624232j0916758o336108n31427K267188J393589q34893j544311
65007a5507054J071677O818382J2297637J2163527M746589m356283p779520m878941
64999D576014j107571p980n58742j687245l608470m387617j103741M439816O656241
64990C210705M094972J190857Q91643P93651j846522n839792p996312n822128
64982a1322926Q55273O950732M055355q160494j6618146j0371676K509530O032280
64974b6070072Q37637J165570Q072708O405167o346026j0194131O074129K3088104
64966C033086J7825971k277268j2174810n974972N70976j214262l465816o54940
64958d332035J544343n57026k476632k417148m539302p536382l247660Q183795
$$ plain form
65015 10619898 995666 -9921092 -16257200 -16788627 -14521439 -13127850 -13962743 -15507054
65007 -15507054 -14435377 -7616995 4680642 16844169 21590758 17234475 9454955 4576014
64999 4576014 3468443 3460463 2901721 1214476 -2393994 -6781611 -7885352 -3445536 3210705
64990 3210705 7305677 8496534 9388177 10181828 8335306 2495514 -5500798 -11322926
64982 -11322926 -10467653 -3516921 538434 -7622060 -24240206 -34611882 -32102352 -26070072
64974 -26070072 -25232435 -24066865 -15994157 -9588990 -15935016 -26129147 -20055018 3033086
64966 3033086 20859057 18581789 6406979 432007 1002983 -211279 -3677095 -4332035
64958 -4332035 -2787692 -3344718 -5821350 -8238498 -12777800 -20314182 -23561842 -15378047
64950a5378047J4115056P083955l804081o693816l249979k546116n627314n991821
64942b2092163k163252n28968n094026j0626677q506518K806681J4815470J6844224
64934a4545229P065489n386802j0546824q037705m834572m830396n174972k348369
64926d8639380K825862O731053N906851j188376j1091442j4565040m741617J2641619
64918e2120470K2574046J6873202K642449p761472j0417385r525837p648050k841960
64910d8225477M918314J0536937R892980N924326M958710Q093653J0079320P317954
64902A3496717K946644J440035J621151o61070n064699p195855n640305l118360
64894b175742q98866J939447L337471p10862q178418j1000061n849545J622226
$$ plain form
64950 -15378047 -1262991 5820964 2016883 -4676933 -7926912 -10473028 -16100342 -22092163
64942 -22092163 -24255415 -24784383 -29878409 -40505086 -49011604 -46204923 -31389453 -14545229
64934 -14545229 -7479740 -12866542 -23413366 -31451071 -36285643 -41116039 -46291011 -48639380
64926 -48639380 -45813518 -39082465 -33175614 -34363990 -45455432 -60020472 -64762089 -52120470
64918 -52120470 -29546424 -12673222 -10030773 -17792245 -28209630 -37735467 -45383517 -48225477
64910 -48225477 -43307163 -32770226 -22877246 -16952920 -11994210 -3900557 6178763 13496717
64902 13496717 16443361 17883396 19504547 18843477 13778778 6582923 942618 -2175742
64894 -2175742 -3074608 -1135161 2202310 1491448 -6686970 -17687031 -23536576 -21914350
64886b1914350O050506Q326865Q764086L303381p160308j2164602n008691N945595
64878a3857518Q480087L261905m79684o79312k246048m645115k272506L635555
64870h802636N500568K607446K479229O926616P487244j207239j2378843j6170637
64862a3558252j1229594l381134J809604K272818J51573J015127P383772J2780474
64854b755612Q869491j253662n472181j15902M527241J94396p344607q923511
64846a2274347o585654q451653j3723041j2598136o29278J4176988K0039152J3115789
64838f930180r0997r183774q613289k291764M56049m984489j2991420j3776767
64830e8406631m365218Q208684J4740692J3321638R600627Q059968O022356p72691
$$ plain form
64886 -21914350 -15863844 -7536979 1227107 4530488 -2629820 -14794422 -19803113 -13857518
64878 -13857518 -5377431 -2115526 -2595210 -3274522 -5520570 -10165685 -12438191 -8802636
64870 -8802636 -3302068 -694622 1784607 8711223 16198467 14991228 2612385 -13558252
64862 -13558252 -24787846 -28168980 -26359376 -24086558 -23934985 -22919858 -15536086 -2755612
64854 -2755612 6113879 4860217 -611964 -727866 3799375 3993771 -3350836 -12274347
64846 -12274347 -18860001 -27311654 -41034695 -53632831 -54262109 -40085121 -20045969 -6930180
64838 -6930180 -7021177 -16204951 -24818240 -27110004 -26653955 -31638444 -44629864 -58406631
64830 -58406631 -62771849 -54563165 -39822473 -26500835 -16900208 -8840240 -2817884 -3590575
$$ [...]
##END NTUPLES=NMR SPECTRUM
##END=
