##TITLE=31Pdec_DE-56_NaOH_2
 D2O, 64 sc
 5.7.2024
##JCAMPDX= 6.0         $$ Bruker NMR JCAMP-DX V2.0
##DATA TYPE= NMR SPECTRUM
##DATA CLASS= NTUPLES
##ORIGIN= UXNMR, Bruker Analytische Messtechnik GmbH
##OWNER= root
$$ XWIN-NMR		Version 3.5
$$ Fri Jul  5 14:30:45 2024 Russian Standard Time (UT+4h)  she@DPX200
##.OBSERVE FREQUENCY= 81.013821
##.OBSERVE NUCLEUS= ^31P
##.ACQUISITION MODE= SIMULTANEOUS
##.ACQUISITION SCHEME= undefined
##.AVERAGES= 64
##.DIGITISER RES= 17
##SPECTROMETER/DATA SYSTEM= spect
##.PULSE SEQUENCE= zgpg30
##.SOLVENT NAME= DMSO
##.SHIFT REFERENCE= (INTERNAL, DMSO, 0, 198.062)
##AUDIT TRAIL= $$ (NUMBER, WHEN, WHO, WHERE, WHAT)
$$ ##TITLE= Audit trail, XWIN-NMR		Version 3.5
$$ ##JCAMPDX= 5.01
$$ ##ORIGIN= Bruker BioSpin GmbH
$$ ##OWNER= she
$$ F:/spectra/data/she/nmr/P31/2/pdata/1/auditp.txt
$$ ##AUDIT TRAIL=  $$ (NUMBER, WHEN, WHO, WHERE, WHAT)
(   1,<2024-07-05 14:28:28.87 +0400>,<she>,<DPX200>,
      <created by zg, POWCHK disabled, PULCHK disabled
       configuration hash MD5:
       00 E9 B6 7A A2 85 ED C7 34 08 36 98 17 FE 4E 26
       data hash MD5: 32K
       28 F8 0E 85 F6 FE 49 AD F1 4C 5D 6A 17 E9 6F 59>)
(   2,<2024-07-05 14:28:31.31 +0400>,<she>,<DPX200>,
      <Start of raw data processing
       efp BC_mod = 2 LB = 1.5 FT_mod = 6 PKNL = 1 PHC0 = 2789.794 PHC1 = 98.08569 SI = 64K 
       data hash MD5: 64K
       A5 E3 A9 D0 3C F9 D9 90 36 3A 28 E1 22 D8 CD 7E>)
(   3,<2024-07-05 14:29:51.20 +0400>,<she>,<DPX200>,
      <pk PHC0 = -406.3321 PHC1 = 892.0007 
       data hash MD5: 64K
       BE A6 EF 15 15 17 92 83 55 A7 D2 60 35 9A C7 CE>)
(   4,<2024-07-05 14:29:55.62 +0400>,<she>,<DPX200>,
      <abs ABSG = 5 
       data hash MD5: 64K
       1C 33 F9 62 0D 6B 11 B9 70 6A AC 00 04 FC 5F 3C>)
$$ ##END=
$$ 
$$ hash MD5
$$ E0 2C 92 34 37 41 6D 5E 60 F5 AD D4 04 B3 E9 10
##$RELAX= 
##$RELAX= 
##$RELAX= 
##$RELAX= 
##$RELAX= 
##$RELAX= 
##$RELAX= 
##$RELAX= 
$$ Bruker specific parameters
$$ --------------------------
##$DU= <F:/spectra>
##$EXPNO= 2
##$NAME= <P31>
##$PROCNO= 1
##$TYPE= <nmr>
##$USER= <she>
##$AMP= (0..31)
100 100 100 100 100 100 100 100 100 100 100 100 100 100 100 100 100 100 
100 100 100 100 100 100 100 100 100 100 100 100 100 100 
##$AQSEQ= 0
##$AQ_mod= 1
##$AUNM= <au_zg>
##$AUTOPOS= <>
##$BF1= 81.014009
##$BF2= 200.13
##$BF3= 200.13
##$BF4= 200.13
##$BF5= 200.13
##$BF6= 200.13
##$BF7= 200.13
##$BF8= 200.13
##$BYTORDA= 1
##$CFDGTYP= 0
##$CFRGTYP= 5
##$CHEMSTR= <none>
##$CNST= (0..31)
1 1 145 1 1 1 1 1 1 1 1 1 1 1 1 1 1 1 1 1 1 1 1 1 1 1 1 1 1 1 1 1 
##$CPDPRG= <waltz16>
##$CPDPRG1= <>
##$CPDPRG2= <waltz16>
##$CPDPRG3= <>
##$CPDPRG4= <mlev>
##$CPDPRG5= <mlev>
##$CPDPRG6= <mlev>
##$CPDPRG7= <mlev>
##$CPDPRG8= <mlev>
##$CPDPRGB= <>
##$CPDPRGT= <>
##$D= (0..31)
0 1 0 0 0 0 0 0 0 0.06 0 0.03 2e-05 3e-06 0 0 0.0002 0 0 0 0 0 0 0 0 0 
0 0 0 0 0 0 
##$DATE= 1720175308
##$DBL= (0..7)
120 120 120 11 120 120 24 19 
##$DBP= (0..7)
150 150 150 150 150 150 150 150 
##$DBP07= 0
##$DBPNAM0= <>
##$DBPNAM1= <>
$$ [...]
##$SUBNAM3= <"">
##$SUBNAM4= <"">
##$SUBNAM5= <"">
##$SUBNAM6= <"">
##$SUBNAM7= <"">
##$SUBNAM8= <"">
##$SUBNAM9= <"">
##$SW= 400.765351723535
##$SWIBOX= (0..15)
0 1 3 0 0 0 0 0 0 0 0 0 0 0 0 0 
##$SW_h= 32467.5324675325
##$TD= 32768
##$TD0= 1
##$TE= 0
##$TE2= 300
##$TE3= 300
##$TEG= 300
##$TL= (0..7)
0 120 53 12 22 120 120 120 
##$TP= (0..7)
150 150 150 150 150 150 150 150 
##$TP07= 0
##$TPNAME0= <>
##$TPNAME1= <>
##$TPNAME2= <>
##$TPNAME3= <>
##$TPNAME4= <>
##$TPNAME5= <>
##$TPNAME6= <>
##$TPNAME7= <>
##$TPOAL= (0..7)
0.5 0.5 0.5 0.5 0.5 0.5 0.5 0.5 
##$TPOFFS= (0..7)
0 0 0 0 0 0 0 0 
##$TUNHIN= 0
##$TUNHOUT= 0
##$TUNXOUT= 0
##$USERA1= <user>
##$USERA2= <user>
##$USERA3= <user>
##$USERA4= <user>
##$USERA5= <user>
##$V9= 5
##$VALIST= <valist>
##$VCLIST= <CCCCCCCCCCCCCCC>
##$VD= 0
##$VDLIST= <DDDDDDDDDDDDDDD>
##$VPLIST= <PPPPPPPPPPPPPPP>
##$VTLIST= <TTTTTTTTTTTTTTT>
##$WBST= 1024
##$WBSW= 4
##$XGAIN= (0..3)
0 0 0 0 
##$XL= 0
##$YL= 0
##$YMAX_a= 2853
##$YMIN_a= -11682
##$ZGOPTNS= <>
##$ZL1= 120
##$ZL2= 120
##$ZL3= 120
##$ZL4= 120
##$ABSF1= 198.0616
##$ABSF2= -202.7028
##$ABSG= 5
##$ABSL= 3
##$ALPHA= 0
##$AQORDER= 0
##$ASSFAC= 0
##$ASSFACI= 0
##$ASSFACX= 0
##$ASSWID= 0
##$AUNMP= <proc_1d>
##$AZFE= 0.1
##$AZFW= 0.5
##$BCFW= 0
##$BC_mod= 2
##$BYTORDP= 0
##$COROFFS= 0
##$CY= -3
##$DATMOD= 1
##$DC= 0
##$DFILT= <>
##$DTYPP= 0
##$F1P= 0
##$F2P= 0
##$FCOR= 1
##$FTSIZE= 65536
##$FT_mod= 6
##$GAMMA= 0
##$GB= 0
##$INTBC= 1
##$INTSCL= 9.790993e-09
##$ISEN= 30
##$LB= 1.5
##$LEV0= 0
##$LPBIN= 0
##$MAXI= 10000
##$MC2= 0
##$MEAN= 0
##$ME_mod= 0
##$MI= 50
##$NCOEF= 0
##$NC_proc= -11
##$NLEV= 6
##$NOISF1= 182.463
##$NOISF2= 159.3651
##$NSP= 0
##$NTH_PI= 0
##$NZP= 0
##$OFFSET= 198.0616
##$PC= 4
##$PHC0= 2383.462
##$PHC1= 990.0864
##$PH_mod= 1
##$PKNL= yes
##$PPARMOD= 0
##$PSCAL= 0
##$PSIGN= 0
##$REVERSE= no
##$SF= 81.0140089999434
##$SI= 65536
##$SIGF1= 159.3651
##$SIGF2= -187.1042
##$SINO= 113.3802
##$SIOLD= 16384
##$SREGLST= <1H.CDCl3>
##$SSB= 0
##$STSI= 65536
##$STSR= 0
##$SW_p= 32467.5324675325
##$SYMM= 0
##$S_DEV= 0
##$TDeff= 32768
##$TDoff= 0
##$TI= <>
##$TILT= no
##$TM1= 0
##$TM2= 0
##$TOPLEV= 0
##$USERP1= <user>
##$USERP2= <user>
##$USERP3= <user>
##$USERP4= <user>
##$USERP5= <user>
##$WDW= 1
##$XDIM= 65536
##$YMAX_p= 320316027
##$YMIN_p= -406371614
$$ End of Bruker specific parameters
$$ ---------------------------------
##NTUPLES= NMR SPECTRUM
##VAR_NAME=  FREQUENCY,     SPECTRUM/REAL,   SPECTRUM/IMAG
##SYMBOL=    X,             R,               I
##VAR_TYPE=  INDEPENDENT,   DEPENDENT,       DEPENDENT
##VAR_FORM=  AFFN,          ASDF,            ASDF
##VAR_DIM=   65536,         65536,           65536
##UNITS=     HZ,            ARBITRARY UNITS, ARBITRARY UNITS
##FACTOR=    0.49542278885378, 1,            1
##FIRST=     16045.7642231865, 0,            0
##LAST=      -16421.768244346, 0,            0
##MIN=       -16421.768244346, -406371614,   0
##MAX=       16045.7642231865, 320316027,    0
$$ Real data points
##PAGE= N=1
##DATA TABLE= (X++(R..R)), XYDATA
$$ [...]
6441a1311045K1896677J2086171j0224379k2501889j2310301M198825M270393
$$ -11311045 10585632 22671803 12447424 -10054465 -22364766 -18165941 -13895548
6434a3895548j1061837k2403875j8198400q87005K2710314M0198729L3537345
$$ -13895548 -24957385 -47361260 -65559660 -66446665 -43736351 -3537622 29999723
6427B9999723J199704k7680091k4000106K632932J9151162J5610868Q261073J804062
$$ 29999723 31199427 3519336 -20480770 -17847838 1303324 16914192 25175265 26979327
6419B6979327j5454921l5889614l0645656K913226K6325982J2580206j5459732
$$ 26979327 11524406 -24365208 -55010864 -52097638 -25771656 -13191450 -28651182
6412b8651182k1516259m692135J3430956K6698526L9316152M1061759K0414445
$$ -28651182 -50167441 -54859576 -41428620 -14730094 24586058 65647817 86062262
6405H6062262q023162j9370977j4242024j0842742r862914J283801J4614412P743029
$$ 86062262 78039100 58668123 44426099 33583357 23720443 25004244 39618656 47361685
6397D7361685j3589847j4906680J3614560L4321778J1639863l7396815o2806059
$$ 47361685 33771838 18865158 32479718 66801496 78441359 41044544 -21761515
6390b1761515l9615574R865312M3563739L7738848M110436k2726845j9780065
$$ -21761515 -61377089 -51511777 -7948038 29790810 33901246 11174401 -8605664
6383h605664J32186O557753p878437k0110144j1479572Q387363J8925979J3315562
$$ -8605664 -8473478 -1915725 -9794162 -29904306 -41383878 -32996515 -14070536 -754974
6375g54974j244069j2161281m833193K3763299M8469555L6004143p804935l6500828
$$ -754974 -1999043 -14160324 -18993517 4769782 53239337 89243480 81438545 44937717
6367D4937717k4665023l643795j1914165l6268961l5936545o056455K1365423
$$ 44937717 20272694 16628899 4714734 -31554227 -67490772 -73547227 -52181804
6360e2181804K8785428K6161055J8187462j136408k0561770j8141366j374427
$$ -52181804 -23396376 2764679 20952141 19815733 -746037 -18887403 -20261830
6353b0261830j695923j9889553j8487821J4954941L9004923J9721081j5582111
$$ -20261830 -21957753 -41847306 -60335127 -45380186 -6375263 13345818 -2236293
6346b236293k0968438k85657O978377r658849k2364633j3361675M303577J4850520
$$ -2236293 -23204731 -23490388 -16512011 -26170860 -48535493 -61897168 -57593591 -42743071
6338d2743071J8636691J9381796J5432850O808164n169877k2096976l7259875
$$ -42743071 -24106380 -4724584 10708266 17516430 12346553 -9750423 -47010298
6331d7010298l0862546K029702L0897135K5328936J234996j992950J6455437J9817623
$$ -47010298 -77872844 -75843142 -44946007 -19617071 -18382075 -20375025 -3919588 15898035
6323A5898035k567676j7119140l636105J1335917Q45403j8514951j7080668R88728
$$ 15898035 13330359 -3788781 -7424886 3911031 4756434 -13758517 -30839185 -29850457
6315b9850457J1064527P940078L929842K987185L168395J1171446K8923285L8022690
$$ -29850457 -18785930 -10845852 -6916010 -3928825 -760430 10411016 39334301 77356991
6307G7356991K2933193j197984r185016m143069q525947k4812350l3354338k5918865
$$ 77356991 100290184 99092200 89907184 85764115 77238168 52425818 19071480 -6847385
6299f847385j4676601q425675m076267j981809o880502j2438832o014744R727030
$$ -6847385 -21523986 -29949661 -34025928 -36007737 -42888239 -55327071 -61341815 -51614785
6291e1614785J8761684J4623627L220574j2830892l0623382l2874687m984621
$$ -51614785 -32853101 -18229474 -15008900 -27839792 -58463174 -91337861 -96322482
6284i6322482L4755316N0570010L6108242J6568522L009794j9294341m8761950
$$ -96322482 -61567166 -10997156 25111086 41679608 44689402 25395061 -23366889
6277b3366889n3310974j8304600K3862953L5782446J9784239j499873k0471777
$$ -23366889 -76677863 -94982463 -71119510 -35337064 -15552825 -17052698 -37524475
6270c7524475l3146313k0959802J9832328N1459253L6930688m073111k0643568
$$ -37524475 -70670788 -91630590 -71798262 -20339009 16591679 12518568 -8125000
6263h125000k515760J4766611J1869426P372690J2003747O358256j8423147l5962366
$$ -8125000 -10640760 4125851 15995277 23367967 35371714 41729970 23306823 -12655543
6255a2655543k4853980l729772N73777m357289M178516J9798419J5972880q011439
$$ -12655543 -37509523 -41239295 -40665518 -45022807 -40844291 -21045872 -5072992 -13084431
6247a3084431k2169084r129515J3831043K3178438J8796031J4684034J5016736
$$ -13084431 -35253515 -44383030 -30551987 -7373549 11422482 26106516 41123252
6240D1123252J2727522M963734j369550J134023J1123914J9085135J6305150M286865
$$ 41123252 53850774 58814508 57444958 58578981 69702895 88788030 105093180 109380045
6232A09380045n986265o952312m309824q862978k0482325k7555651k2754843j1713475
$$ 109380045 103393780 96441468 92131644 83268666 62786341 35230690 12475847 762372
6224G62372l753968r11589N11178L667922J0081965J8574151K1230406Q111905
$$ 762372 -2991596 -3903185 -3392007 275915 10357880 28932031 50162437 58274342
6216E8274342j6937148l2291448k1086718N745493K0467570J1692950n206007
$$ 58274342 41337194 9045746 -12040972 -6295479 14172091 25865041 20659034
6209B0659034j1903159q014747k706489J909695Q165749J1657446N536661o500262
$$ 20659034 8755875 741128 -1965361 -55666 8110083 19767529 25304190 18803928
6201A8803928j2414780p121562K881021J0158875J2951258R898779k463584k1609032
$$ 18803928 6389148 -732414 2148607 12307482 25258740 35157519 32693935 11084903
6193A1084903l4430765k8226297o166379J2725329J1951332m243333j3961247
$$ 11084903 -23345862 -51572159 -57738538 -45013209 -33061877 -37305210 -51266457
6186e1266457k237771J9593355K6067171R724837q673871p438955Q503584J7651003
$$ -51266457 -53504228 -33910873 -7843702 1881135 -6792736 -14231691 -5728107 11922896
6178A1922896J1860851K069084k634907n676343j0221397r667288K075799J8936884
$$ 11922896 23783747 25852831 23217924 17541581 7320184 -2347104 -271305 18665579
6170A8665579K7319326J8319349n696501l0557971l6877099j6661092J4683678
$$ 18665579 45984905 64304254 58607753 28049782 -8827317 -25488409 -10804731
6163a0804731L1673159K5938800J1317288J254517o330451j7394358k7684978
$$ -10804731 20868428 46807228 58124516 59379033 53048582 35654224 7969246
6156G969246k8739557j9822328o994525L032704L910328o364583j7368823j2430399
$$ 7969246 -20770311 -40592639 -47587164 -44554460 -40644132 -47008715 -64377538 -76807937
6148g6807937J0054945L0974531L3556275K2393599J1492034M302079l170649
$$ -76807937 -66752992 -35778461 -2222186 20171413 31663447 35965526 32794877
6141C2794877q810820p700244l526510m060827q438652r319412m559237K234092
$$ 32794877 23984057 16283813 12757303 8696476 257824 -9061588 -13620825 -11386733
6133a1386733Q641626J2109521O900445p430805j8968109j5648151j569952Q677277
$$ -11386733 -2745107 9364414 16264859 8834054 -10134055 -25782206 -27352158 -18674881
6125a8674881Q981998N512965M457639N400641N137553P74110q123803j5141324
$$ -18674881 -9692883 -4179918 277721 5678362 10815915 11590025 3466222 -11675102
6117a1675102j1171384R48461N736190k043517n876405P666145K5100623K5850337
$$ -11675102 -22846486 -21898025 -16161835 -18205352 -24081757 -16415612 8685011 34535348
6109C4535348J5424597J4809719K2492604J5043397j2250590l2927324k7646761
$$ 34535348 49959945 64769664 87262268 102305665 90055075 57127751 29480990
6102B9480990j2359993j3224275k9007350l5020462j6805890J3455173L1913548
$$ 29480990 17120997 3896722 -25110628 -60131090 -76936980 -63481807 -31568259
6095c1568259K7089580R691076j85569K678347K051596j5068653l5155580l4351108
$$ -31568259 -4478679 5212397 5026828 7705175 9756771 -5311882 -40467462 -74818570
6087g4818570j2937479N589297Q824599P231441Q779874N601096m840260p458104
$$ -74818570 -87756049 -82166752 -73342153 -66110712 -57330838 -51729742 -56570002 -64028106
6079f4028106P046286K4051672K6344455J9553357J9840849K7525960K9684845
$$ -64028106 -56981820 -32930148 -6585693 12967664 32808513 60334473 90019318
6072I0019318K0873833O152578r684141k2307239k4370721j5317000p809584j0957644
$$ 90019318 110893151 117045729 107361588 85054349 60683628 45366628 37557044 26599400
6064B6599400j4476250m479064J1898174J5255938L630320m667341J925542J4395921
$$ 26599400 12123150 7644086 19542260 34798198 38428518 33761177 35686719 50082640
6056E0082640J8339901R268477r100321k8472303l5339045k0293989O952291K3334827
$$ 50082640 68422541 77691018 68590697 40118394 4779349 -15514640 -8562349 14772478
6048A4772478J8979930Q130033P790889J5445268J6249267M538136j2036679k5561478
$$ 14772478 33752408 41882441 49673330 65118598 81367865 85906001 73869322 48307844
6040D8307844l4467418l7388876l0044816j2459061O252152J5909872J6271070
$$ 48307844 13840426 -23548450 -53593266 -66052327 -59800175 -43890303 -27619233
6033b7619233J5067751J5505552J1880252N37790j0714135j1008158j550525N520016
$$ -27619233 -12551482 2954070 14834322 15372112 4657977 -6350181 -7900706 -2380690
6025b380690L225567l070164n679105l463265K251243J1970367K2396372K3584497
$$ -2380690 844877 -2225287 -7904392 -11367657 -9116414 2853953 25250325 48834822
6017D8834822R895869r642460j9267909j3701344k389339K294914l198902j2760130
$$ 48834822 58730691 49088231 29820322 16118978 13729639 16024553 12825651 65521
6009F5521j7881630j5613451j0431507p345638m322493M099500J6022023K1960204
$$ 65521 -17816109 -33429560 -43861067 -51206705 -55529198 -51429698 -35407675 -13447471
6001a3447471J7706801J0135995N683966K37518j2000099k4608541k3957860q192508
$$ -13447471 4259330 14395325 20079291 20316809 8316710 -16291831 -40249691 -48442199
5993d8442199P361768P908345k540101o866383J441559P641698m564418k6626558
$$ -48442199 -41080431 -33172086 -35712187 -42578570 -41137011 -33495313 -38059731 -64686289
5985f4686289l0705345n356666K6657283L6105166K2970430J0500899J0644334
$$ -64686289 -95391634 -100748300 -74091017 -37985851 -15015421 -4514522 6129812
5978F129812J3220301P983965q30394n829424p395297p895246o655632n252719
$$ 6129812 19350113 27334078 26503684 20674260 13278963 5383717 -1271915 -6524634
5970f524634p847342j3337624j6094928j4258230p508108Q701676L1589888M0083185
$$ -6524634 -14371976 -27709600 -43804528 -58062758 -65570866 -56869190 -25279302 14803883
5962A4803883J8297978j2562409j3932134J5038920L2482380J3284232j7306665
$$ 14803883 33101861 20539452 6607318 21646238 54128618 67412850 50106185
5955E0106185k4896643j1282604K015679R108223J4208579J2579046J852660n902361
$$ 50106185 25209542 13926938 15942617 25050840 39259419 51838465 53691125 47788764
5947D7788764n101135q582886j6842327k904917M1020682O9097686L6177603l1606770
$$ 47788764 42687629 34104743 17262416 14357499 55378181 124475867 160653470 129046700
5939A29046700o5805656m4720734q443840Q553265J1430541R762395l397448k4719660
$$ 129046700 63241044 18520310 10076470 18629735 30060276 39822671 36425223 11705563
5931A1705563l2504406k0282978o548641k89251J0626538K6484237K6438807P116695
$$ 11705563 -20798843 -41081821 -47630462 -47919713 -37293175 -10808938 15629869 22746564
5923B2746564k948217J3895801L6431007L8279477K2837445O032142r540278k3213080
$$ 22746564 19798347 33694148 70125155 108404632 131242077 137274219 127733941 104520861
5915A04520861k3598523r020197L14613r197700k3036987k3340725j4944754r176350
$$ 104520861 80922338 71902141 72216754 63019054 39982067 16641342 1696588 -7479762
5907g479762l284455N252815O063053k469842j511673J6680113K8793871J6242941
$$ -7479762 -10764217 -5511402 551651 -1918191 -3429864 13250249 42044120 58287061
5899E8287061k366073k074139P296136J951893j3511888j8355187j3979814j4797706
$$ 58287061 55920988 53846849 61142985 63094878 49582990 31227803 17247989 2450283
5891B450283j4683752L41420J6770543J0064258j0345943j2437641N082528J1678978
$$ 2450283 -12233469 -11892049 4878494 14942752 4596809 -7840832 -2758304 8920674
5883H920674j584039r210529J023178P938604k579581j3889952j2046908r646828
$$ 8920674 7336635 -1873894 -850716 7087888 4508307 -9381645 -21428553 -31075381
5875c1075381j6965764j9557611o436958O742668O801024J0333241L3855095N7321204
$$ -31075381 -48041145 -67598756 -74035714 -67293046 -60492022 -50158781 -16303686 41017518
5867D1017518M9852508J9179690K208760J0674370J7397450K20266k6592067l4845632
$$ 41017518 90870026 110049716 112258476 122932846 140330296 140550562 113958495 79112863
5859G9112863j8854682J934024P688627k840208j4650629j4339239o227110p375867
$$ 79112863 60258181 62192205 69880832 67040624 52389995 38050756 31823646 24447779
5851B4447779k3700959l8829073l4820053j5857922J349582J3745208L0253849
$$ 24447779 746820 -38082253 -72902306 -88760228 -87410646 -73665438 -43411589
5844d3411589M6075600M1086558J1430147j6696993j8742701l426569L556453
$$ -43411589 2664011 43750569 55180716 38483723 19741022 16314453 19870906
5837A9870906k957735o120235J757591Q265036L827645l467117l216838K348118
$$ 19870906 16913171 10792936 12550527 20815563 24643208 21176091 17959253 20307371
5829B0307371P158196J1484877J3956867O622039j0416372k1425064j5328206
$$ 20307371 27465567 38950444 52907311 59529350 49112978 27687914 12359708
5822A2359708k786480Q59212j835491j151515j028479q193656j1690728R03244
$$ 12359708 9573228 10432440 8596949 7445434 6416955 -1776701 -13467429 -12564185
5814a2564185J5070684P280142j3152279j4616162L508891P052770j3930346k3031816
$$ -12564185 2506499 9786641 -3365638 -17981800 -14472909 -7420139 -21350485 -44382301
5806d4382301M705310L8949649L7505267N903600j8479727k0497614j2447532
$$ -44382301 -39676991 -727342 36777925 42681525 24201798 3704184 -8743348
5799h743348k162956R547412J0854258p512210k6860190k0752694K694051R423790
$$ -8743348 -10906304 -1358892 9495366 1983156 -24877034 -45629728 -42935677 -33511887
5791c3511887j0029495k7833071j9963773N253195K4458228K4581667P851842
$$ -33511887 -43541382 -71374453 -91338226 -86085031 -61626803 -37045136 -29193294
5784b9193294j1037441j3147558K952347J3002257l26686j6345509m594295K4052764
$$ -29193294 -40230735 -53378293 -50425946 -37423689 -37750375 -54095884 -58690179 -34637415
5776c4637415K8756667M23878k4064191j6302945Q350230K1518718J8030898P271363
$$ -34637415 -5880748 -5456870 -29521061 -45824006 -37473776 -15955058 2075840 9347203
5768I347203n463130j3521750p209847P759233R985709o503984k0099639j2367334
$$ 9347203 3884073 -9637677 -16847524 -9088291 897418 -5606566 -25706205 -38073539
5760c8073539Q224802K4083101K9781144K5040769Q240871j1115028j5289588
$$ -38073539 -29848737 -5765636 24015508 49056277 57297148 46182120 30892532
5753C0892532n584365l578634j3604849j2069693R507119K2042457M287294j8256973
$$ 30892532 25308167 21729533 8124684 -3945009 5562110 27604567 31891861 13634888
5745A3634888j2061756J0137526J1459730q144513j3719103O848780K5122843
$$ 13634888 1573132 11710658 23170388 15025875 1306772 8155552 33278395
5738C3278395J6701687p182606k0991209j5107826K764885J8679158J9220345
$$ 33278395 49980082 42797476 21806267 6698441 9463326 28142484 47362829
5731D7362829J956897j7095038j9166902o964384J97480m344555n894593P143980
$$ 47362829 49319726 32224688 13057786 6093402 6290882 1946327 -3948266 3195714
5723C195714K3868636K3644374J371217k5630015l3977005j6635498J0030077
$$ 3195714 27064350 50708724 52079941 26449926 -7527079 -24162577 -14132500
5716a4132500K3439858J7994624N473555m421601j0968839j0792715J664295J7207923
$$ -14132500 9307358 27301982 32775537 28353936 17385097 6592382 8256677 25464600
5708B5464600J6405438L03278n623188Q554832J7624393J218261k0634664j8954885
$$ 25464600 41870038 42173316 36550128 45104960 62729353 63947614 43312950 24358065
5700B4358065k838448k499533j8903793k5528160j3982086l284327l889266m017373
$$ 24358065 21519617 19020084 116291 -25411869 -39393955 -42678282 -46567548 -50584921
5692e0584921M135767J1333005R662101K311237p549327j7873291j8570224k124731
$$ -50584921 -46449154 -35116149 -25454048 -23142811 -30692138 -48565429 -67135653 -69260384
5684f9260384J8990259K7029000K5668104K7419646K3421850r52306k6932580
$$ -69260384 -50270125 -23241125 2426979 29846625 53268475 52316169 25383589
5677B5383589k0723820P400307Q820297k6852746m8234902j8532057K7514941
$$ 25383589 4659769 12060076 20880373 -5972373 -54207275 -72739332 -45224391
5670d5224391L6096622R123501j1990545j1330373n162735K52218J4620422L2245334
$$ -45224391 -9127769 -4268 -11994813 -23325186 -28487921 -28235703 -13615281 18630053
5662A8630053L2563387J4439588o89606l931804r718840k4866041l2172485j7226407
$$ 18630053 51193440 65633028 64943422 61011618 51292778 26426737 -5745748 -22972155
5654b2972155O860624J6174222O850302m268288n098445j986469n235072r545755
$$ -22972155 -16111531 62691 6912993 2644705 -2453740 -4440209 -9675281 -19221036
5646a9221036K13095K2059961K9098086K726167l4292594m0185932j0506706J3306120
$$ -19221036 -19007941 3052020 32150106 34876273 583679 -39602253 -50108959 -36802839
5638c6802839J828607k1180142j5745851J5803682L4995487K2855920J244997
$$ -36802839 -34974232 -56154374 -71900225 -56096543 -21101056 1754864 2999861
5631B999861k276677J1975147K3721360J8794463M67555j6036973j6303249j16383
$$ 2999861 723184 12698331 36419691 55214154 55681709 39644736 23341487 23225104
5623B3225104J6881398J9431424Q085956o253953j7194770k4431803k6620402
$$ 23225104 40106502 59537926 67623882 61369929 44175159 19743356 -6877046
5616f877046k2853023j7466871j4615036j2107354p896784n748379n758370J716742
$$ -6877046 -29730069 -47196940 -61811976 -73919330 -81816114 -87564493 -93322863 -91606121
5608i1606121K0593086L6129454L2138098J4235179M45392m595083q269185q966926
$$ -91606121 -71013035 -34883581 -2745483 11489696 11935088 7340005 -929180 -9896106
5600i896106J514629J5729971J3709913p136175k5086339k3618065j0175483J864167
$$ -9896106 -8381477 7348494 21058407 13922232 -11164107 -34782172 -44957655 -43093488
5592d3093488J2222734K3842298K9327612K1697308Q971076L964893N019980m62686
$$ -43093488 -30870754 -7028456 22299156 43996464 52967540 56932433 61952413 61489727
5584F1489727j5462482k7349647k4094776r145237L845355Q138330J0400240J7616816
$$ 61489727 46027245 18677598 -5417178 -14562415 -10717060 -2578730 7821510 25438326
5576B5438326K2680671J2608646r244271k2921697j9353765j2565013j3387221
$$ 25438326 48118997 60727643 51483372 28561675 9207910 -3357103 -16744324
5569a6744324q755586J2809119L0936233J8064045j3922288k5819109r289846
$$ -16744324 -25499910 -12690791 18245442 36309487 22387199 -3431910 -12721756
5562a2721756L706912l536787o865272J1077925K5016552P938463k1451726k6881859
$$ -12721756 -9014844 -12551631 -19416903 -8338978 16677574 24616037 3164311 -23717548
5554b3717548q943053N362001J1443313K4799360L8621955K7639695l754140j8781412
$$ -23717548 -32660601 -27298600 -15855287 8944073 47566028 75205723 71451583 52670171
5546E2670171l493720J2698456O262728n789108r78463J0442304R085328K525506
$$ 52670171 49176451 61874907 68137635 62348527 61370064 71812368 80897696 83423202
5538H3423202O652397J0230412o878145l1102025k7687557M876454K6766113J0782279
$$ 83423202 90075599 100306011 93427866 62325841 34638284 39514738 66280851 77063130
5530G7063130k2726788l6235136j9414438Q888342K6204813K1445056k458795
$$ 77063130 54336342 18101206 -1313232 7575110 33779923 55224979 52766184
5523E2766184k8049314l3812274j5037288J1264807K6356258K5779217J3210059
$$ 52766184 24716870 -9095404 -24132692 -12867885 13488373 39267590 52477649
5516E2477649p140371k5345294k7791763j4225709k13685N744625J2027949K1022530
$$ 52477649 45337278 19991984 -7799779 -22025488 -22239173 -16494548 -4466599 16555931
5508A6555931J7033238n249196k0531384p136594J4444234R275059j5670485k0026301
$$ 16555931 33589169 28339973 7808589 671995 15116229 24391288 8720803 -11305498
5500a1305498O465649K8228938J9832533O4226o241811n975342j3573493j8150894
$$ -11305498 -4839849 23389089 43221622 43285848 37044037 31068695 17495202 -655692
5492f55692m638473J3336746J3372308K353305K647434J0601225K777246j9770672
$$ -655692 -5294165 8042581 21414889 23768194 26415628 37016853 39794099 20023427
5484B0023427k7090151m823503K5168836L6808983K9243619J5487666J937648
$$ 20023427 -7066724 -11890227 13278609 50087592 79331211 94818877 96756525
5477I6756525j0378650j9479464k5643561k8722084j9908545O923921L3662846
$$ 96756525 86377875 66898411 41254850 12532766 -7375779 -451858 33210988
5470C3210988L0424047k610160k8997091k4046547o100921k749105q746949l255746
$$ 33210988 63635035 61024875 32027784 7981237 1880316 -868789 -9615738 -12871484
5462a2871484Q344968K918845j6235392j7722263R447208L4402685K5844396n329001
$$ -12871484 -4526516 -1607671 -17843063 -35565326 -26118118 8284567 34128963 28799962
5454B8799962k2957139j3144159M430681Q542949J090341m712744o587262j1938027
$$ 28799962 5842823 -7301336 -2870655 5672294 6762635 2049891 -4537371 -16475398
5446a6475398j9780773j7672173p06048J6489449J6333497K270346n267260L146028
$$ -16475398 -36256171 -53928344 -54634392 -38144943 -21811446 -19541100 -24808360 -21662332
5438b1662332J3851491J0588598l453803j2822865j2236977j0637104j3923107
$$ -21662332 -7810841 2777757 -676046 -13498911 -25735888 -36372992 -50296099
5431e0296099j3812498J170484K7466237M4975234L6451690O873369k0837482
$$ -50296099 -64108597 -62938113 -35471876 9503358 45955048 52828417 31990935
5424C1990935k9986995k3687572j2103167K375547J7158257J8471045k137704
$$ 31990935 2003940 -21683632 -33786799 -31411252 -14252995 4218050 2080346
5417B080346k5536272k2715095L954506K1573988J4475180M471982J1356229K0777285
$$ 2080346 -23455926 -46171021 -42216515 -20642527 -6167347 -1695365 9660864 30438149
5409C0438149J2205218n045789j0526300q397028j3875970j8423556k985746K2263919
$$ 30438149 42643367 37597578 27071278 18674250 4798280 -13625276 -16611022 5652897
5401E652897K7809733J2291883L665846J0476506R897534o587521j3803322L039064
$$ 5652897 33462630 45754513 49420359 59896865 69794399 63206878 49403556 52442620
5393E2442620J8861913P911126j4737505j9039649p185011n058745j8804139k8258513
$$ 52442620 71304533 79215659 64478154 45438505 38253494 33194749 14390610 -13867903
5385a3867903j9043599P08677J3347085O677433j8130430m1451329l8114421p963589
$$ -13867903 -32911502 -32202825 -18855740 -12178307 -30308737 -71760066 -109874487 -117838076
5377a17838076J9755635K5787385K5829008L7381242M4326646K4014511r013094
$$ -117838076 -98082441 -72295056 -46466048 -9084806 35241840 59256351 50243257
5370E0243257k3007336k0003692k5593840l4920458j6518403K6058677M5548263
$$ 50243257 27235921 7232229 -18361611 -53282069 -69800472 -43741795 1806468
5363A806468K0195289j2269082j3671722O96889k132654j6469173j5105037O49271
$$ 1806468 22001757 9732675 -3939047 -3242158 -5374812 -21843985 -36949022 -36299751
5355c6299751P981196N675725J1666051K4443586K3427641P119887k337470L416463
$$ -36299751 -28318555 -22642830 -10976779 13466807 36894448 44014335 41676865 45093328
5347D5093328O568149m376960j5312240j0304394N334699J6351555J6396707O892434
$$ 45093328 51661477 47284517 31972277 21667883 27002582 43354137 59750844 66643278
5339F6643278r077605k3644838k6773697j8916965j0963100p559110k410266N817524
$$ 66643278 57565673 33920835 7147138 -11769827 -22732927 -30292037 -32702303 -26884779
5331b6884779O924360m083153j5417329j2435777M561930K2231072K6758702J2050720
$$ -26884779 -19960419 -24043572 -39460901 -51896678 -47334748 -25103676 1655026 13705746
5323A3705746j4545514l1776408k1776460P118807K6026266J8740762k147789
$$ 13705746 -839768 -32616176 -54392636 -47273829 -21247563 -2506801 -4654590
5316d654590j5800555j4826872j189249K0887060L6998864K6392590r290893l6429971
$$ -4654590 -20455145 -35282017 -36471266 -15584206 21414658 47807248 38516355 2086384
5308B086384k8713584l660452K910487j1378900j7552232n373228J008580j4536893
$$ 2086384 -26627200 -30287652 -27377165 -38756065 -56308297 -61681525 -60672945 -75209838
5300g5209838l0620564j8335857J8442354N1097977O1403736N0977466K6362881
$$ -75209838 -105830402 -124166259 -105723905 -54625928 6777808 57755274 84118155
5293H4118155n391032l1264201m1081743m0827522m2022271m0476270k3458721
$$ 84118155 78727123 47462922 6381179 -34446343 -76468614 -116944884 -140403605
5286a40403605L174448J7327117J4997875J8465740L8185623N0014428L1088204
$$ -140403605 -137229157 -119902040 -104904165 -86438425 -48252802 1761626 32849830
5279C2849830j009234j2716696m626049l477059j0612611J068862L2762857M4574764
$$ 32849830 31840596 19123900 14497851 11020792 408181 1477043 34239900 78814664
5271G8814664J5029864k0693433k2202149m141968p068945k9278852l2864369
$$ 78814664 93844528 73151095 50948946 46806978 39738033 10459181 -22405188
5264b2405188r159616Q677632K366033n395116N054342J7170085R222283r771550
$$ -22405188 -31564804 -22887172 -20521139 -25916255 -20861913 -3691828 5530455 -4241095
5256d241095j6792510o900976R721051K4450384K8366401J3321641r221038j1428935
$$ -4241095 -21033605 -27934581 -18213530 6236854 34603255 47924896 38703858 27274923
5248B7274923J0907592K4140778M796328k0915868j4914664J3887721K3684688
$$ 27274923 38182515 62323293 67119621 46203753 31289089 45176810 68861498
5241F8861498K397498k0632396k3609934j7462100j6093458j2941874p18104Q425765
$$ 68861498 71258996 50626600 27016666 9554566 -6538892 -19480766 -20198870 -11773105
5233a1773105n62241k0530668k6661672l218331L7667186O2235746M5460389R19242
$$ -11773105 -12335346 -32866014 -59527686 -62746017 -25078831 37156915 82617304 83536546
5225H3536546k9355481k4128393p751575j0627045k3422397j7430934M079169
$$ 83536546 54181065 30052672 22301097 11674052 -11748345 -29179279 -25100110
5218b5100110J0977331k488548j0422595k352523J554421p155823o039559J6136076
$$ -25100110 -14122779 -16611327 -27033922 -29386445 -27832024 -34987847 -41027406 -24891330
5210b4891330L1937355J5244639j7759875l4256415k9657902j9336018m756361
$$ -24891330 7046025 22290664 4530789 -29725626 -59383528 -78719546 -83475907
5203h3475907K0436600M2552184L8573682J1674825j0491449j2310371k838835
$$ -83475907 -63039307 -20487123 18086559 29761384 19269935 6959564 4120729
5196D120729O382769J3238219J3523132n138k0707435k7899606j2178383J0860191
$$ 4120729 10503498 23741717 37264849 37259711 16552276 -11347330 -23525713 -12665522
5188a2665522J9188091Q297210q197719j5122468q955982J380374N007503J560274
$$ -12665522 6522569 14819779 6622060 -8500408 -17456390 -16076016 -11068513 -9508239
5180i508239J53793M305150N897358l33291o345907m706673k949702r989288j6714967
$$ -9508239 -9354446 -5049296 848062 514771 -5831136 -10537809 -13487511 -23476799 -40191766
5171d0191766q399912Q486842J3161195M275500L868818K0875591L2792854J8313057
$$ -40191766 -48591678 -40104836 -26943641 -22668141 -18799323 2076268 34869122 53182179
5163E3182179q532918j6719702j691758J1125851M836350q575400j3194386j5086277
$$ 53182179 44649261 27929559 26237801 37363652 42200002 33624602 20430216 5343939
5155E343939k7210497m0428803l1745808l85552K6044132K8193615J8424915J5744033
$$ 5343939 -21866558 -62295361 -94041169 -94426721 -68382589 -40188974 -21764059 -6020026
5147f020026J5997090O450207n012454j791012Q396013K505377j6817357k1120767
$$ -6020026 9977064 16427271 11414817 9623805 18019818 20525195 3707838 -17412929
5139a7412929k788703J1009847L978254k376128J0998704K3249884P105696k1818170
$$ -17412929 -20201632 -9191785 -5213531 -7589659 3409045 26658929 33764625 11946455
5131A1946455k4831724K138195K5224937K2487634N555071p506214j1119054k474043
$$ 11946455 -12885269 -10747074 14477863 36965497 42520568 35014354 23895300 21421257
5123B1421257J7829814L0511593J1458204k9866134n1454787l0453408Q109769
$$ 21421257 39251071 69762664 81220868 51354734 -100053 -30553461 -22443692
5116b2443692K6991500K0048195M684511q736770j8773310j8089419j012779J8382441
$$ -22443692 4547808 24596003 29280514 20543744 1770434 -16318985 -17331764 1050677
5108A050677J6846451o594755k4484493j2208430K2420880M6399525L5587877
$$ 1050677 17897128 11302373 -13182120 -25390550 -2969670 43429855 79017732
5101G9017732j989010l6651762m7438715l7506108k0654414l485756J1687411
$$ 79017732 77028722 40376960 -7061755 -44567863 -65222277 -68708033 -57020622
5094e7020622J6743604O147494q289154p584141Q712973K2055576K1597432J4808304
$$ -57020622 -40277018 -34129524 -42418678 -50002819 -41289846 -19234270 2363162 17171466
5086A7171466P681629o605997k8929986m0820887k6325214J869821J5028648M632441
$$ 17171466 24853095 18247098 -10682888 -51503775 -77828989 -75959168 -60930520 -56298079
5078e6298079p900504K7763K3276998L4449019J5860926j8480924l6379352k2559392
$$ -56298079 -64198583 -64170820 -40893822 -6444803 9416123 -9064801 -45444153 -68003545
5070f8003545N969721K2916066K1949898J3818344L980524r676543k0934170j7846973
$$ -68003545 -62033824 -39117758 -17167860 -3349516 631008 -9045535 -29979705 -47826678
5062d7826678m278579J46493j1758273k3257893j8315002k113068J1973612K0763277
$$ -47826678 -52105257 -51958764 -63717037 -86974930 -105289932 -107403000 -95429388 -74666111
5054g4666111K6104150K5620476K0508147J9601237K3610058J8764004m3438j3804681
$$ -74666111 -48561961 -22941485 -2433338 17167899 40777957 59541961 59498523 45693842
5046D5693842n059132J2263766R812586j4328644l2632888k4730960Q81571K2302116
$$ 45693842 40634710 52898476 62711062 48382418 15749530 -8981430 -8099859 14202257
5038A4202257K6155438J3378502l153650o254387P464723J7516615J509532l2579315
$$ 14202257 40357695 53736197 50582547 44328160 51792883 69309498 70819030 38239715
5030C8239715n1425856l6426460l919898J9113238K4563668K0599115J3180560
$$ 38239715 -13186141 -49612601 -53532499 -34419261 -9855593 10743522 23924082
5023B3924082K678052q197295j4817845j6827858j6206883j1033419K117292J9925775
$$ 23924082 26602134 18404839 3586994 -13240864 -29447747 -40481166 -38363874 -18438099
5015a8438099L1616874K8019452J0276820r914838j8867618j2449283j64238M578348
$$ -18438099 13178775 41198227 51475047 41560209 22692591 10243308 10079070 14657418
5007A4657418j351682r328745j1501323r553231q835256r372091p955387n704694
$$ 14657418 13305736 3976991 -7524332 -17077563 -25912819 -35284910 -43240297 -48944991
4999d8944991o473549q049836k576711J0601191J8721908R716984r672515j8647510
$$ -48944991 -55418540 -63468376 -66045087 -55443896 -36721988 -27005004 -36677519 -55325029
4991e5325029p216349J1284751J6817722N366829j0388014j6710422p740186J4756981
$$ -55325029 -62541378 -51256627 -34438905 -29072076 -39460090 -56170512 -63910698 -49153717
4983d9153717L9550174M7565548K8356267m753574k7348271l2015746l1294990
$$ -49153717 -9603543 37962005 66318272 61564698 34216427 2200681 -29094309
4976b9094309l2051105k4031141j484017J9654669K0467560O246752K85044J3296677
$$ -29094309 -61145414 -85176555 -86660572 -67005903 -46538343 -40291591 -40006547 -26709870
4968b6709870L0943090L2462512J3704551j0242653k1399011j6456208p869743
$$ -26709870 4233220 36695732 50400283 40157630 18758619 2302411 -5567332
4961e567332o383397o708948J784681J3574127J0106613j2897113l5321433l6551035
$$ -5567332 -11950729 -18659677 -16874996 -3300869 6805744 -6091369 -41412802 -77963837
4953g7963837j7752940O220959K4101149K8913818J5963354o639471j6943437
$$ -77963837 -95716777 -89495818 -65394669 -36480851 -20517497 -27156968 -44100405
4946d4100405l426155J8217092K5853355J8894931J0811686M458127n585207j3528286
$$ -44100405 -47526560 -29309468 -3456113 15438818 26250504 30708631 25123424 11595138
4938A1595138p728768O507369J1090982L516561O09489R613013J4909004K077944
$$ 11595138 3866370 10373739 21464721 24981282 25590771 35203784 50112788 52190732
4930E2190732j9932772l0644504k1889714k083605J4790351J7909161M955819
$$ 52190732 32257960 1613456 -20276258 -22359863 -7569512 10339649 15295468
4923A5295468j4482255k5095619j9093419p72289J9990424L2304682K6506759
$$ 15295468 813213 -24282406 -43375825 -44148114 -24157690 8146992 34653751
4916C4653751M047481j5685923j2270417R679560K4470414J8464033M842868k58910
$$ 34653751 38701232 23015309 10744892 20424452 44894866 63358899 68201767 67942857
4908F7942857o60391q104330j9589052k1034374p302487J3503462L0698745L4713790
$$ 67942857 67282466 59178136 39589084 18554710 11252223 24755685 55454430 90168220
4900I0168220J6377041k1384512n2441592m6757326p779976K5148260K3833282
$$ 90168220 106545261 85160749 32719157 -14038169 -21818145 3330115 27163397
4893B7163397O887013R206815K6314282K0328633j4990950l2372687J494524M6845379
$$ 27163397 34050410 43257225 69571507 89900140 74909190 42536503 44031027 90876406
4885I0876406L9663364j6579720n6326548m5740181j7129569K05722K3204466
$$ 90876406 130539770 113960050 57633502 11893321 -5236248 -5030526 18173940
4878A8173940N9442511O7655540K5222444j4515325j643503J0635842o4646727
$$ 18173940 77616451 145271991 170494435 155979110 154335607 164971449 100324722
4871A00324722j90656860k20573166r5466310O2235913J06207536M5931245n093
$$ 100324722 -90332138 -310905304 -406371614 -344135701 -237928165 -191996920 -192002013
4864a92002013K2057268N7912143N4320253K6192919P018476j060695o150250
$$ -192002013 -169944745 -112032602 -57712349 -31519430 -24500954 -25561649 -31711899
4857c1711899m216255n81813j4924139m1871070m1306449M516527N2608968N0365417
$$ -31711899 -35928154 -36509967 -51434106 -93305176 -134611625 -130095098 -77486130 -27120713
4849b7120713N972688k6374333k1111131n203057o819908j5399636q247922Q838666
$$ -27120713 -21148025 -47522358 -68633489 -73836546 -80656454 -96056090 -104304012 -95465346
4841i5465346J2608266K165872O27202J6063705K5318228Q601575j7275201j8623018
$$ -95465346 -82857080 -80691208 -80064006 -64000301 -38682073 -30080498 -47355699 -65978717
4833f5978717J0219912L9974026M2406959J7545009j4582395l3777505k9941505
$$ -65978717 -55758805 -15784779 26622180 44167189 29584794 -4192711 -34134216
4826c4134216r063803P852346N687274l874227J360195J7582814J8981162K630395
$$ -34134216 -43198019 -35345673 -29658399 -33532626 -32172431 -14589617 4391545 7021940
4818G021940j404598J9718314L2622981O766208l2449260l6408147m527262J7486711
$$ 7021940 5617342 25335656 57958637 64724845 32275585 -4132562 -8659824 8826887
4810H826887N876502j5336950k0815679j6424576j1986746K272664K9703887M6139034
$$ 8826887 14703389 -633561 -21449240 -37873816 -49860562 -47587898 -17884011 28255023
4802B8255023L2228213O981442O70517Q711083L322836j6776197k2003809j00476
$$ 28255023 60483236 67464678 68135195 76846278 80169114 63392917 41389108 41288632
4794D1288632K2091718J7489963l954720j4041763o087703L676757M589936P04923
$$ 41288632 63380350 80870313 76915593 62873830 56786127 60462884 65052820 65757743
4786F5757743m828653j3845730j9522138q341898J6333346K9685281J7203123
$$ 65757743 60929090 47083360 27561222 19219324 35552670 65237951 82441074
4779H2441074k354032k096152J4660708K1193091P665123q453323j4326311j9989983
$$ 82441074 80087042 77990890 92651598 113844689 121509812 113056489 98730178 78740195
4771G8740195l3923014m1382944k5973547m4290Q197410n993384j7251697n174009
$$ 78740195 44817181 3434237 -22539310 -22583600 -14386190 -20379574 -37631271 -42805280
4763d2805280J9805711L2150790K2053011K178984j0740133j2430063r205694
$$ -42805280 -22999569 9151221 31204232 33383216 22643083 10213020 1007326
4756A007326n941685j189882N794305R095019L003999p704506j1989304o984325
$$ 1007326 -4934359 -6124241 -329936 8765083 11769082 4064576 -7924728 -14909053
4748a4909053k03638L702918Q969723J7948884K3415374J7425681J425509j6784240
$$ -14909053 -15112691 -11409773 -2440050 15508834 38924208 56349889 57775398 40991158
4740D0991158k9897164l2633521k5041689j6357369j4640501j0880122J0672661
$$ 40991158 11093994 -21539527 -46581216 -62938585 -77579086 -88459208 -77786547
4733g7786547M1494219M8851651J9595276j6080287k3474258q189848J743310
$$ -77786547 -36292328 12559323 32154599 16074312 -7399946 -15589794 -13846484
4726a3846484K467489J0943114K3692535J6825484r304288k2232341p595285N428818
$$ -13846484 -11378995 -435881 23256654 40082138 30777850 8545509 950224 6379042
4718F379042r404403l0536856k0436606J4613137L1909507J5913069l83936J2653037
$$ 6379042 -3025361 -33562217 -53998823 -39385686 -7476179 8436890 8052954 20705991
4710B0705991L7062950L5924119P860982j4754130j6426000j7318206l3051457
$$ 20705991 57768941 93693060 101554042 86799912 70373912 53055706 20004249
4703B0004249m2879647k0755340J7708271K9176209J218082l1367375l4826309
$$ 20004249 -22875398 -43630738 -25922467 3253742 4471824 -26895551 -61721860
4696f1721860j4948016M345254J5578884K1433629J5176341n811093j9831287
$$ -61721860 -76669876 -72324622 -56745738 -35312109 -20135768 -25946861 -45778148
4689d5778148l425996L0277874M3057682K2291618m749991j1823801n525720o487751
$$ -45778148 -49204144 -18926270 24131412 46423030 41673039 29849238 24323518 17835767
4681A7835767j7620892k4693843j7857067j264976J3289287J5826801N644793
$$ 17835767 214875 -24478968 -42336035 -43601011 -30311724 -14484923 -8840130
4674h840130p316159j2016030o790451L280595J3783111J8106541N973006k0681665
$$ -8840130 -16156289 -28172319 -34962770 -31682175 -17899064 207477 6180483 -14501182
4666a4501182l7326217k1986782J1502206K6674974J2297223n316997l144716
$$ -14501182 -51827399 -73814181 -62311975 -35637001 -23339778 -28656775 -31801491
4659c1801491R060660J1998293Q097218J0820808J6996645J1425688o151706j7703651
$$ -31801491 -22740831 -10742538 -2645320 8175488 25172133 36597821 30446115 12742464
4651A2742464j1818747J659606O210040q40163q257973p450168k151466K83971
$$ 12742464 923717 2583323 8793363 7953200 -304773 -7754941 -9906407 -9622436
4643i622436J204517O208693J0727566K922288j5198558k3656057j0919817Q132353
$$ -9622436 -8417919 -2209226 8518340 11440628 -3757930 -27413987 -38333804 -30201451
4635c0201451J2838961L527704o121881j0622568r666941K617730K3761425L1320331
$$ -30201451 -17362490 -13834786 -19956667 -30579235 -40246176 -37628446 -13867021 17453310
4627A7453310J1405170j2400459r182780R661457P276375j7174749k5984274n114563
$$ 17453310 28858480 16458021 7275241 16936698 24213073 7038324 -18945950 -24060513
4619b4060513J4906875J1927150L461754O680537P471569n653147j3156686l5505
$$ -24060513 -9153638 2773512 6235266 12915803 20387372 14734225 1577539 1542034
4611A542034J1334075k891494k5004382k3517709l303404P501571M637023O061337
$$ 1542034 12876109 9984615 -15019767 -38537476 -41840880 -34339309 -29702286 -23640949
4603b3640949J4118624J3760965K838454n722020p655751p223284N94588K1289941
$$ -23640949 -9522325 4238640 7077094 1355074 -6300677 -13523961 -12929373 8360568
4595H360568L9194822L1214291M83830k6335711l3245769k6734375j8155885j3823723
$$ 8360568 47555390 78769681 79253511 52917800 19672031 -7062344 -25218229 -39041952
4587c9041952j7064578k1697046j1222607J7595198M1947856M3372739L5033294
$$ -39041952 -56106530 -77803576 -89026183 -71430985 -29483129 13889610 48922904
4580D8922904L4132959K6399699p328470m4436902m3176866o493747J9686283
$$ 48922904 83055863 109455562 102127092 57690190 14513324 8019577 27705860
4573B7705860J2947640k937004p576154j3266723k9919554l8341632k0466067
$$ 27705860 40653500 37716496 30140342 16873619 -13045935 -51387567 -71853634
4566g1853634R962749K6143072J8564995n003267k9243890l2440448k182153L9526420
$$ -71853634 -61890885 -35747813 -17182818 -22186085 -51429975 -83870423 -86052576 -46526156
4558d6526156N1384835K4912283k869372j534763J3651106J1647249q923243k5435775
$$ -46526156 4858679 29770962 26901590 25366827 39017933 50665182 41741939 16306164
4550A6306164k5447479j4797473k340649P493260J3899701J9954703K5874026
$$ 16306164 -9141315 -23938788 -26279437 -18786177 -4886476 15068227 40942253
4543D0942253K1476829K74765k0927370j9518403m369660o531331k8053295l3910123
$$ 40942253 62419082 62693847 41766477 22248074 17878414 11347083 -16706212 -50616335
4535e0616335o917034K3596968K6553043J1229650K770703M239314O708960J0625880
$$ -50616335 -57533369 -33936401 -7383358 3846292 6616995 10856309 17565269 28191149
4527B8191149J2975598o87922k6792416l4071664j0184503J1988731O045248k488472
$$ 28191149 41166747 40478825 13686409 -20385255 -30569758 -18581027 -12535779 -15024251
4519a5024251J7112280L9469486K0433954k5605425m3409639k1589576j091930
$$ -15024251 2088029 41557515 61991469 36386044 -7023595 -28613171 -29705101
4512b9705101r21913M408118K4211043K7465231J114512j8645189l390885K0582212
$$ -29705101 -30627014 -26218896 -2007853 25457378 26571890 7926701 4535816 25118028
4504B5118028J5891692q659127k0470243j7026655j8665776k3644752r991927
$$ 25118028 41009720 32350593 11880350 -5146305 -23812081 -47456833 -57448760
4497e7448760K1310349L8676039K1576225j2962479l3832839l0976258j8300430
$$ -57448760 -36138411 2537628 24113853 11151374 -22681465 -53657723 -71958153
4490g1958153j0288231o290436R10478Q621972O816194k005040l18259J6812498
$$ -71958153 -82246384 -88536820 -87626342 -79004370 -72188176 -74193216 -74511475 -57698977
4482e7698977K6631547R858999j5625955j8007491J02968Q171698q72438l367956
$$ -57698977 -31067430 -21208431 -36834386 -54841877 -54738909 -46567211 -47439649 -50807605
4474e0807605O406479K159515k3470348l4421621n728692L0576820K9256171k062115
$$ -50807605 -44401126 -42241611 -65711959 -100133580 -105862272 -75285452 -46029281 -48091396
4466d8091396j7893049o14039K5470467L6858858L2914984J8900981j426654j5890038
$$ -48091396 -65984445 -66598484 -41128017 -4269159 28645825 47546806 46120152 30230114
4458C0230114j2925657j014342K781476j86783K359484O136189j544362j1541493
$$ 30230114 17304457 16290115 19071591 18884808 21244292 27380481 25836119 14294626
4450A4294626l139772J7148364K1859937R803421R252103K5812134K6763457n292578
$$ 14294626 11154854 28303218 50163155 59966576 69218679 95030813 121794270 116501692
4442A16501692l9457298m1202861j9553653k861333N469212J6003901K0222053
$$ 116501692 77044394 35841533 16287880 13426547 18895759 34899660 55121713
4435E5121713L944095j9358113k2862001p043607M932301P613581J7495795L6432404
$$ 55121713 59065808 39707695 16845694 9802087 14734388 22347969 39843764 76276168
4427G6276168M1264123J7978898j6647602l6847056l5148095k1490707q909330
$$ 76276168 117540291 135519189 118871587 82024531 46876436 25385729 16476399
4420A6476399n347559q876474q428004J995329J2030203Q408773n149852j4754558
$$ 16476399 11128840 2252366 -6175638 -4180309 7849894 16258667 11108815 -3645743
4412c645743j6986521j6775343j1695484J437258J0028920k41771j7362367j4883310
$$ -3645743 -20632264 -37407607 -49103091 -47665833 -37636913 -37878684 -55241051 -70124361
4404g0124361P540492K2570411J7515415R601833J1423979J0430956l706322j7403336
$$ -70124361 -62583869 -40013458 -22498043 -12896210 -1472231 8958725 5252403 -12150933
4396a2150933j5789084n748323K01919M151996J0951779J3730643P032916j156301
$$ -12150933 -27940017 -33688340 -33486421 -29334425 -18382646 -4652003 2380913 1224612
4388A224612l749463m739389m540321M540346J6929244J2481329q443523j5472897
$$ 1224612 -2524851 -7264240 -11804561 -7264215 9665029 22146358 13702835 -1770062
4380a770062O434720K9310324K4000801L174251n548071l790349p408793j1071032
$$ -1770062 4664658 33974982 57975783 61150034 55601963 51811614 44402821 33331789
4372C3331789m136537r24891j6002644k8129519j1248707J5155242J2926712j0931131
$$ 33331789 29195252 28270361 12267717 -15861802 -27110509 -11955267 971445 -9959686
4364i959686j7252438j815483M966441J060604J6057338M6323808M7552046Q026357
$$ -9959686 -27212124 -29027607 -24061166 -23000562 -6943224 39380584 86932630 94958987
4356I4958987k6602582k3657226p046646n428428o697466M580925R913635o562684
$$ 94958987 68356405 44699179 37652533 32224105 25526639 30107564 40021199 33458515
4348C3458515k2712665j6396222m835924r672849j5135961K66948J9575074J5666097
$$ 33458515 10745850 -5650372 -10486296 -20159145 -35295106 -35028158 -15453084 213013
4340B13013p24242j635782J0303247J3575570Q094591N886102L17976j6818081
$$ 213013 -511229 -2147011 8156236 21731806 29826397 35712499 36030475 19212394
4332A9212394k5838634o991238J8977284J9087182Q73750n743466k659926j1504790
$$ 19212394 -6626240 -13617478 5359806 24446988 25320738 19577272 16917346 5412556
4324E412556k0948674o97417L6643299M3650274J2266921j3115695o918485L577344
$$ 5412556 -15536118 -16233535 20409764 64060038 76326959 63211264 56292779 59870123
4316E9870123q380004k7432948k9505356j8466780p014949O771207K2450556K4720723
$$ 59870123 51490119 24057171 -5448185 -23914965 -30929914 -24158707 -1708151 23012572
4308B3012572P425418j3468344k4742149k9064435k3784138K084910L6755432
$$ 23012572 30437990 16969646 -7772503 -36836938 -60621076 -58536166 -21780734
4301b1780734M5732519K1291756j180192K738300J0273832m028954k1289274j1830450
$$ -21780734 23951785 45243541 44063349 46801649 57075481 53046527 31757253 19926803
4293A9926803J0249338P720978j8886595l1614291j2143926J6213560K5428637
$$ 19926803 30176141 37897119 19010524 -12603767 -24747693 -8534133 16894504
4286A6894504J3889849l361887j3467319j0220230K891283R729712m701995l3096901
$$ 16894504 30784353 27422466 13955147 3734917 6626200 16355912 11653917 -21442984
4278b1442984m8039862k9621394J2448864M4359960L6914295m093132l6944160
$$ -21442984 -69482846 -99104240 -86655376 -42295416 -5381121 -9474253 -46418413
4271d6418413k6086829J4073759L5348255J9162837r68559P726272K9557000K9499138
$$ -46418413 -72505242 -58431483 -23083228 -3920391 -4888950 2837322 32394322 61893460
4263F1893460P765308p545182r753838j8755841l8129219m3091331k1469073L050735
$$ 61893460 69658768 62113586 52359748 33603907 -4525312 -47616643 -69085716 -66034981
4255f6034981O457659J172263J3540436L6922460L5615516k009712l9657442l8133567
$$ -66034981 -59577322 -58405059 -44864623 -7942163 27673353 25663641 -13993801 -52127368
4247e2127368p868079Q037539k848739q039523J1774663K5309910K80697l5621107
$$ -52127368 -59995447 -51957908 -54806647 -62846170 -51071507 -25761597 -25480900 -61102007
4239f1102007k7140826K4484170N7774773L6780983n327839k4000813k0372738
$$ -61102007 -88242833 -63758663 -5983890 30797093 25469254 1468441 -18904297
4232a8904297j4367820r59115K8587496N0555973L6785487K462533j3780962o373329
$$ -18904297 -33272117 -34231232 -5643736 44912237 81697724 84160257 70379295 64005966
4224F4005966j259361o472727n096525M006018m62718k0959208k9744647j2133808
$$ 64005966 62746605 56273878 51177353 55183371 54720653 33761445 4016798 -8117010
4216h117010R106657Q943596m592516q162424K104093J1694260J1558354N014545
$$ -8117010 989647 9933243 5340727 -2821697 -717604 10976656 22535010 27549555
4208B7549555k297942p741625j0811322j2981365j4238930q780071P383493K4138883
$$ 27549555 25251613 17509988 6698666 -6282699 -20521629 -29301700 -21918207 2220676
4200B220676K5074786J1081371K724006J1618669K1339113Q648184k2509707m1271850
$$ 2220676 27295462 38376833 41100839 52719508 74058621 82706805 60197098 18925248
4192A8925248k5935302Q413544K5121266Q173702j8217729j8664158R903401L5939236
$$ 18925248 -7010054 1403490 26524756 34698458 16480729 -2183429 7719972 43659208
4184D3659208L3638698R864600j3141829k3878049k1087333n848799J0966234
$$ 43659208 77297906 87162506 74020677 50142628 29055295 23206496 34172730
4177C4172730J0402784p146475j2741007J0681955L5265628K4764909q870681
$$ 34172730 44575514 37429039 24688032 35369987 70635615 95400524 86529843
4170H6529843k1403377l187237J0065439k577530j7600622j2753511m891125j6237698
$$ 86529843 65126466 61939229 72004668 69427138 51826516 39073005 34181880 17944182
4162A7944182l1464152k1278158P436593J8923823J728289j5312530n626096J9256821
$$ 17944182 -13519970 -34798128 -27361535 -8437712 -6709423 -22021953 -27648049 -8391228
4154h391228K8425809J2784872p266504j1765570m823604k831336q783796j0750144
$$ -8391228 20034581 32819453 25552949 13787379 8963775 6132439 -2651357 -13401501
4146a3401501k965666O546471J1636385J5194430J5485132M525393j0478500p135517
$$ -13401501 -16367167 -9820696 1815689 17010119 32495251 37020644 26542144 19406627
4138A9406627J4922787K3799588P568696O250623M9363969Q6638736M2418131
$$ 19406627 34329414 58129002 65697698 71948321 121312290 207951026 250369157
4131B50369157o5704247j29841190q9829930o786172L0765934J6946406N99968
$$ 250369157 184664910 54823720 -35006210 -41792382 -11026448 5919958 6519926
4124F519926l601603j5735134l1068808k3804338j162791K874806j1906850r065911
$$ 6519926 2918323 -12816811 -43885619 -67689957 -68852748 -65977942 -77884792 -86950703
4116h6950703J9985426L7020363J8251961p807750o738222J1526638J6044266
$$ -86950703 -66965277 -29944914 -11692953 -19500703 -26238925 -14712287 1331979
4109A331979L030343q637861j3160301j9468249k5302921j6689098O971954K8070079
$$ 1331979 4362322 -4275539 -17435840 -36904089 -62207010 -78896108 -71924154 -43854075
4101d3854075L3569546K6728777J3891566m364501k2869626k7234563j1429815
$$ -43854075 -10284529 16444248 30335814 25971313 3101687 -24132876 -35562691
4094c5562691Q334055J0888494j684451p342580K667980R653577l574635k2822829
$$ -35562691 -27228636 -16340142 -18024593 -25367173 -22699193 -13045616 -16620251 -39443080
4086c9443080j9755154O027626K3381315J1992130j1314774j9404624j1744043
$$ -39443080 -59198234 -53170608 -29789293 -17797163 -29111937 -48516561 -60260604
4079f0260604p778942j3224146j2964570K882036K2606033K8363609J7862243
$$ -60260604 -68039546 -81263692 -94228262 -91346226 -68740193 -40376584 -22514341
4072b2514341L868590k699821k715284k648013l721695j984190J086405m152848
$$ -22514341 -18645751 -21345572 -24060856 -26708869 -30430564 -32414754 -31328349 -35481197
4064c5481197k0396099l1369682j8021787J3775435L6276309L3850034J8528982
$$ -35481197 -55877296 -87246978 -105268765 -91493330 -55217021 -21366987 -2838005
4057b838005N516595q442112k8152468l7484342j6363459K5269122N2046036M3750174
$$ -2838005 2678590 -5763522 -33915990 -71400332 -87763791 -62494669 -10448633 33301541
4049C3301541J5387269o165137j1196981p603269m564609m615773n862881m651389
$$ 33301541 48688810 42523673 31326692 23723423 19158814 14543041 8680160 4028771
4041D028771J679238J0052141J1240686j021370j8849137k1744604L736350M2945509
$$ 4028771 5708009 15760150 27000836 25979466 7130329 -14614275 -10877925 32067584
4033C2067584N9344170L1657705j8349900m7280617l8778201j6961387r615050
$$ 32067584 91411754 123069459 104719559 57438942 18660741 1699354 -7915696
4026g915696j5599141j7526238j0768534m928020n311705o763178k013933J1921332
$$ -7915696 -23514837 -41041075 -51809609 -56737629 -62049334 -68812512 -70826445 -58905113
4018e8905113L0101085L7774095K2790560m162883j5786873l194745J1705949
$$ -58905113 -28804028 8970067 31760627 27597744 11810871 8616126 20322075
4011B0322075J0341332M233863R626212J5425438K828674j8067172k2517664j3158505
$$ 20322075 30663407 34897270 44523482 59948920 62777594 44710422 22192758 9034253
4003I034253j4029928k5170981j8885564J2177989L5969866K4338855r353687
$$ 9034253 -4995675 -30166656 -49052220 -36874231 -904365 23434490 14080803
3996A4080803l1546777k8652157j1416705N521198J4259881J4405706J3548759
$$ 14080803 -17465974 -46118131 -57534836 -52013638 -37753757 -23348051 -9799292
3989i799292J8406578K1022712O663740k0360671l5448999k5907168p804240o28369
$$ -9799292 8607286 29629998 36293738 15933067 -19515932 -45423100 -53227340 -53855709
3981e3855709j032614N216284J8323414K6270889K3276698J4001556M711450j180649
$$ -53855709 -54888323 -49672039 -31348625 -5077736 18198962 32200518 36911968 35731319
3973C5731319l792949p577759j4502018j5602220j887546J5112386J2099724j0580734
$$ 35731319 31938370 24360611 9858593 -5743627 -7631173 7481213 19580937 9000203
3965I000203k3015999p374875J4278819J1601716j0329475k0336772m970573J7567491
$$ 9000203 -14015796 -21390671 -7111852 4489864 -5839611 -26176383 -31146956 -13579465
3957a3579465K3696391Q630346j3498955k2116104o693335K0010208L1468143
$$ -13579465 10116926 18747272 5248317 -16867787 -23561122 -3550914 27917229
3950B7917229J7920420k590433j1766844j4233879j9846903k0527983o177736
$$ 27917229 45837649 43247216 31480372 17246493 -2600410 -23128393 -29306129
3943b9306129R858332O693068j0982660k1146142j9496935j8968705j8158487
$$ -29306129 -19447797 -12754729 -23737389 -44883531 -64380466 -83349171 -101507658
3936a01507658j146259K8733023M5699171M0123036L1572584L1770830K3407536
$$ -101507658 -102653917 -73920894 -28221723 11901313 43473897 75244727 98652263
3929I8652263n404184l0803184k3538305O051965K0789910P042040j3026488j8142947
$$ 98652263 93248079 62444895 38906590 44958555 65748465 72790505 59764017 41621070
3921D1621070j3210991j2046220j3301433n824048J0370494K0709740J4781979
$$ 41621070 28410079 16363859 3062426 -2761622 7608872 28318612 43100591
3914D3100591J702689K72853J3434711K1076333O500855j7008880k1810185o335771
$$ 43100591 44803280 45076133 58510844 79587177 86088032 69079152 47268967 40933196
3906D0933196J158471j4060947k8566243j5625567J4183346L0128499K5215092
$$ 40933196 42091667 28030720 -535523 -16161090 -1977744 28150755 53365847
3899E3365847J5109621K516481k2340509m5045997l0355326K1848499N8537332
$$ 53365847 68475468 70991949 48651440 3605443 -26749883 -4901384 53635948
3892E3635948L8780194q410699k4521921j914296J5237148K327027j6683859j7213459
$$ 53635948 92416142 84005443 59483522 57569226 72806374 75133401 58449542 41236083
3884D1236083r842497j0811567j1183194m9234Q591600L52784r687394k248932
$$ 41236083 31393586 20582019 9398825 9349591 17941191 18293975 8606581 6357649
3876F357649Q963188k08378j8449308j4994886N940556J0487642m632069m288616
$$ 6357649 15320837 15112459 -3336849 -18331735 -12391179 -1903537 -6535606 -10824222
3868a0824222K1801873L5862815J4702852r109873k216134J2254235l955151l5245940
$$ -10824222 10977651 46840466 61543318 52433445 50217311 62471546 58516395 23270455
3860B3270455l6270575q021396N006920j0649652k0005679l890868J0616024K129397
$$ 23270455 -13000120 -21021516 -16014596 -26664248 -46669927 -50560795 -39944771 -37815374
3852c7815374p326207P077583L0197525L4700903K3815082J5031425L583304k3416333
$$ -37815374 -45141581 -38063998 -7866473 26834430 50649512 65680937 69264241 45847908
3844D5847908n0899370m9110424j8262321R786208J4192078M864227j192952o23412
$$ 45847908 -5051462 -54161886 -72424207 -62637999 -48445921 -43581694 -44774646 -45398058
3836d5398058K947923P601693R650561M699812m428077j0607596j2343848j0755378
$$ -45398058 -42450135 -34848442 -25197881 -20498069 -24926146 -35533742 -47877590 -58632968
3828e8632968j396738J6903176K9834574K2066471K021439o844972J65860M470762
$$ -58632968 -60029706 -43126530 -13291956 8774515 10795954 3950982 4116842 8587604
3820H587604l143054p619555L055166J5848549J3417728K421964K831631J6258649
$$ 8587604 5444550 -2175005 880161 16728710 30146438 32568402 35400033 51658682
3812E1658682K3059118J1353917n136767m802328J2343164K1229791J246281l5352208
$$ 51658682 74717800 86071717 80934950 76132622 88475786 109705577 110951858 75599650
3804G5599650n4645747m2665915k2118386j7922832k1418700q837099J5870713
$$ 75599650 20953903 -21712012 -43830398 -61753230 -83171930 -92009029 -76138316
3797g6138316K5384139J4111835P241946J7532433K3936730Q412553j3518548
$$ -76138316 -50754177 -36642342 -29400396 -11867963 12068767 20481320 6962772
3790F962772j9739936j5856104j8217056k1746447j2066529M352765J0241521
$$ 6962772 -12777164 -28633268 -46850324 -68596771 -80663300 -76310535 -66069014
3783f6069014P128130O775223K769265j7117324l5512240j8951979K8784387O1163476
$$ -66069014 -58940884 -52165661 -49396396 -66513720 -102025960 -120977939 -92193552 -31030076
3775c1030076M8878242J6634400L974677J3511429J8653485O163505j1303666
$$ -31030076 17848166 34482566 38457243 51968672 70622157 76785662 65481996
3768F5481996j8220231j3843077p000137l492027j282442L364849O350292o87206
$$ 65481996 47261765 33418688 26418551 22926524 21644082 25008931 31359223 30672017
3760C0672017j2967922j1883405N235586J0828245j3056290l5183948j2453696
$$ 30672017 17704095 5820690 11056276 21884521 8828231 -26355717 -38809413
3753c8809413L8940981N5521186J7038909k3848633k2999585p019143j7922404
$$ -38809413 131568 55652754 72691663 48843030 25843445 18824302 901898
3746I01898l8279241k3821734J5450127K5929367m517248k7276843o833734L1747699
$$ 901898 -37377343 -61199077 -45748950 -19819583 -24336831 -51613674 -58447408 -26699709
3738b6699709M5432500K8176549L808683j0345116j2801220p322164N31434N089138
$$ -26699709 18732791 46909340 50718023 40372907 27571687 20249523 20780957 25870095
3730B5870095P038055J0230900J0907685K473035r219463j0744070j781910M898291
$$ 25870095 32908150 43139050 54046735 56519770 47300307 36556237 34774327 39672618
3722C9672618L766455k91090p314429j9935381k6376494j0393904J8434530K9709848
$$ 39672618 43439073 43147983 35833554 15898173 -10478321 -20872225 -2437695 27272153
3714B7272153J4081737m911658r175877r513891j7935080k3162513j3004437N47587
$$ 27272153 41353890 36442232 27266355 17752464 -182616 -23345129 -36349566 -35801979
3706c5801979N23718p007253n748556K596853L836760m238063j2019655j5507353
$$ -35801979 -35278261 -42285514 -48034070 -45437217 -41600457 -45838520 -57858175 -73365528
3698g3365528j6460842j1785574O59425J0858317P164810m714922o637916R270360
$$ -73365528 -89826370 -101611944 -100952519 -90094202 -82929392 -87644314 -94282230 -85011870
3690h5011870L2054091M3626339L3108808N489436j8227087j7767462L058199
$$ -85011870 -52957779 -9331440 23777368 29266804 11039717 -6727745 -3669546
3683c669546J8951242J4790157K457860j269802J310862j310889r427783j5276882
$$ -3669546 15281696 30071853 32529713 31259911 32570773 31259884 21832101 6555219
3675F555219j6039121j1516797K13420J3574832J4957453L676204j473005Q863684
$$ 6555219 -9483902 -21000699 -20787279 -7212447 7745006 11421210 9948205 18811889
3667A8811889J5688752M95145k2662721k7007819j2677863j375790o9586L535058
$$ 18811889 34500641 34995786 12333065 -14674754 -27352617 -28728407 -28797993 -25262935
3659b5262935J3009448J5656401L860939j5107691l0369309l3291828j7140688
$$ -25262935 -12253487 3402914 7263853 -7843838 -38213147 -71504975 -88645663
3652h8645663J2074302L0830822K2949500K849739m625123J458416N271079M436704
$$ -88645663 -76571361 -45740539 -22791039 -19941300 -24566423 -23108007 -17836928 -13400224
3644a3400224O280295M009682j1410353k2824882o996180J9556811J5821221j8177561
$$ -13400224 -7119929 -3110247 -14520600 -37345482 -44341662 -24784851 -8963630 -27141191
3636b7141191l4247759p705843K5708137K6514078P423513L040909J4186138J7484295
$$ -27141191 -61388950 -69094793 -43386656 -16872578 -9449065 -6408156 7777982 25262277
3628B5262277R861441P534412J1681719P656572o057037j5340902j5109437j3494875
$$ 25262277 35123718 42658130 54339849 61996421 55939384 40598482 25489045 11994170
3620A1994170j2451007n360547N148227O229233m741337j3948408r748874L561622
$$ 11994170 -456837 -5817384 -669157 5560076 818739 -13129669 -22878543 -19316921
3612a9316921J3631417J2870628J721252j2915202k0907873j6859022o003397
$$ -19316921 -5685504 7185124 8906376 -4008826 -24916699 -41775721 -47779118
3605d7779118K062533M612456O390903J0667019J4749306J4185758Q137700O43811
$$ -47779118 -45716585 -41104129 -34713226 -24046207 -9296901 4888857 13026557 13670368
3597A3670368k439603P83336N402155M831612k073335j1469203j8992030j9790175
$$ 13670368 11230765 12014101 17416256 22247868 20174533 8705330 -10286700 -30076875
3589c0076875r325117Q950231K2330082K3726001K0575786J8524951P660409j7052792
$$ -30076875 -39401992 -30451761 -8121679 15604322 36180108 54705059 62365468 45312676
3581D5312676l3253670j6849904J4926483J9676315p615642k4476491o254990
$$ 45312676 12059006 -4790898 10135585 29811900 22196258 -2280233 -8535223
3574h535223J4798443J43137l5299467m6637143k2952124O538729J9892872K2662165
$$ -8535223 6263220 6406357 -28893110 -75530253 -98482377 -91943648 -72050776 -49388611
3566d9388611K3074306J7147138L971235o226570o793446l251502k549799m271717
$$ -49388611 -26314305 -9167167 -5195932 -11422502 -18215948 -21467450 -24017249 -28288966
3558b8288966m745146j750715M462123Q461603K317343j1503321j7009647m875540
$$ -28288966 -33034112 -34784827 -30322704 -21861101 -19543758 -31047079 -48056726 -52932266
3550e2932266J1319108J1737334k249359j0806186k700149J3064832K1292662
$$ -52932266 -41613158 -29875824 -32125183 -42931369 -45631518 -32566686 -11274024
3543a1274024J5802873J615193j0018520j0384762k433267K583681L97892k412777
$$ -11274024 4528849 6144042 -3874478 -14259240 -16692507 -14108826 -13710934 -16123711
3535a6123711k433809m275176o374737J179535J5199194J4454342r147757l1930298
$$ -16123711 -18557520 -22832696 -29207433 -28027898 -12828704 1625638 -7522119 -39452417
3527c9452417k8857499o673622J2475074K3603017L1811359K8982256O715134
$$ -39452417 -68309916 -74983538 -62508464 -38905447 -7094088 21888168 28603302
3520B8603302j8082749k0657266n077168N086339O171591J3316832K4372070J9724617
$$ 28603302 10520553 -10136713 -15213881 -10127542 -3955951 9360881 33732951 53457568
3512E3457568k54071j2082765r575327j3684467l1488323l8134707j6526353J2853792
$$ 53457568 53203497 41120732 31545405 17860938 -13627385 -51762092 -68288445 -55434653
3504e5434653K2059199J3514177O720934N158149p31128r178227q138912L389340
$$ -55434653 -33375454 -19861277 -13140343 -7982194 -8713322 -17891549 -26030461 -22641121
3496b2641121J2402608J0235912K392524j483044p53315l508493j2985295j7556852
$$ -22641121 -10238513 -2601 2389923 906879 153564 -3354929 -16340224 -33897076
3488c3897076l599265J9182810K1370399m830261k5334499p975912K7507244L4287857
$$ -33897076 -37496341 -18313531 3056868 -1773393 -27107892 -35083804 -7576560 26711297
3480B6711297N818562j7847626j1856280L740750N784636K402283P214432J0493466
$$ 26711297 32529859 14682233 2825953 6566703 12351339 14753622 21968054 32461520
3472C2461520n60843j6237570k1444307j9048135j5880496m830016J7263631L1527228
$$ 32461520 31900677 15663107 -5781200 -24829335 -40709831 -45539847 -28276216 3251012
3464C251012K1057096r7975n534242N177850Q567919p941188l1434454m0589643
$$ 3251012 24308108 24210133 18675891 23853741 32421660 24480472 -6953982 -47543625
3456d7543625k5613577L697010K3033117J6955942J529057O369288K9080698L3595958
$$ -47543625 -73157202 -69460192 -46427075 -29471133 -27942076 -21572788 7507910 41103868
3448D1103868O097703j8737008j0562497Q071071N6812k3891604k4090705P90156
$$ 41103868 47201571 28464563 17902066 25973137 26029949 2138345 -21952360 -21162204
3440b1162204J2121302m084987j5541029L102494L2233765L9217790K1256197
$$ -21162204 -9040902 -13125889 -28666918 -25564424 6669341 45887131 67143328
3433F7143328j305133j4683345j7718907j1843267k78656R513939J1930695P657246
$$ 67143328 65838195 51154850 33435943 21592676 21314020 30827959 42758654 50415900
3425E0415900n86286j0214123j6519285j6574274j4790309j5910349j4813844
$$ 50415900 49829614 39615491 23096206 6521932 -8268377 -24178726 -38992570
3418c8992570l721161J3064480K3271514K3388027J9591157J4426504M998026
$$ -38992570 -42713731 -29649251 -6377737 17010290 36601447 51027951 56025977
3411E6025977p146968j5930963j9131199j7781106j1777912m735265m295826o998954
$$ 56025977 48879009 32948046 13816847 -3964259 -15742171 -20477436 -24773262 -31772216
3403c1772216L536091K7684474L6469361J1905396j5584001m754107L1093555
$$ -31772216 -28236125 -551651 35917710 47823106 32239105 27484998 58578553
3396E8578553L8186918K326924l0136099k4030392m491485q913491k5964047j8934502
$$ 58578553 96765471 99092395 68956296 44925904 40434419 31520928 5556881 -13377621
3388a3377621J1719434K8060112J0487365j8449459k8639853j7121741j516007
$$ -13377621 -1658187 26401925 36889290 18439831 -10200022 -27321763 -28837770
3381b8837770N663974P436946J2882019K2452384K4570012J0444929r417833j3580309
$$ -28837770 -23173796 -15736850 -2854831 19597553 44167565 54612494 45194661 31614352
3373C1614352K592530J8752806J5585535q06425r004463K37516J5091230J7870856
$$ 31614352 34206882 52959688 68545223 67738798 58734335 58971851 74063081 91933937
3365I1933937M075692j1864061j0087548J1017294K8578569K1870678L8980j1300591
$$ 91933937 96009629 84145568 74058020 85075314 113653883 135524561 135563541 124262950
3357A24262950p038531o000775j6993514k4639128j6157956r51102P170756Q900106
$$ 124262950 117224419 111223644 94230130 69591002 53433046 52481944 59652700 68552806
3349F8552806R176313M789895n910462j5582773j9889501k1807270j7390441J994252
$$ 68552806 77729119 82519014 76608552 61025779 41136278 19329008 1938567 3932819
3341C932819K4805530K3223815l189777j6459520M634392K6828025J1327658k3826213
$$ 3932819 28738349 51962164 48772387 32312867 36947259 63775284 75102942 51276729
3333E1276729l0478594m203197J3109170L4465j9478258k3423220k2163676k6420626
$$ 51276729 20798135 16594938 29704108 29738573 10260315 -13162905 -35326581 -61747207
3325f1747207k0463004R017493M1394515M5323262K1213077p98836O9967J4108521
$$ -61747207 -82210211 -73192718 -31798203 13525059 34738136 33939300 34009267 48117788
3317D8117788J7933875K317292j8403837k2030429l475650J8834560K4917038
$$ 48117788 66051663 68368955 49965118 27934689 24459039 43293599 68210637
3310F8210637J5469028M848271j22908k371399l480229o141667k0352060m6940273
$$ 68210637 83679665 88527936 88405028 86033629 82553400 76411733 56059673 9119400
3302I119400o0177703l2369269K2679230N6437430M2997220P105128j3346836
$$ 9119400 -51058303 -83427572 -60748342 -4310912 38686308 45791436 32444600
3295C2444600r917101K990482J4710687K0516652J4068149k689170j2365364j965146
$$ 32444600 22527499 25517981 40228668 60745320 74813469 72124299 59758935 57793789
3287E7793789J7087975K2751946J0281431n485876j0566406m963298k35094j0079755
$$ 57793789 74881764 97633710 107915141 102429265 91862859 86899561 86664467 76584712
3279G6584712l5778895n6391718m5532270n533657K8376682K8575909P189963
$$ 76584712 40805817 -15585901 -61118171 -66651828 -38275146 -9699237 -2509274
3272b509274m529876L091346J3342371J0579627l077548j4975250j5249467n930326
$$ -2509274 -7039150 -3947804 9394567 19974194 16896646 1921396 -13328071 -19258397
3264a9258397r30965q612142j3514466O454447L9774228M4481284O650638l1926230
$$ -19258397 -20189362 -28801504 -42315970 -35861523 3912705 48393989 55044627 23118397
3256B3118397k9507258k618274N083028q707363j0461786O274384J1642539m953981
$$ 23118397 -6388861 -9007135 -3924107 -12631470 -23093256 -16818872 -5176333 -10130314
3248a0130314j6277083o265560L432980n585338j6332776p982324R527162J6645838
$$ -10130314 -26407397 -32672957 -29239977 -34825315 -51158091 -59140415 -49613253 -32967415
3240c2967415J5783124J7557608J6969263Q386427N328931J8538249K9771105
$$ -32967415 -17184291 373317 17342580 25729007 31057938 49596187 79367292
3233G9367292J5194877j6316734l4953440l1284441k0066277j0314138J395655
$$ 79367292 94562169 78245435 43291995 12007554 -8058723 -18372861 -16977206
3226a6977206J1437014R189717l011825j1840866j4380626j7005781j5336913
$$ -16977206 -5540192 3649525 637700 -11203166 -25583792 -42589573 -57926486
3219e7926486J040994K3494539K8442341J0828779q466841j3648531j0964241
$$ -57926486 -56885492 -33390953 -4948612 5880167 -2586674 -16235205 -27199446
3212b7199446q445025o08099J6101226L0400878L0123147J6347664l365184k2283902
$$ -27199446 -35644471 -36252570 -20151344 10249534 40372681 56720345 53355161 31071259
3204C1071259l0386899j9769147n56482O024372k436226n358373O868758J6395148
$$ 31071259 684360 -19084787 -19641269 -13616897 -16053123 -21411496 -14542738 1852410
3196A852410Q204639m754026m590176K422444J096234m175338m63557N745614
$$ 1852410 10057049 5303023 712847 3135291 4231525 56187 -407370 5338244
3188E338244j990779j8440663k0338636j506048J8073834K1031796J1448751R61036
$$ 5338244 3347465 -15093198 -35431834 -36937882 -18864048 2167748 13616499 14577535
3180A4577535p067880j3234162j4876600j0399482l600219M05100m28089m314311
$$ 14577535 7509655 -5724507 -20601107 -31000589 -34600808 -34195708 -34623797 -38938108
3172c8938108n684639k65903N806172O35073j2653666j1964531J4085603M3921148
$$ -38938108 -44622747 -44888650 -39082478 -38447405 -51101071 -63065602 -48979999 -5058851
3164e058851M7355866K3274385m972285k2552745l0091172k6099146r176695N489102
$$ -5058851 42297015 65571400 60599115 38046370 7955198 -18143948 -27320643 -21831541
3156b1831541j94162j6176740j4862506M205920J0631397p641925k2588525r164107
$$ -21831541 -22025703 -38202443 -53064949 -48859029 -38227632 -45869557 -68458082 -77622189
3148g7622189J7057153K5448409J2110068m728062j3522387j3004194j825912
$$ -77622189 -60565036 -35116627 -23006559 -27734621 -41257008 -54261202 -56087114
3141e6087114J4873473K0495349P264551r324505j2474323p235062m809989R6161
$$ -56087114 -41213641 -20718292 -13453741 -22778246 -35252569 -42487631 -47297620 -47201459
3133d7201459J4398183K4192294J3756991l972364m511153P787272O531869j2465250
$$ -47201459 -32803276 -8610982 5146009 1173645 -3337508 4449764 10981633 -1483617
3125a483617k4598418j6273220j733810O027103J3150053K3618006K5682795J3643599
$$ -1483617 -26082035 -42355255 -44089065 -38061962 -24911909 -1293903 24388892 38032491
3117C8032491K271951M149999R374273K827434j2214203k1707922j9883281q242627
$$ 38032491 40304442 44454441 53828714 56656148 44441945 22734023 2850742 -5391885
3109e391885J1415669K9399038K7048840M89092k4950205k2874174j235945R810905
$$ -5391885 6023784 35422822 62471662 62960754 38010549 15136375 13900430 23711335
3101B3711335N59741r654028o595490l82510k372270l476699Q369081K2620212
$$ 23711335 24271076 14617048 8021558 7639048 5266778 1790079 10159160 32779372
3093C2779372J8484688j951457j4213497q196392l849989j8354766l4972314k5586118
$$ 32779372 51264060 49312603 35099106 26902714 23052725 4697959 -30274355 -55860473
3085e5860473M822236K2458747J4293566N809010J8496750L5500201L0042115
$$ -55860473 -51038237 -28579490 -14285924 -8476914 10019836 45520037 75562152
3078G5562152P824789o069652r293455j9622609l5510327l3248687q087927J3056086
$$ 75562152 83386941 77317289 68023834 48401225 12890898 -20357789 -28445716 -15389630
3070a5389630J1095730j81274k921389l478933j1961184j5262405L365640L0550945
$$ -15389630 -4293900 -4475174 -7396563 -10875496 -22836680 -38099085 -34733445 -4182500
3062d182500L5108315J0095403j8621743k4963841p538499J6625601K8709065
$$ -4182500 30925815 41021218 22399475 -2564366 -10102865 6522736 35231801
3055C5231801J9494848l186103j9009365j6209672l920683M739130J1728180K2040554
$$ 35231801 54726649 51540546 32531181 16321509 12400826 17139956 28868136 50908690
3047E0908690K3953352L796679k4496905k9761149n758127J9674380K2624024
$$ 50908690 74862042 78658721 54161816 24400667 18642540 38316920 60940944
3040F0940944Q661969o460774j8683012k5861681j7969483L876442J5090758k463499
$$ 60940944 69602913 63142139 44459127 18597446 627963 4504405 19595163 17131664
3032A7131664k7954093k3934265J1238967L7926936K7156608l652976j8509713
$$ 17131664 -10822429 -34756694 -23517727 14409209 41565817 37912841 19403128
3025A9403128r387288K727318L916163K718292P712620R562629k413762j7769863
$$ 19403128 10015840 12743158 16659321 19377613 27090233 36652862 34239100 16469237
3017A6469237j6135821K124018J3452370L018012j5758974k1910125j4769881
$$ 16469237 333416 2457434 15909804 18927816 3168842 -18741283 -33511164
3010c3511164r030004j0964572j4283218j4732398j3250523o026029J2716560
$$ -33511164 -42541168 -53505740 -67788958 -82521356 -95771879 -101797908 -89081348
3003h9081348L5502847M3356522K8207182L246578j3209279j4572738m122297
$$ -89081348 -53578501 -10221979 17985203 21231781 8022502 -6550236 -10672533
2996a0672533J1614710K2577467K0108505R221226N830718J4921322K1727797
$$ -10672533 942177 23519644 43628149 52849375 58680093 73601415 95329212
2989I5329212J2280284p411721k1232928k2491542j5064605n024242k31144p532441
$$ 95329212 107609496 100197775 78964847 56473305 41408700 36384458 36153314 28620873
2981B8620873k0171018j9718598k262167J0820482L176235j0265068p594988L689084
$$ 28620873 8449855 -11268743 -13530910 -2710428 465807 -9799261 -17394249 -13705165
2973a3705165J446193j0187266p227280J0137757J5480440K392967l315437J0521719
$$ -13705165 -12258972 -22446238 -29673518 -19535761 -4055321 -1662354 -4977791 5543928
2965E543928J9501385M986424j2549151q515820M534059J745020r516770n333945
$$ 5543928 25045313 30031737 17482586 8966766 13500825 15245845 5729075 395130
2957C95130R254824Q154663r277588j6534343m006404R486441J1403008Q905674
$$ 395130 9649954 17804617 8527029 -8007314 -12013718 -2527277 8875731 17781405
2949A7781405M025216j0218728k2160187p166962K5828019L1850182m197968l5515980
$$ 17781405 21806621 11587893 -10572294 -17739256 8088763 39938945 35740977 224997
2941B24997j8097354K3913964L6398139J4918709L54289Q031844J1424716k306658
$$ 224997 -17872357 6041607 42439746 57358455 57712744 65744588 77169304 74862646
2933G4862646q698320P698373K3156964J2886160j0857874k2932855k3914254
$$ 74862646 66164326 73862699 97019663 109905823 99047949 76115094 52200840
2926E2200840k8332778l1924168j9261045M588422J6345730O764033r792442j7489165
$$ 52200840 23868062 -8056106 -27317151 -22728729 -6382999 381034 -9411408 -26900573
2918b6900573j3371256k34194J7361962K8279834K2483574P405061J719161P952679
$$ -26900573 -40271829 -40506023 -23144061 5135773 27619347 35024408 36743569 44696248
2910D4696248P141487j0110642k2573748n178996L0862897M5044355J7757498
$$ 44696248 51837735 41727093 19153345 13974349 44837246 89881601 107639099
2903A07639099k3253151l7216234k0075732l839266r471529k0141115r993820
$$ 107639099 84385948 47169714 27093982 23254716 13783187 -6357928 -16351748
2896a6351748J6376099L1028044K2194533O033884k010473o766468j5980196k1850229
$$ -16351748 24351 31052395 53246928 59280812 57270339 50503871 34523675 12673446
2888A2673446j4624348j983862J773843k334022l237373k85461o62725j247575
$$ 12673446 -1950902 -3934764 -2160921 -4494943 -7732316 -8017777 -8680502 -9928077
2880i928077O884942J7590273J4886702P05427n433637L70524j526333j8087844
$$ -9928077 -3043135 14547138 29433840 30139267 24705630 25076154 23549821 5461977
2872E461977k5345300n713137J8946299J7984629p80034n451787Q393680J5308714
$$ 5461977 -19883323 -25596460 -6650161 11334468 10554434 5102647 13496327 28805041
2864B8805041O891400M127780J5348997J7464979l781965k4962878j9320858L812139
$$ 28805041 35696441 39824221 55173218 72638197 68856232 43893354 24572496 28384635
2856B8384635J9041629K3530014K6638117J9005210j1862978m4570658m1885837
$$ 28384635 47426264 70956278 97594395 116599605 104736627 60165969 18280132
2849A8280132o746133J7112139P817726p537559k367838Q057033j586204k1689842
$$ 18280132 11533999 28646138 36463864 28926305 26558467 34615500 33029296 11339454
2841A1339454k4291222o497768J1460525J8949747J8730778Q941511j0556048
$$ 11339454 -12951768 -19449536 -7989011 10960736 29691514 38633025 28076977
2834B8076977k1836650q479405J2866569J0547191j4010398k7994399j9064533
$$ 28076977 6240327 -2239078 10627491 21174682 7164284 -20830115 -39894648
2827c9894648j0911566j7860384j9241770K076847K5929776K5285908P860243
$$ -39894648 -50806214 -68666598 -87908368 -85831521 -59901745 -34615837 -26755594
2820b6755594n20899K412294o40028j1826390j6613622j1570447o247519K99288
$$ -26755594 -27276493 -24864199 -25504227 -37330617 -53944239 -65514686 -71762205 -71462917
2812g1462917J7506152L6456574L2732532L883864j9975619j4926739O536157
$$ -71462917 -53956765 -17500191 15232341 19116205 -859414 -15786153 -9249996
2805i249996J7159934J0720468J093421k341846j801130K11497M833724J1085718
$$ -9249996 7909938 18630406 19723827 17381981 15580851 15792348 20626072 31711790
2797C1711790J5517490J6042753J0767769k218150j8422112k7020074k3983450
$$ 31711790 47229280 63272033 74039802 71821652 53399540 26379466 2396016
2790B396016j7337563j1545816K731122K9784623M9067659L4554119p443015m0029244
$$ 2396016 -14941547 -26487363 -23756241 6028382 55096041 89650160 82207145 42177901
2782D2177901l9754202k0974048r149224q128290p027808m118796m924148n121467
$$ 42177901 2423699 -18550349 -27699573 -35827863 -42855671 -46974467 -51898615 -57020082
2774e7020082M691837J9977157K6153470K1005235J5431270J1075592k651783
$$ -57020082 -52328245 -32351088 -6197618 14807617 30238887 41314479 38662696
2767C8662696k4267183l4226602k3813922j0070891p195476k691067J7049995
$$ 38662696 14395513 -19831089 -43645011 -53715902 -60911378 -63602445 -46552450
2760d6552450L4890586K5310585k046930j4092682o013116n202539j9112741j8540847
$$ -46552450 -11661864 13648721 11601791 -2490891 -8504007 -13706546 -32819287 -51360134
2752e1360134J0045301L2278130J5487768j7171826j9083613J0580893L0390530
$$ -51360134 -41314833 -9036703 6451065 -10720761 -29804374 -19223481 11167049
2745A1167049K2217636J0714701J2583312P555981k1562858n1711253m9063262
$$ 11167049 33384685 44099386 56682698 64238679 42675821 -9035432 -58098694
2738e8098694j7235213R820844J3371257N381248K527917N162196M460466l089118
$$ -58098694 -75333907 -65513063 -52141806 -46760558 -44232641 -39070445 -34609979 -37699097
2730c7699097j2134172j2981588n60771J6111612J8748997K093767j4554341r017140
$$ -37699097 -49833269 -62814857 -63375628 -47264016 -28515019 -26421252 -40975593 -49992733
2722d9992733J4967389L2874746L0229996J4678513j180900j2943973j7715329
$$ -49992733 -35025344 -2150598 28079398 42757911 41577011 28633038 10917709
2715A0917709j0450760N338335J5662683J3575080Q659353J0951861J5809767
$$ 10917709 466949 5805284 21467967 35043047 43702400 54654261 70464028
2708G0464028J4291535P861091O99393j2052387l2533087m5447801l4966063j1486759
$$ 70464028 84755563 92616654 93316047 81263660 48730573 3282772 -31683291 -43170050
2700d3170050M67482o12208O437397K4608940K7341756J239657k6724978k6290238
$$ -43170050 -42702568 -43314776 -36877379 -12268439 15073317 16312974 -10412004 -36702242
2692c6702242o910657K615018J151638J0420815L1615147M0153288K4654690J906849
$$ -36702242 -43612899 -40997881 -39846243 -29425428 2189719 42343007 66997697 68904546
2684F8904546j1797938j8239323k0217238j2353007K186429Q808968M967700M996931
$$ 68904546 57106608 38867285 18650047 6297040 8483469 17292437 22260137 27257068
2676B7257068J2925463J3882578K477834n826790m010175o309210j6024596j1683172
$$ 27257068 40182531 54065109 56542943 50716153 46705978 40396768 24372172 12689000
2668A2689000J1880648K1002641n830914l3453211j7800730K3636415L6696827
$$ 12689000 24569648 45572289 39741375 6288164 -11512566 12123849 48820676
2661D8820676J2646574o226171K78096N313394q171701j6794693l447662Q114855
$$ 48820676 61467250 55241079 55519175 60832569 52660868 35866175 32418513 40533368
2653D0533368p025826l2581120l6825539j7712144L114006J3146711J3731806
$$ 40533368 33507542 926422 -35899117 -53611261 -50497255 -37350544 -23618738
2646b3618738P550272N09346K227457R890624P701440n243750p707522Q152026
$$ -23618738 -16068466 -15559120 -13331663 -3441039 4260401 -983349 -8690871 -538845
2638e38845J8342910M207513j6139331j8032193q854144p454163o294536J0855911
$$ -538845 17804065 22011578 5872247 -12159946 -21014090 -28468253 -34762789 -23906878
2630b3906878K9325725K0880673o987916j7733711k24420J9775280K4358694K3467078
$$ -23906878 5418847 26299520 19311604 1577893 1353473 21128753 45487447 68954525
2622F8954525K3415392J1121362j6092565l5317800l1004961j9064825j8945945
$$ 68954525 92369917 103491279 87398714 52080914 21075953 2011128 -16934817
2615a6934817k2010433r377453J3574698K3831075J4750293K590794J81671J379439
$$ -16934817 -38945250 -48322703 -34748005 -10916930 3833363 6424157 6605828 7985267
2607G985267l835878j0525875m196426J6884893L2670408K1939112q656374k6577323
$$ 7985267 4149389 -6376486 -10572912 6311981 38982389 60921501 52265127 25687804
2599B5687804j1199589J9362561L0184784J1239619j6485134l1222106l0068231
$$ 25687804 14488215 33850776 64035560 75275179 58790045 27567939 -2500292
2592b500292k0071750p490989R46487Q61139j386014N278595K0011339L0723661
$$ -2500292 -22572042 -30063031 -29116544 -28255405 -29641419 -24362824 -4351485 26372176
2584B6372176L1284900K4809300J1174730j1201529l0138028k6757971l683096
$$ 26372176 57657076 82466376 93641106 82439577 52301549 25543578 21860482
2577B1860482J3275547R852574O79379J383478L195523q198904k4332778k4877560
$$ 21860482 35136029 44988603 45667982 47051460 50246983 42048079 17715301 -7162259
2569g162259q375223O806636Q617425K733897j154217j632959k500796n293249
$$ -7162259 -15537482 -8730846 -113421 2620476 1466259 -166700 -2667496 -7960745
2561g960745o527414j12157J4791264K7389276K3468205K657960j9612077k9393533
$$ -7960745 -14488159 -14600316 190948 27580224 51048429 53706389 34094312 4700779
2553D700779k5130952j1267504N960656J4397510M366358j2871955j2712174Q067745
$$ 4700779 -20430173 -31697677 -25737021 -11339511 -6973153 -19845108 -32557282 -24489537
2545b4489537K3197370J5502678K509216N210673J1913705j94077k2256531k4701478
$$ -24489537 -1292167 14210511 16719727 21930400 33844105 33650028 11393497 -13307981
2537a3307981n265013O586094m060614j6779951j0720665M855875R352484J839064
$$ -13307981 -18572994 -11986900 -16047514 -32827465 -43548130 -38692255 -29339771 -27500707
2529b7500707k809313K563709J2115246J8645754J8970487J1704105p50056r391573
$$ -27500707 -30310020 -27746311 -15631065 3014689 21985176 33689281 32939225 23547652
2521B3547652m915128J1700565K7408223K7833456J1676031o321533j1744975
$$ 23547652 18632524 30333089 57741312 85574768 97250799 90929266 79184291
2514G9184291r630584j7204376l4741776l9656431k0723049p18249m097147j6258830
$$ 79184291 69553707 52349331 17607555 -22048876 -42771925 -43490174 -47587321 -63846151
2506f3846151m766136K5436104L4220836Q812993j2693328K287839L2413244L6667819
$$ -63846151 -68612287 -43176183 -8955347 -142354 -12835682 -10547843 21865401 58533220
2498E8533220J3891588l596782k482334r69200j1369521k0508861j3823814L181179
$$ 58533220 72424808 68828026 66345692 65376492 54006971 33498110 19674296 22855475
2490B2855475J5952378J7453801P083838j2497566k9897002k8727587o057224
$$ 22855475 38807853 56261654 63345492 50847926 20950924 -7776663 -13833887
2483a3833887K0374406K9837933J7785092n128429k4227260k7594815j2474834
$$ -13833887 6540519 36378452 54163544 49035115 24807855 -2786960 -15261794
2476a5261794Q228811J4439128J093949j5356194j8459886j0472198j991424N824934
$$ -15261794 -7032983 7406145 8500094 -6856100 -25315986 -35788184 -37779608 -31954674
2468c1954674J5973689K1767723J5167993M346434N019613J5377704J8002291
$$ -31954674 -15980985 5786738 20954731 25301165 30320778 45698482 63700773
2461F3700773Q145545L33553K141896K892709k205755M20975J5128737J9415532
$$ 63700773 71846318 72179871 74321767 77214476 75008721 75429696 90558433 109973965
2453A09973965k336273k6405802k2015572k470345n989184l0959132l4625205
$$ 109973965 107637692 81231890 59216318 56745973 50756789 19797657 -14827548
2446a4827548l398068K1139504O957556j9016257j7468908J997472O253636q29852
$$ -14827548 -18225616 2913888 9871444 -9144813 -26613721 -24616249 -18362613 -19192465
2438a9192465R184183L0606557K7907807k565708k2502870j0940109Q495187J1825540
$$ -19192465 -10008282 20598275 48506082 45940374 23437504 12497395 20992582 32818122
2430C2818122P088037O229275J483409r370843p833271J0929992J9474494J489612
$$ 32818122 39906159 46135434 47618843 38248000 30414729 41344721 60819215 62308827
2422F2308827j5046514m81890K6060558K6146937K259631j2219043j0024902j3684375
$$ 62308827 47262313 46780423 72840981 98987918 101247549 89028506 79003604 65319229
2414F5319229k7142133k6679284m127527J8107606K2838346J7339988J0324574
$$ 65319229 38177096 11497812 7370285 25477891 48316237 65656225 75980799
2407G5980799K36676o980072L79684J2486201M346533k1279033l1245056j4389080
$$ 75980799 76217475 69237403 69617087 82103288 86449821 65170788 33925732 19536652
2399A9536652K35485n067062o294728J4151507K7265100L655139l0195919k7594204
$$ 19536652 19772137 14705075 8410347 22561854 49826954 53482093 23286174 -4308030
2391d308030N740330K2733779R076464k346412P976446J7172667K973376k1708146
$$ -4308030 1432300 24166079 33242543 30896131 38872577 56045244 59018620 37310474
2383C7310474l3105815k7201657j1779080P738345K1512226J6708483j646994
$$ 37310474 4204659 -22996998 -34776078 -27037733 -5525507 11182976 9535982
2376I535982j1304548m723670Q29173m867963p562469K843295J1209216M223800
$$ 9535982 -1768566 -6492236 -5663063 -10531026 -18093495 -15250200 -4040984 182816
2368A82816l966680K978105J1513839p10112k4234355k7734048l813339K1521037
$$ 182816 -3783864 -805759 10708080 9997968 -14236387 -41970435 -45783774 -24262737
2360b4262737K5121486J0443882o321513j4404319r781163N004253J8015771J7117252
$$ -24262737 858749 11302631 4981118 -9423201 -19204364 -14200111 3815660 20932912
2352B0932912M415765p912364j4414938j7818278j7362286j0244858k698782l602152
$$ 20932912 25348677 17436313 3021375 -14796903 -32159189 -42404047 -45102829 -48704981
2344d8704981p071007J605894J9909376K5107478M612533k3960911l2278117j2989986
$$ -48704981 -55775988 -54170094 -34260718 -9153240 -4540707 -28501618 -60779735 -73769721
2336g3769721J4985026K8125079K1253675J1025828J5282770K7262684K0136972
$$ -73769721 -58784695 -30659616 -9405941 1619887 16902657 44165341 64302313
2329F4302313j3682078m1304602k8017012J1284990K7495801M648205j9078315
$$ 64302313 50620235 9315633 -18701379 -7416389 20079412 24727617 5649302
2322E649302q437773J9599026K4080599l080574l2795182l9508597k3564000M33394
$$ 5649302 -2788471 16810555 40891154 37810580 5015398 -34493199 -58057199 -57623805
2314e7623805J7140148J5662312p27098j1199916P91233K3056382K6947428M739309
$$ -57623805 -40483657 -24821345 -25548443 -36748359 -35957126 -12900744 14046684 18785993
2306A8785993j9680177k0967244j375971J5529076J2179670o803341k0968059
$$ 18785993 -894184 -21861428 -23237399 -7708323 4471347 -2331994 -23300053
2299b3300053j3713598J1322487L2695622L2122451J1871638j0308716j9258332
$$ -23300053 -37013651 -25691164 7004458 39126909 50998547 40689831 21431499
2292B1431499j1902621N170460K0340664K2928159J2310534n05816o006281p845935
$$ 21431499 9528878 14699338 35040002 57968161 70278695 69772879 63766598 55920663
2284E5920663j5306862k7697564l4140241k7442693j1498136M160772J1954203
$$ 55920663 40613801 12916237 -21224004 -48666697 -60164833 -56004061 -44049858
2277d4049858J0267563M770968L581269P526612R458015O760732P018359J4387790
$$ -44049858 -33782295 -29011327 -25430058 -17903446 -8445431 -1684699 5333660 19721450
2269A9721450J8559397Q299225r360909j5893140n334991R384657J3643477N330584
$$ 19721450 38280847 46580072 37219163 21326023 15991032 25375689 39019166 44349750
2261D4349750p585433j5196362j1832269j394391M559345o9557p976458r399892
$$ 44349750 36764317 21567955 9735686 8341295 12900640 12831083 4854625 -4545267
2253d545267m842289Q17323Q337425J6700326J4694513l924498k3401359k2934738
$$ -4545267 -9387556 -8570233 -232808 16467518 31162031 27237533 3836174 -19098564
2245a9098564o984492J416808m323049q517852l445530m42312m459539k897224
$$ -19098564 -26083056 -24666248 -28989297 -37507149 -40952679 -41394991 -45854530 -48751754
2237d8751754Q286149J1508243j874894r584932R020152L4229179K9247124l886795
$$ -48751754 -40465605 -28957362 -30832256 -40417188 -31397036 2832143 32079267 28192472
2229B8192472k2377138k219839K6584173K0419462j8012818m1659849j9838728
$$ 28192472 5815334 3595495 30179668 50599130 32586312 -9073537 -28912265
2222b8912265K1358000L0664054m390621m2209359m0386724q132855J0784611
$$ -28912265 -7554265 23109789 18719168 -23490191 -63876915 -72009770 -61225159
2215f1225159j297249j6195212m229084K4743071L8671773K6217694M526337p971246
$$ -61225159 -62522408 -78717620 -82946704 -58203633 -19531860 6685834 11212171 3240925
2207C240925r397060p339332p828941j2082718j4874200o643978J4922263L7106615
$$ 3240925 -6156135 -13495467 -21324408 -33407126 -48281326 -54925304 -40003041 -2896426
2199b896426M3667539L2186236J3088068m271637j5264664j4855461k735430P555167
$$ -2896426 40771113 72957349 86045417 81773780 66509116 51653655 48918225 56473392
2191E6473392J33417j9177061k5305834p816579J1901305R794023o063265q095113
$$ 56473392 56606809 37429748 12123914 4307335 16208640 26002663 19939398 11844285
2183A1844285Q710929J9563598Q368418q560334r808259j107018l72116m588863
$$ 11844285 20555214 40118812 48487230 39926896 30118637 29011619 28639503 24050640
2175B4050640J612183J1665972L813150j6383005j6211011R954508K3849541K955668
$$ 24050640 25662823 37328795 41141945 24758940 8547929 18502437 42351978 45307646
2167D5307646k0067097j2021569J097545k1349184n5066053l9267281K2064637
$$ 45307646 25240549 13218980 14316525 -7032659 -62098712 -101365993 -79301356
2160g9301356N5814964K8220248q880979o694164R359739l93749j5255329J437987
$$ -79301356 -23486392 4733856 -4147123 -10841287 -1481548 -1875297 -17130626 -15692639
2152a5692639K4538656L476658m5024469n2161479k223545M3688005M0185273
$$ -15692639 8846017 12322675 -32701794 -84863273 -87086818 -43398813 -3213540
2145c213540J4980800J1125415K0876188J0374009k1736950m4301717l6772516
$$ -3213540 11767260 22892675 43768863 54142872 32405922 -11895795 -48668311
2138d8668311q296310J7352134K1580023M295464j4348615j4211382J329797J4101328
$$ -48668311 -56964621 -39612487 -18032464 -13737000 -28085615 -42296997 -40967200 -26865872
2130b6865872J8804749K1911149J8284866k013923k3857625j8445851Q440575
$$ -26865872 -8061123 13850026 32134892 30120969 6263344 -12182507 -3741932
2123c741932J5690646j1495736l4738744j8807477J6541509K7812935O266967
$$ -3741932 11948714 452978 -34285766 -53093243 -36551734 -8738799 -2471832
2116b471832k1977387l4764039k7848769p309709J0099390O928345o234623L888037
$$ -2471832 -24449219 -59213258 -87062027 -94371736 -84272346 -77344001 -83578624 -79690587
2108g9690587L8998746N2518426J7414912k3641645j8724270J3257679J7179224
$$ -79690587 -40691841 11826585 29241497 5599852 -13124418 133261 17312485
2101A7312485o063586o614561K3850416L8396631J8601931L742588J5792733J9722498
$$ 17312485 11248899 4634338 28484754 66881385 85483316 89225904 105018637 124741135
2093A24741135q259262l0693025j1785493J6776715N334002l2979378m6507823
$$ 124741135 116481873 85788848 74003355 90780070 96114072 63134694 16626871
2086A6626871k7123138j1920709j5137912j2883734O005088K2945640K7798457
$$ 16626871 -10496267 -22416976 -37554888 -50438622 -44433534 -21487894 6310563
2079F310563L0986369L1308586J2937903j5905121k1277896M787562K6806044
$$ 6310563 37296932 68605518 81543421 65638300 44360404 49147966 75954010
2072G5954010J7359913o396839j6123689j0708673o10036J4889772K9625627J9852015
$$ 75954010 93313923 86917084 70793395 60084722 59474686 74364458 103990085 123842100
2064A23842100j7400529m1837430k1973459J2429230J1361204j8924660k8570821
$$ 123842100 106441571 64604141 42630682 55059912 66421116 47496456 18925635
2057A8925635n931499O564192j4249241l4287757j9195635J2755190K4409765
$$ 18925635 12994136 19558328 5309087 -28978670 -48174305 -35419115 -11009350
2050a1009350J4366983M832628r83061j3161245k2117782q747133J7674736K5561979
$$ -11009350 3357633 8190261 7207200 -5954045 -28071827 -36818960 -19144224 6417755
2042F417755O711137j2732621j1940320q67867J870396m779508j0430899r236865
$$ 6417755 13128892 396271 -11544049 -12411916 -10541520 -15321028 -25751927 -34988792
2034c4988792o26444J2242077J8077367O457747j1843056j0810223J3932421L1801774
$$ -34988792 -35615236 -23373159 -5295792 1161955 -10681101 -21491324 -7558903 24242871
2026B4242871J6709882j4963939k6260684r621147Q400667Q834542K052496L263274
$$ 24242871 40952753 25988814 -271870 -9893017 -1492350 7342192 9394688 12657962
2018A2657962Q013407L822771q176350j6320896j4783283o251822M860229J2250638
$$ 12657962 20671369 24494140 16317790 -3106 -14786389 -21038211 -16177982 -3927344
2010c927344Q063142n165496r370251P878003L0932014L1856350Q953399r485589
$$ -3927344 4135798 -1029698 -10399949 -2521946 28410068 60266418 69219817 59734228
2002E9734228n680675L467065l792167j7980292j4530267L914238Q472591j1822551
$$ 59734228 54053553 57520618 53728451 35748159 21217892 25132130 33604721 21782170
1994B1782170l2352969k8550765q504367L866956K353619j637807j999019k466083
$$ 21782170 -10570799 -39121564 -47625931 -43758975 -41405356 -43043163 -45042182 -47508265
1986d7508265l159741N88015O632269O977343J410502o84131O592976J9183283
$$ -47508265 -50668006 -50079991 -43447722 -36470379 -35059877 -35744008 -29151032 -9967749
1978i967749K9348781L0506406J8208168l235114j6437174n695373K1434908L7669932
$$ -9967749 19381032 49887438 68095606 64860492 48423318 42727945 64162853 101832785
1970A01832785K5107716o341565l1877117l6444190k5127695j5457229k0028360
$$ 101832785 126940501 120598936 88721819 52277629 27149934 11692705 -8335655
1963h335655l1444926k7569396j06133K7172923K3558593o433824k4417661p137792
$$ -8335655 -39780581 -67349977 -67456110 -40283187 -16724594 -23158418 -47576079 -54713871
1955e4713871K3397992L0389135R661762r100596k863287J8104442K6018109R238868
$$ -54713871 -31315879 -926744 8735018 -365578 -3228865 14875577 40893686 50132554
1947E0132554j4760393j9561122j108647J6050329Q391385j6347691k9005255
$$ 50132554 35372161 15811039 14702392 30752721 39144106 22796415 -6208840
1940f208840j6208166O043102J6811460J3246826M925063o8808L502210J6794840
$$ -6208840 -22417006 -16373904 437556 13684382 18609445 18540637 22042847 38837687
1932C8837687K8551256K1237236m440270k3792854j8629863j596212L516793n112756
$$ 38837687 67388943 88626179 84185909 60393055 41763192 40166980 43683773 38571017
1924C8571017j0336062m679824J677938o63909q458645j2612795p476985M606339
$$ 38571017 28234955 23555131 25233069 24569160 16110515 3497720 -3979265 627074
1916F27074J1485383R55808j9471966k3552521l11618K4371260J9093303q595203
$$ 627074 12112457 13068265 -6403701 -29956222 -30267840 -5896580 13196723 4601520
1908D601520k1938907n713046J7317717K2711630J3247916M272714J102661J982401
$$ 4601520 -17337387 -23050433 -5732716 16978914 30226830 34499544 35602205 37584606
1900C7584606P136143J3037544J0239197k334415j1603175q394866j114860k021166
$$ 37584606 44720749 57758293 67997490 65663075 54059900 45665034 44550174 42529008
1892D2529008r695149j5070769j6001021j5614635j3912165j0769644r974791
$$ 42529008 32833859 17763090 1762069 -13852566 -27764731 -38534375 -48509166
1885d8509166j1072102n622260P920555J4920240M157973j0602648n680646J8676571
$$ -48509166 -59581268 -65203528 -57282973 -42362733 -38204760 -48807408 -54488054 -35811483
1877c5811483L6569608K9783452P690735r297197j2098398l642817R839625K0223473
$$ -35811483 758125 30541577 38232312 28935115 16836717 13193900 23033525 43256998
1869D3256998J9529459Q444895l553740j1227795j8301803k4754075k1334726
$$ 43256998 62786457 71231352 67677612 56449817 38148014 13393939 -7940787
1862g940787n522989Q664705Q910329K247081K84789k035077j3222076k0359260
$$ -7940787 -13463776 -4799071 4111258 6358339 6643128 4608051 -8614025 -28973285
1854b8973285m538546K1666984K3663687k352200j8495763j259573K3293647K2965491
$$ -28973285 -33511831 -11844847 11818840 9466640 -9029123 -10288696 13004951 35970442
1846C5970442Q710351R121847J9375956J4096542m756356j5124277k0549619m2355858
$$ 35970442 44680793 53802640 73178596 87275138 82518782 67394505 46844886 4489028
1838D489028o7713553n5483181l768463L6449079L3722027J7504745K2322068
$$ 4489028 -63224525 -118707706 -122476169 -86027090 -52305063 -34800318 -12478250
1831a2478250L3435398K2134244j219357r689080p546298j4187010k2448116j5055407
$$ -12478250 20957148 43091392 41872035 32182955 24636657 10449647 -11998469 -27053876
1823b7053876m328405j1651512k1886424m536329K9298327L9288739K0832372
$$ -27053876 -31382281 -43033793 -64920217 -69456546 -40158219 -869480 19962892
$$ [...]
##END NTUPLES=NMR SPECTRUM
##END=
