##TITLE=31Pdec_DE-56K
 CDCl3, 64 sc
 26.6.2024
##JCAMPDX= 6.0         $$ Bruker NMR JCAMP-DX V2.0
##DATA TYPE= NMR SPECTRUM
##DATA CLASS= NTUPLES
##ORIGIN= UXNMR, Bruker Analytische Messtechnik GmbH
##OWNER= root
$$ XWIN-NMR		Version 3.5
$$ Wed Jun 26 14:45:34 2024 Russian Standard Time (UT+4h)  she@DPX200
##.OBSERVE FREQUENCY= 81.013821
##.OBSERVE NUCLEUS= ^31P
##.ACQUISITION MODE= SIMULTANEOUS
##.ACQUISITION SCHEME= undefined
##.AVERAGES= 64
##.DIGITISER RES= 17
##SPECTROMETER/DATA SYSTEM= spect
##.PULSE SEQUENCE= zgpg30
##.SOLVENT NAME= CDCl3
##.SHIFT REFERENCE= (INTERNAL, CDCl3, 0, 182.463)
##AUDIT TRAIL= $$ (NUMBER, WHEN, WHO, WHERE, WHAT)
$$ ##TITLE= Audit trail, XWIN-NMR		Version 3.5
$$ ##JCAMPDX= 5.01
$$ ##ORIGIN= Bruker BioSpin GmbH
$$ ##OWNER= she
$$ F:/spectra/data/she/nmr/P31/2/pdata/1/auditp.txt
$$ ##AUDIT TRAIL=  $$ (NUMBER, WHEN, WHO, WHERE, WHAT)
(   1,<2024-06-26 14:43:24.43 +0400>,<she>,<DPX200>,
      <continue with go, POWCHK disabled, PULCHK disabled
       configuration hash MD5:
       00 E9 B6 7A A2 85 ED C7 34 08 36 98 17 FE 4E 26
       data hash MD5: 32K
       6A 51 94 D2 2A F4 0A 14 1C B6 1F 70 15 56 AF 03>)
(   2,<2024-06-26 14:44:37.67 +0400>,<she>,<DPX200>,
      <Start of raw data processing
       efp BC_mod = 2 LB = 1.5 FT_mod = 6 PKNL = 1 PHC0 = 2739.724 PHC1 = 294.0862 SI = 64K 
       data hash MD5: 64K
       81 41 A6 D2 DA EE 3C BC 21 0D 0F 76 D5 61 E8 06>)
(   3,<2024-06-26 14:45:05.56 +0400>,<she>,<DPX200>,
      <pk PHC0 = 168.6067 PHC1 = -102.2 
       data hash MD5: 64K
       A1 C8 5D CA 35 27 26 DD 06 6F 82 42 1D 09 BA A5>)
$$ ##END=
$$ 
$$ hash MD5
$$ 9A BF EC 45 20 25 55 77 48 E4 51 AA 44 32 10 0F
##$RELAX= 
##$RELAX= 
##$RELAX= 
##$RELAX= 
##$RELAX= 
##$RELAX= 
##$RELAX= 
##$RELAX= 
$$ Bruker specific parameters
$$ --------------------------
##$DU= <F:/spectra>
##$EXPNO= 2
##$NAME= <P31>
##$PROCNO= 1
##$TYPE= <nmr>
##$USER= <she>
##$AMP= (0..31)
100 100 100 100 100 100 100 100 100 100 100 100 100 100 100 100 100 100 
100 100 100 100 100 100 100 100 100 100 100 100 100 100 
##$AQSEQ= 0
##$AQ_mod= 1
##$AUNM= <au_zg>
##$AUTOPOS= <>
##$BF1= 81.014009
##$BF2= 200.13
##$BF3= 200.13
##$BF4= 200.13
##$BF5= 200.13
##$BF6= 200.13
##$BF7= 200.13
##$BF8= 200.13
##$BYTORDA= 1
##$CFDGTYP= 0
##$CFRGTYP= 5
##$CHEMSTR= <none>
##$CNST= (0..31)
1 1 145 1 1 1 1 1 1 1 1 1 1 1 1 1 1 1 1 1 1 1 1 1 1 1 1 1 1 1 1 1 
##$CPDPRG= <waltz16>
##$CPDPRG1= <>
##$CPDPRG2= <waltz16>
##$CPDPRG3= <>
##$CPDPRG4= <mlev>
##$CPDPRG5= <mlev>
##$CPDPRG6= <mlev>
##$CPDPRG7= <mlev>
##$CPDPRG8= <mlev>
##$CPDPRGB= <>
##$CPDPRGT= <>
##$D= (0..31)
0 1 0 0 0 0 0 0 0 0 0 0.03 2e-05 3e-06 0 0 0 0 0 0 0 0 0 0 0 0 0 0 0 0 
0 0 
##$DATE= 1719398521
##$DBL= (0..7)
120 120 120 11 120 120 24 19 
##$DBP= (0..7)
150 150 150 150 150 150 150 150 
##$DBP07= 0
##$DBPNAM0= <>
##$DBPNAM1= <>
##$DBPNAM2= <>
##$DBPNAM3= <>
##$DBPNAM4= <>
##$DBPNAM5= <>
##$DBPNAM6= <>
##$DBPNAM7= <>
##$DBPOAL= (0..7)
0.5 0.5 0.5 0.5 0.5 0.5 0.5 0.5 
##$DBPOFFS= (0..7)
$$ [...]
##$SUBNAM2= <"">
##$SUBNAM3= <"">
##$SUBNAM4= <"">
##$SUBNAM5= <"">
##$SUBNAM6= <"">
##$SUBNAM7= <"">
##$SUBNAM8= <"">
##$SUBNAM9= <"">
##$SW= 369.568048894756
##$SWIBOX= (0..15)
0 1 3 0 0 0 0 0 0 0 0 0 0 0 0 0 
##$SW_h= 29940.119760479
##$TD= 32768
##$TD0= 1
##$TE= 0
##$TE2= 300
##$TE3= 300
##$TEG= 300
##$TL= (0..7)
0 120 53 12 22 120 120 120 
##$TP= (0..7)
150 150 150 150 150 150 150 150 
##$TP07= 0
##$TPNAME0= <>
##$TPNAME1= <>
##$TPNAME2= <>
##$TPNAME3= <>
##$TPNAME4= <>
##$TPNAME5= <>
##$TPNAME6= <>
##$TPNAME7= <>
##$TPOAL= (0..7)
0.5 0.5 0.5 0.5 0.5 0.5 0.5 0.5 
##$TPOFFS= (0..7)
0 0 0 0 0 0 0 0 
##$TUNHIN= 0
##$TUNHOUT= 0
##$TUNXOUT= 0
##$USERA1= <user>
##$USERA2= <user>
##$USERA3= <user>
##$USERA4= <user>
##$USERA5= <user>
##$V9= 5
##$VALIST= <valist>
##$VCLIST= <CCCCCCCCCCCCCCC>
##$VD= 0
##$VDLIST= <DDDDDDDDDDDDDDD>
##$VPLIST= <PPPPPPPPPPPPPPP>
##$VTLIST= <TTTTTTTTTTTTTTT>
##$WBST= 1024
##$WBSW= 4
##$XGAIN= (0..3)
0 0 0 0 
##$XL= 0
##$YL= 0
##$YMAX_a= 14712
##$YMIN_a= -8596
##$ZGOPTNS= <>
##$ZL1= 120
##$ZL2= 120
##$ZL3= 120
##$ZL4= 120
##$ABSF1= 0
##$ABSF2= 0
##$ABSG= 0
##$ABSL= 0
##$ALPHA= 0
##$AQORDER= 0
##$ASSFAC= 0
##$ASSFACI= 0
##$ASSFACX= 0
##$ASSWID= 0
##$AUNMP= <proc_1d>
##$AZFE= 0.1
##$AZFW= 0.5
##$BCFW= 0
##$BC_mod= 2
##$BYTORDP= 0
##$COROFFS= 0
##$CY= -3
##$DATMOD= 1
##$DC= 0
##$DFILT= <>
##$DTYPP= 0
##$F1P= 0
##$F2P= 0
##$FCOR= 1
##$FTSIZE= 65536
##$FT_mod= 6
##$GAMMA= 0
##$GB= 0
##$INTBC= 1
##$INTSCL= 9.790993e-09
##$ISEN= 30
##$LB= 1.5
##$LEV0= 0
##$LPBIN= 0
##$MAXI= 10000
##$MC2= 0
##$MEAN= 0
##$ME_mod= 0
##$MI= 50
##$NCOEF= 0
##$NC_proc= -11
##$NLEV= 6
##$NOISF1= 182.463
##$NOISF2= 159.3651
##$NSP= 0
##$NTH_PI= 0
##$NZP= 0
##$OFFSET= 182.463
##$PC= 4
##$PHC0= 2908.331
##$PHC1= 191.8862
##$PH_mod= 1
##$PKNL= yes
##$PPARMOD= 0
##$PSCAL= 0
##$PSIGN= 0
##$REVERSE= no
##$SF= 81.0140089999434
##$SI= 65536
##$SIGF1= 159.3651
##$SIGF2= -187.1042
##$SINO= 113.3802
##$SIOLD= 16384
##$SREGLST= <1H.CDCl3>
##$SSB= 0
##$STSI= 65536
##$STSR= 0
##$SW_p= 29940.119760479
##$SYMM= 0
##$S_DEV= 0
##$TDeff= 32768
##$TDoff= 0
##$TI= <>
##$TILT= no
##$TM1= 0
##$TM2= 0
##$TOPLEV= 0
##$USERP1= <user>
##$USERP2= <user>
##$USERP3= <user>
##$USERP4= <user>
##$USERP5= <user>
##$WDW= 1
##$XDIM= 65536
##$YMAX_p= 286572287
##$YMIN_p= -170974637
$$ End of Bruker specific parameters
$$ ---------------------------------
##NTUPLES= NMR SPECTRUM
##VAR_NAME=  FREQUENCY,     SPECTRUM/REAL,   SPECTRUM/IMAG
##SYMBOL=    X,             R,               I
##VAR_TYPE=  INDEPENDENT,   DEPENDENT,       DEPENDENT
##VAR_FORM=  AFFN,          ASDF,            ASDF
##VAR_DIM=   65536,         65536,           65536
##UNITS=     HZ,            ARBITRARY UNITS, ARBITRARY UNITS
##FACTOR=    0.456856943014862, 1,           1
##FIRST=     14782.0589164792, 0,            0
##LAST=      -15158.0608439998, 0,           0
##MIN=       -15158.0608439998, -170974637,  0
##MAX=       14782.0589164792, 286572287,    0
$$ Real data points
##PAGE= N=1
##DATA TABLE= (X++(R..R)), XYDATA
$$ [...]
4826E4295330J2214467K348314j4900727k6919899k3629684j1345024m640601
4819a2577824o615340p459188r64727Q479835J4914909J5877471Q457553p615963
4811A2496726k1285127j7698526O01025J1947805K293098j6215640k1690415r205616
4803e8756670P934608J6349091J1852866l442059k1287609k7359080j3337890
4796h8046743J0283835K3181113J8329164P631227L487704M764807M806525L799826
4788a1762542O008468J0899233J4678305J6937978J8452408J4884483J192617
4781G1290950j6848327k3524197j0878448Q168746J1360996o485242k4059032
4774I025446j7118996R752876K4693185P369518k2874161l0105048q363424J2133487
$$ plain form
4826 54295330 66509797 68858111 53957384 27037485 3407801 -7937223 -12577824
4819 -12577824 -19193164 -26652352 -27617079 -19137244 -4222335 11655136 20112689 12496726
4811 12496726 -8788401 -26486927 -25885902 -13938097 -11644999 -27860639 -49551054 -58756670
4803 -58756670 -50822062 -34472971 -22620105 -26062164 -47349773 -74708853 -88046743
4796 -88046743 -77762908 -54581795 -36252631 -28621404 -25133700 -20368893 -15562368 -11762542
4788 -11762542 -5754074 5145159 19823464 36761442 55213850 70098333 71290950
4781 71290950 54442623 30918426 20039978 28208724 39569720 33084478 9025446
4774 9025446 -8093550 1659326 26352511 33722029 10847868 -19257180 -27620604 -15487117
4766a5487117P648632r317473j3545169l445754M264377N311025J0705082K1751204
4758G884807K4641611J3822919J739579j478667j602266n416219p582615k843431
4750B9165718K009972N24574j66628Q386468J9288183J9346504Q280387l239524
4742H3595654q578569o993889J733013J1676317Q170693j3275574l2556318k7945472
4734A5825855q495701k413987j5002866k2146358r695216N099360K971530o864454
4726d0721837k646475J6234746K9372410K3769438P318352n212215r001039j0088309
4718I025071j4526502j8586286j1284803R938073K9294039K7669993P488327q410910
4710C0607002m992663R195653J7832333J5799769O565518o666751j8491848k0602640
$$ plain form
4766 -15487117 -7838485 -17155958 -30701127 -34146881 -29882504 -24571479 -13866397 7884807
4758 7884807 32526418 46349337 48088916 46610249 45007983 39591764 32009149 29165718
4750 29165718 31175690 31700264 31533636 39920104 59208287 78554791 86835178 83595654
4742 83595654 75017085 68023196 69756209 81432526 89603219 76327645 43771327 15825855
4734 15825855 7330154 4916167 -10086699 -32233057 -41928273 -36828913 -33857383 -40721837
4726 -40721837 -43368312 -27133566 2238844 26008282 33326634 28114419 19113380 9025071
4718 9025071 -5501431 -24087717 -35372520 -25434447 3859592 31529585 39017912 30607002
4710 30607002 25614339 34809992 52642325 68442094 75007612 68340861 49849013 29246373
4702B9246373j2802192n800661n238654l376360M826182J0071172N316910J491945
4694B3734715J0288675K1132996J4816105n523668j7758850j3884440r203009
4687B3602524j5251879k2941742k0678145j3362746j1779891j3742897q466920
4680h2621696N454210J7602003K0266655J7277874J6940061K0971777K2718135
4673C8609019J4980191j132159j4950878j4899926k60490J5564974J6310117M18982
4665E4639830j4363090r937661Q143068J4894235q53706j8904108j5529695J329390
4657A9418263M235754j1254766k0602254r191893Q410549J7179279K4157481L6282319
4649F8634732L8549458J6907843j3181119k4842868j5350862j794484P828674
$$ plain form
4702 29246373 16444181 10643520 5404866 2028506 6854688 16925860 22242770 23734715
4694 23734715 34023390 55156386 69972491 64448823 46689973 32805533 23602524
4687 23602524 8350645 -14591097 -35269242 -48631988 -60411879 -74154776 -82621696
4680 -82621696 -77167486 -59565483 -39298828 -22020954 -5080893 15890884 38609019
4673 38609019 53589210 52457051 37506173 22606247 22345757 37910731 54220848 54639830
4665 54639830 40276740 30339079 38482147 53376382 52522676 33618568 18088873 19418263
4657 19418263 23654017 12399251 -8203003 -17394896 -8984347 8194932 32352413 68634732
4649 68634732 107184190 124092033 110910914 86068046 70717184 68922700 76751374
4642G6751374J5758823J6383337L049537j2754997j4426313q152251j2401529
4635F4207981k3861839k2144808o522992K859044K009184Q154043K1147221J4703430
4627F0551264j8746184m5755475l5788833l000615J8512727K0932672J9756332
4620A6461888K0104526J2444545m592898j8640565j9509877q100585O508034J0987115
4612A5662183j813634j8413802j4153854J2526193L1166630J8777794q139563
4605C5611947j9153625j1897943n895417o930900m381349K164528J120600o099261
4597a5461420l244949J2787067K3035406J3119742p187019j8697056j4721273
4590a0369502j525845J2479469K0587641J8092962O047488p414976j2757409o285455
$$ plain form
4642 76751374 92510197 108893534 111943071 99188074 84761761 76609510 64207981
4635 64207981 40346142 18201334 11678342 14537386 16546570 24700613 45847834 60551264
4627 60551264 41805080 -3950395 -39739228 -42739843 -24227116 -3294444 16461888
4620 16461888 36566414 49010959 44418061 25777496 6267619 -1832966 4675068 15662183
4612 15662183 13848549 -4565253 -18719107 -6192914 24973716 43751510 35611947
4605 35611947 16458322 4560379 -1335038 -8265938 -12647287 -10482759 -9362159 -15461420
4597 -15461420 -18706369 -5919302 17116104 30235846 23048827 4351771 -10369502
4590 -10369502 -11895347 584122 21171763 39264725 45312213 37897237 25139828 18854373
4582A8854373O462950J3796133Q562364l333839j1510536j7387743k9083638l8426222
4574e2066158k3011814J8166301N1280896M7915329K1978403M885223j15220j0727540
4566E8305420k4628718k0713074K12011J0630855q42438j2449261o713960K496594
4558F297429l207286j5137034j2820983L736532J6357356J4839297N061057m003600
4550A1122768r088826j0936768j1377938j0413092m852422M567365O914693n824777
4542b9888997j9962371j1909134J6644815L4036697J8803174j2465952l0112329
4535c4854097k8559447k2207427j7116343p202226P157280J6204205J6662089
4528f9915966J5837034J8138587J8755837J2950530L134370n239344q530297m950801
$$ plain form
4582 18854373 25317323 39113456 47675820 44341981 32831445 15443702 -13639936 -52066158
4574 -52066158 -75077972 -56911671 -5630775 42284554 64262957 69148180 69032960 58305420
4566 58305420 33676702 12963628 13175639 23806494 22964056 10514795 3800835 6297429
4558 6297429 3090143 -12046891 -24867874 -21131342 -4773986 10065311 15126368 11122768
4550 11122768 2033942 -8902826 -20280764 -30693856 -35546278 -30978913 -24064220 -29888997
4542 -29888997 -49851368 -61760502 -45115687 -11078990 7724184 -4741768 -34854097
4535 -34854097 -63413544 -85620971 -102737314 -109939540 -102782260 -86578055 -69915966
4528 -69915966 -54078932 -35940345 -17184508 -4233978 -1099608 -6338952 -14869249 -19820050
4520a9820050M161901J1796867R168261m895546k0333763k3983599j2310674M618260
4512e1598343J4298575J6615413K1608919L0546492K9619612J1100300r630419
4505F2560549j2928243l124379P20724k882472J687666J4263688J3134429r567577
4497F3864385l1182077l0760870j7555495j1632785j3501719j0350826J227513
4490d9891874J5188338K6831186K9343095J2968271j7074610l5766015k8093672
4483d6495281r890721j660271K179401J6032859L0960244K7568571J0413412J08265
4475B9216479k202803j2149446k7320577k6923871q063937Q028219J1187756J4595543
4467a3632637K4015579K3632959N368123j3077318j5043190q706627q446322j1287830
$$ plain form
4520 -19820050 -15658149 -3861282 5306979 411433 -19922330 -43905929 -56216603 -51598343
4512 -51598343 -37299768 -20684355 924564 31471056 61090668 72190968 62560549
4505 62560549 49632306 46507927 47228651 44346179 46033845 60297533 73431962 63864385
4497 63864385 32682308 1921438 -15634057 -27266842 -40768561 -51119387 -49891874
4490 -49891874 -34703536 -7872350 21470745 34439016 17364406 -18401609 -46495281
4483 -46495281 -56386002 -58046273 -55866872 -39834013 -8873769 18694802 29108214 29216479
4475 29216479 27013676 14864230 -12456347 -39380218 -47444155 -39415936 -28228180 -13632637
4467 -13632637 10382942 34015901 39384024 26306706 11263516 2556889 -5889433 -17177263
4459a7177263q224011k325181J231835Q389614K2094932K7924918J2366379j3899879
4451C0381344k8291582k4640661j3748754l062279P784930J6342657J8344363
4444C110018J6713983J5989200J0701345p021228k9914356l8946776k5205708
4437e4573522J154848K3351782L0891547K2251975M631314r170415j1432657o494511
4429F10361j909477K411745Q349823R210684k717160k1449668l2288506k9837751
4421f7619949j9836915n901678J1682603K5161685K3452665R885632Q07275K026065
4413b0342617J621787p396574j3113234m137634J0762094J6390774J3560990J1781788
4405I127374Q369675n237070k0025033j4748935J0801754K7644935J3216346j8897825
$$ plain form
4459 -17177263 -25401274 -27726455 -26494620 -18105006 3989926 31914844 44281223 30381344
4451 30381344 2089762 -22550899 -36299653 -39361932 -31577002 -15234345 3110018
4444 3110018 19824001 35813201 46514546 39493318 9578962 -29367814 -54573522
4437 -54573522 -53418674 -30066892 824655 23076630 27707944 18537529 7104872 610361
4429 610361 -1299116 1112629 9462452 18673136 15955976 -5493692 -37782198 -67619949
4421 -67619949 -87456864 -93358542 -81675939 -56514254 -33061589 -23175957 -22368682 -20342617
4413 -20342617 -18720830 -26117404 -39230638 -43368272 -32606178 -16215404 -2654414 9127374
4405 9127374 17497049 12259979 -7765054 -22513989 -11712235 15932700 29149046 10251221
4397A0251221l6549798k5778826J773962K8169198M0851242L2002461M654722
4390E5374182k0670282k1947249k248951J2591510O785230q198638j4873752j3852248
4382g040198j5680318j9473556j4680843m22710J0160827O521742n740150r831875
4374e6187081N539109L1832347M2780626J9344101k3533459m6054866k7837229
4367e4116452P656200K4399597J8107107J1861182J5988175J6149682K260122
4360D2305613j3735989j7564171j2826606j0580810j1423616r460328m984986
4353c8270893j828046J875699R644846J6856333J4732591L647485n227841l676101
4345b245927K784671J880375q246297j4098436m450460J0700852J0405566o346873
$$ plain form
4397 10251221 -26298577 -52077403 -50303441 -22134243 18716999 50719460 55374182
4390 55374182 34703900 12756651 10507700 23099210 29884440 21685802 6812050 -7040198
4382 -7040198 -22720516 -42194072 -56874915 -57297625 -47136798 -40615056 -46355206 -56187081
4374 -56187081 -50647972 -18815625 23965001 43309102 19775643 -26279223 -54116452
4367 -54116452 -46460252 -22060655 -3953548 7907634 23895809 40045491 42305613
4360 42305613 28569624 11005453 -1821153 -12401963 -23825579 -33285907 -38270893
4353 -38270893 -40098939 -38223240 -28578394 -11722061 3010530 6658015 1430174 -2245927
4345 -2245927 538744 2419119 -5827178 -19925614 -24376074 -13675222 -3269656 -9616529
4337i616529j5354957j637398J6754637J5389426M19297l138842Q755587J6677987
4329B8249208J1566364M216410J14778q099228j8387552j6231947j555485O720113
4321F592661K009810K90420Q948273J2946628M919254k43469K618115o038676
4313C2043016l0489241l6732608j441252M2524806M6942124J5270995r477549
4306E8640291q706068J60807N102146J0122196R138578r155853l0333708k7466046
4298G502343o601955P34198p303652M44156K8019595L6422793P000051k3261891
4290D2955638j7875969M585331N345317j4172813k2877443j0619618O788485J9348288
4282A3477216K7194749K3081467J377429k1496086k3893328j2289428j1218613
$$ plain form
4337 -9616529 -24971486 -26608884 -9854247 5535179 5954476 2815634 11571221 28249208
4329 28249208 39815572 44031982 44146760 36047532 17659980 1428033 -127452 6592661
4321 6592661 8602471 8892891 17841164 30787792 35707046 35463577 38081692 32043016
4313 32043016 1553775 -35178833 -36620085 5904721 52846845 68117840 58640291
4306 58640291 49934223 50095030 55197176 65319372 74457950 65302097 34968389 7502343
4298 7502343 900388 1634586 -5669066 -5224910 22794685 59217478 66217529 42955638
4290 42955638 25079669 29665000 35010317 20837504 -2039939 -12659557 -5871072 13477216
4282 13477216 40671965 63753432 65130861 43634775 19741447 7452019 -3766594
4275c766594k2628099k3095953l954261J2551172O395554j1595253j7082220n239269
4267f8414923O512226L234697j0250532j7192689q695328Q215666K2025192K9633612
4259c4932079L1741062K3088289J876902j5251052q713476J1418643J2570285
4252B1798574j2234287k9536133j4169846J3152215J9835039R302273M848826
4245A2996661M796588r011562k8425840k5148207O26541J6024583O643855l281928
4237b4779309O298297K0636786J9678681J0284046P276470M460183j0612921k7894982
4229E347251k6092589n156998J4178368J9490426J6403526J1093270J439520j1319452
4221B5383322j6932278r231396L341011O999520j023533j0106413r451181j71082
$$ plain form
4275 -3766594 -26394693 -49490646 -53444907 -40893735 -34498181 -46093434 -63175654 -68414923
4267 -68414923 -61902697 -58668000 -68918532 -86111221 -94806549 -86590883 -64565691 -34932079
4259 -34932079 -3191017 19897272 21774174 6523122 -2190354 9228289 21798574
4252 21798574 9564287 -19971846 -34141692 -20989477 -1154438 8147835 12996661
4245 12996661 17793249 8781687 -19644153 -44792360 -44165819 -28141236 -21497381 -24779309
4237 -24779309 -18481012 2155774 21834455 32118501 39394971 43855154 33242233 5347251
4229 5347251 -20745338 -25902336 -11723968 7766458 24169984 35263254 36702774 25383322
4221 25383322 8451044 -780352 2560659 9560179 8536646 -1569767 -11020948 -11192030
4213a1192030P910988R707054R615121J0789194O993951p043432k2070993k2243669
4205a7533816o161494J0086439J2177996J594231r984292j2049712j572532J3052772
4197a0390408J6004417K649756q894677M07538J9473919J8144011q257165k8949608
4189A87783k1936764m697224l362026j1449531m122958J8510725L0176390J8008988
4181B1315383j851739j2182720j6573553k3976253k7691476j4131710J3713827
4174f1378241L3682495K6988832r08198k4046815k1114274L499863K6004632K9822492
4166A2550786K0010813J0016985L699600k699516r025729j1915750j1867656r476891
4158A292642N02537J9433877L2925170K3530288l807276k2832377j6383550N697985
$$ plain form
4213 -11192030 -3281042 6426012 16041133 26830327 33824278 26780846 4709853 -17533816
4205 -17533816 -23695310 -13608871 -1430875 163356 -9820936 -21870648 -23443180 -10390408
4197 -10390408 5614009 8263765 -630912 -223374 19250545 37394556 29137391 187783
4189 187783 -21748981 -26446205 -29808231 -41257762 -45380720 -26869995 3306395 21315383
4181 21315383 19463644 7280924 -9292629 -33268882 -60960358 -75092068 -61378241
4174 -61378241 -27695746 -706914 -1615112 -25661927 -46776201 -43276338 -17271706 12550786
4166 12550786 32561599 42578584 46278184 43578668 34552939 22637189 10769533 1292642
4158 1292642 1795179 21229056 54154226 77684514 73877238 51044861 34661311 40359296
4150D0359296K3083963K7429221K1698489Q480521r793911k5034257k9110020
4143E7113302k3752459j6991835j1476354m157831L597730M878370j584198p053856
4135E72869m088020L855867R517865J2985901J7793673J9647369J0065722q202782
4127F2148464k1008255k2270929k2037829k7353711k7183083j0265247J1033029
4120e6937561J3859709r11933q348573L738469J8439589J8434352J0940892R624876
4112H839820Q683928m460376k0907114j8150181N468843K5312263K3710884J1371505
4104C9869572P255274J0301409L937255j6462498l3471943k8627783o623365R472886
4096a4349193O951534j965384m82107P270736N110194o194157q706654K484262
$$ plain form
4150 40359296 63443259 90872480 112570969 121051490 111257579 86223322 57113302
4143 57113302 33360843 16369008 4892654 734823 4332553 9210923 7626725 572869
4135 572869 -3515151 340716 9858581 22844482 40638155 60285524 70351246 62148464
4127 62148464 41140209 18869280 -3168549 -30522260 -57705343 -67970590 -56937561
4120 -56937561 -43077852 -43989785 -52338358 -48599889 -30160300 -11725948 -785056 8839820
4112 8839820 17523748 13063372 -7843742 -25993923 -20525080 4787183 28498067 39869572
4104 39869572 47124846 57426255 61363510 44901012 11429069 -17198714 -23822079 -14349193
4096 -14349193 -7397659 -9363043 -9845150 -2574414 2535780 -3658377 -12365031 -9880769
4088i880769J0916055P945428P219253J6566459J8661959M89428j8074881j1723314
4080B2119618R243888J4600445j06030j4723358k2888522l4074899m0754403k2130061
4072h8713322J4744206L4785204K5654470J3658561J6534294J6595322n70884
4065C2687851j5808199j0234568Q31509l227346j1213092l053025J2204234J4445213
4057A6632577R919187J5709307K2244256Q651358j5446340k2042766j1910567
4050B3757012j0484047j9675763j4534291R494178K6270944K3339911J7848552
4043E6016496J7545468N183410k2016610l5802623k2265802q369337j5635374
4036b5344372k0410820M690941L7004185L3610181j688899k4846383j7923530
$$ plain form
4088 -9880769 1035286 8980714 16199967 32766426 51428385 51917813 33842932 22119618
4080 22119618 31363506 45963951 45857921 31134563 8246041 -25828858 -66583261 -88713322
4072 -88713322 -73969116 -39183912 -13529442 129119 16663413 33258735 32687851
4065 32687851 16879652 6645084 7476593 4249247 -6963845 -10016870 2187364 16632577
4057 16632577 26551764 42261071 64505327 73156685 57710345 35667579 23757012
4050 23757012 13272965 -6402798 -20937089 -11442911 14828033 38167944 56016496
4043 56016496 73561964 78745374 56728764 20926141 -1339661 -9708998 -25344372
4036 -25344372 -45755192 -41064251 -4060066 29550115 27861216 3014833 -14908697
4029a4908697o024727o616593m077843J2741142K3576148R122221j4094459j5393243
4021a5676051O949710K5527828K0433470q71806j8186558k0233700j0787540j096796
4013a3941443J574343k65852n77673q9384m320081j1519535j1702811j182683
4005d2025119J0432903J3071063Q665247M798841K871382O2855k609121k726615
3997g458564l157526p825891j3306190j2952193p783268m777496n011765k436769
3989f4709662M853013J1411823J4781018J9236675K4333474J9548261n11012k2316995
3981F626595k6411494j1633268N005458J2266497J5790596K1564849K1313900
3974D4523133M697349k1430187l7929316l5307059k0927059n561407O867805J4848044
$$ plain form
4029 -14908697 -20933424 -27550017 -31627860 -18886718 4689430 13811651 -282808 -15676051
4021 -15676051 -8726341 16801487 37234957 36363151 18176593 -2057107 -12844647 -13941443
4013 -13941443 -12367100 -12632952 -13210625 -13300009 -17620090 -29139625 -40842436 -42025119
4005 -42025119 -31592216 -18521153 -9855906 -5057065 -2185683 -2122828 -4731949 -7458564
3997 -7458564 -10616090 -18441981 -31748171 -44700364 -52483632 -57261128 -62272893 -64709662
3989 -64709662 -59856649 -48444826 -33663808 -14427133 9906341 29454602 28943590 6626595
3981 6626595 -19784899 -31418167 -26412709 -14146212 1644384 23209233 44523133
3974 44523133 49220482 27790295 -10139021 -45446080 -66373139 -71934546 -65066741 -50218697
3966e0218697J4978651P414894q01676k974656N07085N333945Q147135N616883
3958a1996436m715026j7735086k0894308p831952J1951338K3250303K1417393
3951f553774J2439252J716299q144499j1779165n202963L863541J623969j1692489
3943b3729829j7873141l964669J8677090K7632411J6459635j182945j1256133
3936D762419j2211307q081780l49776Q145845J0000602K252866n895645k861242
3928d238018R500896J8111964J6839631J3313006J4100990J2469555O1391j4626154
3920F5533261j2638102Q298243K4895101J5510785j0210820k0938947l156372
3913F7293149K0496734J9068232q073397l1239340k7522897o301230O862487K056648
$$ plain form
3966 -50218697 -35240046 -27825152 -28626828 -31601484 -31094399 -25760454 -17613319 -11996436
3958 -11996436 -16711462 -34446548 -55340856 -63172808 -51221470 -27971167 -6553774
3951 -6553774 5885478 7601777 -542722 -12321887 -17524850 -13661309 -12037340 -23729829
3943 -23729829 -41602970 -45567639 -26890549 741862 17201497 16018552 4762419
3936 4762419 -7448888 -15530668 -15880444 -7734599 2266003 4518869 -1376776 -4238018
3928 -4238018 5262878 23374842 40214473 53527479 67628469 80098024 80159415 65533261
3920 65533261 52895159 61193402 86088503 101599288 91388468 70449521 67293149
3913 67293149 87789883 106858115 98784718 67545378 40022481 33721251 40583738 42640386
3905D2640386r040532j3891659j3089219j2582899j3330084j3743550j3877633
3898d6915190j1258606m11760J6202478K4653110J7047424O199852R869025K3818385
3890C9204718K5634076O328729j6717633k3333459j4296154m148574p75600j400454
3882A0495649j917435j118332O99131J242306k155552p106304q229976p118273
3874a5208786j0763304j5662546o322212K0521036M2227465L5490798P200762
3867E7483213j5652357k0854527j8391954j7184559j4872026j1750571j4004194
3860e5226975j6911334m348688K4012761M1745596K7446621l869864j8751861
3853e903744q822209K189241m477620j6213675r012479J6614666L3477110K1616801
$$ plain form
3905 42640386 33599854 19708195 6618976 -5963923 -19294007 -33037557 -46915190
3898 -46915190 -58173796 -58585556 -42383078 -17729968 -682544 5517308 15386333 39204718
3890 39204718 64838794 71167523 54449890 31116431 16820277 12671703 11896103 10495649
3882 10495649 8578214 7459882 8159013 9401319 7245767 139463 -8090513 -15208786
3874 -15208786 -25972090 -41634636 -47956848 -27435812 14791653 50282451 57483213
3867 57483213 41830856 20976329 2584375 -14600184 -29472210 -41222781 -55226975
3860 -55226975 -72138309 -76486997 -52474236 -10728640 16717981 12848117 -5903744
3853 -5903744 -14725953 -12536712 -17014332 -33228007 -42240486 -25625820 7851290 29468091
3845B9468091o299087k0544151j0414203N431595N929624n962976j1744051m810278
3837a8945436K716278p64325j1445717j7153239j1871739n39809O393780L328430
3829d8281777k036333N035804K5100232L6681254K1813466o565204j9570502j1368504
3821H08436k579365m629248n657300J407746L679889m020094j898706K1595398
3813H706756M0173588K2809981j6455216l3825589j5798723P668561J0974579
3806B4253937K713260l53277j182184r424595k0596361k3837874j6906679k077076
3798d7410849J9007698L5826293L0083481L12768k8149574l2644751k0147852
3791d3122786r327313p9573J7254601L3223766K7583490M163734r904818m047950
$$ plain form
3845 29468091 23169004 2624853 -7789350 -2357755 3571869 -2391107 -14135158 -18945436
3837 -18945436 -16229158 -16993483 -28439200 -45592439 -57464178 -58003987 -51610207 -48281777
3829 -48281777 -50318110 -45282306 -20182074 16499180 38312646 31747442 12176940 808436
3821 808436 -1770929 -6400177 -12057477 -10649731 -6969842 -10989936 -12888642 8706756
3813 8706756 48880344 71690325 55235109 21409520 5610797 13279358 24253937
3806 24253937 26967197 26613920 25431736 16007141 -4589220 -28427094 -45333773 -47410849
3798 -47410849 -28403151 7423142 37506623 37819391 9669817 -22974934 -43122786
3791 -43122786 -52450099 -52529672 -35275071 -2051305 25532185 29695919 19791101 15743151
3783A5743151K557442l112824m651703J3210993L1737844K1932114r505304k6182056
3775D1729657j3302871L794097L51553j1954470o822884J4121209K2767234N175540
3767E5859065j8942751k2656014m626127J2994057J2776247m30690r274884n679273
3759B0019630N04714m366521j7510696k1170989p990864M547502l242547k2221049
3751e1430820k3636117j82656K1869850J9942456N856369L750218J2202159J0581813
3743a046728l793342r691783M154447K0589493J8619848J329252j1928572j1550365
3735F682250n174977m501800j2996405k3870437k5416925j1888319P820096J7656045
3727e1690472J3986620J1007453K1171801L6524959L7599975J8025137p562080
$$ plain form
3783 15743151 18300593 15187769 10536066 23747059 55484903 77417017 67911713 41729657
3775 41729657 28426786 32220883 32572436 20617966 13795082 27916291 50683525 55859065
3767 55859065 36916314 14260300 9634173 22628230 35404477 34973787 25698903 20019630
3759 20019630 20524344 16157823 -1352873 -22523862 -30514726 -25967224 -29209771 -51430820
3751 -51430820 -75066937 -75249593 -53379743 -33437287 -27580918 -23830700 -11628541 -1046728
3743 -1046728 -4840070 -14531853 -10377406 10212087 28831935 30161187 18232615 6682250
3735 6682250 1507273 -2994527 -15990932 -39861369 -65278294 -77166613 -69346517 -51690472
3727 -51690472 -37703852 -26696399 -5524598 31000361 68600336 86625473 79063393
3720G9063393k0598336j8117428j2640387j4581912j8660628j1741338O748507
3713a0528129K0644681J8278189Q458665M226746n39506j9574067m2574727l9346260
3705f0954408k658962L4745651L9374232J6367565n074401j0262617n375361J596397
3697G758096N603008n27392j4829419j7347983M938572L0510200K6752780j205895
3689D1651967j4412680K996250K1285355J1853054j1546981j8487041p245096
3682B6094828K52952m310425q468277l318676O502169J5189082K0328807J6612255
3674F8882715J592273j2811942j0536872N870479J7142088J3005557J685467p644059
3666G7185706j6160382k4977906k8426933k4240505j7707662r764049N224109
$$ plain form
3720 79063393 58465057 40347629 27707242 13125330 -5535298 -17276636 -10528129
3713 -10528129 10116552 28394741 36853406 41080152 40540646 20966579 -21608148 -60954408
3705 -60954408 -63613370 -28867719 10506513 26874078 21799677 11537060 6161699 7758096
3697 7758096 13361104 12833712 -1995707 -19343690 -14405118 16105082 42857862 41651967
3689 41651967 27239287 30235537 51520892 63373946 51826965 33339924 26094828
3682 26094828 26347780 22037355 13569078 10250402 16752571 31941653 52270460 68882715
3674 68882715 70474988 57663046 47126174 52996653 70138741 83144298 84829765 77185706
3666 77185706 61025324 36047418 7620485 -16620020 -34327682 -44091731 -38867622
3659c8867622K2387475K2766958n63146k6039731k9274312j5136144o108018o317810
3651g7152350L61227J7531846K5727050J2438946o911104j0925430j228921N359906
3643c4798830M300128O283362J5840832K2409637J5450001j631497j6069972j8000340
3635f216679o868269Q115644J2875351O98413j7797647k2741903o860851J4435164
3627b4360777J8443803p91178k5473326l0354271o992948K6088104L9473332K2669798
3619A8702537m776545j6750250j0432402l315075m421201m405710K865176O673586
3611a5859884j520255r768087l011380J0197716Q119405r733691j9180839o493742
3603d7250757J1368253J1172274n539957j7814394j2966284K962122J7012616
$$ plain form
3659 -38867622 -16480147 6286811 5723665 -20316066 -49590378 -64726522 -70834540 -77152350
3651 -77152350 -76791123 -59259277 -33532227 -21093281 -28004385 -38929815 -40158736 -34798830
3643 -34798830 -30498702 -24215340 -8374508 14035129 29485130 27853633 11783661 -6216679
3635 -6216679 -13084948 -4969304 7906047 8604460 -9193187 -31935090 -38795941 -24360777
3627 -24360777 -5916974 -6708152 -32181478 -62535749 -69528697 -43440593 -3967261 18702537
3619 18702537 13925992 -2824258 -13256660 -16571735 -20992936 -25398646 -22533470 -15859884
3611 -15859884 -17380139 -27148226 -30159606 -19961890 -11842485 -21576176 -40757015 -47250757
3603 -47250757 -35882504 -24710230 -30250187 -48064581 -61030865 -58068743 -41056127
3596d1056127K0652566J2629907K80103m245607K419160Q100672J508015q222456
3588g933767j914026J9745412L2437025K0474484j108676p733024J535606O161788
3580F1664822n202102k0986018k4418185j2968663L256345J3462101J2772271
3573B7580571M383063j226646M126651J4459772J4605690N28308j3868469j5547317
3565C5041623q765100m587665k872219L267153J0806929Q918845l399787j4779907
3557B3629872j7634989j5283376j1397621m478717L516379M721921k559038q967666
3549b8453235p468151k913480j917155j803891K760714R496161J2663821J1205911
3541f429305N892565m358091j5735130j7450336o378409L772105j78245j0510337
$$ plain form
3596 -41056127 -20403561 -7773654 -7493551 -11739158 -9319998 -1219326 288689 -7933767
3588 -7933767 -9847793 9897619 42334644 62809128 61700452 53967428 55503034 61664822
3580 61664822 56462720 35476702 11058517 -1910146 1346199 14808300 27580571
3573 27580571 31963634 30736988 34863639 49323411 63929101 64457409 50588940 35041623
3565 35041623 26276523 21688858 18816639 22083792 32890721 41809566 38409779 23629872
3557 23629872 5994883 -9288493 -20686114 -25164831 -21648452 -16926531 -19485569 -28453235
3549 -28453235 -35921386 -38834866 -40752021 -42555912 -39795198 -30299037 -17635216 -6429305
3541 -6429305 -536740 -4894831 -20629961 -38080297 -44458706 -40686601 -40864846 -51375183
3533e1375183r159618N485920J7175769J5955822Q787241M205461L44689o786337
3525a5366236j4061869j6414427j3829585q473126r52882O719497R664342N368563
3517d7345723k237501n160658L001993J9976867L0749260J8843552j0706429k9388611
3509b2267250j9187123R23701J219287j3591962j1583137J4325923L1810497J6949789
3501a400275j1037918k0818085j2283774o314343q000960n856151J966585O232832
3493e7512089P626977J6003142K8561902K9295246J3294591n150697j2452090
3486A9666982r915055n148189j955723j677375l428097r96327J0031696K1410326
3478B7988238J9772628N534441p550683j2050287j3119601j4400332j2226364
$$ plain form
3533 -51375183 -60534801 -55048881 -37873112 -21917290 -13130049 -8924588 -8579899 -15366236
3525 -15366236 -29428105 -45842532 -59672117 -68145243 -69098125 -62378628 -52714286 -47345723
3517 -47345723 -49583224 -54743882 -51741889 -31765022 -1015762 17827790 7121361 -22267250
3509 -22267250 -41454373 -40530672 -39311385 -52903347 -64486484 -50160561 -18350064 -1400275
3501 -1400275 -12438193 -33256278 -45540052 -51854395 -59855355 -65711506 -63744921 -57512089
3493 -57512089 -49885112 -33881970 -5320068 23975178 37269769 32119072 19666982
3486 19666982 9751927 4603738 2648015 970640 -2457457 -3453784 6577912 27988238
3478 27988238 47760866 53295307 45744624 33694337 20574736 6174404 -6051960
3471f051960o599476l215817m79676J0388478K6445014K9693591J1658708j1880232
3463D9958630k0671006j3268614j160040Q601227J3483918Q696958o140101j9938525
3455A9562447k1158172j0970497K291130J3481056J7281886O547159j3327564
3448A3707445k0538928m532644J2668595L678496k2847450l2350272j3527865
3441f3742623R136445J5450661J4687968J9578642K0125598K535185k2447356
3434d675480l1062745j7381264M633105K2271514L0759535K5781747P833807q900827
3426B9259392r157430K863898J0661710J0697285J2771135J6400285Q632593j0145766
3418G1983102k0664038j5130165j1901918k4306631l3975148j7451452J3805312
$$ plain form
3471 -6051960 -12651436 -15867253 -16346929 -5958451 20486563 50180154 61838862 49958630
3463 49958630 29287624 16019010 14858970 23460197 36944115 45641073 39500972 19562447
3455 19562447 -1595725 -12566222 -10275092 3205964 20487850 27035009 13707445
3448 13707445 -6831483 -11364127 1304468 4982964 -17864486 -50214758 -63742623
3441 -63742623 -54606178 -39155517 -24467549 -4888907 15236691 17771876 -4675480
3434 -4675480 -35738225 -53119489 -48486384 -26214870 4544665 30326412 38160219 29259392
3426 29259392 20101962 22965860 33627570 44324855 57095990 73496275 82128868 71983102
3418 71983102 51319064 36188899 24286981 -19650 -33994798 -51446250 -37640938
3411c7640938K6147112J0879263p455925r837770l710723K41591O466177J7104688
3403B193475J8286218J998916j4605391j2197984J42963m15263j2725438j3468882
3395c0791386L975889J7330972Q978790r143427j5788826r363962k226923K390369
3387c4638504J0791587K0984236K0630355M802422j4975294k3402542j7313372
3380c3121112o064659M22531J392871L342034Q796643R642047k764949k0653994
3372c9008588k2193955K736641L5656399M7348084K9336373j055456k3959062
3365B8860436l3935992l3495508k2775712l140386J6441621K5497611K2534765
3358a3165J3903628M373336n101707j1045245o599863Q388397K0569958J4256360
$$ plain form
3411 -37640938 -11493826 -614563 -8070488 -17908258 -21618981 -21377390 -14911213 2193475
3403 2193475 20479693 22478609 7873218 -4324766 -4181803 -4597066 -17322504 -30791386
3395 -30791386 -26815497 -9484525 -505735 -9649162 -25437988 -34801950 -37028873 -34638504
3387 -34638504 -23846917 -2862681 17767674 22570096 7594802 -15807740 -33121112
3380 -33121112 -39185771 -38763240 -37370369 -34028335 -25231692 -15589645 -18354594 -39008588
3372 -39008588 -61202543 -58465902 -22809503 24538581 53874954 52819498 28860436
3365 28860436 -5075556 -38571064 -61346776 -64487162 -48045541 -22547930 -13165
3358 -13165 13890463 18263799 13162092 2116847 -4483016 3905381 24475339 38731699
3350C8731699q338016k4517898j6005206O454933J3811784l899136k2837027j6612543
3342c3211410P907454K0917240J1169618j066706M649240K1993814L1335084K6382167
3334I0076501J4660305J104229j3500935k2182903j5470629L185394J6936946
3327G4808908J3246847m932081k5484080l7074829l4029955k0338067q340889
3320d2144146m866889j075537J2744891K6044055J9103225m423515j7573280r419263
3312b1610459j300288r632142j5239805O433685M1011235N1160076K9478379M200775
3304H4501456p219373j7440453l4241630l8189255j4285817J7366352K6079506
3297A6570786J1906224L38182M410033J3045317J3107476M549964n719512j0721566
$$ plain form
3350 38731699 30393683 5875785 -10129421 -3674488 10137296 6238160 -16598867 -33211410
3342 -33211410 -25303956 -4386716 6782902 5716196 10365436 32359250 63694334 90076501
3334 90076501 104736806 105841035 92340100 70157197 54686568 57871962 74808908
3327 74808908 88055755 83123674 57639594 20564765 -13465190 -33803257 -42144146
3320 -42144146 -47011035 -48086572 -35341681 -9297626 9805599 5382084 -12191196 -21610459
3312 -21610459 -22910747 -32542889 -47782694 -41349009 -337774 50822302 80300681 84501456
3304 84501456 77282083 59841630 25600000 -12589255 -26875072 -9508720 16570786
3297 16570786 28477010 28815192 33225225 46270542 59378018 63927982 58208470 47486904
3289D7486904n186326P220529J0949126m224576k5451163l0136123j5696022j472869
3281a6510520n45983m560748j07456J2560551K2128324J8459565j94517k3534042
3273G695174l2810060j9079150K207005P615274l261760q875743N86842J0066354
3265c5856064P218220K946045J0709895K1958894J9882242O038434n147784r925060
3257A7824822j3995425j3764555k65096J8895712K2653550O374297r330111p564528
3249B0828666K212853J325260r837439j4098186k648807J4299730K1280554J3351250
3241D6713881k356536j4425220j5393471o952713J679394L322295M56403j41437
3233A2902596J023640l057006j1598947j1314662N598757K4470293K2661785J764777
$$ plain form
3289 47486904 42300578 49521107 60470233 56245657 30794494 658371 -15037651 -16510520
3281 -16510520 -17056503 -21617251 -21724707 -9164156 12964168 31423733 31229216 7695174
3273 7695174 -25114886 -44194036 -41987031 -34371757 -37633517 -46509260 -45922418 -35856064
3265 -35856064 -28637844 -25691799 -14981904 6976990 26859232 32897666 27749882 17824822
3257 17824822 3829397 -9935158 -10200254 8695458 31349008 37723305 28393194 20828666
3249 20828666 23041519 24366779 14529340 431154 -2217653 12082077 33362631 46713881
3241 46713881 44357345 29932125 14538654 7585941 9265335 12587630 13044033 12902596
3233 12902596 13926236 10869230 -729717 -12044379 -6445622 18024671 40686456 42451233
3225D2451233j0134438L368731K0857623J1572286j8621142l2216676j2095292
3218E182325J4279849J3326124j0113371k3705434j2519016O106820R966067k276968
3210B46396j5447857j6406346m105002J1791234J9293180J5046976O924827K489868
3202A9833276r87530q138644j2118589j856130J7657212K5899701J2883811o212555
3194D6960552j0741579j032261N488446P09016m172937K171561J2404919R681363
3186F1469080q490842k5727605k7486752j6899407m664762P737487K3815625L6440091
3178D6192915L1533266Q970639j3705266k3355127k5138511k7900239k7757195
3171c1159518j6848546P6632R691732O490683l878656j3637625j7508458j2819025
$$ plain form
3225 42451233 32316795 35685526 56543149 68115435 49494293 17277617 5182325
3218 5182325 19462174 32788298 22674927 -1030507 -13549523 -7442703 2523364 246396
3210 246396 -15201461 -31607807 -35712809 -23921575 -4628395 10418581 17343408 19833276
3202 19833276 18845746 10707102 -1411487 -3267617 14389595 40289296 53173107 46960552
3194 46960552 36218973 35186712 40675158 41384174 37211237 39382798 51787717 61469080
3186 61469080 52978238 27250633 -236119 -17135526 -21800288 -14062801 9752824 46192915
3178 46192915 77726181 86696820 72991554 49636427 24497916 -3402323 -31159518
3171 -31159518 -48008064 -47931432 -38239700 -31749017 -35627673 -49265298 -66773756 -79592781
3163g9592781k278625P371284J3949794J9851434K0197929M691275k0443368k9149798
3155f5402856r513035J4405121J5137726K542877N852362K4733270K9997575J1425865
3147B9178905p963348j1279457j0399108j7230667j9841557m714643J7796433
3140b4453442K8053030K2042118P579933r093139j9594224j2778751O853629J5672166
3132A4281320K060729j4286187j2023536j268553m613793j7803060j6137255N246336
3124d4543999K3378521K0612290M486189q712259j2887375j0761668p341956q003488
3116d3773745j2566247j1109965L579807K0971884K2727496P178263q481660j0517276
3108c1991443j321458J0205011J8661658K1041601J6442601R183019M588109J997912
$$ plain form
3163 -79592781 -81871406 -74500122 -60550328 -40698894 -20500965 -15809690 -36253058 -65402856
3155 -65402856 -74915891 -60510770 -45373044 -42830167 -36977805 -12244535 17753040 29178905
3147 29178905 21215557 9936100 -463008 -17693675 -37535232 -42249875 -24453442
3140 -24453442 3599588 25641706 33221639 24128500 4534276 -8244475 -1390846 14281320
3132 14281320 16342049 2055862 -9967674 -11236227 -15850020 -33653080 -49790335 -44543999
3124 -44543999 -21165478 -553188 3933001 -4779258 -17666633 -28428301 -35770257 -43773745
3116 -43773745 -56339992 -67449957 -63870150 -42898266 -20170770 -12992507 -21474167 -31991443
3108 -31991443 -33312901 -23107890 -4446232 16595369 33037970 42220989 46809098 48807010
3100D8807010j323562l159370j771226k588186q521822j0526939j849334N539152
3092B4605723l236385j9204079j9958073m268525P356776P255295R326861J7373361
3084A9250954J2780120j2137825l2896372k4986341M88213J4803939J2159522
3077a0537790R285059J2491596R348775o567371k2733448k4752318j2806614M130887
3069d2141224J9821876L0144837K8632403J1382842j4094106l0537194k5469295
3062b2259861m359174J3963934J7389389J2537078J2610792J8076890J7845963
3055F5805011P064036o727039j5285288j7529710j5154958j0694904j0341555
3048b864407j6885588j9290100m026369K0264697K6572921N661751j7922775j7586424
$$ plain form
3100 48807010 47483448 44324078 42552852 39964666 31442844 20915905 19066571 24605723
3092 24605723 21369338 2165259 -17792814 -22061339 -14704563 -7449268 1877593 19250954
3084 19250954 32031074 19893249 -13003123 -37989464 -37501251 -22697312 -10537790
3077 -10537790 -1252731 11238865 20587640 14020269 -8713179 -33465497 -46272111 -42141224
3069 -42141224 -22319348 7825489 36457892 47840734 33746628 3209434 -22259861
3062 -22259861 -26619035 -12655101 4734288 17271366 29882158 47959048 65805011
3055 65805011 72869047 66142008 50856720 33327010 18172052 7477148 -2864407
3048 -2864407 -19749995 -39040095 -43066464 -22801767 3771154 9432905 -8489870 -26076294
3040b6076294J428758J4031502J0337332K580064K714877Q182790R503481K680038
3032B5382548o074513n044047Q805294J9827670R254943j6298611k7729651j2382042
3024d258409P672004Q788971q95617N31745J2973027J9139690J4332325P763720
3016F6047456J633055p362479j1459586k021216P137231o142626l4003885m2073217
3008b8245267j7659796J1057396J4712024J05504n490372Q542476K7643858L0343680
3000D1009503P292280k8254321m6154885k8905990L179465J3538620k534224j3951927
2992e4781479k681460J1589791R034590L514646J5278641L1783497K5374320k145506
2984C6967040k1785367j9064076p305762n19965L056756P552463R711283P714498
$$ plain form
3040 -26076294 -24647536 -10616034 -278702 2301362 5016239 13199029 22702510 25382548
3032 25382548 19308035 14263988 23069282 42896952 52151895 35853284 8123633 -4258409
3024 -4258409 3413595 12202566 11306949 11838694 24811721 43951411 58283736 66047456
3016 66047456 67680511 60318032 48858446 46837230 53974461 47831835 13827950 -28245267
3008 -28245267 -45905063 -34847667 -20135643 -20030139 -25520511 -16978035 10665823 41009503
3000 41009503 48301783 20047462 -26107423 -55013413 -51833948 -38295328 -40829552 -54781479
2992 -54781479 -57462939 -45873148 -36838558 -33323912 -18045271 13738226 39112546 36967040
2984 36967040 15181673 -3882403 -11188165 -11708130 -8651374 -1098911 8612372 16326870
2976A6326870M868899Q58502q231283j9616703k5657444k5962791k4670977j7005097
2968i9090024M839187L1151745L9023326K3834696R076115J3922917K5479356
2961D8237318J8154319q315851k7010905j8816186M318460J5549508N082900j0344947
2953B6854616q972585R512511K3155069J3775439j1385703k8826948k5899818
2946a787419j1452237p78446J212665m84742p95870J017510L064605K964425m43937
2937g483446n946440j1155154j3855428j0709536J852509K0868525L4108112L0816418
2929C8495560J4062476l392841j3195425j4433197o553554R093088K1304590J6316369
2921F1697066k945835j6906192j4351487n915225n011889p151533l29734J2636277
$$ plain form
2976 16326870 21195769 22054271 13822988 -5793715 -31451159 -57413950 -82084927 -99090024
2968 -99090024 -94250837 -63099092 -24075766 -241070 8835045 22757962 48237318
2961 48237318 66391637 58075786 31064881 12248695 16567155 32116663 37199563 26854616
2953 26854616 17882031 27394542 50549611 64325050 52939347 24112399 -1787419
2946 -1787419 -13239656 -14018102 -12805437 -13290179 -14086049 -13068539 -10003934 -7039509 -7483446
2937 -7483446 -13429886 -24585040 -38440468 -49150004 -47297495 -26428970 7679142 38495560
2929 38495560 52558036 49165195 35969770 21536573 14983019 24076107 45380697 61697066
2921 61697066 58751231 41845039 27493552 21578327 16566438 9414905 9085171 21721448
2913B1721448J7207770R011442k131096j0109957j9970235l3089158l7712570
2906e5072356k3576921J298220J8293101J9495153J2614236O411463J552025j659157
2898b0644236L161047J8990817L5575398L9384345L0901692K0778487R342307
2891A37489857j4923751n0225254p0045739n1794273q874117K2161938K3468298
2884a2743041R495769K74057j021832j36756J375148K242472k832863j3249931
2876a6596977j7327360o686179J0825453K0141276J4587163k483290k2047781
2869a9587695k9491239j3263875J6146688K8697073J0517684j4021818j3151071
2862c4154253R045081K1069392R217796r969537k1093324k7265927l0191951j8028570
$$ plain form
2913 21721448 38929218 47940660 45809564 35699607 15729372 -17359786 -55072356
2906 -55072356 -78649277 -77351057 -59057956 -39562803 -26948567 -20537104 -18985079 -20644236
2898 -20644236 -17483189 1507628 37083026 76467371 107369063 128147550 137489857
2891 137489857 122566106 72340852 2295113 -49499160 -58373277 -36211339 -12743041
2884 -12743041 -3247272 -2973215 -3995047 -4131803 -2756655 -514183 -3347046 -16596977
2876 -16596977 -33924337 -40610516 -29785063 -9643787 4943376 2460086 -19587695
2869 -19587695 -49078934 -62342809 -46196121 -17499048 -6981364 -21003182 -34154253
2862 -34154253 -25109172 -4039780 5178016 -4791521 -25884845 -53150772 -83342723 -101371293
2854a01371293J3248142M4441194N4122948M3004879K5746070J0670580p42967
2847H9119553o749146j1009019k3709841m2886226m6699544k1572979J2710930
2840e0796272K6320865J9325409J4977735J8739316J2517373p631523j7391452
2833A6061451m62035K4034141K7634564R910460p770557j3648222j2466557r129291
2825C4163954l766009L75222n33410k608384j381707l412956j6129792k9262180
2817b2555262k4206380l095071R546696M2864j5520032j4915762O87413J2720553
2809e7294981J1685285M372757j050337m395700p171098o350247J375551J2438748
2801d6390022J6663154O425946j2762000k3142908j2098258J1246378K4098829
$$ plain form
2854 -101371293 -88123151 -43681957 10440991 53445870 79191940 89862520 89119553
2847 89119553 82370407 71361388 47651547 4765321 -41934223 -63507202 -50796272
2840 -50796272 -24475407 -5149998 9827737 28567053 41084426 33452903 16061451
2833 16061451 15599416 39633557 67268121 77178581 69408024 55759802 43293245 34163954
2825 34163954 30397945 30773167 30239757 27631373 26249666 22836710 6706918 -22555262
2817 -22555262 -46761642 -49856713 -40310017 -40267153 -55787185 -70702947 -70015534 -57294981
2809 -57294981 -45609696 -41236939 -42287276 -46682976 -53854074 -60204321 -58828770 -46390022
2801 -46390022 -29726868 -23300922 -36062922 -59205830 -71304088 -60057710 -35958881
2794c5958881J6680970K797253j24403P116848J0634280L650107p358852j3411910
2786a5974588j2228341p887044o196109q980774j0785894n056512N457889J1702713
2778d9948660J3090266J8064558K5830225K2230328L400637j1632044o945550
2771A4089760N064490L566394o736308m978289R346740J5445437N451943o346613
2763C4903554j0504683j2744930j2867273p88951J7247483J6027691j0320377
2756B0952514l1854100k2673060M045601K0136994K1147346J8386825J0769309
2749D0911429q109409k6883683k7766779j4089981k672165M040658J3838892J9903960
2741h27078P745968j5603193k6419359j8692423q067209o03488J4631247L6774411
$$ plain form
2794 -35958881 -19277911 -16480658 -16605061 -9488213 1146067 4796174 -2562678 -15974588
2786 -15974588 -28202929 -36089973 -42286082 -51266856 -62052750 -67109262 -61651373 -49948660
2778 -49948660 -36858394 -18793836 7036389 29266717 32667354 21035310 14089760
2771 14089760 19154250 22720644 15984336 11006047 20352787 35798224 41250167 34903554
2763 34903554 24398871 11653941 -1213332 -2002283 15245200 31272891 20952514
2756 20952514 -10901586 -33574646 -29529045 -9392051 11755295 30142120 40911429
2749 40911429 32802020 5918337 -21848442 -35938423 -38610588 -34569930 -20731038 -827078
2741 -827078 6918890 -8684303 -35103662 -53796085 -61863294 -62466782 -47835535 -11061124
2733a1061124M4734466K8180327M065661r126876j3585040j7845698j9867091
2726E494625j6574762j2851618r213487K833462K2000520L1471151K4244496J5855074
2718F3259461J7498503J5737390k304422k1075440j7361280L082494J3997638
2711G2834344O886567k082884p7423Q362400J4374372J3670577K713931j7214817
2703I9467067l1835228k5523897k652261J5957095J7974869Q095183o563633k3362337
2695E1556858l5116043l0882943j1948816M820346N516907o952555j9908784k3142471
2687f6057501j3126517N042978J8379872J8148157J1622102J1360708J4174535
2680d55666N784934j2038858j7336847O73238K1990465K0667503j676744k1276873
$$ plain form
2733 -11061124 33673342 61853669 65919330 56792454 43207414 25361716 5494625
2726 5494625 -11080137 -23931755 -33145242 -30311780 -8311260 23159891 47404387 63259461
2718 63259461 80757964 96495354 94190932 73115492 55754212 58836706 72834344
2711 72834344 79720911 77638027 77560604 85923004 100297376 113967953 116681884 99467067
2703 99467067 67631839 42107942 39455681 55412776 73387645 81482828 74919195 51556858
2695 51556858 16440815 -14442128 -26390944 -21570598 -16053691 -23006246 -42915030 -66057501
2687 -66057501 -79184018 -74141040 -55761168 -37613011 -25990909 -14630201 -455666
2680 -455666 5329268 -6709590 -24046437 -23373199 -1382734 19284769 17608025 -3668848
2672c668848k3716134j4927754m221836P671281K0393353K5955904J6664176l852143
2664B0297999k3332111l2576285l0387545j8651386J261585K4067421L7032308
2657b2288014K8819856M204194j5960498j4912855K470756J7158197J8611259
2650A8102895J3700078J3502880J8192051J8306235P507014r354218k0415584
2643E9541351j7933415n305065P026504J1999023J0643417P447162M997627L521031
2635H1937635Q74627q033794k5762539m3975931m7536781l1400368p567163R133802
2627g2330512J5860198J7937859J8407172J8589046K1799373K7634979K7864773
2620G5762888J6308995j814077j7151010k6388320k8378628j9446395k585450
$$ plain form
2672 -3668848 -27384982 -42312736 -46534572 -38863291 -18469938 7485966 24150142 20297999
2664 20297999 -3034112 -35610397 -65997942 -84649328 -83387743 -59320322 -22288014
2657 -22288014 6531842 10736036 -5224462 -20137317 -17666561 -508364 18102895
2650 18102895 31802973 45305853 63497904 81804139 89311153 79956935 59541351
2643 59541351 41607936 36302871 43329375 55328398 65971815 73418977 78416604 81937635
2635 81937635 82812262 74778468 49015929 5039998 -42496783 -73897151 -81464314 -72330512
2627 -72330512 -56470314 -38532455 -20125283 -1536237 20263136 47898115 75762888
2620 75762888 92071883 90257806 73106796 46718476 18339848 -1106547 -3691997
2613c691997Q330223O454256N006522J6862257K9349727J8850624j3438117m0235295
2605B7488200m2197450k5158868l673970J3575575K0087667J2532161M11719j634457
2597A430577M625447L292967q620385j5384823j0024097p503081j8800925k8826095
2589g9810415j6142876J5239714L8703212L5708837J3700993m870748o044627
2582c515910K468130K141775j0268165j5216997J654191K3876025K4356106M844568
2574C0339723p480649q94048Q559053P848790L771167K572321j390192p197241
2566C6128924k564164J1015789J2642379n159865k1359471j8355145n902196J291536
2558G737787N244532P832076j373360k0933200k8050711j5536542j0002910k6168518
$$ plain form
2613 -3691997 4638226 11092482 16099004 32961261 62310988 81161612 67723495 27488200
2605 27488200 -14709250 -39868118 -43542088 -29966513 -9878846 2653315 3065034 1430577
2597 1430577 6056024 9348991 728606 -14656217 -24680314 -32183395 -50984320 -79810415
2589 -79810415 -95953291 -80713577 -42010365 -6301528 7399465 2528717 -3515910
2582 -3515910 -1047780 1093995 -9174170 -24391167 -22736976 1139049 25495155 30339723
2574 30339723 22859074 21965026 30524079 38372869 42144036 44716357 43326165 36128924
2566 36128924 33564760 44580549 57222928 52063063 30703592 12348447 6446251 7737787
2558 7737787 12982319 20814395 19441035 -1492165 -29542876 -45079418 -55082328 -81250846
2550h1250846l2596452J341546M9564329O2311705L6888295J0991980j600269
2543D5650288j9920000m4182417m5132374j3872179J9213897K9202285K6842478
2536b198022K9817081L2679116K1716782j442075k4627539l7916411l4299375
2529a6270443j3402567J0462454J8826445J0132733k366825r909091j0439453
2522a2966747n37204J5362003K0195454J3218449K5814569P2092046J01323242
2515B34501812N2070475n0755994j11586530q6508074l2006132j2003467j5420904
2508b1708814k017312K1224862J9921227l921826j7901719j1293456M84166J0231050
2500d981822K0986261K4426088J1099410n670135n861423N050717P289411J373395
$$ plain form
2550 -81250846 -113847298 -112505752 -62941423 -629718 36258577 47250557 45650288
2543 45650288 25730288 -18452129 -63584503 -77456682 -58242785 -29040500 -2198022
2536 -2198022 27619059 60298175 82014957 80572882 55945343 18028932 -16270443
2529 -16270443 -29673010 -19210556 -384111 9748622 7381797 -2527294 -12966747
2522 -12966747 -13503951 1858052 22053506 35271955 61086524 133178570 234501812
2515 234501812 286572287 235816293 124229763 37721689 5715557 -6287910 -21708814
2508 -21708814 -23726126 -2501264 17419963 13498137 -4403582 -15697038 -15212872 -4981822
2500 -4981822 16004439 40430527 51529937 45859802 39998379 45049096 52338507 53711902
2492E3711902L664956J4570277J8882119J3402346Q749979O632520j587940j5576255
2484A02449904k4956979k5141373j8512746n879634Q551517J3361100O455628
2477E6327417K660129Q282065N442709j6541448l3607063k0109287O753330J0223039
2469A9430891r342694j8039477k967870J4365349J8601283J7801347J6429689
2462E6278518N915214j0315611j4070652l818758O5038r388546j3876809l947849
2454F840545L768497k276620p003689L532716J5465413R105714q521536j3530170
2446G380870J902929K2345328K8835618J5655663o423834j7683141q051610Q741430
2438E2703253R946588n967767j8023390j3934862n158873m587540o608245M7452
$$ plain form
2492 53711902 57376858 71947135 90829254 104231600 112981579 119614099 118026159 102449904
2484 102449904 77492925 52351552 33838806 27959172 36510689 49871789 56327417
2477 56327417 58987546 67269611 72712320 56170872 22563809 2454522 9207852 19430891
2469 19430891 10088197 -7951280 -10919150 3446199 22047482 39848829 56278518
2462 56278518 62193732 51878121 37807469 33988711 34053749 24665203 10788394 6840545
2454 6840545 10609042 8332422 1328733 4861449 20326862 29432576 20911040 7380870
2446 7380870 9283799 31629127 60464745 76120408 69696574 52013433 43961823 52703253
2438 52703253 62649841 56682074 38658684 24723822 19564949 14977409 8369164 8416616
2430H416616J2637952J8718246J2227584j868725j2894364j1861025n27318P934366
2422C2783332N579711J365881L794326J558522j7701126l7685474l1079097m378258
2414d5762183P312218o128788j5705159k665239J2751204R480167J000343Q569185
2406c1148252K3866788K4537856R641135l838713o347118J091854J4401846K0522335
2398E2727731J894508l4458358n1545049k8188793P859848J7107285J796237n611604
2390c8418195O173470J8091736J5658960M028228r154650k0856515k3825224j2244738
2382f0546928M839056J3426919J3797752J3421473R231349l161256j1912888m031131
2374b4935654R590846R122609p56495O94083J2926755J4236271j287033j5213283
$$ plain form
2430 8416616 21054568 39772814 52000398 50131673 37237309 25376284 24848966 32783332
2422 32783332 38363043 39728924 43523250 45081772 27380646 -10304828 -41383925 -45762183
2414 -45762183 -38449965 -44578753 -60283912 -62949151 -50197947 -40717780 -39717437 -31148252
2406 -31148252 -7281464 17256392 26897527 23058814 16711696 17803550 32205396 52727731
2398 52727731 54622239 20163881 -31381168 -59569961 -51710113 -34602828 -32806591 -38418195
2390 -38418195 -32244725 -14152989 1505971 5534199 -3620451 -24476966 -48302190 -60546928
2382 -60546928 -55707872 -42280953 -28483201 -15061728 -5830379 -8991635 -20904523 -24935654
2374 -24935654 -15344808 -6222199 -6978694 -6284611 6642144 20878415 19591382 4378099
2366D378099j5374489q653441o41688J1383120K2043232K0645915J3697737J7307286
2358F4785771K3853995P980150k6350244l9441218j2742231J9378460J6927827
2351E4392510j2610769l3145056l0453893j7033071k934139J0126158J5257943
2344a6400317O642674n780201q502076n839404j0217804j7641368j3317111K839790
2336f8215817J6863764K3871376K9677801L0735116J5263483j1919428k7286089
2329H990206j9924676p337505q983978j8665037j7304856l403018N437564j300629
2321f2491929j3307749j4474254k056924J3841683K3797575K6249245K4131394
2314d310959K0411595J6979756J3189611M900611r913486k3313852k2072405m670412
$$ plain form
2366 4378099 -10996390 -19649831 -20291519 -8908399 13134833 33780748 47478485 64785771
2358 64785771 88639766 96619916 70269672 30828454 18086223 37464683 54392510
2351 54392510 41781741 8636685 -21817208 -38850279 -41784418 -31658260 -16400317
2344 -16400317 -9757643 -15537844 -24039920 -29879324 -40097128 -57738496 -71055607 -68215817
2336 -68215817 -51352053 -27480677 2197124 32932240 48195723 36276295 8990206
2329 8990206 -10934470 -18271975 -27255953 -45920990 -63225846 -66628864 -61191300 -62491929
2321 -62491929 -75799678 -90273932 -92330856 -78489173 -54691598 -28442353 -4310959
2314 -4310959 16100636 33080392 46270003 51170614 41257128 17943276 -4129129 -8799541
2306h799541J2915256J5405754O594346O06483l2659n053819j6917937k4664628
2298a9946745k0025129p884509L091784R608736R936349K445645o991061p490497
2290c7255427Q19963M645661j563187n013113M983933J7590144J4938519k055721
2282b909228j6196943j6722075o462544Q808012K4361773L2617709K8584751J8492249
2274G0573704J2213302R278738L427063k743597j777865K284022k212881j3810166
2266G7232320j8099484j1641175p775300j2067909j0623525N134431J8746063
2259D0905421J1337762p594017j2699324n00279P385795m57306q666509k291031
2251B7420512P796405J822661j7744871k9682411k4442989j3441012o427780K915939
$$ plain form
2306 -8799541 4115715 19521469 26115815 26722298 26689639 21635820 4717883 -19946745
2298 -19946745 -39971874 -47856383 -44764599 -35155863 -25219514 -22773869 -29764930 -37255427
2290 -37255427 -36435464 -31789803 -33352990 -38366103 -33382170 -15792026 -853507 -2909228
2282 -2909228 -19106171 -35828246 -42290790 -33482778 -9121005 23496704 52081455 70573704
2274 70573704 82787006 92065744 95492807 92749210 90971345 93255367 91042486 77232320
2266 77232320 59132836 47491661 39716361 27648452 17024927 22159358 40905421
2259 40905421 52243183 44649166 31949842 31449563 38835358 38378052 29711543 27420512
2251 27420512 35216917 37039578 19294707 -10387704 -34830693 -48271705 -54699485 -51783546
2243e1783546J9990280L1745203K1431666m804028k1833795j6577537j573646
2236b3405403N749844M213258K269508K255151K695127P674252J9334068K5330608
2228D6116413J0345740j8427084l2942896j7762789J0711298K6730747K5522118
2221E0293547J9553455J4164165M034200q630051j0901598J4748P130553m234214
2213G1424805k3534637k7372770j1694590K196260k712649j5034334j0540325
2206a7268240J2969876K9244481J6621189j1718161k1803861j582142K3531915
2199B9995057K4181805N024661m557034P502062K1514195J7374837K696881k209489
2191A01522975N063628R462099K991406p761695j6340757k2593032k3686596j4974964
$$ plain form
2243 -51783546 -31793266 -48063 21383603 16579575 -5254220 -21831757 -23405403
2236 -23405403 -17655559 -13442301 -11172793 -8917642 -6222515 1451737 20785805 46116413
2228 46116413 56462153 38035069 5092173 -12670616 -1959318 24771429 50293547
2221 50293547 69847002 84011167 88045367 79415316 68513718 68528466 75659019 71424805
2213 71424805 47890168 20517398 8822808 11019068 8306419 -6727915 -17268240
2206 -17268240 -4298364 24946117 41567306 29849145 8045284 6463142 29995057
2199 29995057 54176862 59201523 54644489 62146551 83660746 101035583 103732464 101522975
2191 101522975 106586603 116048702 119040108 111278413 94937656 72344624 48658028 33683064
2183C3683064l184763l228240j5700994k1980055j0333628O058913P906746m099622
2175a0878579j3718958j1127844R94535J5465852K2976369J4258887p186731k1549376
2167a0765845j5546299j757392J94703n794058n79313J5680469K0999144O013008
2159H444417j1909762j6396042j3310583j3260759j1016216K372032J9462874
2152c5614039K4499950J5024058K893944j568384L028870J2468191J9279194J6761023
2144E6772807P338137R72560J67010m332724j6485682k5175153k1109308j1770879
2136a3623232p275097l178132P033095J3618760M961294p755234l731785J3125056
2128C174725J8412362O739156q5168Q636109J3682158K32475j4227994r068865
$$ plain form
2183 33683064 30498301 27270061 11569067 -10410988 -20744616 -14685703 -6778957 -10878579
2175 -10878579 -24597537 -35725381 -34730846 -19264994 3711375 17970262 10783531 -10765845
2167 -10765845 -26312144 -28069536 -27874833 -33668891 -34248204 -18567735 2431409 8444417
2159 8444417 -3465345 -19861387 -33171970 -46432729 -57448945 -55076913 -35614039
2152 -35614039 -11114089 3909969 6803913 5235529 8264399 20732590 40011784 56772807
2144 56772807 64110944 65083504 65250514 60917790 44432108 19256955 -1852353 -13623232
2136 -13623232 -20898329 -24076461 -17043366 -3424606 1536688 -6218546 -9950331 3174725
2128 3174725 21587087 28326243 28241075 36877184 50559342 50791817 36563823 27494958
2120B7494958J764489r450172l5576222l8982045o083434L1421603L9619682K3354683
2112C3563542R659901Q548575R181658L992261l255674r259814j3990187j3218710
2104B5221552l405804O632251M554836m070941k81330J7892821K7363388J1801431
2096H5708204j4337625k6722112k2623828j5469596r286039J166936J1087291
2089I523231Q754785k316078n305154K521363M370829p597791j7865399j2593815
2081b0508029j726586o16230k894520Q739136L0589319L6822961J3080845k2824431
2073D0662465m0509992l0171608r567135J14079r25516M142504K0093974K7221344
2065A1060115Q582009j8471307j8275909J4214124M2490773L5856513P014403
$$ plain form
2120 27494958 29259447 19809275 -15766947 -54748992 -60832426 -29410823 10208859 33563542
2112 33563542 43223443 51772018 60953676 64945937 61690263 52430449 38440262 25221552
2104 25221552 21815748 28447999 33002835 28931894 28650564 46543385 73906773 85708204
2096 85708204 71370579 44648467 22024639 6555043 -2730996 -1564060 9523231
2089 9523231 18278016 15961938 10656784 13178147 17548976 9951185 -7914214 -20508029
2081 -20508029 -22234615 -22850845 -25745365 -17006229 13583090 50406051 63486896 40662465
2073 40662465 152473 -30019135 -39586270 -39472191 -40397707 -36255203 -16161229 11060115
2065 11060115 19642124 1170817 -17105092 -2890968 39599805 75456318 82470721
2058H2470721j2952262j7577557k0154470k0999036r716479N473246L000324j3391413
2050c846926j1834981J9323698M6812650L5725980j952092k5702475k0861614
2043C7664240q701366p201808r059890l622108K923689J862977j62682O489215
2035B0192267J4379726Q365418r240071j9228283j1346742M729450J5981251J9106222
2027D2939238J3264670l972286k4443696k8190793q196176J5042446J9029598
2020B5473001R515049P445949J4392991J3437432O08335r218798r300916r841330
2012D2511713j4973660j4514173o217091k726666o346691j266198J5361161J9533807
2004C1362202l275403l0533311l4323260k0624849j1189163m746990J2523150
$$ plain form
2058 82470721 69518459 51940902 31786432 10787396 1070917 6544163 9544487 -3846926
2050 -3846926 -15681907 3641791 50454441 86180421 84228329 58525854 37664240
2043 37664240 28962874 21761066 12701176 9079068 12002757 13865734 13703052 20192267
2035 20192267 34571993 42937411 33697340 14469057 3122315 7851765 23833016 42939238
2027 42939238 56203908 52231622 27787926 -402867 -8599043 6443403 25473001
2020 25473001 34988050 42433999 56826990 70264422 70872757 61653959 52353043 42511713
2012 42511713 27538053 13023880 6806789 4080123 -2266568 -3532766 11828395 31362202
2004 31362202 28086799 -2446512 -36769772 -57394621 -68583784 -73330774 -60807624
1997f0807624L1188841K7932235N237568j0791123j0585678q644295j1353342
1990c7823418q349242J233217M395743J580977Q692838K4466399K5608656N014712
1982B4819882j4063019j5042654j0782960j3316308r277998J2399907L2428450
1975G165300K6896715L944756j0320559r432283o609838q172664r759110j0829890
1967a7117573j2151604o354922R549012K0340066J1372107o314819j0264459Q99879
1959a0042313J0630072J3518055J7304939J9808750R583550r710158j9922201
1952C1170694j6671347j4372759j8883012j8099940o567561L130634L170188L398048
1944c3725055R663639R892697k951671j2902202n011420Q267286O680385l879642
$$ plain form
1997 -60807624 -29618783 -1686548 3551020 -7240103 -17825781 -26470076 -37823418
1990 -37823418 -46172660 -44939443 -40543700 -38962723 -30269885 -5803486 19805170 24819882
1982 24819882 10756863 -4285791 -15068751 -28385059 -37663057 -25263150 7165300
1975 7165300 34062015 38006771 27686212 18253929 11644091 3471427 -6287683 -17117573
1967 -17117573 -29269177 -35624099 -26075087 -5735021 5637086 -677733 -10942192 -10042313
1959 -10042313 587759 14105814 31410753 51219503 60803053 51092895 31170694
1952 31170694 14499347 126588 -18756424 -36856364 -43423925 -40293291 -37123103 -33725055
1944 -33725055 -24061416 -14168719 -17120390 -30022592 -35034012 -26766726 -20086341 -23965983
1936b3965983k373376R084009O245847j5965755l0504600j7410862N875541J0120368
1928e8894811m361387j1280763L663007K6952438L8389537L2203293J4721945
1921D1393259n172260j7944964j6988818p397415k776421o634172n688999R490623
1913a1719167K5878847K3463468M739300p264054j461433P114037K923644m691230
1905C8983412L393138K2362223K3593528o400705m1233008m2422244p797558K2948384
1897A3427170J5982589j6134462l3842436k2427992n812898p675143j9135277
1890g5618449j6579883L010892K1071288K4507849J7797650J0665811P200912
1883g943930O815710N758647j038922j1395476j3860634m140933L452592n144241
$$ plain form
1936 -23965983 -26339359 -17255350 -11009503 -26975258 -57479858 -74890720 -69015179 -58894811
1928 -58894811 -63256198 -74536961 -70873954 -43921516 -5531979 26671314 41393259
1921 41393259 36220999 18276035 1287217 -6110198 -8886619 -15520791 -21209790 -11719167
1913 -11719167 14159680 37623148 42362448 35098394 33636961 40750998 43674642 38983412
1905 38983412 42376550 64738773 88332301 81931596 40698588 -1723656 -9521214 13427170
1897 13427170 29409759 13275297 -20567139 -42995131 -48808029 -56483172 -75618449
1890 -75618449 -92198332 -89187440 -68116152 -43608303 -25810653 -15144842 -7943930
1883 -7943930 -1128220 4630427 3591505 -7803971 -21664605 -25805538 -22352946 -27497187
1875b7497187j9732532j7961568K131417K0092274K1933935J2329311q91969j3696061
1867b3292380j6710548j746469J8945366K2555036R881215N969003J9971398L0434285
1859F6006906K1428865O546834J174970l372411j7624542k8899626k2598822r856276
1851A2805898q641871j2863282o500142M549933K602322q729182r084955N577752
1843b0283527J8937841K0219121J2681403M61229j2172567j3628274J218361J5134582
1835B2568169Q590880r917266j7298593j3264965j6305188k5807612k0040257
1828g1474832M835899K4424435K2916117J2861954Q067110K738429q878765j5178082
1820a9687735o319127O480412O842815m054726j3399408j4107250n828418R626993
$$ plain form
1875 -27497187 -47229719 -65191287 -63059870 -42967596 -21033661 -8704350 -9596319 -23292380
1867 -23292380 -40002928 -41749397 -22804031 -248995 9632220 15601223 35572621 66006906
1859 66006906 87435771 93982605 95157575 91785164 74160622 45260996 22662174 12805898
1851 12805898 4164027 -8699255 -15199397 -10649464 -8047142 -16776324 -25861279 -20283527
1843 -20283527 -1345686 18873435 31554838 32016067 19843500 6215226 7433587 22568169
1835 22568169 31159049 21241783 3943190 -9321775 -25626963 -51434575 -71474832
1828 -71474832 -66638933 -42214498 -19298381 -6436427 1630683 4369112 -4509653 -19687735
1820 -19687735 -26006862 -19526450 -12683635 -16738361 -30137769 -44245019 -50073437 -40446444
1812d0446444K3272997K0350211j840181k5176558k9067088j2203876R172334
1805e5938605J8534552J1829794l590q06882J0932484J6006860L51267j9646780
1797a8740900j7125988M457793J5970468Q211825K954292J1247263J2790655o560558
1789A3204850k5623428j9907965l50580O566966L85300m3129P154787P564888
1781a1048311K348166R332885K9225565L6610109J4601364j8965639l1479747
1774C0624392j2531221J7418923L0627788J9076344p30512q464699l805149l814333
1766F8401533j5763210k4512352j5999468k294240o689624k7914889l8012337
1759f2784587j9840153R492155K2422473J6330574J0701402J4757001J6400945
$$ plain form
1812 -40446444 -17173447 3176764 1336583 -23839975 -52907063 -65110939 -55938605
1805 -55938605 -37404053 -25574259 -25577849 -26384731 -15452247 554613 905880 -18740900
1797 -18740900 -35866888 -31409095 -15438627 -7226802 -4272510 6974753 19765408 13204850
1789 13204850 -12418578 -32326543 -32677123 -26110157 -25724857 -25767986 -18613199 -11048311
1781 -11048311 -8700145 632740 29858305 66468414 81069778 62104139 30624392
1774 30624392 18093171 35512094 66139882 85216226 84485714 76021015 72215866 68401533
1766 68401533 52638323 28125971 12126503 9832263 3142639 -24772250 -62784587
1759 -62784587 -82624740 -73132585 -50710112 -34379538 -23678136 -8921135 7479810
1752G479810P291132R34369J1665044K7632436K5236510N712448o277418j918707
1744G7755624K07367j0128525j5995820o712972k094731j8426504l4873834k5167344
1736c5436739k229766M716644r9157O487203J6545357L976512j9434517j3920469
1728c9394932K0120132L7432648K0464238L184060P636668J0519896n871371k1956607
1720C2134732k4919729l1105001l6770194o389053N1412408O0485747j3432339
1713C1416571q7576309o8368260J2627116N0549600K1917305l653933R420145
1706c3667765K0351571L881521n746210J1490670K0001318l827396k5262359j1505760
1698b4284410J2644227R155782j4364982k7866240k6628027k0988278q454051
$$ plain form
1752 7479810 14770942 15705311 27370355 55002791 80239301 85951749 79674331 77755624
1744 77755624 77962991 67834466 51838646 45125674 43030943 24604439 -10269395 -35436739
1736 -35436739 -37666505 -32949861 -33049018 -26561815 -10016458 -6039946 -25474463 -39394932
1728 -39394932 -19274800 18157848 38622086 41806146 49442814 59962710 54091339 32134732
1720 32134732 7215003 -23889998 -60660192 -67049245 -15636837 44848910 31416571
1713 31416571 -56159738 -124527998 -111900882 -61351282 -39433977 -43087910 -33667765
1706 -33667765 -13316194 -9434673 -15180883 -3690213 16311105 12483709 -12778650 -24284410
1698 -24284410 -11640183 -2484401 -16849383 -44715623 -71343650 -92331928 -100785979
1691a00785979J0813155J7225883J915790r942408M532260K8004411K9714255
1684a8522633J0262234p715111j5164441j6176583q669430Q286651K1635886K1598127
1676d465300J7700296J7962629J0717190j0083801k1727610l834378K3207649
1669B9476675K2592264n540714k5550594j6531116O507246K0314366J7780604
1662D9048731L505325j4192629k3463676j6220989J925875J7686278K3304639
1655D1593554J6888626j531023k3755838l3130272k3144809p369348O71612N801037
1647b3976461J5860640K1852986J2077055m315976q095593K247518J1719809J2095683
1639C9465661O684256k633439j5795207k5975838k6111873j9998297j3655287
$$ plain form
1691 -100785979 -89972824 -72746941 -70831151 -80773559 -76241299 -48236888 -18522633
1684 -18522633 -8260399 -15975510 -31139951 -47316534 -55985964 -47699313 -26063427 -4465300
1676 -4465300 13234996 31197625 41914815 31831014 10103404 6269026 29476675
1669 29476675 52068939 46528225 20977631 4446515 10953761 31268127 49048731
1662 49048731 52554056 38361427 14897751 -1323238 602637 18288915 41593554
1655 41593554 58482180 56951157 33195319 65047 -23079762 -30449110 -29777498 -23976461
1647 -23976461 -8115821 13737165 25814220 21498244 13402651 15650169 27369978 39465661
1639 39465661 46149917 43516478 27721271 1745433 -24366440 -44364737 -58020024
1632e8020024k699764J6723031L2377788K9009079J1376352k898544q261576j1634491
1624E971851j2907755m228263J2340541K3035142J8940877K992168j6127746k6343253
1616C673562j6084814R965774K6532156J4913461j2270969k8732545k7753879
1609b9757254j9933750q494594R120582K1419573J1527034j3818429k7400179
1602e7337017j6762251K955715J3111686J0191389m88246j1372575j1945697J246363
1594g0400633J4074613J1597952K596233O759744K0090663J8243438l832679k1681016
1586b2551685j7298286j532105Q194562J0684763J0940713O940018j184472m096559
1578i903051L342149J3414919J7628650J5552454P331773q062516k2600099k2967191
$$ plain form
1632 -58020024 -60719788 -43996757 -11618969 17390110 28766462 25867918 17606342 5971851
1624 5971851 -6935904 -11164167 1176374 24211516 43152393 46144561 30016815 3673562
1616 3673562 -12411252 -2445478 24086678 39000139 26729170 -2003375 -29757254
1609 -29757254 -49691004 -58185598 -49065016 -27645443 -16118409 -29936838 -57337017
1602 -57337017 -74099268 -71143553 -58031867 -47840478 -48328724 -59701299 -71646996 -70400633
1594 -70400633 -56326020 -44728068 -42131835 -35372091 -15281428 2962010 -870669 -22551685
1586 -22551685 -39849971 -41382076 -33187514 -22502751 -11562038 -4622020 -5806492 -9903051
1578 -9903051 -6560902 6854017 24482667 40035121 47366894 39304378 16704279 -6262912
1570f262912j0089941J02000j97187k522629m41714J899578L529209R607297J5659736
1561A1283437R242433o644735j2987126m242379L942531L493479N188130J1698108
1553B0973878P126395j2108323k3110403j1297932N984110R915360Q363028J1757665
1545A7603778Q158018r933101j9425757m52190K4998639K4215024N200488k339249
1537D8025650j573847j7991480m2205779l4167238J0235922M3829944L3994181
1530D0147353M215429q466517k797727K004382J836845K960591K903173q65446
1522D1938083J10539Q143965Q133051p197741j8328280p728762P966346Q98261
1514C3935462k3274313l1612461j1499365J3775178J8856096M307382j3147815
$$ plain form
1570 -6262912 -16352853 -16250853 -16448040 -18970669 -19412383 -17512805 -13983596 -4376299 11283437
1561 11283437 20525870 13881135 894009 -3348370 594161 4087640 9275770 20973878
1553 20973878 28100273 15991950 -7118453 -18416385 -12432275 -2516915 5846113 17603778
1545 17603778 25761796 15828695 -3597062 -4049252 20949387 45164411 50364899 48025650
1537 48025650 46451803 28460323 -13745456 -47912694 -37676772 6153172 40147353
1530 40147353 44362782 35896265 33098538 35102920 36939765 39900356 42803529 41938083
1522 41938083 42048622 50192587 58325638 51127897 32799617 25070855 33037201 33935462
1514 33935462 10661149 -20951312 -32450677 -18675499 180597 4487979 -8659836
1507h659836k0452048j3449953K922944J5089205J3443935O466145R549521J9803228
1499B4713141J9146262N329925q64814J0904307J9878089M024486k4397630l4910403
1491B3823363k2550750j1810991j7093294k2297608q227735J6832639K7056843
1484a4267533J1125401j6458035l2109174k4392007k064075J4538575J3928784
1477d9698064P086853J3649824L2900770M0395046K0171161j1825262k7686183
1470B4994145k1080748p498447Q49089M322219M893813K701373K113900O389007
1462A7684351Q009760n90755r576020l232669J2724891J6948393O708885J721970
1454E0398806Q282659P040612j0852325k2711814r913417Q705326N178803j3426251
$$ plain form
1507 -8659836 -29111884 -42561837 -39638893 -24549688 -11105753 -4639608 4909913 24713141
1499 24713141 43859403 49189328 48324514 59228821 79106910 83131396 58733766 23823363
1491 23823363 1272613 -10538378 -27631672 -49929280 -58157015 -41324376 -14267533
1484 -14267533 -3142132 -19600167 -51709341 -76101348 -78165423 -63626848 -49698064
1477 -49698064 -42611211 -28961387 3939383 44334429 64505590 52680328 24994145
1470 24994145 3913397 -3585050 -2735961 1586258 6480071 9181444 11295344 17684351
1462 17684351 25694111 25103356 15527336 12294667 25019558 41967951 48676836 50398806
1454 50398806 58681465 65722077 54869752 32157938 22244521 30949847 36128650 22702399
1446B2702399j8748960p164782j395l061608O81738J5112648J8911091k11268
1438B8219863k4181346l0514741j9962254n391890Q880533K1150501K0599456
1431a199878M95742k4200254k9341760r836636J6228692K9792950K7280236J6437161
1423B5656253N523796j584369n389877q062561r249473n937164J844670P846781
1415A0648056M754422q687221k5771609l4515646k4687267N54186K0601922J5605989
1407d1497168p525307j8416776n40319K4787140K4709247p23423j7315090k039892
1399c8561588K6374731L2431534R565874j3958771j3451892K896842J0236292
1392A5533022J859327n671660M56176J1611610J2211052J622429o901726l807234
$$ plain form
1446 22702399 3953439 -3211343 -3212738 -6274346 -5592608 9520040 28431131 28219863
1438 28219863 4038517 -26476224 -46438478 -51830368 -42949835 -21799334 -1199878
1431 -1199878 -704136 -24904390 -54246150 -64082786 -47854094 -18061144 9219092 25656253
1423 25656253 31180049 29595680 24205803 16143242 6893769 956605 2801275 10648056
1415 10648056 15402478 6715257 -19056352 -53571998 -78259265 -77705079 -57103157 -41497168
1407 -41497168 -49022475 -67439251 -67979570 -43192430 -18483183 -19206606 -36521696 -38561588
1399 -38561588 -12186857 20244677 29810551 15851780 2399888 5296730 15533022
1392 15533022 17392349 11720689 12176865 23788475 35999527 37621956 30720230 26912996
1384B6912996P734459J6900431J3652413l180259k0054094j7229755P587917K9464496
1376F1788604K2067057r405100l3944513l2606906j6534736m946413l01615O562543
1368g321079J7595821K4542948K0183755N353091j2447678k3624376k3515903
1361G66579j7286002j3033879r338697K112807J9278425K6203721J3793884n104538
1353A7392300j1412168m720053j619773j1506842k4268008k3497406n135678J9616654
1345d5150974L6380328M0124730L5973376K8922878J6908022j616167j7239890
1338I4302303j6750364j679092J0583232Q070105k904317j1047394j5714612k1268857
1330D3591004k5240785k2563980j4947281o023993O162013K0704756K4984243
$$ plain form
1384 26912996 34647455 51547886 65200299 62020040 41965946 24736191 32324108 61788604
1376 61788604 83855661 74450561 40506048 7899142 -8635594 -13582007 -13883622 -7321079
1368 -7321079 10274742 34817690 55001445 60354536 47906858 24282482 766579
1361 766579 -16519423 -29553302 -38891999 -36779192 -17500767 8702954 22496838 17392300
1353 17392300 5980132 1260079 -359694 -11866536 -36134544 -59631950 -64767628 -45150974
1345 -45150974 -8770646 31354084 67327460 96250338 113158360 111542193 94302303
1338 94302303 77551939 75872847 86456079 94526184 91621867 80574473 64859861 43591004
1330 43591004 18350219 -4213761 -19161042 -25185035 -19023022 1681734 26665977
1323B6665977R336657j2987069j7444778j093281J2117350M038960j3887596j8281270
1315a1535050m481373J1528805J5583360Q307148k298884j0728523j4379636j1840707
1307a9844860n416213j152238j119909K165968J6785495L5673439L7982586J3356057
1299G8430325k0185423l3163639j8487314L066184J2408775J2625296J3061594
1292D7755798Q635928q829089k7413661k3354656O458814L5873542L8250578J3585649
1284I0962903j6715607l2783551k9793625j6521666n831018k940910j548320N219052
1276i952742J2971765J2562918N189248l284j998124q488595j9603660k5381294
1268c4703768k2329179j7268632j0432918P230117L1494519L9329271K0769940
$$ plain form
1323 26665977 36002634 23015565 5570787 4477506 16594856 20633816 6746220 -11535050
1315 -11535050 -16016423 -4487618 11095742 19402890 17104006 6375483 -8004153 -19844860
1307 -19844860 -25261073 -26413311 -27533220 -25367252 -8581757 27091682 65074268 78430325
1299 78430325 58244902 25081263 6593949 9660133 22068908 34694204 47755798
1292 47755798 56391726 47562637 20148976 -3205680 3253134 39126676 77377254 90962903
1284 90962903 74247296 41463745 11670120 -4851546 -10682564 -13623474 -15171794 -9952742
1276 -9952742 3019023 15581941 20771189 20767905 18769781 10281186 -9322474 -34703768
1268 -34703768 -57032947 -74301579 -84734497 -77504380 -46009861 -6680590 14089350
1261A4089350j472466l880171K344967o760035k2747387j5020425J6100989L2980106
1253A5634928J6552952n417431m512701M417280n875396k3568329j5739816J1821215
1245f687298J5402963j8841245m5922766k2221054L1836812N7679290L3477594
1238D4724296n865288k0066700p426238Q430213J3152778R184829J970732n651462
1230C8453160r379397n356969L684824J0281333R529032J129067j2428042k5078166
1222A0834842k8316781j9113264m347804P681319J6561631K4344177K5754547
1215C3398667J4603498j361794m728579Q252898J8776904P148798k2770283m7706354
1207E613755m9755052l1106060p104191Q821740J3359429J1025142O366373Q7395
$$ plain form
1261 14089350 12616884 8736713 11081680 4321645 -18425742 -33446167 -17345178 15634928
1253 15634928 32187880 26770449 22257748 26675028 20799632 -2768697 -18508513 -6687298
1245 -6687298 8715665 -10125580 -56048346 -78269400 -46432588 11246702 44724296
1238 44724296 38859008 18792308 11366070 19796283 32949061 42133890 44104622 38453160
1230 38453160 29073763 23716794 27401618 37682951 47211983 48341050 35913008 10834842
1222 10834842 -17481939 -36595203 -40943007 -33261688 -16700057 7644120 33398667
1215 33398667 48002165 46640371 41911792 50164690 68941594 76090392 53320109 5613755
1207 5613755 -44141297 -75247357 -82351548 -73529808 -60170379 -49145237 -42778864 -42691469
1199d2691469o125030n771814L966246J2624572P156686o699293q351511O509298
1191c9382315J5091740N24666j9127574j4324550J2974446L2575397K8107199
1184A6439009J1481496m754571k2352554l7141253l0837610N83776L1096096L6584419
1176A098808K6608194K4063237K7694088J9321773j229000j5271891j5857401
1169F6427808j3531204j1627776j824526J1457027Q257081j5001893l3053164
1162A1103353k4971795j932369J2715006J5385082J7705047K2395965K1951629
1155G4351918J4666244O382652J59789m337222o298540q252679j7182245l0551283
1147B8938634l1464482j2056389Q152794N302299j4561926k4179333j3321673
$$ plain form
1199 -42691469 -48816499 -54588313 -50622067 -37997495 -30840809 -37540102 -45891613 -39382315
1191 -39382315 -24290575 -23765909 -42893483 -57218033 -44243587 -11668190 16439009
1184 16439009 27920505 23165934 813380 -36327873 -67165483 -66581707 -35485611 1098808
1176 1098808 27707002 51770239 79464327 98786100 97557100 82285209 66427808
1169 66427808 52896604 41268828 39444302 50901329 59158410 44156517 11103353
1162 11103353 -13868442 -15800811 -3085805 12299277 30004324 52400289 74351918
1155 74351918 89018162 95400814 95560603 91223381 84924841 76672162 59489917 28938634
1147 28938634 -2525848 -14582237 -6429443 -1127144 -15689070 -39868403 -53190076
1140e3190076L340574J4680201K5154142L4788272L1542548J4131190K266031
1133G2712882R763442K2182982J6542389o794205k6423387k7454845j3965592
1126D6563666J544517R661667P430382m40189m749903k241461l01189n883085
1118E1584405j3621885j1937220P98732J2221262Q602535j0528759k9671282l0101496
1110b2653708r128856J4728629K1547105J2625280M627930M272124L181133j661527
1102B7538110o91482Q034274R223697o479989k3805498k2143324l052232J5800517
1094D424073K4381104K2921722J0742441r154213k1008912j1577598Q070217J3977369
1086D2776203J212129j2588154j4189718p221895K228715J2948397J8586100R956892
$$ plain form
1140 -53190076 -49849502 -35169301 -10015159 24773113 56315661 70446851 72712882
1133 72712882 82476324 104659306 121201695 114407490 87984103 60529258 46563666
1126 46563666 48108183 57769850 65200232 64760043 60010140 57768679 57467490 51584405
1118 51584405 37962520 26025300 26824032 39045294 47647829 37119070 7447788 -22653708
1110 -22653708 -31782564 -17053935 4493170 17118450 21746380 26018504 29199637 27538110
1102 27538110 26846628 34880902 44104599 37624610 13819112 -8324212 -11376444 4424073
1094 4424073 28805177 51726899 62469340 53315127 32306215 20728617 28798834 42776203
1086 42776203 43988332 31400178 17210460 9988565 12217280 25165677 43751777 53708669
1078E3708669o162069q607160Q498558K3212641J4101213j1416787k8930758k7563650
1070A6840657j6692789r118546r287831j5016346k1342220k2717373j6189805
1063i3524253k612106J4719728K9004249L0581247J7538266L972004N500033J6156882
1055B1336050J4489395l969921j7222382q268213R697925J2601465j658231j4212739
1047A2793349j1809831P59738J0319436P398121o618947j7056387q173763J4838523
1039B450239K6810158J5356062l04755K301416J4860722J2940691m685060j5983105
1031E3746368j1829602o920982j1717086j7166025j4790045j0886221r925283
1024b9488876k274558J7061015L1517257K1968459m452842k0178490j0329890
$$ plain form
1078 53708669 47546600 38939440 47437998 70650639 84751852 73335065 44404307 16840657
1070 16840657 147868 -8970678 -18258509 -33274855 -54617075 -77334448 -93524253
1063 -93524253 -96136359 -81416631 -52412382 -21831135 -4292869 -320865 5179168 21336050
1055 21336050 35825445 31855524 14633142 6364929 16062854 28664319 27006088 12793349
1047 12793349 983518 1743256 12062692 19460813 12841866 -4214521 -12388284 2450239
1039 2450239 29260397 44616459 44311704 46613120 61473842 74414533 69729473 53746368
1031 53746368 41916766 34995784 23278698 6112673 -8677372 -19563593 -29488876
1024 -29488876 -31763434 -14702419 16814838 38783297 34330455 14151965 3822075
1017C822075J1437111K1308386J2016859j903818l442336N438491O778710o775763
1009D8679715j7906208q464008J0292227J0316196j1496112k6358801j4400638
1002i337629R127481J9640866J5122205O849123l109028j4729640j5460102K862014
994A0965290K2045989J7350747o536515k3655212k5807508k5888063k4260698
987e5785970m368337L0898749M9741205L3792604M862218q263985p793513j1644425
979C1438546j9846044k0557015j5781619j5837856j6903816p972848N882283J0194553
971d9383816O483489P983081J3324602Q737630m155426p801423J298085O465642
963a7048136m4958n557822j823813K252194K183499Q212112K1182444K1800344
$$ plain form
1017 3822075 15259186 36567572 48584431 46680613 43238277 48676768 55455478 48679715
1009 48679715 30773507 22309499 32601726 42917922 31421810 5063009 -9337629
1002 -9337629 -210148 19430718 34552923 41402046 38293018 23563378 8103276 10965290
994 10965290 33011279 50362026 43825511 20170299 -5637209 -31525272 -55785970
987 -55785970 -60154307 -29255558 20485647 54278251 59140469 50876484 43082971 31438546
979 31438546 11592502 -8964513 -24746132 -40583988 -57487804 -65460652 -59578369 -49383816
971 -49383816 -42900327 -34917246 -21592644 -12855014 -17010440 -24811863 -23513778 -17048136
963 -17048136 -17093094 -22650916 -24474729 -22222535 -20039036 -11826924 9355520 31155864
955C1155864J504358j6828047r740704J2265197K2533390J5718439M876494n553749
947E5931242j8812429k7626975k2582596j2169363j0062906q854589P125149K7717851
939i334616K5556197o85234k1112058j7610316m688958l21521k402049l902602
931c4501157o592167q082333J583728J8080078K0358462L524976r076143k395257
923a7099813N592102m288813j8645841j4842910N17811N139963m5250M386128
915c9286623J9784996K6747066J7378545M709013j064203l577027n851131m690275
907A4150361j879035l961612r449461j1133640r656417r236581l947644J2682524
899b2431505K7973245K2259883m8205j4554218j2634235q706852r591917m088489
$$ plain form
955 31155864 32660222 15832175 6091471 18356668 40890058 56608497 61484991 55931242
947 55931242 37118813 9491838 -13090758 -25260121 -35323027 -44177616 -37052467 -9334616
939 -9334616 16221581 15536347 -5575711 -23186027 -27874985 -28196506 -30598555 -34501157
931 -34501157 -41093324 -49175657 -47591929 -29511851 -9153389 -5628413 -14704556 -17099813
923 -17099813 -11507711 -15796524 -34442365 -49285275 -48767464 -43627501 -43672751 -39286623
915 -39286623 -19501627 7245439 24623984 29332997 28268794 24691767 18840636 14150361
907 14150361 12271326 8309714 -1139747 -12273387 -21929804 -31166385 -35114029 -22431505
899 -22431505 5541740 27801623 27753418 13199200 564965 -8141887 -17733804 -21822293
891b1822293R612355J3785613J039648j0500695p050769j407168p927978j6408471
883d0679758j1131945K351717J1156109J9051997L2338405L6269048J3866101
876F3221674k0412966l4890898k5317457j7361824k4041010k8666073j6287860
869a03756414L586370J6616834K4316718L1357916L0201903J5104702j460356
862A5967673m129237J635612j574291j4979780k1760843j3250715l17932O137124
854c2272389J1328690K3315199L3992369K7570266N196397j2557055j0936415
847D5637062J620074O961604j29823j0545388j6187705j7053399j5421884j2200390
839a7319849r033727o680959j539804R134043J9310967J9507051R922644L40804
$$ plain form
891 -21822293 -12209938 1575675 2615323 -7885372 -14936141 -16343309 -24271287 -40679758
883 -40679758 -51811703 -49459986 -38303877 -19251880 13086525 49355573 63221674
876 63221674 42808708 7917810 -17399647 -34761471 -58802481 -87468554 -103756414
869 -103756414 -100170044 -83553210 -59236492 -27878576 2323327 17428029 15967673
862 15967673 11838436 13474048 11899757 -3080023 -24840866 -38091581 -38409513 -32272389
854 -32272389 -20943699 2371500 36363869 63934135 69130532 56573477 45637062
847 45637062 47257136 54218740 54088917 43543529 27355824 10302425 -5119459 -17319849
839 -17319849 -26353576 -33034535 -34574339 -25440296 -6129329 13377722 23300366 23641170
831B3641170k614695L03102P707880J7336495K0183328Q839547p460097j2020417
823E5916313p521866j4535601l6078320m4749670j9890720J9921547M0117136
816f821181L2822438J6803917N687742j594077n081210j242632N116377N490133
808E1181507L375410P991983J4489458R442043n017185j2872798j0642700j0886725
800D7060993j6904593j6684209p763584m514886j0585559p338242J4527750L1756302
792B9553972J7584759j8729664m1771285l1938520l65997L1157468M6976685L8375233
784G0842651P181432k8272538m4547640l5510928j6128168l027606R47844K132988
776d6381965M485108O731528P240738Q099696J2976137J9792215J8483802K793624
$$ plain form
831 23641170 21026475 21329577 29037457 46373952 66557280 75396827 67936730 55916313
823 55916313 48394447 33858846 -2219474 -46969144 -66859864 -46938317 -6821181
816 -6821181 26001257 42805174 48492916 46898839 41817629 40574997 45691374 51181507
808 51181507 54556917 62548900 77038358 86480401 81463216 68590418 57947718 47060993
800 47060993 30156400 13472191 5708607 1193721 -9391838 -16730080 -2202330 29553972
792 29553972 47138731 28409067 -13362218 -45300738 -45666735 -14509267 32467418 70842651
784 70842651 78024083 49751545 5203905 -30307023 -46435191 -49462797 -48514953 -46381965
776 -46381965 -41896857 -35165329 -27924591 -19824895 -6848758 12943457 31427259 34220883
768C4220883j6450277j9885053m071903J3417065J7803287J3534619R828079M198563
760E2595263p042858j4583651r112926O01271O13784m617815j689666M480583
752B1243985k792529j8891819j8713349K340821J4878001j536381k4210109j8620942
744d6302322J0327885K4508361N920253k0872054k4298731m170236J5809683K0645921
736a8431240J5354318R331406M067647m11090K381120J6937781L2396998K9431215
728I1058155N383176j6894438j5525706R32601M790960j1162673k2948928j0705589
720B4927558J2272080J9740009R256513j78202o09060l072041j1852530j2892175
712C7592152K547446J9839520K0451873P630691k349479n705033j0479293j5252764
$$ plain form
768 34220883 17770606 -2114447 -6186350 7230715 25034002 38568621 48396700 52595263
760 52595263 45552405 30968754 21855828 22457099 23070883 18453068 16763402 21243985
752 21243985 18451456 -440363 -19153712 -16812891 -1934890 -3471271 -27681380 -46302322
744 -46302322 -35974437 -11466076 -5545823 -26417877 -50716608 -54886844 -39077161 -18431240
736 -18431240 -3076922 6254484 10322131 9911041 12292161 29229942 61626940 91058155
728 91058155 96441331 79546893 64021187 64953788 69744748 58582075 35633147 24927558
720 24927558 37199638 56939647 66196160 66017958 65408898 62336857 50484327 37592152
712 37592152 40139598 59979118 80430991 88061682 85712203 80007170 69527877 54275113
704E4275113q578876Q167433J6043293M687846j1348982j3367460m700522l232886
696D1944959j4663642k6821027k7920822j8405985n153873N399786P755052R80661
688c6884891o041495j544788J4132038K7331582K7144358J6598914O278851K890865
680D9905434N323347O075422l403432k1839472l3679046k4862601k480774J2606070
672a2355052J2649033Q339814O033259j596411j5068982j8275298l267585J2013203
664a1528019R023703k004129N81220J3338293J3702925j606381j0188412J136108
656A2455308J7883177K1321426J1660728k62239q685399j1718563p787686j708701
648C3158051l215481j2580975j8423397j5375425j2015766j5218864j9215707
$$ plain form
704 54275113 45696237 53863670 69906963 74594809 63245827 49878367 45177845 41944959
696 41944959 27281317 460290 -27460532 -45866517 -51020390 -45620604 -37865552 -36884891
688 -36884891 -42926386 -44471174 -30339136 -3007554 24136804 40735718 47014569 49905434
680 49905434 55228781 61304203 57900771 36061299 2382253 -22480348 -24961122 -12355052
672 -12355052 293981 8633795 14667054 13070643 -1998339 -20273637 -23541222 -11528019
664 -11528019 -2504316 -4508445 -3927225 9411068 23113993 21507612 11319200 12455308
656 12455308 30338485 51659911 63320639 63058400 54373001 42654438 34866752 33158051
648 33158051 29942570 17361595 -1061802 -16437227 -28452993 -43671857 -62887564
641f2887564j7204276j1174243k671700J2655140L1945014M0015534K8858318
634A9536223J0649338J0542m836457j1004535j3789106o082929N387466R605477
626I476019Q683417R974333R576769J045150p726197n552627J212576l19223m227006
617B2143211M365489J7768542J1818354j3978028k9884692j7644342N713218J6287311
609A6589063J2723233M442703p430057k0347358k0302209j602597J6820851J4427633
601A5321262j964299j0274272m375712N248613J2588008J7239030J1967678p947807
593C7802501k6444930k0929740M839300K3615202K1902896J2390741O131752k965211
585E6342511j6838644k0632836p212735M892463k791548j9394982k1749306r951353
$$ plain form
641 -62887564 -80091840 -91266083 -93937783 -81282643 -49337629 -9322095 19536223
634 19536223 30185561 30196103 25359646 14355111 566005 -5516924 -129458 9476019
626 9476019 18159436 28133769 37710538 38755688 31029491 25476864 26689440 26370217 22143211
617 22143211 26508700 44277242 56095596 42117568 12232876 -5411466 301752 16589063
609 16589063 29312296 33754999 26324942 5977584 -14324625 -15927222 893629 15321262
601 15321262 13356963 3082691 -1293021 3955592 16543600 33782630 45750308 37802501
593 37802501 11357571 -9572169 -4732869 18882333 40785229 53175970 59307722 56342511
585 56342511 39503867 18871031 11658296 16550759 13759211 -5635771 -27385077 -37336430
577c7336430l096855n455150j479063J4291409K5150985J7563407J069356p058727
569C648932m395757p32370k435800q645328j5602132j6860012o339135J1294130
561d0067472K0748379J4635850M075608J708111K937094l373503j3161223j2612050
553b5109206j976699L783834o64379k873104O525231J9510536K3872153J8385468
545D1453834Q071175m104159j3547258j3202011m275993K528358L465891P187914
537B7577751J5831764J6050343J634723j0317563l633521R562228P316598o190901
529E7831422q265815L817946Q844753l350357j8790337k5242242k6338042k3496387
521c4989059q936400J3087574K2329081J3484362Q364751K0579014K9923294J3388818
$$ plain form
577 -37336430 -40433285 -45888435 -47367498 -33076089 -7925104 9638303 10707659 3648932
569 3648932 -746825 -1479195 -3914995 -12560323 -28162455 -45022467 -51361602 -40067472
561 -40067472 -19319093 -4683243 -607635 1100476 4037570 664067 -12497156 -25109206
553 -25109206 -27085905 -23302071 -23966450 -26839554 -20314323 -803787 23068366 41453834
545 41453834 49525009 45420850 31873592 18671581 14395588 16923946 20389837 27577751
537 27577751 43409515 59459858 61094581 50777018 47143497 56705725 64022323 57831422
529 57831422 49565607 53383553 62228306 58877949 40087612 14845370 -11492672 -34989059
521 -34989059 -43925459 -30837885 -8508804 4975558 13340309 33919323 63842617 77231435
513G7231435j6621824l0020650k1763028j1033053p113663k945757K199804O15926
505i450810l473992L371777J7683756J9031511J874098j3972268j2851301l857587
497a644816j580758l596808n98022M045489j37229j2505859k1157518j7983902
489e5159423n833296O722620J2637580J1574649J0788885J6469325K3035855J8246580
481C8482775J141100j3653971j3714115l249770M919823M859518j9742m155159
473A4610459m752150l508356n398325j1180423j2211590j060292J3815242J6090397
465F404962N576820p6212P755527J5255822Q096646p150831j5082430j3617918
457G162386j1264137j1103387j0601028j0644917j2455392j1186345l786583L053737
$$ plain form
513 77231435 60609611 30588961 8825933 -2207120 -9320783 -12266540 -10066736 -9450810
505 -9450810 -12924802 -9553025 8130731 27162242 29036340 15064072 2212771 -1644816
497 -1644816 -3225574 -6822382 -7420404 -3374915 -3512144 -16018003 -37175521 -55159423
489 -55159423 -60992719 -54270099 -41632519 -30057870 -19268985 -2799660 20236195 38482775
481 38482775 39623875 25969904 12255789 9006019 13925842 18785360 18765618 14610459
473 14610459 9858309 6349953 951628 -10228795 -22440385 -23500677 -9685435 6404962
465 6404962 11981782 11905570 19661097 34916919 43013565 35862734 20780304 7162386
457 7162386 -4101751 -15205138 -25806166 -36451083 -48906475 -60092820 -63879403 -60825666
449f0825666L983416O384154J7488846K7926193K4577478J4152732J4826940K6045878
441G4559971K6522100N562579k1006416l2186101k5206681j1703393k631636k728922
433A1181501r138032j0366457L008716K2397313K7547675J3455098k356558o044030
425D9685226o053687j4546864k4290060k0471749o470899P97652k203291j558040
417b5111712J0027224K1584177K1726288J4704239J0367207P910901r3798j2641334
409D8473192j9487759j4826352m298414K907083L706745R50408k353753n370785
401I700365p650323q176541o695262m298193j706531K131866Q196646J3896565
393E398592J3309786L541888q925955j1632648P30459J7964964K3760055J4208622
$$ plain form
449 -60825666 -56842250 -50458096 -32969250 -5043057 19534421 33687153 48514093 74559971
441 74559971 101082071 106644650 85638234 53452133 28245452 16542059 13910423 11181501
433 11181501 2043469 -8322988 -5314272 17083041 44630716 58085814 55729256 49685226
425 49685226 43631539 29084675 4794615 -15677134 -22148033 -21350381 -23553672 -25111712
417 -25111712 -15084488 6499689 28225977 42930216 53297423 61208324 61114526 48473192
409 48473192 28985433 14159081 9860667 12767750 16474495 17424903 15071150 9700365
401 9700365 2050042 -6126499 -12821761 -17119954 -18826485 -16694619 -8497973 5398592
393 5398592 18708378 22250266 13324311 1691663 2422122 20387086 44147141 58355763
385E8355763K148831N88853O897177Q425192k33754j2574553k0556872k1794078
377B1256559j6876374p912698j086902k505639q857220r754569k211732N191383
369b2757192N758908K937457L89366n492760j5148954j8181739p602583N772905
361e4324592O083324n152060j2131313p234283K181952P746988Q714504P313038
353d6802442O542390J1473691K1569042K3831871P057122j7932709k7181213j4054175
345c5496423L945590J0891110Q965922N233846q90830q767871j0362275l399310
337b9880241J667901j893432n109003J574048J1903452J4134213Q488990K933953
329C819881N4224p70166L119168J0262741J0096375j889178j2642686q950367
$$ plain form
385 58355763 60504594 61093447 67990624 76415816 76182062 63607509 43050637 21256559
377 21256559 4380185 -3532513 -4619415 -7125054 -15982274 -25736843 -27948575 -22757192
369 -22757192 -16998284 -14060827 -13671461 -19164221 -34313175 -52494914 -60097497 -54324592
361 -54324592 -48241268 -53393328 -65524641 -72758924 -70576972 -62829984 -54115480 -46802442
353 -46802442 -40260052 -28786361 -7217319 16614552 23671674 5738965 -21442248 -35496423
345 -35496423 -31550833 -20659723 -11693801 -6459955 -7350785 -16118656 -26480931 -29880241
337 -29880241 -28212340 -30105772 -35214775 -33640727 -21737275 -7603062 885928 3819881
329 3819881 3874105 3103939 6223107 16485848 26582223 24693045 12050359 3099992
321C099992K349577O853851O241523J0672869J5108921O189984j0183689j3251409
313B7081619k148924j090990k0743789l7275902k5282029N339519K3550173J7738635
305a2831688M238055O03834O972778J3583266J3513511N422539p167360j6242487
297H092448j4874197m717117N711242J0491428J0044794N887462k391544j2348864
289E895652j5713417n960709J1303152K0617132J2823121l415766j0975099m587611
281I986455M217414M108221j541381k766162Q27199J621327j013503J365861J1096144
272B7901575J7062375Q947640p018996j4531538q292157j370485p907324k2627198
264g836108k5174457o908651J4574068J6108021q35160j3414540r735241j305000
$$ plain form
321 3099992 5449569 12303420 18544943 29217812 44326733 50516717 40333028 27081619
313 27081619 24932695 23841705 3097916 -34177986 -59460015 -54120496 -30570323 -12831688
305 -12831688 -8593633 -7989799 -1017021 12566245 26079756 31502295 24334935 8092448
297 8092448 -6781749 -11498866 -5787624 4703804 14748598 20636060 18244516 5895652
289 5895652 -9817765 -15778474 -4475322 16141810 28964931 25549165 14574066 9986455
281 9986455 14203869 18312090 16770709 14004547 14831746 16453073 15439570 16805431 27901575
272 27901575 44963950 53911590 46892594 32361056 24068899 22698414 14791090 -7836108
264 -7836108 -33010565 -39919216 -25345148 -9237127 -10072287 -23486827 -33222068 -34527068
256c4527068J139344N060742J7093198K4237180J3410975l090262m742244L252265
248B1834130q19316j6321291j9760039n170504M925619k408751j0018037k522176
240c0260365P207192K643360p308351o380634k08036k606382o534469M084913
232c9362772K2432938K6448442J4368963N689673P153049M659406o941866j2101360
224B2346473k329803O380397k336108j9734893k4920778j2446038N505451J6320642
216a1214657J5433063M293794r708543j5332768p753269N495719J3281498J1784088
208F278925M143356m129644o089655J845126J0939586N408389j5476675k9596314
200b6676906j7713604R192676K1957425J0585974m670430k637793J1178642J4999493
$$ plain form
256 -34527068 -33387724 -28326982 -11233784 13003396 26414371 23324109 18581865 21834130
248 21834130 21014814 4693523 -15066516 -20237020 -15311401 -17720152 -27738189 -30260365
240 -30260365 -23053173 -20409813 -27718164 -34098798 -34306834 -36913216 -43447685 -39362772
232 -39362772 -16929834 9518608 23887571 29577244 36730293 41389699 34447833 22346473
224 22346473 20016670 26397067 24060959 4326066 -20594712 -33040750 -27535299 -11214657
216 -11214657 4218406 8512200 -1196343 -16529111 -24282380 -18786661 -5505163 6278925
208 6278925 10422281 6292637 202982 2048108 12987694 18396083 2919408 -26676906
200 -26676906 -44390510 -35197834 -13240409 -2654435 -7324865 -9962658 1215984 16215477
192A6215477J308701j4589653j6469242p598130l155018p575314r175681J091207
184c9947653J4262554J3865199k071165j7305608j5586348K924226K3428335L0235010
176I804550J9562610L202256k216637N409398Q512437p979741l2848666l9124712
$$ plain form
192 16215477 17524178 2934525 -13534717 -21132847 -24287865 -31863179 -41038860 -39947653
184 -39947653 -25685099 -11819900 -13891065 -31196673 -46783021 -43858795 -20430460 9804550
176 9804550 29367160 32569416 30352779 35762177 44274614 36294873 3446207 -35678505
$$ [...]
##END NTUPLES=NMR SPECTRUM
##END=
