##TITLE=31Pdec_DE-55rmDCM
 
 64 sc
 3.5.2024
##JCAMPDX= 6.0         $$ Bruker NMR JCAMP-DX V2.0
##DATA TYPE= NMR SPECTRUM
##DATA CLASS= NTUPLES
##ORIGIN= UXNMR, Bruker Analytische Messtechnik GmbH
##OWNER= root
$$ XWIN-NMR		Version 3.5
$$ Fri May  3 13:54:34 2024 Russian Standard Time (UT+4h)  she@DPX200
##.OBSERVE FREQUENCY= 81.013821
##.OBSERVE NUCLEUS= ^31P
##.ACQUISITION MODE= SIMULTANEOUS
##.ACQUISITION SCHEME= undefined
##.AVERAGES= 64
##.DIGITISER RES= 16
##SPECTROMETER/DATA SYSTEM= spect
##.PULSE SEQUENCE= zgpg30
##.SOLVENT NAME= CDCl3
##.SHIFT REFERENCE= (INTERNAL, CDCl3, 0, 248.564)
##AUDIT TRAIL= $$ (NUMBER, WHEN, WHO, WHERE, WHAT)
$$ ##TITLE= Audit trail, XWIN-NMR		Version 3.5
$$ ##JCAMPDX= 5.01
$$ ##ORIGIN= Bruker BioSpin GmbH
$$ ##OWNER= she
$$ F:/spectra/data/she/nmr/P31/1/pdata/1/auditp.txt
$$ ##AUDIT TRAIL=  $$ (NUMBER, WHEN, WHO, WHERE, WHAT)
(   1,<2024-05-03 13:53:03.48 +0400>,<she>,<DPX200>,
      <continue with go, POWCHK disabled, PULCHK disabled
       configuration hash MD5:
       00 E9 B6 7A A2 85 ED C7 34 08 36 98 17 FE 4E 26
       data hash MD5: 32K
       6F 3A 02 9B 69 89 88 15 F9 F2 00 B7 96 BE 11 7F>)
(   2,<2024-05-03 13:53:04.90 +0400>,<she>,<DPX200>,
      <Start of raw data processing
       efp BC_mod = 2 LB = 10 FT_mod = 6 PKNL = 1 PHC0 = -13235.47 PHC1 = 82.08328 SI = 64K 
       data hash MD5: 64K
       FA 86 B1 A6 E0 B7 2B E2 2B 0E 42 59 28 EC 6F 60>)
(   3,<2024-05-03 13:53:25.34 +0400>,<she>,<DPX200>,
      <pk PHC0 = -54.00278 PHC1 = 185.8001 
       data hash MD5: 64K
       E5 67 1B 60 09 F8 AA 3F 2B 6B B4 1B 57 57 EF EE>)
(   4,<2024-05-03 13:53:54.85 +0400>,<she>,<DPX200>,
      <pk PHC0 = -18.9806 PHC1 = 0 
       data hash MD5: 64K
       E2 80 34 7E 94 D8 67 23 A7 FF 1D 46 85 3F 53 79>)
$$ ##END=
$$ 
$$ hash MD5
$$ D7 C8 23 55 D9 CD 89 26 D1 8A 8A 79 42 F3 D2 EF
##$RELAX= 
##$RELAX= 
##$RELAX= 
##$RELAX= 
##$RELAX= 
##$RELAX= 
##$RELAX= 
##$RELAX= 
##$RELAX= 
$$ Bruker specific parameters
$$ --------------------------
##$DU= <F:/spectra>
##$EXPNO= 1
##$NAME= <P31>
##$PROCNO= 1
##$TYPE= <nmr>
##$USER= <she>
##$AMP= (0..31)
100 100 100 100 100 100 100 100 100 100 100 100 100 100 100 100 100 100 
100 100 100 100 100 100 100 100 100 100 100 100 100 100 
##$AQSEQ= 0
##$AQ_mod= 1
##$AUNM= <au_zg>
##$AUTOPOS= <>
##$BF1= 81.014009
##$BF2= 200.13
##$BF3= 200.13
##$BF4= 200.13
##$BF5= 200.13
##$BF6= 200.13
##$BF7= 200.13
##$BF8= 200.13
##$BYTORDA= 1
##$CFDGTYP= 0
##$CFRGTYP= 5
##$CHEMSTR= <none>
##$CNST= (0..31)
1 1 145 1 1 1 1 1 1 1 1 1 1 1 1 1 1 1 1 1 1 1 1 1 1 1 1 1 1 1 1 1 
##$CPDPRG= <waltz16>
##$CPDPRG1= <>
##$CPDPRG2= <waltz16>
##$CPDPRG3= <>
##$CPDPRG4= <mlev>
##$CPDPRG5= <mlev>
##$CPDPRG6= <mlev>
##$CPDPRG7= <mlev>
##$CPDPRG8= <mlev>
##$CPDPRGB= <>
##$CPDPRGT= <>
##$D= (0..31)
0 1 0 0 0 0 0 0 0 0 0 0.03 2e-05 3e-06 0 0 0 0 0 0 0 0 0 0 0 0 0 0 0 0 
0 0 
##$DATE= 1714729911
##$DBL= (0..7)
120 120 120 11 120 120 24 19 
##$DBP= (0..7)
150 150 150 150 150 150 150 150 
##$DBP07= 0
##$DBPNAM0= <>
$$ [...]
##$SUBNAM2= <"">
##$SUBNAM3= <"">
##$SUBNAM4= <"">
##$SUBNAM5= <"">
##$SUBNAM6= <"">
##$SUBNAM7= <"">
##$SUBNAM8= <"">
##$SUBNAM9= <"">
##$SW= 501.771253377433
##$SWIBOX= (0..15)
0 1 3 0 0 0 0 0 0 0 0 0 0 0 0 0 
##$SW_h= 40650.406504065
##$TD= 32768
##$TD0= 1
##$TE= 0
##$TE2= 300
##$TE3= 300
##$TEG= 300
##$TL= (0..7)
0 120 53 12 22 120 120 120 
##$TP= (0..7)
150 150 150 150 150 150 150 150 
##$TP07= 0
##$TPNAME0= <>
##$TPNAME1= <>
##$TPNAME2= <>
##$TPNAME3= <>
##$TPNAME4= <>
##$TPNAME5= <>
##$TPNAME6= <>
##$TPNAME7= <>
##$TPOAL= (0..7)
0.5 0.5 0.5 0.5 0.5 0.5 0.5 0.5 
##$TPOFFS= (0..7)
0 0 0 0 0 0 0 0 
##$TUNHIN= 0
##$TUNHOUT= 0
##$TUNXOUT= 0
##$USERA1= <user>
##$USERA2= <user>
##$USERA3= <user>
##$USERA4= <user>
##$USERA5= <user>
##$V9= 5
##$VALIST= <valist>
##$VCLIST= <CCCCCCCCCCCCCCC>
##$VD= 0
##$VDLIST= <DDDDDDDDDDDDDDD>
##$VPLIST= <PPPPPPPPPPPPPPP>
##$VTLIST= <TTTTTTTTTTTTTTT>
##$WBST= 1024
##$WBSW= 4
##$XGAIN= (0..3)
0 0 0 0 
##$XL= 0
##$YL= 0
##$YMAX_a= 2999
##$YMIN_a= -1945
##$ZGOPTNS= <>
##$ZL1= 120
##$ZL2= 120
##$ZL3= 120
##$ZL4= 120
##$ABSF1= 0
##$ABSF2= 0
##$ABSG= 0
##$ABSL= 0
##$ALPHA= 0
##$AQORDER= 0
##$ASSFAC= 0
##$ASSFACI= 0
##$ASSFACX= 0
##$ASSWID= 0
##$AUNMP= <proc_1d>
##$AZFE= 0.1
##$AZFW= 0.5
##$BCFW= 0
##$BC_mod= 2
##$BYTORDP= 0
##$COROFFS= 0
##$CY= -3
##$DATMOD= 1
##$DC= 0
##$DFILT= <>
##$DTYPP= 0
##$F1P= 0
##$F2P= 0
##$FCOR= 1
##$FTSIZE= 65536
##$FT_mod= 6
##$GAMMA= 0
##$GB= 0
##$INTBC= 1
##$INTSCL= 6.047779e-11
##$ISEN= 30
##$LB= 10
##$LEV0= 0
##$LPBIN= 0
##$MAXI= 10000
##$MC2= 0
##$MEAN= 0
##$ME_mod= 0
##$MI= 50
##$NCOEF= 0
##$NC_proc= -10
##$NLEV= 6
##$NOISF1= 182.463
##$NOISF2= 159.3651
##$NSP= 0
##$NTH_PI= 0
##$NZP= 0
##$OFFSET= 248.5645
##$PC= 4
##$PHC0= -13308.45
##$PHC1= 267.8834
##$PH_mod= 1
##$PKNL= yes
##$PPARMOD= 0
##$PSCAL= 0
##$PSIGN= 0
##$REVERSE= no
##$SF= 81.0140089999694
##$SI= 65536
##$SIGF1= 159.3651
##$SIGF2= -187.1042
##$SINO= 113.3802
##$SIOLD= 16384
##$SREGLST= <1H.CDCl3>
##$SSB= 0
##$STSI= 65536
##$STSR= 0
##$SW_p= 40650.406504065
##$SYMM= 0
##$S_DEV= 0
##$TDeff= 32768
##$TDoff= 0
##$TI= <>
##$TILT= no
##$TM1= 0
##$TM2= 0
##$TOPLEV= 0
##$USERP1= <user>
##$USERP2= <user>
##$USERP3= <user>
##$USERP4= <user>
##$USERP5= <user>
##$WDW= 1
##$XDIM= 65536
##$YMAX_p= 326756342
##$YMIN_p= -44794357
$$ End of Bruker specific parameters
$$ ---------------------------------
##NTUPLES= NMR SPECTRUM
##VAR_NAME=  FREQUENCY,     SPECTRUM/REAL,   SPECTRUM/IMAG
##SYMBOL=    X,             R,               I
##VAR_TYPE=  INDEPENDENT,   DEPENDENT,       DEPENDENT
##VAR_FORM=  AFFN,          ASDF,            ASDF
##VAR_DIM=   65536,         65536,           65536
##UNITS=     HZ,            ARBITRARY UNITS, ARBITRARY UNITS
##FACTOR=    0.620285442955139, 1,           1
##FIRST=     20137.2065510682, 0,            0
##LAST=      -20513.1999529968, 0,           0
##MIN=       -20513.1999529968, -44794357,   0
##MAX=       20137.2065510682, 326756342,    0
$$ Real data points
##PAGE= N=1
##DATA TABLE= (X++(R..R)), XYDATA
$$ [...]
12469g071110l73557m13886m25665m12472l84070l63205l81974m69208o37301
12460a0932448q76901j161779j458826j735102j958123k093125k104038j960736
12452b4281078j649357j180646n92535N4951O91747J251973J684505J958549K067747
12443a9994144K034197J907104J750256J621061J552607J548352J589153J644847
12435f346567J683769J679091J614038J486634J311493J115382R26650P63561
12427D234051O29162N16202M18306L38249K85998K67205K70951K67328K18321
12418G445773R5279j08022l72558o60498r28188j143291j299249j415618j520116
12409I3512j625384j720053j778705j776022j691352j507214j212638q10952l21266
$$ plain form
12469 -7071110 -7444667 -7858553 -8284218 -8696690 -9080760 -9443965 -9825939 -10295147 -10932448
12460 -10932448 -11809349 -12971128 -14429954 -16165056 -18123179 -20216304 -22320342 -24281078
12452 -24281078 -25930435 -27111081 -27703616 -27648665 -26956918 -25704945 -24020440 -22061891 -19994144
12443 -19994144 -17959947 -16052843 -14302587 -12681526 -11128919 -9580567 -7991414 -6346567
12435 -6346567 -4662798 -2983707 -1369669 116965 1428458 2543840 3470490 4234051
12427 4234051 4863213 5379415 5797721 6135970 6421968 6689173 6960124 7227452 7445773
12418 7445773 7541052 7433030 7060472 6399974 5471786 4328495 3029246 1613628 93512
12409 93512 -1531872 -3251925 -5030630 -6806652 -8498004 -10005218 -11217856 -12028808 -12350074
12400a2350074K29454Q13688J401124J951686K415239K742009K897514K872902
12392B973542K685228K367802J957082J485140R81666M80224K0048l60077o32595
12383A1958060p90914q52503q52139q28066q09904q15161q51808r19656j009309
12374D228600j103906j185662j241619j263433j243487j173193j045276q57312
12366d885288o14203l29195k2549K83245N70630Q32313J070790J291519J493464
12357c09274J663004J776168J809508J753839J621469J440183J235940J015985
12349A2006822P65852M64027J03920k92551o78028r96021j200885j271797j214184
12340G687155j048828p98322m83267j30587K17239N04630O77709P01627N71307
$$ plain form
12400 -12350074 -12120620 -11306932 -9905808 -7954122 -5538883 -2796874 100640 2973542
12392 2973542 5658770 8026572 9983654 11468794 12450460 12930684 12950732 12590655 11958060
12383 11958060 11167146 10314643 9462504 8634438 7824534 7009373 6157565 5237909 4228600
12374 4228600 3124694 1939032 697413 -566020 -1809507 -2982700 -4027976 -4885288
12366 -4885288 -5499491 -5828686 -5851235 -5567990 -4997360 -4165047 -3094257 -1802738 -309274
12357 -309274 1353730 3129898 4939406 6693245 8314714 9754897 10990837 12006822
12349 12006822 12772674 13236701 13340621 13048070 12370042 11374021 10173136 8901339 7687155
12340 7687155 6638327 5840005 5356738 5226151 5443390 5948020 6625729 7327356 7898663
12331G898663L12554k6380l90884p37177j041042j293889j492328j631841j708688
12322a11012j724188j683135j586297j426765j199093r16454o18350l56463j67004
12313i788761n2541J2152N7983J03003J48877J88583K15559K29673K40831K69970
12303h374671L44549M87319P03316R73771J261859J526673J736024J870520J918825
12294B448185J870272J712160J434820J042156N61281M4652m38745q21146j055797
12285F797838j130355j068549r20412p45351n93626m91933m38575m10596l78712
12276F19729l21182k30438j13080J3125J24012J95818K11643J63455M9224j30492
12266E81814l72696o69582j006876j364191j716361k035139k291792k461986k532399
$$ plain form
12331 7898663 8211217 8184837 7793953 7056776 6015734 4721845 3229517 1597676 -111012
12322 -111012 -1835200 -3518335 -5104632 -6531397 -7730490 -8646944 -9265294 -9621757 -9788761
12313 -9788761 -9841302 -9829150 -9771167 -9668164 -9519287 -9330704 -9115145 -8885472 -8644641 -8374671
12303 -8374671 -8030122 -7542803 -6839487 -5865716 -4603857 -3077184 -1341160 529360 2448185
12294 2448185 4318457 6030617 7465437 8507593 9068874 9113526 8674781 7853635 6797838
12285 6797838 5667483 4598934 3678522 2933171 2339545 1847612 1409037 998441 619729
12276 619729 298547 68109 -44971 -31846 92166 287984 499627 663082 712306 581814
12266 581814 209118 -460464 -1467340 -2831531 -4547892 -6583031 -8874823 -11336809 -13869208
12257a3869208k505660k398892k234675k029637j788103j503566j164502p60333
12249b8254576k86789K48791Q22516J390601J889931K247662K403975K340951
12241a7196938K098214J759347J415341J130089R28262Q04273P36977O99458O64875
12232f960102O13127N38415M53262L85012L64615M12203N27413O90529Q72452
12223b103074J043676J174634J231375J179020R99049P10204L74049P5376j13563
12214D570746j64554j03983J254P3971N8316o0929k57395m76095o50409p16510
12204B274412o25322l53853Q6422O49596J265704J857013K353256K701824K872945
12195A3081997K861146K683140K372015J968798J514077J042500N81307J51443
$$ plain form
12257 -13869208 -16374868 -18773760 -21008435 -23038072 -24826175 -26329741 -27494243 -28254576
12249 -28254576 -28541365 -28292574 -27470058 -26079457 -24189526 -21941864 -19537889 -17196938
12241 -17196938 -15098724 -13339377 -11924036 -10793947 -9865685 -9061412 -8324435 -7624977 -6960102
12232 -6960102 -6346975 -5808560 -5355298 -4970286 -4605671 -4193468 -3666055 -2975526 -2103074
12223 -2103074 -1059398 115236 1346611 2525631 3524680 4234884 4608933 4684309 4570746
12214 4570746 4406192 4302209 4303463 4377434 4435750 4374821 4117426 3641331 2990922 2274412
12204 2274412 1649090 1295237 1381659 2031255 3296959 5153972 7507228 10209052 13081997
12195 13081997 15943143 18626283 20998298 22967096 24481173 25523673 26104980 26256423
12187B6256423k31391n56501q17043j007164j120881j157218j129362j067648
12179A9169215j008639r75779r67103r60407r31295q70543p90627p20220o91300
12170A1253302p24833q20930r57978j101435j217727j285833j300790j268645
12162B575131j197417j089836r41109p42557m90651j98537R7296L42815M84069
12153a160796M86517L45921Q9314k30383n45113p88818r16243r13997p99130o09943
12143e042671l94931k00688n8140K7219P2647J02857J33367J64926J90610K05650
12133d799154K09886K02626J78204J28339M8583n7382j76565k84872l45018l11104
12123e206457j44445J65240N85847J044709J446663J703015J761878J626796J352881
$$ plain form
12187 26256423 26025032 25468531 24651488 23644324 22523443 21366225 20236863 19169215
12179 19169215 18160576 17184797 16217694 15257287 14325992 13455449 12664822 11944602 11253302
12170 11253302 10528469 9707539 8749561 7648126 6430399 5144566 3843776 2575131
12162 2575131 1377714 287878 -653231 -1395788 -1886439 -2084976 -1987680 -1644865 -1160796
12153 -1160796 -674279 -328358 -239044 -469427 -1014540 -1803358 -2719601 -3633598 -4432728 -5042671
12143 -5042671 -5437602 -5638290 -5696430 -5669211 -5596564 -5493707 -5360340 -5195414 -5004804 -4799154
12133 -4799154 -4589268 -4386642 -4208438 -4080099 -4031516 -4088898 -4265463 -4550335 -4895353 -5206457
12123 -5206457 -5350902 -5185662 -4599815 -3555106 -2108443 -405428 1356450 2983246 4336127
12114D336127J021767P10077M68677L19227K61560K80590L47051M15546M28290
12105H588912L29900Q9932k77779p11361j119143j414688j551391j535980j412556
12096I85846j230352j020400p95580n65776l48016j61311j3397J06461K22451
12087b820074L60372N38036P62098J028301J320580J609447J855650K022745K092883
12078H770038K074196J993819J882196J759117J627501J475469J285522J047849
12070B1915707P69594M72021J77636r9568l51290n65206p22777q10354q34725
12061A9951038q29880q49074r45300j148220j447325j790293k099903k304018
12053H537025k365940k300674k167115k037478j959624j935072j925929j883175
$$ plain form
12114 4336127 5357894 6067971 6536648 6855875 7117435 7398025 7745076 8160622 8588912
12105 8588912 8918812 9008744 8730965 8019604 6900461 5485773 3934382 2398402 985846
12096 985846 -244506 -1264906 -2060486 -2626262 -2974278 -3135589 -3148986 -3042525 -2820074
12087 -2820074 -2459702 -1921666 -1159568 -131267 1189313 2798760 4654410 6677155 8770038
12078 8770038 10844234 12838053 14720249 16479366 18106867 19582336 20867858 21915707
12070 21915707 22685301 23157322 23334958 23235390 22884100 22318894 21596117 20785763 19951038
12061 19951038 19121158 18272084 17326784 16178564 14731239 12940946 10841043 8537025
12053 8537025 6171085 3870411 1703296 -334182 -2293806 -4228878 -6154807 -8037982
12045h037982j774667j595881j363147j101236q35651n90465l86467k36641j41798
12036a6063935r0587o4356m3590j3303L3631R6533J71476K57610L59225M80392
12026a4876904O16174P47528Q43904Q73081Q14579O70377M65532K36729J6323
12017i592677j76382l31411m37489m75189m21880k67543l0491K41827M91971O79135
12007a0320129P92663Q43430Q43445P91914O77654M93559K50399k1722k86402
11998e935189n18536p11957q71745r99826j087032j116197j070292r37786p13200
11989a3961760l96611L651M65294R48816J402617J776298K034282K161178K157385
11980c408850K031047J793665J462034J063271O37245K32277j05360l43849m74750
$$ plain form
12045 -8037982 -9812649 -11408530 -12771677 -13872913 -14708564 -15299029 -15685496 -15922137 -16063935
12036 -16063935 -16154522 -16218878 -16262468 -16275771 -16242140 -16145607 -15974131 -15716521 -15357296 -14876904
12026 -14876904 -14260730 -13513202 -12669298 -11796217 -10981638 -10311261 -9845729 -9609000 -9592677
12017 -9592677 -9769059 -10100470 -10537959 -11013148 -11435028 -11702571 -11733062 -11491235 -10999264 -10320129
12007 -10320129 -9527466 -8684036 -7840591 -7048677 -6371023 -5877464 -5627065 -5648787 -5935189
11998 -5935189 -6453725 -7165682 -8037427 -9037253 -10124285 -11240482 -12310774 -13248560 -13961760
11989 -13961760 -14358371 -14354720 -13889426 -12940610 -11537993 -9761695 -7727413 -5566235 -3408850
11980 -3408850 -1377803 415862 1877896 2941167 3578412 3810689 3705329 3361480 2886730
11971B886730n14283m95302m52503m08312l67941l25652k75685k18482j58322
11962c29752r6199k5357O5591J83626L23447M67250N91997O78977P21002P25540
11952C306122P11426O97574O88599O68768O10121M87500K88496J5748l12534o62175
11942F499645r88609j250492j422637j498342j482994j389163j237290j054339
11934c824221q62654o64579m38390j53554K04636O19622J045579J419853J676317
11925i77391J759142J639654J330614Q86214L84687r5107m89011p51199q52716
11916B834887p81834n47437j82162K59197P08847J100819J384920J533763J542495
11907G853495J425277J211522R41008O56138L92123J69120r354j50654k63837
$$ plain form
11971 2886730 2372447 1877145 1424642 1016330 648389 322737 47052 -171430 -329752
11962 -329752 -425951 -451308 -385717 -202091 121356 588606 1180603 1859580 2580582 3306122
11952 3306122 4017548 4715122 5403721 6072489 6682610 7170110 7458606 7474354 7161820 6499645
11942 6499645 5511036 4260544 2837907 1339565 -143429 -1532592 -2769882 -3824221
11934 -3824221 -4686875 -5351454 -5789844 -5943398 -5738762 -5119140 -4073561 -2653708 -977391
11925 -977391 781751 2421405 3752019 4638233 5022920 4927813 4438802 3687603 2834887
11916 2834887 2053053 1505616 1323454 1582651 2291498 3392317 4777237 6311000 7853495
11907 7853495 9278772 10490294 11431302 12087440 12479563 12648683 12639329 12488675 12224838
11898A2224838l53230m17574m52547m53269m17198l49080k66098j97651j76813
11889I141378k26764l49455n22792p09473q75162j005989j111479j207534j291585
11880A841145j331493j279087j097875p83771l66684J02651N68293R79518J296195
11871g1108J492591J560383J508489J358040J135145Q66481N78898K98876M8167
11862H775962j61860l32040m72136n94948p08142q03907q53245q16295o69426
11853C363963m31270j65435M4584J31263O8159j24815l92009o60541q61669r51985
11843B0245r29350q35077p35927o91268p23472q09555q96890r30029q73308p22218
11833h126849n03276k63755n4485Q7492J48941J40414Q9392L1549K613L0103J24476
$$ plain form
11898 12224838 11871608 11454034 11001487 10548218 10131020 9781940 9515842 9318191 9141378
11889 9141378 8914614 8565159 8042367 7332894 6457732 5451743 4340264 3132730 1841145
11880 1841145 509652 -769435 -1867310 -2651081 -3017765 -2915114 -2346821 -1367303 -71108
11871 -71108 1421483 2981866 4490355 5848395 6983540 7850021 8428919 8727795 8775962
11862 8775962 8614102 8282062 7809926 7214978 6506836 5702929 4849684 4033389 3363963
11853 3363963 2932693 2767258 2811842 2943105 3011264 2886449 2494440 1833899 972230 20245
11843 20245 -909105 -1744182 -2480109 -3171377 -3894849 -4704404 -5601294 -6531323 -7404631 -8126849
11833 -8126849 -8630125 -8893880 -8948365 -8860873 -8711932 -8571518 -8482126 -8450577 -8447964 -8417861 -8293385
11822h293385K72730M40011N81137O56634O45121N47921L86656J95627J1185j37337
11812d693700k30673k57714k13867j01551P0279K88392N35434P86803J010388
11803b806209J174405J258607J259080J184056J046830Q61607O42205M02406J58640
11794E181627o5684k39387l31609l26588k34994r1686O0069J86381K68985K97851
11784D704965K61510J48431l9224k71730m93107o42417o84232o27773n20197m18722
11774A417504l62267l60691m03098m74513n70700p04695r00216j172402j508149
11765e039227j862525k174576k388517k465409k384609k143601j760115j272708
11757b1491287p35935k10286K50430O10230Q54796R85057J006171R22638P43981
$$ plain form
11822 -8293385 -8020655 -7580644 -6999507 -6342873 -5697752 -5149831 -4763175 -4567548 -4556363 -4693700
11812 -4693700 -4924373 -5182087 -5395954 -5497505 -5427226 -5138834 -4603400 -3816597 -2806209
11803 -2806209 -1631804 -373197 885883 2069939 3116769 3978376 4620581 5022987 5181627
11794 5181627 5115943 4876556 4544947 4218359 3983365 3891679 3951748 4138129 4407114 4704965
11784 4704965 4966475 5114906 5075682 4803952 4310845 3668428 2984196 2356423 1836226 1417504
11774 1417504 1055237 694546 291448 -183065 -753765 -1458460 -2358676 -3531078 -5039227
11765 -5039227 -6901752 -9076328 -11464845 -13930254 -16314863 -18458464 -20218579 -21491287
11757 -21491287 -22227222 -22437508 -22187078 -21576848 -20722052 -19736995 -18730824 -17808186 -17064205
11748a7064205M94010K13519m6966k40182l35131l25819k31618q7194P3601K29587
11738a7320398L72653N00113O09117O97948P69131Q27075Q70741Q89307Q66909
11729a0917404P94303O79341N48680M38383L77703L74938M13637M60872M82256
11720f347291M55697L78107K63227J33329J0906q4518j35783j30339o8110L1601
11710e493174J33570K00883K09374J52031L3562j36303l44089n69428p82639r46496
11700g542709j022903r84149q26288n77848k95302m3516J29019K05336J97843
11691a0760517J33760L9619o6402j73068k70442l46341l87596l83123l24241k02330
11681a2740681r368K54758N72199R03688J197800J409409J516097J521529J444230
$$ plain form
11748 -17064205 -16570195 -16356676 -16403642 -16643824 -16978955 -17304774 -17536392 -17623586 -17549985 -17320398
11738 -17320398 -16947745 -16447632 -15838515 -15140567 -14371436 -13544361 -12673620 -11784313 -10917404
11729 -10917404 -10123101 -9443760 -8895080 -8456697 -8078994 -7704056 -7290419 -6829547 -6347291
11720 -6347291 -5891594 -5513487 -5250260 -5116931 -5106025 -5190543 -5326326 -5456665 -5524775 -5493174
11710 -5493174 -5359604 -5158721 -4949347 -4797316 -4763754 -4900057 -5244146 -5813574 -6596213 -7542709
11700 -7542709 -8565612 -9549761 -10376049 -10953897 -11249199 -11292715 -11163696 -10958360 -10760517
11691 -10760517 -10626757 -10587138 -10653540 -10826608 -11097050 -11443391 -11830987 -12214110 -12538351 -12740681
11681 -12740681 -12750049 -12495291 -11923092 -11019404 -9821604 -8412195 -6896098 -5374569 -3930339
11672c930339J301691J103228Q56380N79224L07161Q8271l1482k8241Q2865K45689
11662E74447L83403M33855L78311K44400Q3242o0815j67573k39073k86682l19339
11652A024176l38947l41607l21104k72201j92309q0633O4054K44088M60501P09907
11642I55925R83678J269094J549828J805376K012192K147945K196243K148181
11634A5068462J999928J749372J395681R44029M13738j55502p04883j166124j475942
11625A8068759j591675j505488j252642r06597n57933k85095j31483r8400j52368
11616A1587078k39794l03513k98818k05768l3467J86180M12542O10846P59922
11607A2475208Q51026Q82364Q55653P76670O56725N12701L66657K45833J79717
$$ plain form
11672 -3930339 -2628648 -1525420 -669040 -89816 217345 305616 274134 245893 328758 574447
11662 574447 957850 1391705 1770016 2014416 2097658 2036843 1869270 1630197 1343515 1024176
11652 1024176 685229 343622 22518 -249683 -441992 -522625 -458571 -214483 246018 955925
11642 955925 1939603 3208697 4758525 6563901 8576093 10724038 12920281 15068462
11634 15068462 17068390 18817762 20213443 21157472 21571210 21415708 20710825 19544701 18068759
11625 18068759 16477084 14971596 13718954 12812357 12254424 11969329 11837846 11739446 11587078
11616 11587078 11347284 11043771 10744953 10539185 10505718 10691898 11104440 11715286 12475208
11607 12475208 13326234 14208598 15064251 15840921 16497646 17010347 17377004 17622837 17802554
11598A7802554J90446K79661M21634N70080O75585P02891O38992M90989K78505
11589B2051337K6001k42335n04921p43668r45286j104375j227336j333617j450865
11580A4524935j603758j801070k027776k247779k418108k509391k521516k482857
11572c087320k430138k381038k320162k210512k021557j750521j420414j059786
11564a8681448o84338k95088J09518N21436R20532J280448J575414J783493J887249
11555a1582784J874944J743594J501948J170586P78340L57651n7370m29382p16351
11546e358824q75399q74322p07696m09468n2475K69440M70501M98604L45222L8955
11536f655462l68272q13100j228115j547216j712276j682417j444427j020005
$$ plain form
11598 17802554 17993000 18272661 18694295 19264375 19939960 20642851 21281843 21772832 22051337
11589 22051337 22077338 21835003 21330082 20586414 19641128 18536753 17309417 15975800 14524935
11580 14524935 12921177 11120107 9092331 6844552 4426444 1917053 -604463 -3087320
11572 -3087320 -5517458 -7898496 -10218658 -12429170 -14450727 -16201248 -17621662 -18681448
11564 -18681448 -19365786 -19660874 -19551356 -19029920 -18109388 -16828940 -15253526 -13470033 -11582784
11555 -11582784 -9707840 -7964246 -6462298 -5291712 -4513372 -4155721 -4213091 -4642473 -5358824
11546 -5358824 -6234223 -7108545 -7816241 -8225709 -8278184 -8008744 -7538243 -7039639 -6694417 -6655462
11536 -6655462 -7023734 -7836834 -9064949 -10612165 -12324441 -14006858 -15451285 -16471290
11528a6471290m65363J38362P01839J147599J428315J536408J499814J366068
11520i118248J183938R91110Q09731O47740N04540L78918K74078J95262J42440
11511c990491J06024P0507K3237l8363j05671j64130k00868k08564j82515j15768
11501d806602j050J58643L40101N02100O01399O13470N46207M39513L49512L22639
11491i34068L71590M67045N51542N68304M88877L25531J23762n9701j81847k28703
11481A492332k14283j66923j14630p8412p1843r8922j48112j90472j89593j19678
11471I9464K1084K10700M13805N92877P14924P55903P07221N83540M25195K88698
11461D813411K27052K70940M22167O60732R56829J278731J595077J875144K090151
$$ plain form
11528 -16471290 -16936653 -16798291 -16096452 -14948853 -13520538 -11984130 -10484316 -9118248
11520 -9118248 -7934310 -6943200 -6133469 -5485729 -4981189 -4602271 -4328193 -4132931 -3990491
11511 -3990491 -3884467 -3813960 -3790723 -3829086 -3934757 -4098887 -4299755 -4508319 -4690834 -4806602
11501 -4806602 -4807652 -4649009 -4308908 -3806808 -3205409 -2591939 -2045732 -1606219 -1256707 -934068
11491 -934068 -562478 -95433 456109 1024413 1513290 1838821 1962583 1902882 1721035 1492332
11481 1492332 1278049 1111126 996496 918084 846241 747319 599207 408735 219142 99464
11471 99464 120548 331248 745053 1337930 2052854 2808757 3515978 4099518 4524713 4813411
11461 4813411 5040463 5311403 5733570 6394302 7351131 8629862 10224939 12100083 14190234
11452A4190234K216381K240131K162477J999224J773002J501782J192658Q45056
11444B8120945M58458L7856m03999q44000j245773j562011j745859j767401j626005
11435A9422211j352382j000716o35221l15686q5870L1852L4642o7223k56507n11324
11425A5263776q03580j096773j347892j515956j574083j516877j356950j113676
11417D937989q05426m53503r3134K22907M37811N15303M57329L01500J01257r6049
11407E525984k60265l77241m41685m50406l99131k84109j07337J18649L71001
11398C695460O22253Q47619J029583J158575J231192J248348J214422J136150
11390A2183602J019222Q63415O61039M02395Q5763k74679o47820r91661j264209
$$ plain form
11452 14190234 16406615 18646746 20809223 22808447 24581449 26083231 27275889 28120945
11444 28120945 28579403 28617259 28213260 27369260 26123487 24561476 22815617 21048216 19422211
11435 19422211 18069829 17069113 16433892 16118206 16032336 16064188 16098830 16031607 15775100 15263776
11425 15263776 14460196 13363423 12015531 10499575 8925492 7408615 6051665 4937989
11417 4937989 4132563 3679060 3585926 3808833 4246644 4761947 5219276 5520776 5622033 5525984
11407 5525984 5265719 4888478 4446793 3996387 3597256 3313147 3205810 3324459 3695460
11398 3695460 4317713 5165332 6194915 7353490 8584682 9833030 11047452 12183602
11390 12183602 13202824 14066239 14727278 15129673 15215436 14940757 14292937 13301276 12037067
11381A2037067j435415j494956j452213j330058j156946r59375p54540n45814
11373B907750l25706q6126J70727M26933O50085Q01232Q49999P91397O51387M73240
11363G310918K93859J29465j9474j52297k56990l12104k98152k08601n2969J48248
11353F581903L70988N92721P95785R71001J119486J248380J361179J449175J490155
11344A5980773J454913J318409J071108P25943L17211j08340n04025q33954j078285
11335A8343753j231708j297822j285198j208579j091212r60284q34669p14134
11327I720147n79711m04756j68471J33952M83847Q33278J105629J209668J066947
11318A3400530O41661m1672r00151j810638k635725l250890l568432l553551l228276
$$ plain form
11381 12037067 10601652 9106696 7654483 6324425 5167479 4208104 3453564 2907750
11373 2907750 2582044 2495918 2666645 3093578 3743663 4544895 5394894 6186291 6837678 7310918
11363 7310918 7604777 7734242 7714768 7562471 7305481 6993377 6695225 6486624 6433655 6581903
11353 6581903 6952891 7545612 8341397 9312398 10431884 11680264 13041443 14490618 15980773
11344 15980773 17435686 18754095 19825203 20551146 20868357 20760017 20255992 19422038 18343753
11335 18343753 17112045 15814223 14529025 13320446 12229234 11268950 10434281 9720147
11327 9720147 9140436 8735680 8567209 8701161 9185008 10018286 11123915 12333583 13400530
11318 13400530 14042191 14000519 13100368 11289730 8654005 5403115 1834683 -1718868 -4947144
11309d947144k661857j950440j192002m65097J80859P22839J156196J489062J738746
11300e928838J924574K056775K129378K124406K025916J834615J573830J283621
11292I024277J007740P82654O34503N81002O30311P74255R82010J202571J378545
11283A6997868J465959J449458J342374J170022R48104O73596L34108p4812n38772
11274B3767905j025154j491448j896669k211681k423300k529759k533231k438143
11266G218520k256903k015396j750552j500160j291701j137289j037037r86412
11258d756930r79951j007738j049894j077942j066095j005777r13175q23571p74620
11249a3455693p88222q61934r73200j088872j170835j178621j077619q55156n32694
$$ plain form
11309 -4947144 -7609001 -9559441 -10751443 -11216540 -11035681 -10312842 -9156646 -7667584 -5928838
11300 -5928838 -4004264 -1947489 181889 2306295 4332211 6166826 7740656 9024277
11292 9024277 10032017 10814671 11449174 12030176 12660487 13434742 14416752 15619323 16997868
11283 16997868 18463827 19913285 21255659 22425681 23373785 24047381 24381489 24306677 23767905
11274 23767905 22742751 21251303 19354634 17142953 14719653 12189894 9656663 7218520
11266 7218520 4961617 2946221 1195669 -304491 -1596192 -2733481 -3770518 -4756930
11258 -4756930 -5736881 -6744619 -7794513 -8872455 -9938550 -10944327 -11857502 -12681073 -13455693
11249 -13455693 -14243915 -15105849 -16079049 -17167921 -18338756 -19517377 -20594996 -21450152 -21982846
11240b1982846j60219K06810N31499Q03216J026509J204745J334623J415162J458794
11231a4161707J489164J523901J557862J563506J508333J373304J158011Q74690
11223c112936N42712J88839j52806m47178o68076q04014q58743q49632q04278
11214f966112p52167p13186o90721o73203o39096n60026m05758j56981J78594
11205a1378656N60574R28763J227668J427816J533511J575438J593354J618160
11197i13372J662902J726354J803332J891223J987087K079565K145728K159328
11189A4542147K106358J995626J854799J714533J592752J488859J387441J265579
11181B7948094J101033Q82641O21240L53399J30866j300k5010M5007J71511L11715
$$ plain form
11240 -21982846 -22143065 -21936255 -21404756 -20601540 -19575031 -18370286 -17035663 -15620501 -14161707
11231 -14161707 -12672543 -11148642 -9590780 -8027274 -6518941 -5145637 -3987626 -3112936
11223 -3112936 -2570224 -2381385 -2534191 -2981369 -3649445 -4453459 -5312202 -6161834 -6966112
11214 -6966112 -7718279 -8431465 -9122186 -9795389 -10434485 -10994511 -11400269 -11557250 -11378656
11205 -11378656 -10818082 -9889319 -8661651 -7233835 -5700324 -4124886 -2531532 -913372
11197 -913372 749530 2475884 4279216 6170439 8157526 10237091 12382819 14542147
11189 14542147 16648505 18644131 20498930 22213463 23806215 25295074 26682515 27948094
11181 27948094 29049127 29931768 30553008 30906407 31037273 31035973 31010963 31055970 31227481 31539196
11171C1539196M29105M95793M90079L96220K08478o4648m00925p69800j138492
11162C1185006j475616j752741j945183k032221j998413j839918j574640j245390
11154A7320884r05849n95821l26829r0735J19040K94533M16783M67567M38476
11145A7138049L34141J70881k7698k35048m22279n56277o02958n41201l82012
11136A4875598j78334j2412L8766n8062k75454n42238p81591r43298j013530j006242
11126A0103203r49172q71845p96447p32520o77279o20799n53553m74592l97748
11117D029248l50998l65881m61156o30095q38631j035435j169113j204079j126872
11108c153012r42191o66636l28064L2593L67259O37288Q28911R53358J030723
$$ plain form
11171 31539196 31968301 32464094 32954173 33350393 33558871 33494223 33093298 32323498 31185006
11162 31185006 29709390 27956649 26011466 23979245 21980832 20140914 18566274 17320884
11154 17320884 16415035 15819214 15492385 15401650 15520690 15815223 16232006 16699573 17138049
11145 17138049 17472190 17643071 17615373 17380325 16958046 16401769 15798811 15257610 14875598
11136 14875598 14697264 14684852 14723618 14665556 14390102 13847864 13066273 12122975 11109445 10103203
11126 10103203 9154031 8282186 7485739 6753219 6075940 5455141 4901588 4426996 4029248
11117 4029248 3678250 3312369 2851213 2221118 1382487 347052 -822061 -2026140 -3153012
11108 -3153012 -4095203 -4761839 -5089903 -5057310 -4690051 -4052763 -3223852 -2270494 -1239771
11099a239771J071968J074033J029563R39400Q15932O77407N42588M31576L66729
11090E709425L64353M18889M94492N36858N00956L75582J88460q592j62574k38574
11080H179275k29637j55129m7622O5432J72881K75698L73213M54086M99896M95606
11070A0083699M36751L29358J85688K0136j52808l18948m65220n82384o67374
11061H868898p21583p46413p42719p16768o85027o68259o76406o97176o99262
11052B515285o48934n28583l44691j19567J27592L96116P02904J064847J477374
11043D642343J904148K284048K550533K652620K568296K307428J906950J421432
11035B2237798R09687M19346k3177m09811p37215r94688j164342j232624j203048
$$ plain form
11099 -1239771 -167803 906230 1935793 2875193 3691125 4368532 4911120 5342696 5709425
11090 5709425 6073778 6492667 6987159 7524017 8024973 8400555 8589015 8580423 8417849 8179275
11080 8179275 7949638 7794509 7746887 7812319 7985200 8260898 8634111 9088197 9588093 10083699
11070 10083699 10520450 10849808 11035496 11055632 10902824 10583876 10118656 9536272 8868898
11061 8868898 8147315 7400902 6658183 5941415 5256388 4588129 3911723 3214547 2515285
11052 2515285 1866351 1337768 993077 873510 1001102 1397218 2100122 3164969 4642343
11043 4642343 6546491 8830539 11381072 14033692 16601988 18909416 20816366 22237798
11035 22237798 23147485 23566831 23543654 23133843 22396628 21401940 20237598 19004974 17801926
11026A7801926j100215r62376q27145p19046o45232n98935n65048n24221m56847
11017A1402861l49013j98758j8348J69651L41382M82021N92168O86420P85104
11008A3893488R04897J053191J226126J408477J575679J699116J752872J718498
11000B5232344J587414J363247J064528P24427L84738Q5544j45108k97723l81922
10991B9617489m20890m41794m66274n04528n54217o03914o40459o57774o61594
10982B4666045o65691o82407p16687p69096q41882r38166j054142j175711j287000
10973A6535263j382726j469758j554735j629695j668768j637963j511265j284652
10965D395701r81128o43417l18812m6756J44716K39064K35613J55595L9005p1463
$$ plain form
11026 17801926 16701711 15739335 14912190 14193144 13547912 12948977 12383929 11859708 11402861
11017 11402861 11053848 10855090 10836742 11006393 11347775 11829796 12421964 13108384 13893488
11008 13893488 14798385 15851576 17077702 18486179 20061858 21760974 23513846 25232344
11000 25232344 26819758 28183005 29247533 29971960 30356698 30442242 30297134 29999411 29617489
10991 29617489 29196599 28754805 28288531 27784003 27229786 26625872 25985413 25327639 24666045
10982 24666045 24000354 23317947 22601260 21832164 20990282 20052116 18997974 17822263 16535263
10973 16535263 15152537 13682779 12128044 10498349 8829581 7191618 5680353 4395701
10965 4395701 3414573 2771156 2452344 2405588 2550304 2789368 3024981 3180576 3219581 3148118
10955C148118j49169j91176k10630k21133k24198k07351j53423n4056Q2257K31971
10945B051210L64136M47292M53538L62186J64667j30523m95003q81285j229056
10936A107162j478224j586239j541990j367828j107610q07773n03045k14210M4611
10927g455146K59024M15781N11071N56584N75839N92285O17826O49167O72648
10918b604921O73654O46918O04541N76441N98465O91545Q45257J018668J158094
10909D208662J219099J180369J046532Q43168O06654L71473J60355j7354j60297
10900I458661k70039l51270m14254m72710n35945o01625o56953o88146o89586
10891D778133o63690o12006n27574l97098k10491L2703L25485O58094J015265
$$ plain form
10955 3148118 2998949 2807773 2597143 2376010 2151812 1944461 1791038 1736982 1819239 2051210
10945 2051210 2415346 2862638 3316176 3678362 3843029 3712506 3217503 2336218 1107162
10936 1107162 -371062 -1957301 -3499291 -4867119 -5974729 -6782502 -7285547 -7499757 -7455146
10927 -7455146 -7196122 -6780341 -6269270 -5712686 -5136847 -4544562 -3926736 -3277569 -2604921
10918 -2604921 -1931267 -1284349 -679808 -103367 495098 1186643 2031900 3050568 4208662
10909 4208662 5427761 6608130 7654662 8497830 9104484 9475957 9636312 9618958 9458661
10900 9458661 9188622 8837352 8423098 7950388 7414443 6812818 6155865 5467719 4778133
10891 4778133 4114443 3502437 2974863 2577765 2367274 2399977 2725462 3383556 4398821
10882D398821J365527J654229J812622J782605J542630J118680N75602l693n40392
10873A3706631r77174j287262j472122j548872j536222j449048j301739j110809
10865C023383q91461o55019m15764k02576o0271l2636j36938l48236o04112q26446
10855a150076r48653r37128q00738n86686l63844j97190j22528j35081k00892
10846e442816k83913l68206m58932n64886o79678p76076q15409p64844o13852
10837a0768612l82466j16666J28274L09164M11038M51150M69303N09445O01662
10828h387708P53111R49167J158872J339763J444010J430062J277350R95287O21076
10819A580990K09392j79764m92731o93375p70812p38649o25075m60005k66636
$$ plain form
10882 4398821 5764348 7418577 9231199 11013804 12556434 13675114 14250716 14247023 13706631
10873 13706631 12729457 11442195 9970073 8421201 6884979 5435931 4134192 3023383
10865 3023383 2131922 1476903 1061139 858563 798292 765656 628718 280482 -323630 -1150076
10855 -1150076 -2098729 -3035857 -3836595 -4423281 -4787125 -4984315 -5106843 -5241924 -5442816
10846 -5442816 -5726729 -6094935 -6553867 -7118753 -7798431 -8574507 -9389916 -10154760 -10768612
10837 -10768612 -11151078 -11267744 -11139470 -10830306 -10419268 -9968118 -9498815 -8989370 -8387708
10828 -8387708 -7634597 -6685430 -5526558 -4186795 -2742785 -1312723 -35373 959914 1580990
10819 1580990 1790382 1610618 1117887 424512 -346300 -1084949 -1710024 -2170029 -2436665
10810b436665o0606J44912L32723M79497N61814N66924M98896L74544K13937L4968
10800G10944j45437l08498m32920m95409m72626l48503j26551J62720M68888P40336
10790b47056R41150J056395J086937J041326R30715P69329N78083L84688K15701
10781F757268Q5683n227o2550q8656q5791o7193o0773r6604j86619l13139m35124
10770E441275n07339m99965m08364k50352n5357J47759L38994N09340O57433P83892
10760F157316Q86915R60440R93918R74102Q90893P45673N54906L43278J30595
10751A2638036p6453k81584m89572o98208q95824j064516j188172j261617j293842
10742E388248j300530j289932j252864j164383r95445p27332l62137P3462N31435
$$ plain form
10810 -2436665 -2497271 -2352359 -2019636 -1540139 -978325 -411401 87495 462039 675976 710944
10800 710944 565507 257009 -175911 -671320 -1143946 -1492449 -1619000 -1456280 -987392 -247056
10790 -247056 694094 1750489 2837426 3878752 4809467 5578796 6156879 6541567 6757268
10781 6757268 6842951 6837724 6775174 6686518 6600727 6533534 6472761 6376157 6189538 5876399 5441275
10770 5441275 4933936 4433971 4025607 3775255 3719898 3867657 4206651 4715991 5373424 6157316
10760 6157316 7044231 8004671 8998589 9972691 10863584 11609257 12164163 12507441 12638036
10751 12638036 12561583 12279999 11790427 11092219 10196395 9131879 7943707 6682090 5388248
10742 5388248 4087718 2797786 1544922 380539 -614906 -1342238 -1704375 -1630913 -1099478
10733a099478R50294J264575J414355J356258J077366O07418J9727n86122j114448
10724C889945j500653j720826j782090j705068j511886j225264q73681m93700
10716f923223j24005K06283M86387P22336R25312J097796J226697J287290J255420
10707A60293J121802R01094O30010L53737J08017r1469k46101l62735m45397m96618
10697A632633n23811n41274n64701o03282o55486p09106p43021p30144o43731
10688d081923m67277k04126J18745M55968P57077R82293J112625J148777J101535
10679I23694R83053Q06498N92067L70469J77837M4432j5286n679N4547J41383
10669D073015K34521L21490L94482M43918M56961M25248L55853K74752K18603
$$ plain form
10733 -1099478 -149184 1115391 2529746 3886004 4963370 5570788 5590515 5004393 3889945
10724 3889945 2389292 668466 -1113624 -2818692 -4330578 -5555842 -6429523 -6923223
10716 -6923223 -7047228 -6840945 -6354558 -5632222 -4706910 -3609114 -2382417 -1095127 160293
10707 160293 1282095 2183189 2813199 3166936 3274953 3183484 2937383 2574648 2129251 1632633
10697 1632633 1108822 567548 2847 -600435 -1255921 -1965027 -2708048 -3438192 -4081923
10688 -4081923 -4549200 -4753326 -4634581 -4178613 -3421536 -2439243 -1326618 -177841 923694
10679 923694 1906747 2713245 3305312 3675781 3853618 3898050 3882764 3877085 3931632 4073015
10669 4073015 4307536 4629026 5023508 5467426 5924387 6349635 6705488 6980240 7198843
10660G198843K20432K97228M43220O30464Q18557R71337J071209J121394J136087
10651A3908771J127123J094982J026921R03483P13124M67323K03697k8042j87589
10642A9229793k58632k50988j94466j29537r6550j25490k29079m00256o13151
10633A6931644q27449r96688j079026j047734r00049o62488l87482j37400L8374
10624A0931702J19668J16263N6686k5311j00659j49878j62624j33440n8618O1594
10614A0655383K18008L91361N57676O96004P93422Q45786Q55868Q30502P78086
10605A6622096P06757O22585N27499M19210K95128J57595J4368j26895k63714
10596A8974629l97295n26643o45506p44729q16478q57594q72817q76388q86609
$$ plain form
10660 7198843 7419275 7716503 8159723 8790187 9608744 10580081 11651290 12772684 13908771
10651 13908771 15035894 16130876 17157797 18061280 18774404 19241727 19445424 19417382 19229793
10642 19229793 18971161 18720173 18525707 18396170 18299620 18174130 17945051 17544795 16931644
10633 16931644 16104195 15107507 14028481 12980747 12080698 11418210 11030728 10893328 10931702
10624 10931702 11051370 11167633 11224319 11199008 11098349 10948471 10785847 10652407 10593789 10655383
10614 10655383 10873391 11264752 11822428 12518432 13311854 14157640 15013508 15844010 16622096
10605 16622096 17328853 17951438 18478937 18898147 19193275 19350870 19365238 19238343 18974629
10596 18974629 18577334 18050691 17405185 16660456 15843978 14986384 14113567 13237179 12350570
10587A2350570r12377r41662r44263q88933p61484n70838l41955j03680J20521
10578G005899L15024M67951N65113N89919N33529M08892K54873J22445M9453M1480
10568A0354578P2979J07658J22390J17294J07670J08266J22859J43284J54298
10559A1411276J40811R5917K6142n0652j13622j46248j37390p9050L3346J97503
10549A1378033M02080O28639Q56030J063548J230590J334120J348806J255001
10541A9496847J052884P71690M62300J74083o8227k70989m58801o54444q65579
10532A9639764j083234j289107j466814j612224j736978j861113j999037k149766
10524F441491k297911k420464k490465k477212k350057k089160j697748j208652
$$ plain form
10587 12350570 11438193 10496531 9552268 8663335 7901851 7331013 6989058 6885378 7005899
10578 7005899 7320923 7788874 8353987 8943906 9477435 9886327 10141200 10263645 10313098 10354578
10568 10354578 10427557 10535215 10657605 10774899 10882569 10990835 11113694 11256978 11411276
10559 11411276 11552087 11648004 11674146 11623494 11509872 11363624 11226234 11147184 11180530 11378033
10549 11378033 11780113 12408752 13264782 14328330 15558920 16893040 18241846 19496847
10541 19496847 20549731 21321421 21783721 21957804 21889577 21618588 21159787 20505343 19639764
10532 19639764 18556530 17267423 15800609 14188385 12451407 10590294 8591257 6441491
10524 6441491 4143580 1723116 -767349 -3244561 -5594618 -7683778 -9381526 -10590178
10516a0590178o82416j96948J70723L65926L71885K12255n8377l71085o61676
10507a1439891q86668j029082j092257j089958j042088r75291r20549r05511r47595
10498b0328890j053297j221832j448627j726536k044231k381237k699755k935273
10490c5839678k991594k752498k122333j088254K34720J620333K813535L628670
10482c6497099M002400L982085L677708L214438K701746K217322J803308J474098
10474a3423994J230332J069738R89414R81987J031861J115413J205302J276140
10466d523807J308186J286741J198236J028054P65816M17898J7764l77588p07122
10457D14178r30162j041273j069149j062442j069373j118737j209756j314672
$$ plain form
10516 -10590178 -11272594 -11469542 -11298819 -10932893 -10561008 -10348753 -10407130 -10778215 -11439891
10507 -11439891 -12326559 -13355641 -14447898 -15537856 -16579944 -17555235 -18475784 -19381295 -20328890
10498 -20328890 -21382187 -22604019 -24052646 -25779182 -27823413 -30204650 -32904405 -35839678
10490 -35839678 -38831272 -41583770 -43706103 -44794357 -44559637 -42939304 -40125769 -36497099
10482 -36497099 -32494699 -28512614 -24834906 -21620468 -18918722 -16701400 -14898092 -13423994
10474 -13423994 -12193662 -11123924 -10134510 -9152523 -8120662 -7005249 -5799947 -4523807
10466 -4523807 -3215621 -1928880 -730644 297410 1063226 1481124 1498888 1121300 414178
10457 414178 -515984 -1557257 -2626406 -3688848 -4758221 -5876958 -7086714 -8401386
10449h401386j390763j394064j289768j060097p11827k81770J65775N55077Q26074
10440a2982749R58918R79051R37843Q83034Q40127Q13781Q01187Q03733Q29279
10431e135796Q85352R68836J060386J129164J145172J089610R57278P54312M97798
10422C352112K17988m2395k36571l28777l08894j97244l4665J36971K91003M19297
10412C268825N23949O06001O58376O65398O08631M76973K75489K6701k37317m86843
10402F386183p02617q75913j002010j073026j076881j004952q63612o79760m93024
10393a385612l37122k22135j30716l1803R7626K58169M30282N89846P25052Q43038
10383H36625R62073J094186J229782J335097J364571J279310J059779P08673K49471
$$ plain form
10449 -8401386 -9792149 -11186213 -12475981 -13536078 -14247905 -14529675 -14363900 -13808823 -12982749
10440 -12982749 -12023831 -11044780 -10106937 -9223903 -8383776 -7569995 -6768808 -5965075 -5135796
10431 -5135796 -4250444 -3281608 -2221222 -1092058 53114 1142724 2100002 2854314 3352112
10422 3352112 3570100 3527705 3291134 2962357 2653463 2456219 2421554 2558525 2849528 3268825
10412 3268825 3792774 4398775 5057151 5722549 6331180 6808153 7083642 7110343 6873026 6386183
10402 6386183 5683566 4807653 3805643 2732617 1655736 650784 -212828 -892588 -1385612
10393 -1385612 -1722734 -1944869 -2075585 -2107388 -2009762 -1751593 -1321311 -731465 -6413 836625
10383 836625 1798698 2892884 4122666 5457763 6822334 8101644 9161423 9870096 10119567
10374A0119567k72602p88636j212260j460912j486764j300451r71001n99410k80416
10365A747115p3696L044l6956j64338l41617n25998o75162p58006p61981o89920
10355b277515n51034l57208j26937J11995L27888M93736N90329O03527N23361
10346f61858L50022J03078j74897m27116o03067o79657o67647n97286m94587l67631
10336d220646k11458k2461J92699M19677O44401Q57208J050096J212350J330883
10327A252749J394934J398671J338669J212051J021984P87114N43311L31219J76409
10318I457111P6452M736p0634j65697k72458l68396m32766m54484m28049l46755
10308F999060k01721J3777K98312O36268R94693J329256J599939J785771J886371
$$ plain form
10374 10119567 9846965 9058329 7846069 6385157 4898393 3597942 2626941 2027531 1747115
10365 1747115 1673419 1676463 1639507 1475169 1133552 607554 -67608 -825614 -1587595 -2277515
10355 -2277515 -2828549 -3185757 -3312694 -3200699 -2872811 -2379075 -1788746 -1185219 -661858
10346 -661858 -311836 -208758 -383655 -810771 -1413838 -2093495 -2761142 -3358428 -3853015 -4220646
10336 -4220646 -4432104 -4454565 -4261866 -3842189 -3197788 -2340580 -1290484 -78134 1252749
10327 1252749 2647683 4046354 5385023 6597074 7619058 8406172 8949483 9280702 9457111
10318 9457111 9533563 9538299 9467665 9301968 9029510 8661114 8228348 7773864 7345815 6999060
10308 6999060 6797339 6811116 7109428 7745696 8740389 10069645 11669584 13455355 15341726
10299A5341726J910354J861621J732867J508316J174492P36225K29458k81115
10291B4213944p23471j047479j242630j332523j351091j318668j235437j095339
10283A4867306r06179o97426n09107l71177k88046k37181j82370r5488K4934J50621
10273A1755887K39178K57813J99430Q4102m9281j53782j86351j22104L3095K40568
10263A2298555M41073N74171N94052M78662K36323q9354m24329o85530q11882
10254A2611741p87077o40658m29357k11855l0491R3335J51446J37287M1397j40842
10244A0794926l94611o77008r23948j071363j079207r44666o98197l87023n7563
10235D561340K53439N17088P06331P95312P68362O31846M15820J59768j07093
$$ plain form
10299 15341726 17252080 19113701 20846568 22354884 23529376 24265601 24495059 24213944
10291 24213944 23490473 22442994 21200364 19867841 18516750 17198082 15962645 14867306
10283 14867306 13961127 13263701 12754594 12383417 12095371 11858190 11675820 11580332 11605266 11755887
10273 11755887 11995065 12252878 12452308 12536410 12487129 12333347 12146996 12024892 12057987 12298555
10263 12298555 12739628 13313799 13907851 14386513 14622836 14533482 14109153 13423623 12611741
10254 12611741 11824664 11184006 10754649 10542794 10512303 10605638 10757084 10894371 10935768 10794926
10244 10794926 10400315 9723307 8799359 7727996 6648789 5704123 5005926 4618903 4561340
10235 4561340 4814779 5331867 6038198 6833510 7601872 8233718 8649538 8809306 8702213
10226H702213l73334o34847q78895j079305j206490j241612j182741j040112q27142
10217B37735n56917k47867O8484L50675N65350P07038Q01255Q87210R94786J132089
10207D939838J286545J432875J542427J592011J570104J478615J332678J161557
10199A6336650J007363R13980R06015R69592J049264J065147R42515O40932J71395
10190B4002853m04642r93140j494507j830176j961003j891803j660713j320440
10182A2446429r24153n22443j64150J10099K81082L58653L74887L66632L58067
10173A2685103L51624L31217K77008J83192O5173n0218j42716k09832k64895l27001
10163A2898655m10329n17031o36178p49451q40029q98914r27227r37043r50532
$$ plain form
10226 8702213 8328879 7694032 6815137 5735832 4529342 3287730 2104989 1064877 237735
10217 237735 -319182 -567049 -498565 -147890 417460 1124498 1925753 2812963 3807749 4939838
10207 4939838 6226383 7659258 9201685 10793696 12363800 13842415 15175093 16336650
10199 16336650 17344013 18257993 19164008 20133600 21182864 22248011 23190526 23831458 24002853
10190 24002853 23598211 22605071 21110564 19280388 17319385 15427582 13766869 12446429
10182 12446429 11522276 10999833 10835683 10945782 11226864 11585517 11960404 12327036 12685103
10173 12685103 13036727 13367944 13644952 13828144 13893317 13843099 13700383 13490551 13225656 12898655
10163 12898655 12488326 11971295 11335117 10585666 9745637 8846723 7919496 6982453 6031921
10154F031921r92410j074900j184606j283210j324136j275091j133009r23864
10146c159305o88636m64521k72842j19721m828P2129J12425J22544J14631J01991
10136d186133R4595R8503J18323J59238K26695L23751M46835N81781P03832P84071
10126f48509P99580P40125O06512M03598J35759j89966n55345r25036j250539
10117h83821j483896j592422j564327j403862j125224p53531l29546R3170M63394
10108h580065P50136R48536J068531J116004J082801R54359P27793M23811Q2493
10099a425601k51207n39203p54378q82112r22356q87779p95373o58193m85664
10090g601866k90343r1383Q9751K36174L39009L97058M14614L97678L49593K70046
$$ plain form
10154 6031921 5039511 3964611 2780005 1496795 172659 -1102432 -2235441 -3159305
10146 -3159305 -3847941 -4312462 -4585304 -4705025 -4709853 -4637724 -4525299 -4402755 -4288124 -4186133
10136 -4186133 -4091538 -3993035 -3874712 -3715474 -3488779 -3165028 -2718193 -2136412 -1432580 -648509
10126 -648509 151071 891196 1497708 1901306 2037065 1847099 1291754 366718 -883821
10117 -883821 -2367717 -3960139 -5524466 -6928328 -8053552 -8807083 -9136629 -9043459 -8580065
10108 -8580065 -7829929 -6881393 -5812862 -4696858 -3614057 -2659698 -1931905 -1508094 -1425601
10099 -1425601 -1676808 -2216011 -2970389 -3852501 -4774857 -5662636 -6458009 -7116202 -7601866
10090 -7601866 -7892209 -7983592 -7893841 -7657667 -7318658 -6921600 -6506986 -6109308 -5759715 -5489669
10080e489669J59714K6466j13428k39873l34244l81550l71115k98455j67157J2345
10070g196966K26712M62231P03648R32214J127272J271830J358056J388652J374154
10061A647803J329764J275079J235676J240758J312320J449434J619427J765252
10053A2875513J826259J760255J556598J237506Q49505M47937P9775k27874m69552
10044A9935922o55513q02237r21144j007732j037467r74740p92637m91939j08015
10035A3144498K97122O52109Q95455R91337R38711P70968N44557L18986J36342
10026A8690085J0581o8740j23563j75766k43367l41911m83861o72739q96623j129016
10016A4565080j339448j507312j629295j716187j782196j833461j862739j855030
$$ plain form
10080 -5489669 -5329955 -5303489 -5416917 -5656790 -5991034 -6372584 -6743699 -7042154 -7209311 -7196966
10070 -7196966 -6970254 -6508023 -5804375 -4872161 -3744889 -2473059 -1115003 273649 1647803
10061 1647803 2977567 4252646 5488322 6729080 8041400 9490834 11110261 12875513
10053 12875513 14701772 16462027 18018625 19256131 20105636 20553573 20633348 20405474 19935922
10044 19935922 19280409 18478172 17557028 16549296 15511829 14537089 13744452 13252513 13144498
10035 13144498 13441620 14093729 14989184 15980521 16919232 17690200 18234757 18553743 18690085
10026 18690085 18700666 18631926 18508363 18332597 18089230 17747319 17263458 16590719 15694096 14565080
10016 14565080 13225632 11718320 10089025 8372838 6590642 4757181 2894442 1039412
10008A039412j801628j710141j598074j473007j318392j100107p88302l75789
10000i126028J18407O56635J192604J680093K081072K372632K549998K623291
9992D148704K609214K523011K376747K183986J963601J736482J517810J313262
9984B0372817J121994R41774P71173O08702M51439K94997J36030k3211j72147
9975B4503568k94506l74158l98862l62181k69640j49106n3891m7844j78214m54743
9965B1920423q46970j294993j722111k046693k199325k145812j903241j534249
9957H227029j120404p32634m15677j87410m3374L8673R1286J45665K21301L23193
9947F547648M46880N86022P36777Q95664J052683J187110J272878J291416J241186
$$ plain form
10008 1039412 -762216 -2472357 -4070431 -5543438 -6861830 -7961937 -8750239 -9126028
10000 -9126028 -9007621 -8350986 -7158382 -5478289 -3397217 -1024585 1525413 4148704
9992 4148704 6757918 9280929 11657676 13841662 15805263 17541745 19059555 20372817
9984 20372817 21494811 22436585 23207758 23816460 24267899 24562896 24698926 24675715 24503568
9975 24503568 24209062 23834904 23436042 23073861 22804221 22655115 22601224 22553380 22375166 21920423
9965 21920423 21073453 19778460 18056349 16009656 13810331 11664519 9761278 8227029
9957 8227029 7106625 6373991 5958314 5770904 5727530 5766203 5857489 6003154 6224455 6547648
9947 6547648 6994528 7580550 8317327 9212991 10265674 11452784 12725662 14017078 15258264
9938A5258264J135532R91682Q21219O29172M20075K03579n857j93494l46900m54416
9928A8458856n04120m87197m02236k54997n5855J78789M21890O36624P86927Q51024
9918A9629705Q28866P41147O22920N14714M53197M63077N51545P06905R04080
9909B5416156J116601J328352J538824J763391K032515K385979K857060L455182
9901D1894060M163571M953853N801015O687130P600888Q542747R531705J0604159
9893I9779128J1803958J3168616J4714675J6425547J8245421K0072836K1740194
9886B15950375K2979616K3397897K2490577J9724350J4716618P496909j278457
9879C25477885j0364307j8308536k3998040k7025342k7670877k6598938k4526276
$$ plain form
9938 15258264 16393796 17385478 18206697 18835869 19255944 19459523 19453666 19260172 18913272 18458856
9928 18458856 17954736 17467539 17065303 16810306 16754451 16933240 17355130 17991754 18778681 19629705
9918 19629705 20458571 21199718 21822638 22337352 22790549 23253626 23805171 24512076 25416156
9909 25416156 26532757 27861109 29399933 31163324 33195839 35581818 38438878 41894060
9901 41894060 46057631 51011484 56812499 63499629 71100517 79643264 89174969 99779128
9893 99779128 111583086 124751702 139466377 155891924 174137345 194210181 215950375
9886 215950375 238929991 262327888 284818465 304542815 319259433 326756342 325477885
9879 325477885 315113578 296805042 272807002 245781660 218110783 191511845 166985569
9872A66985569k2032591j9510179j7179460j5125386j3341268j1769845j0336210
9865E7690630q976942p664827o417727n285765m326668l581580l056620k714701
9857A5665800k484425k284645k051379j754813j404139j041396p23999n00100
9849C420904l88512l72347m06069m31120l96339k77051q2882J50950L83072N84205
9839B184811P44895Q69058R56859R89944R34544P65182M91561J65556j38821l58274
9829G605315m64540m69075m12483l49199l32664m00156n59589p87606j044362
9820B785641j294566j516630j694235j803722j813300j696226j447587j094248
9812i574873o93097l17296l4066J18064J42570Q1897j971n5006n2929o061N2553
$$ plain form
9872 166985569 144952978 125442799 108263339 93137953 79796685 68026840 57690630
9865 57690630 48713688 41048861 34631134 29345369 25018701 21437121 18380501 15665800
9857 15665800 13181375 10896730 8845351 7090538 5686399 4645003 3921004 3420904
9849 3420904 3032392 2660045 2253976 1822856 1426517 1149466 1066584 1217534 1600606 2184811
9839 2184811 2929706 3798764 4755623 5745567 6680111 7445293 7936854 8102410 7963589 7605315
9829 7605315 7140775 6671700 6259217 5910018 5577354 5177198 4617609 3830003 2785641
9820 2785641 1491075 -25555 -1719790 -3523512 -5336812 -7033038 -8480625 -9574873
9812 -9574873 -10267970 -10585266 -10619332 -10501268 -10358698 -10276801 -10278772 -10333778 -10386707 -10392768 -10340215
9801a0340215Q5259O3780k3903j71530l56054n42571o92755p76316p83285p30764
9791a4268354o56325n98369n75852n82375n97308o01945n86630n46202m73347
9782a9486707l60205k08041l4139J33923K74486L85797M86585O03097P52446R33567
9772a6519191J130941J327374J515583J699047J880825K049622K176073K225172
9764b514554K177627K043815J858612J660525J471291J289342J097729Q78012
9756I962399O22138L37205L9788k57816n58016q73459j209965j552716j868217
9747D641341k119396k281729k351037k340816k272053k161917k017906j839222
9739a2742735j621521j361140j058836p23161l70874k2693L02431N90412Q32407
$$ plain form
9801 -10340215 -10254956 -10191176 -10215079 -10386609 -10742663 -11285234 -11977989 -12754305 -13537590 -14268354
9791 -14268354 -14924679 -15523048 -16098900 -16681275 -17278583 -17880528 -18467158 -19013360 -19486707
9782 -19486707 -19846912 -20054953 -20089092 -19955169 -19680683 -19294886 -18808301 -18205204 -17452758 -16519191
9772 -16519191 -15388250 -14060876 -12545293 -10846246 -8965421 -6915799 -4739726 -2514554
9764 -2514554 -336927 1706888 3565500 5226025 6697316 7986658 9084387 9962399
9756 9962399 10584537 10921742 10961530 10703714 10145698 9272239 8062274 6509558 4641341
9747 4641341 2521945 240216 -2110821 -4451637 -6723690 -8885607 -10903513 -12742735
9739 -12742735 -14364256 -15725396 -16784232 -17507393 -17878267 -17900960 -17598529 -17008117 -16175710
9730a6175710J024619J167153J260492J301103J280227J187556J017630P75672
9722g161258M81044J67915j17361l24110m12558l73210k38352p2865N4799J03900
9712g892056P6463J1520l3725p465J14833L18616N56219P68565R09719R61283
9702d216028R32261Q48255P37560O21837N15335M28827L70225L38958L20285K87723
9692A185238K14181Q4929r4879l00625m94887o37215o94140o47407m99482k75857
9682b160144k3072J99520L35597L52481K57433R8381n4701j38747j20577l360
9672a257189J81369L86727N62560O67866O85508O33670N62445N30517N73951O89496
9662D216920Q45188J007931J164143J318271J475697J628825J758169J843681
$$ plain form
9730 -16175710 -15151091 -13983938 -12723446 -11422343 -10142116 -8954560 -7936930 -7161258
9722 -7161258 -6680214 -6512299 -6629660 -6953770 -7366328 -7739538 -7977890 -8050755 -7995956 -7892056
9712 -7892056 -7815593 -7804073 -7837798 -7845263 -7730430 -7411814 -6855595 -6087030 -5177311 -4216028
9702 -4216028 -3283767 -2435512 -1697952 -1076115 -560780 -131953 238272 577230 897515 1185238
9692 1185238 1399419 1484348 1389469 1088844 593957 -43258 -737398 -1384805 -1884287 -2160144
9682 -2160144 -2183216 -1983696 -1648099 -1295618 -1038185 -939804 -994505 -1133252 -1253829 -1257189
9672 -1257189 -1075820 -689093 -126533 541333 1226841 1860511 2422956 2953473 3527424 4216920
9662 4216920 5062108 6070039 7234182 8552453 10028150 11656975 13415144 15258825
9654A5258825J873339J842664J750008J594874J379179J106289P76859L87292
9646B5969329o4361n67426j089803j577739j967402k206313k274538k190753j996529
9637A2034465j729889j408596j034357o10647j57445K88520O86990J010396J251243
9628A0330680J416168J512410J537991J482958J340288J118576Q47984N74613
9620B0161668L44910J87718J03802O8841M8294J5541l7645j04178j74353k47660
9610B0366938l35838m56954o24564q35736j063423j261065j382078j403402j335011
9601A1668867j207545j049175q71060o71249m50434k24689k4790J16364J78162
9592G464451J59641P8814l1740j30646j76077j37525q031J88694M01919N70858
$$ plain form
9654 15258825 17132164 18974828 20724836 22319710 23698889 24805178 25582037 25969329
9646 25969329 25904968 25337542 24247739 22670000 20702598 18496285 16221747 14030994 12034465
9637 12034465 10304576 8895980 7861623 7250976 7093531 7382051 8069041 9079437 10330680
9628 10330680 11746848 13259258 14797249 16280207 17620495 18739071 19587055 20161668
9620 20161668 20506578 20694296 20798098 20866939 20915233 20930774 20893129 20788951 20614598 20366938
9610 20366938 20031100 19574146 18949582 18113846 17050423 15789358 14407280 13003878 11668867
9601 11668867 10461322 9412147 8541087 7869838 7419404 7194715 7169925 7286289 7464451
9592 7464451 7624092 7702906 7671166 7540520 7364443 7226918 7218887 7407581 7809500 8380358
9582H380358O49704O26852N25000L82313K29419P8071p4773k34713l98814n51596
9572I611821o70390p37762p53164p34481p06899o86356o69512o37196n68358m54356
9562B993347l04293j40059J2965J33102K06042K26999K01739J44631P3134J717
9552C549324o2065j20068j85685k81983m30584o34701q70071j093974j265573
9543a395380j360883j375755j324777j242053j175614j166965j225332j318724
9535a1585483j390475j386175j269999j025756o54247j77035L57036Q75083J299756
9526a4957295J576512J690386J661500J526336J321643J079893Q30605N98090
9518d672330L94092K12012K9505j78980m24648o91576r38137j114053j183646
$$ plain form
9582 8380358 9030062 9656914 10181914 10564227 10793646 10871717 10796944 10562231 10163417 9611821
9572 9611821 8941431 8203669 7450505 6716024 6009125 5322769 4653257 4016061 3447703 2993347
9562 2993347 2689054 2548995 2561960 2695062 2901104 3128103 3329842 3474473 3547607 3549324
9552 3549324 3487259 3367191 3181506 2899523 2468939 1834238 964167 -129807 -1395380
9543 -1395380 -2756263 -4132018 -5456795 -6698848 -7874462 -9041427 -10266759 -11585483
9535 -11585483 -12975958 -14362133 -15632132 -16657888 -17312135 -17489170 -17132134 -16257051 -14957295
9526 -14957295 -13380783 -11690397 -10028897 -8502561 -7180918 -6101025 -5270420 -4672330
9518 -4672330 -4278238 -4066226 -4036721 -4215701 -4640349 -5331925 -6270062 -7384115 -8567761
9509h567761j141459j011528q32190o36960m43937k59059q6619O4652J85149K72367
9499a2457345L35280L92268M64648N69015P11029Q82761J063861J225291J335154
9490e478038J366105J301779J139467Q90653N83013K61983j5142j93740k36046
9481c79966j26463J29846N07724R60758J422637J814619K058914K096379J903417
9472A0387865J498994R36703K88527l68560r60947j428009j733827j872749j862875
9463D885122j732819j510921j220238q77434m94838q6121L26398P07150J009233
9454A005532J184453J200317J057534P97369M90788K11476N171j28356k29872
9445E594412l53718n34614p67325j009069j200469j293065j271059j157556j001114
$$ plain form
9509 -8567761 -9709220 -10720748 -11552938 -12189898 -12633835 -12892894 -12979513 -12914861 -12729712 -12457345
9499 -12457345 -12122065 -11729797 -11265149 -10696134 -9985105 -9102344 -8038483 -6813192 -5478038
9490 -5478038 -4111933 -2810154 -1670687 -780034 -197021 64962 49820 -143920 -379966
9481 -379966 -506429 -376583 131141 1091899 2514536 4329155 6388069 8484448 10387865
9472 10387865 11886859 12823562 13112089 12743529 11782582 10354573 8620746 6747997 4885122
9463 4885122 3152303 1641382 421144 -456290 -951128 -1037249 -710851 -3701 1005532
9454 1005532 2189985 3390302 4447836 5245205 5735993 5947469 5952640 5824284 5594412
9445 5594412 5240694 4706080 3938755 2929686 1729217 436152 -834907 -1992463 -2993577
9436b993577q49862p29660o39315n60457m69495l43766j65128P3429L59625O59655
9426e658551R26475J115265J197424J166381J035075Q30074N86359L42325J33050
9417A673877j7512j01381j25984j09454p5233m7931n0323j00310k07199l67801
9407D70749n64011p64297r31055j032970j057475j016373r41010q70785q42694
9398g549921q85824j017779j239007j526890j835625k104798k273247k292689
9390b0725780k137882j812409j349086q04169k45904K60622O69446R66194J171510
9381b4007458J331834J499135J706783J951568K191294K362025K408917K313882
9373h242020K102921J829154J545121J283809J057467Q68087P17202O07951N40871
$$ plain form
9436 -2993577 -3843439 -4573099 -5212414 -5772871 -6242366 -6586132 -6751260 -6677831 -6318206 -5658551
9426 -5658551 -4732076 -3616811 -2419387 -1253006 -217931 612143 1198502 1540827 1673877
9417 1673877 1656365 1554984 1429000 1319546 1244313 1196382 1146059 1045749 838550 470749
9407 470749 -93262 -857559 -1788614 -2821584 -3879059 -4895432 -5836442 -6707227 -7549921
9398 -7549921 -8435745 -9453524 -10692531 -12219421 -14055046 -16159844 -18433091 -20725780
9390 -20725780 -22863662 -24676071 -26025157 -26829326 -27075230 -26814608 -26145162 -25178968 -24007458
9381 -24007458 -22675624 -21176489 -19469706 -17518138 -15326844 -12964819 -10555902 -8242020
9373 -8242020 -6139099 -4309945 -2764824 -1481015 -423548 444539 1161741 1769692 2310563
9364B310563N08426M92174M64954M00368K88837J52380M4718L0378J53187M14866
9354E260851P75130J166234J508875J727024J767057J618152J318541R37286N41375
9345A6620525J70348j67639m82398p84506j075056j345292j582705j777122j921971
9336G654184k011030k035209j982842j843284j611532j292437r03414m73825m0101
9327d539490L61150O97837R43548J078776J096068J006690Q41571O42357M47364
9318B575871K80873J49682M5466m8318j44639k39688l06725l03976j94478L2241
9308A846309L48219O91896R88572J175981J221603J126190R18394O46872L69727
9299I333763J39677j0218p2495o2152j0287M3100O0407K1164o9258j85380k97638
$$ plain form
9364 2310563 2818989 3311163 3776117 4176485 4465322 4617702 4662420 4692798 4845985 5260851
9354 5260851 6035981 7202215 8711090 10438114 12205171 13823323 15141864 16079150 16620525
9345 16620525 16790873 16623234 16140836 15356330 14281274 12935982 11353277 9576155 7654184
9336 7654184 5643154 3607945 1625103 -218181 -1829713 -3122150 -4025564 -4499389 -4539490
9327 -4539490 -4178340 -3480503 -2536955 -1458179 -362111 644579 1486150 2128507 2575871
9318 2575871 2856744 3006426 3051892 3003574 2858935 2619247 2312522 2008546 1814068 1846309
9308 1846309 2194528 2886424 3874996 5050977 6272580 7398770 8317164 8964036 9333763
9299 9333763 9473440 9463222 9390727 9328575 9318288 9361388 9421795 9442959 9373701 9188321 8890683
9288H890683l85434m38847m52918m24648l57747k70122j94397j67007k12212l32799
9278E654552n13542p32571r70258j209561j430269j604839j701459j693413j568729
9269e770089j334498j015040o46861k73117O1303L14892M56873M77865L99989
9260g328683K77168J79081J63133K48518M06247N71058O70392O56137N21312K93179
9250c342458J2389k83095n60824p91618r53331j039850j064969j054509j030628
9241a0108893r99084r48597q62444p32059n61158l59512j35965J02716L50831
9232a4254165O05054Q63211J114599J328863J459207J464358J334315J100741
9224d983817Q25865N77499M02095L07795K67967K46198K26579K24704K69226L70577
$$ plain form
9288 8890683 8505249 8066402 7613484 7188836 6831089 6560967 6366570 6199563 5987351 5654552
9278 5654552 5141010 4408439 3438181 2228620 798351 -806488 -2507947 -4201360 -5770089
9269 -5770089 -7104587 -8119627 -8766488 -9039605 -8978302 -8663410 -8206537 -7728672 -7328683
9260 -7328683 -7051515 -6872434 -6709301 -6460783 -6054536 -5483478 -4813086 -4156949 -3635637 -3342458
9250 -3342458 -3330069 -3613164 -4173988 -4965606 -5918937 -6958787 -8023756 -9078265 -10108893
9241 -10108893 -11107977 -12056574 -12919018 -13651077 -14212235 -14571747 -14707712 -14604996 -14254165
9232 -14254165 -13649111 -12785900 -11671301 -10342438 -8883231 -7418873 -6084558 -4983817
9224 -4983817 -4157952 -3580453 -3178358 -2870563 -2602596 -2356398 -2129819 -1905115 -1635889 -1265312
9214a265312N05071O26490O91653O78040N85578M31030K44077O3522p2248j39211
9204B348690j36047p9428R522J15212K26368L28719M03412M35009M20383L68611
9194D440451K93894K11823J42412J11898J45732K55756M30699O35310Q18528R29704
9184H416207R38687Q50259P03472N55134M55805M28555M58958N02004N05041M34679
9174A4248801K91025J01907r5127k69417m05272n02840n75741o47058p43107q84677
9164A0518494j077700j307360j539736j732378j850837j882798j839204j738658
9156b450177j586576j369692j074498p14150l38225j5721J94866K67560K13546
9147f873067P1376j09251k82235m12915m79088m70281l88198k45634o0763J50201
$$ plain form
9214 -1265312 -760241 -133751 557902 1235942 1821520 2252550 2496627 2560149 2487901 2348690
9204 2348690 2212643 2133215 2142737 2257949 2484317 2813036 3216448 3651457 4071840 4440451
9194 4440451 4734345 4946168 5088580 5200478 5346210 5601966 6032665 6667975 7486503 8416207
9184 8416207 9354894 10205153 10908625 11463759 11919564 12348119 12807077 13309081 13814122 14248801
9174 14248801 14539826 14641733 14546606 14277189 13871917 13369077 12793336 12146278 11403171 10518494
9164 10518494 9440794 8133434 6593698 4861320 3010483 1127685 -711519 -2450177
9156 -2450177 -4036753 -5406445 -6480943 -7195093 -7533318 -7549039 -7354173 -7086613 -6873067
9147 -6873067 -6801691 -6910942 -7193177 -7606092 -8085180 -8555461 -8943659 -9189293 -9250056 -9099855
9137i099855L76017O07868Q35975J049887J241755J408161J547002J650721J701520
9128A319051J673933J543510J294854R24254M39888j34232p51038j339100j815728
9119C155392k111655k193015k067632j775569j374963r31120n06153j44955J36157
9110g813513L45876M98715N95864O22168N59210M01294J62503j27718m35754p33658
9100e925013j000550j216447j358379j406480j354121j208811r81534o78082l04904
9091a5434321J15615N37724R02758J160398J285666J282967J179375J014120Q28607
9082g127091O57528N21864M26940L67916L39800L45181L94521M99072O59966Q58351
9072b055952J052663J188812J222288J140359R68519P55714N49396L78262K51081
$$ plain form
9137 -9099855 -8723838 -8115970 -7279995 -6230108 -4988353 -3580192 -2033190 -382469 1319051
9128 1319051 2992984 4536494 5831348 6755602 7195490 7061258 6310220 4971120 3155392
9119 3155392 1043737 -1149278 -3216910 -4992479 -6367442 -7298562 -7804715 -7949670 -7813513
9110 -7813513 -7467637 -6968922 -6373058 -5750890 -5191680 -4790386 -4627883 -4755601 -5191355 -5925013
9100 -5925013 -6925563 -8142010 -9500389 -10906869 -12260990 -13469801 -14451335 -15129417 -15434321
9091 -15434321 -15318706 -14780982 -13878224 -12717826 -11432160 -10149193 -8969818 -7955698 -7127091
9082 -7127091 -6469563 -5947699 -5520759 -5152843 -4813043 -4467862 -4073341 -3574269 -2914303 -2055952
9072 -2055952 -1003289 185523 1407811 2548170 3516689 4272403 4821799 5200061 5451142
9063E451142J65375J13776Q2476M6177l0936j82282m18540p14619j017892j275672
9053B219005j461548j579997j648976j679492j668784j605724j477080j270119
9045a0172715r76712o01934j71084K73132O82671J016048J241842J335934J282307
9036f090511J083095P70511M05687N8122k22658m22809n57094o47999p09773p48828
9026g082257p75673q13337q90786j023746j197032j362364j454875j419217j231014
9017a7250301r03407m78232j1008M39934Q18288J076040J186568J158236J035705
9008a2928177Q84071P64349P13359P34923Q02425Q70856Q95838Q53241P49177
8999e659938O12918M76061L52463K33971J04457m1301j90973l25316m35386n30924
$$ plain form
9063 5451142 5616517 5730293 5812769 5858946 5828010 5645728 5227188 4512569 3494677 2219005
9053 2219005 757457 -822540 -2471516 -4151008 -5819792 -7425516 -8902596 -10172715
9045 -10172715 -11149427 -11751361 -11922445 -11649313 -10966642 -9950594 -8708752 -7372818 -6090511
9036 -6090511 -5007416 -4236905 -3831218 -3773096 -3995754 -4418563 -4975657 -5623656 -6333429 -7082257
9026 -7082257 -7857930 -8671267 -9562053 -10585799 -11782831 -13145195 -14600070 -16019287 -17250301
9017 -17250301 -18153708 -18631940 -18642948 -18203014 -17384726 -16308686 -15122118 -13963882 -12928177
9008 -12928177 -12044106 -11279757 -10566398 -9831475 -9029050 -8158194 -7262356 -6409115 -5659938
8999 -5659938 -5047020 -4570959 -4218496 -3984525 -3880068 -3921369 -4112342 -4437658 -4873044 -5403968
8989e403968o33111p57633r00501j036260j129559j152392j096779r76705q19277
8980a3906185o50550m84554l23602j70050l8835M3059N2793r180j13718k16583
8970a5817405k81246k94661k65685k08732j26596p076J63683L82700O22185Q38605
8960a4994228R92499J066321J070475J035839R99503R93012J037230J140871J298689
8951e359789J490336J683672J842738J936706J947330J875244J744325J599164
8943H759726J491361J457514J499876J581777J641417J615252J456620J142090
8935B0645633O70785O6124o18994j302778j888695k290121k454273k375507k094231
8926H357943j682692j222592p83093m08210j17309Q5466K01573K35113J97726
$$ plain form
8989 -5403968 -6037079 -6794712 -7695213 -8731473 -9861032 -11013424 -12110203 -13086908 -13906185
8980 -13906185 -14556735 -15041289 -15364891 -15534941 -15573776 -15530717 -15477924 -15487104 -15600822 -15817405
8970 -15817405 -16098651 -16393312 -16658997 -16867729 -16994325 -17001401 -16837718 -16455018 -15832833 -14994228
8960 -14994228 -14001729 -12935408 -11864933 -10829094 -9829591 -8836579 -7799349 -6658478 -5359789
8951 -5359789 -3869453 -2185781 -343043 1593663 3540993 5416237 7160562 8759726
8943 8759726 10251087 11708601 13208477 14790254 16431671 18046923 19503543 20645633
8935 20645633 21316418 21382542 20763548 19460770 17572075 15281954 12827681 10452174 8357943
8926 8357943 6675251 5452659 4669566 4261356 4144047 4229513 4431086 4666199 4863925
8917D863925J16540L6775J1620P9360K38825M41140O09070O76411O22933M81568
8907H178167L15354J83756J22060J41779K41655M14674O46524R11869J175899
8898A2331737J401550J557193J620789J581398J440837J215115R32362O25968
8890B2706949L26796N9947j53522k96150l60514l59297l27885l11828l45123m35041
8880B0504332n64897p10972q59330j010816j173700j351956j538122j714715j862224
8871I717600j968188k032156k064817k083154k105034k145772k216376k320306
8863g218203k445983k558427k600009k507419k238672j793549j215675n78927
8855b3156864L1685N38916Q91218J075750J118772J070563R82587Q88438P95436
$$ plain form
8917 4863925 4980465 5017240 5028860 5108220 5347045 5788185 6397255 7073666 7696599 8178167
8907 8178167 8493521 8677277 8799337 8941116 9182771 9597445 10243969 11155838 12331737
8898 12331737 13733287 15290480 16911269 18492667 19933504 21148619 22080981 22706949
8890 22706949 23033745 23093692 22940170 22644020 22283506 21924209 21596324 21284496 20939373 20504332
8880 20504332 19939435 19228463 18369133 17358317 16184617 14832661 13294539 11579824 9717600
8871 9717600 7749412 5717256 3652439 1569285 -535749 -2681521 -4897897 -7218203
8863 -7218203 -9664186 -12222613 -14822622 -17330041 -19568713 -21362262 -22577937 -23156864
8855 -23156864 -23125179 -22586263 -21695045 -20619295 -19500523 -18429960 -17447373 -16558935 -15763499
8846a5763499O88083N42322L46344J17934r3253k21964k13294m3873K70901O82891
8836a3687408J124320J522770J816388J968029J973682J858979J663617J423083
8828c36540J160283Q91169O35818M22621K80840K27381K57624L45981M55057N47586
8818D887820N94970N79710M94162L40282J32642r8326l08359m49776m87329m11961
8808E273835k44951l0234J81441L49771M58040N18181N64692O37525P60784R29410
8798I398494J112108J267667J362956J383030J332077J229588J105252R92258
8790A9183430R17538Q90739Q98168R08383Q88303Q18528O95537N21175K93330
8781B6015131R285l22777o78533j024790j331440j577706j751400j845974j857940
$$ plain form
8846 -15763499 -15075416 -14533094 -14186750 -14068816 -14162069 -14384033 -14597327 -14641200 -14370299 -13687408
8836 -13687408 -12563088 -11040318 -9223930 -7255901 -5282219 -3423240 -1759623 -336540
8828 -336540 823743 1714912 2350730 2773351 3054191 3281572 3539196 3885177 4340234 4887820
8818 4887820 5482790 6062500 6556662 6896944 7029586 6931260 6622901 6173125 5685796 5273835
8808 5273835 5028884 4998650 5180091 5529862 5987902 6506083 7070775 7708300 8469084 9398494
8798 9398494 10510602 11778269 13141225 14524255 15856332 17085920 18191172 19183430
8790 19183430 20100968 20991707 21889875 22798258 23686561 24505089 25200626 25721801 26015131
8781 26015131 26024416 25701639 25023106 23998316 22666876 21089170 19337770 17491796 15633856
8772A5633856j784880j627250j397721j133285q96216p54151p47111q63226j041506
8763E388510j201110j278668j251556j137249r75717q09361o69505n69106m99175
8754c002937m31546l32209j81877Q697J99625L39003L86352L31242K00035M7693
8744b435922o3201q6823r319J51214L55315N55814P12156Q04564Q40920Q47332
8734A672050Q45278Q32851P85219O71559M72935J90489j54700n25045q71692j141985
8724B776959j287987j275256j092344p58590l23495J45855N83272R37169J175069
8715H80652J283259J266437J147158R62061P54369N64059M17546L19531K51985
8706G847057J83902Q8371m3271j99420l58307n01313o19858p12964p79900q14323
$$ plain form
8772 15633856 13848976 12221726 10824005 9690720 8794504 8040353 7293242 6430016 5388510
8763 5388510 4187400 2908732 1657176 519927 -455790 -1265151 -1934656 -2503762 -3002937
8754 -3002937 -3434483 -3766692 -3948569 -3939872 -3740247 -3401244 -3014892 -2683650 -2483615 -2435922
8744 -2435922 -2499123 -2585946 -2595265 -2444051 -2088736 -1532922 -820766 -16202 824718 1672050
8734 1672050 2517328 3350179 4135398 4806957 5279892 5470381 5315681 4790636 3918944 2776959
8724 2776959 1488972 213716 -878628 -1637218 -1960713 -1814858 -1231586 -294417 880652
8715 880652 2163911 3430348 4577506 5539567 6293936 6857995 7275541 7595072 7847057
8706 7847057 8030959 8119330 8076059 7876639 7518332 7017019 6397161 5684197 4904297 4089974
8696D089974q03972p36489o08680m33705k40552o4450O6458J40424J63426J54324
8686A726758J37814J37508J69610K38381L35488M44485N48256O34958P00045P46314
8676E819617P85306Q38790R34607J094305J318112J576690J815141J968510J984855
8667A8135933J848485J591503J283330J000538P94278O74244O15402N78880N33199
8658B7055792M66011L83818L03746K43888K15547K16478K25740K05909J16871
8649B9433800o4686l33056o55440r83134j263497j450087j512138j441718j253843
8640B0476201r78633o50564l00838M4602L62537O28127Q12774Q88227Q37225O64756
8630B2784414M01490R5849k00646m46203o15232o99824p08863o64184n92211n14139
$$ plain form
8696 4089974 3286002 2549513 1940833 1507128 1266576 1202126 1268584 1409008 1572434 1726758
8686 1726758 1864572 2002080 2171690 2410071 2745559 3190044 3738300 4373258 5073303 5819617
8676 5819617 6604923 7443713 8378320 9472625 10790737 12367427 14182568 16151078 18135933
8667 18135933 19984418 21575921 22859251 23859789 24654067 25328311 25943713 26522593 27055792
8658 27055792 27521803 27905621 28209367 28453255 28668802 28885280 29111020 29316929 29433800
8649 29433800 29369114 29036058 28380618 27397484 26133987 24683900 23171762 21730044 20476201
8640 20476201 19497568 18847004 18546166 18590768 18953305 19581432 20394206 21282433 22119658 22784414
8630 22784414 23185904 23281753 23081107 22634904 22019672 21319848 20610985 19946801 19354590 18840451
8620A8840451m41641l81412l42756l38761l78666m59355n65502o77932p80381
8611A4474045q57069q86204q42123p10924n08809k86699j14884n5524j35789l32032
8601I743988n72869p64700q31237p46358n41595k87479o3085P1861R5767L0437
8591F134730p1423j53011j78909j43136n8351O0621K05231L70421N46323P11731
8581G424227Q34047Q77463Q17596O56413M27933J87633j1722j43470k14392k53658
8571A0602070k95546l68090m87955o55785q52835j045539j197880j281928j280346
8562C136166j186200j007109p69124n09395k57330j9000K20631M79049P56015
8553H43703J025292J240624J349838J310927J106696P55272L12363j38258n05443
$$ plain form
8620 18840451 18398810 18017398 17674642 17335881 16957215 16497860 15932358 15254426 14474045
8611 14474045 13616976 12730772 11888649 11177725 10668916 10382217 10267333 10211809 10076020 9743988
8601 9743988 9171119 8406419 7575182 6828824 6287229 5999750 5936665 6008526 6104293 6134730
8591 6134730 6063307 5910296 5731387 5588251 5529900 5590521 5795752 6166173 6712496 7424227
8581 7424227 8258274 9135737 9953333 10609746 11037679 11225312 11213590 11070120 10855728 10602070
8571 10602070 10306524 9938434 9450479 8794694 7941859 6896320 5698440 4416512 3136166
8562 3136166 1949966 942857 173733 -335662 -592992 -611992 -391361 87688 843703
8553 843703 1868995 3109619 4459457 5770384 6877080 7632352 7944715 7806457 7301014
8544G301014p16729p40352n93825l34621l7899K25914M03953M66223M11969K76934
8534F662581J28991M3029O5523J92271L74116N44848O53099O82182O50265N92491
8524A0589396N35430M79496M00854K71393Q3656j34958l27708m30998m01922k37289
8514A0827350K3028L08077N39033O56654O40991N11090L04263N0957k35967n53857
8504A3071619q97033j250247j590098j888056k111288k223473k190372j991993
8496a070941j637092j170379o64196j95690J79416M42439O09354P12963P80795
8487b013331Q22161Q30896P97591P18441N94487M27766K24083K897j95249l13689
8477A896053k98286j21450K01786O15835J044509J417057J685740J828487J841095
$$ plain form
8544 7301014 6584285 5843933 5250108 4915487 4877588 5103502 5507455 5973678 6385647 6662581
8534 6662581 6791572 6834601 6900124 7092395 7466511 8011359 8664458 9346640 9996905 10589396
8524 10589396 11124826 11604322 12005176 12276569 12360225 12225267 11897559 11466561 11064639 10827350
8514 10827350 10850378 11158455 11697488 12354142 12995133 13506223 13810486 13861443 13625476 13071619
8504 13071619 12174586 10924339 9334241 7446185 5334897 3111424 921052 -1070941
8496 -1070941 -2708033 -3878412 -4542608 -4738298 -4558882 -4116443 -3507089 -2794126 -2013331
8487 -2013331 -1191170 -360274 437317 1155758 1750245 2178011 2402094 2404991 2209742 1896053
8477 1896053 1597767 1476317 1678103 2293938 3338447 4755504 6441244 8269731 10110826
8468A0110826J728322J501061J180905Q06863M35059J26235p3725j47976j09514
8459A5558056Q286J61958L03616L84567L62721K15185m9822l90282p40159j026664
8449A4787462j187721j185985j018400p17257l37987O2420M42185P75169J038925
8440A2658811J205835J246985J143839Q96524N24550O4053m34383r09354j297841
8431A5099019j548792j633948j549767j311447r46268m92023M00M67123Q40363
8422H924660J066088J121448J020636Q04430N20949K11513r0497l52597n39602
8413A2687028o20135n79779m31542k16012J0330J94632L07654L56206L81192M38975
8403A2528549N71995P83351J030267J240144J338241J271633J022204O10191R0379
$$ plain form
8468 10110826 11839148 13340209 14521114 15327977 15763036 15889271 15815546 15667570 15558056
8459 15558056 15566342 15728300 16031916 16416483 16779204 16994389 16944567 16554285 15814126 14787462
8449 14787462 13599741 12413756 11395356 10678099 10340112 10402532 10844717 11619886 12658811
8440 12658811 13864646 15111631 16255470 17151994 17676544 17740597 17306214 16396860 15099019
8431 15099019 13550227 11916279 10366512 9055065 8108797 7616774 7617174 8084297 8924660
8422 8924660 9990748 11112196 12132832 12937262 13458211 13669724 13579227 13226630 12687028
8413 12687028 12066893 11487114 11055572 10839560 10849890 11044522 11352176 11708382 12089574 12528549
8403 12528549 13100544 13883895 14914162 16154306 17492547 18764180 19786384 20396575 20486954
8394B0486954m60225r62901j358912j622424j759023j791993j744002j623327
8386I164147j421311j121629p15479k14509L43495Q96576J367598J680887J785217
8377A1764992J675317J398739J039335O83324L87147J65210M44j34625k61222
8368A6718661l88311n14354o30925p24754p79104p78503p19792o24928n44037
8359A1013953n39979o59402r08065j246583j607926j923403k141585k233519k187858
8350b434367k003110j682161j231443o65762j7197O58117J283805J780312K087297
8341b224509K177736K056253J746369J279168O91992L4990o25215j214303j670575
8332B251906j964733k105300k125828k063025j939626j759569j513950j192484
$$ plain form
8394 20486954 20026729 19063828 17704916 16082492 14323469 12531476 10787474 9164147
8386 9164147 7742836 6621207 5905728 5691219 6034714 6931290 8298888 9979775 11764992
8377 11764992 13440309 14839048 15878383 16561707 16948854 17114064 17114508 16979883 16718661
8368 16718661 16330350 15815996 15185071 14460317 13681213 12902710 12182918 11557990 11013953
8359 11013953 10473974 9814572 8906507 7659924 6051998 4128595 1987010 -246509 -2434367
8350 -2434367 -4437477 -6119638 -7351081 -8016843 -8034040 -7375923 -6092118 -4311806 -2224509
8341 -2224509 -46773 2009480 3755849 5035017 5727009 5761999 5136784 3922481 2251906
8332 2251906 287173 -1818127 -3943955 -6006980 -7946606 -9706175 -11220125 -12412609
8324a2412609p96232l48218J02854M90597P51331Q50109P99423O57723N04788
8315i400234M06296L88540M36087N07015N50986N23032L96814J78751q6477l29015
8305f428205m81210n02680l90385j73979R6187L62719N73895O93574P07422O25560
8295d917102M80386L17563J81886J04788R8591J56441K54839L59830M38980M75087
8285b048711M72009M48039M23009M09297M10576M23589M37298M30070L71294K32080
8275B008550J896k98569o17304q85668j042523j057222r39731p31208m79983k18915
8265d260677M0586K95976N34821P25986Q28309Q11245O72748M41350J61630j24011
8255A27963l83260n90215p20732p55791o91001n43846l53133j70467m6136j3039
$$ plain form
8324 -12412609 -13208841 -13557059 -13454205 -12963608 -12212277 -11362168 -10562745 -9905022 -9400234
8315 -9400234 -8993938 -8605398 -8169311 -7662296 -7111310 -6588278 -6191464 -6012713 -6099190 -6428205
8305 -6428205 -6909415 -7412095 -7802480 -7976459 -7880272 -7517553 -6943658 -6250084 -5542662 -4917102
8295 -4917102 -4436716 -4119153 -3937267 -3832479 -3733888 -3577447 -3322608 -2962778 -2523798 -2048711
8285 -2048711 -1576702 -1128663 -705654 -296357 114219 537808 975106 1405176 1776470 2008550
8275 2008550 2010446 1711877 1094573 208905 -833618 -1890840 -2830571 -3561779 -4041762 -4260677
8265 -4260677 -4220091 -3924115 -3389294 -2663308 -1834999 -1023754 -351006 90344 251974 127963
8255 127963 -255297 -845512 -1566244 -2322035 -3013036 -3556882 -3910015 -4080482 -4126618 -4139657
8245d139657p4273k01024l44366m57438n17090n32562n36471n65429o42708p69529
8235h780547r23591j063105j138065j108699r64005p30183m63887k32277q7500
8226a5491859m6943r0459j76534k65259l31167l60294l40793k59813j09675J03471
8216a7369325L56841O16572Q48111J025527J136197J181093J171633J122389J040378
8207h870584R17795P37961M94746K10724o4338k77167l98190m30039l93646l09938
8197h382676j96155p6046J4533M0128j1339j16054k24853k89592k86552k22560
8187i751166j23657j8066P3465J36956J62272J46291R9638M7103J8277L6223J12785
8176i059879K49538M37885O56635Q72370J046667J147926J161701J094383R68469
$$ plain form
8245 -4139657 -4213930 -4414954 -4759320 -5216758 -5733848 -6266410 -6802881 -7368310 -8011018 -8780547
8235 -8780547 -9704138 -10767243 -11905308 -13014007 -13978012 -14708195 -15172082 -15404359 -15491859
8226 -15491859 -15538802 -15629261 -15805795 -16071054 -16402221 -16762515 -17103308 -17363121 -17472796 -17369325
8216 -17369325 -17012484 -16395912 -15547801 -14522274 -13386077 -12204984 -11033351 -9910962 -8870584
8207 -8870584 -7952789 -7214828 -6720082 -6509358 -6573696 -6850863 -7249053 -7679092 -8072738 -8382676
8197 -8382676 -8578831 -8654877 -8640344 -8600216 -8611555 -8727609 -8952462 -9242054 -9528606 -9751166
8187 -9751166 -9874823 -9892889 -9819424 -9682468 -9520196 -9373905 -9274267 -9227164 -9208887 -9172664 -9059879
8176 -9059879 -8810341 -8372456 -7715821 -6843451 -5796784 -4648858 -3487157 -2392774 -1424305
8167a424305Q11539O44753M77190L08478J37206l0111j74845k70367k93883k39625
8157e3970j25113J3648J34654K03269K00580J24405j5577k04195m23983o54226
8147h00508q69244j040532j144629j174272j145736j094216j055486j043746j040778
8138a0409147j003574q84007o49091k94833J49285O28128J079929J456745J734140
8129h192425J907729J985111J980608J912177J797729J652493J489409J319601
8121E852432J149211R75938P92130N94216L89445J92976J8560j28310k50984l59330
8111I226284m68420n97242p63778r76466j227517j493814j745251j954288k100638
8102b101130k170212k151547k033113j803369j454749r90891m33652J75272P80631
$$ plain form
8167 -1424305 -612766 31987 509177 817655 954861 924750 749905 479538 185655 -53970
8157 -53970 -179083 -165435 -30781 172488 373068 497473 481896 277701 -146282 -800508
8147 -800508 -1669752 -2710284 -3854913 -5029185 -6174921 -7269137 -8324623 -9368369 -10409147
8138 -10409147 -11412721 -12296728 -12945819 -13240652 -13091367 -12463239 -11383310 -9926565 -8192425
8129 -8192425 -6284696 -4299585 -2318977 -406800 1390929 3043422 4532831 5852432
8121 5852432 7001643 7977581 8769711 9363927 9753372 9946348 9964908 9836598 9585614 9226284
8111 9226284 8757864 8160622 7396844 6420378 5192861 3699047 1953796 -492 -2101130
8102 -2101130 -4271342 -6422889 -8456002 -10259371 -11714120 -12705011 -13138663 -12963391 -12182760
8093a2182760J325603J763275K061464K199602K164138J951708J581632J106668
8085A971330O07846J71096j41865l12515l66368l57058l41253l55677m07342m79894
8075a1700n48053n88990n86572n31712m22607k65316p4086J28846L15245M56981
8065b127964N36038N53928N34285N15298N34274O12392P48631R25866J122802
8056C955550J322283J511806J679587J810894J887169J889179J804980J639952
8048A7501400J421061J188851R79530Q08639O67857N36928M00733K57802J15373
8039B3878174k0640j48164k61904l46894l82286l52313k53611r4064J11696L44175
8029B2474169N79993P96490R78734J122149J227362J292593J311915J281207J205155
$$ plain form
8093 -12182760 -10857157 -9093882 -7032418 -4832816 -2668678 -716970 864662 1971330
8085 1971330 2579176 2750272 2608407 2295892 1929524 1572466 1231213 875536 468194 -11700
8075 -11700 -559753 -1148743 -1735315 -2267027 -2689634 -2954950 -3029036 -2900190 -2584945 -2127964
8065 -2127964 -1591926 -1037998 -503713 11585 545859 1158251 1906882 2832748 3955550
8056 3955550 5277833 6789639 8469226 10280120 12167289 14056468 15861448 17501400
8048 17501400 18922461 20111312 21090842 21899481 22567338 23104266 23504999 23762801 23878174
8039 23878174 23857534 23709370 23447466 23100572 22718286 22365973 22112362 22018298 22129994 22474169
8029 22474169 23054162 23850652 24829386 25951535 27178897 28471490 29783405 31064612 32269767
8020C2269767J097201R71307Q32348O73082M79810K41853m1372l57938o84353
8011C5481705r88881j238332j407870j489146j491770j438671j360905j294561
8003B4771569j275536j327930j451193j617538j784417j912958j978682j970776
7995A1452539j887673j736510j534158j302946j060674q13196n56767k87821j1158
7986B261636K59799N09442P27525R12653J069455J201096J302311J358337J350441
7977A0952695J264040J095812Q59091N86078L22241J10010l1753j19160j96047
7968A4843007l10781m89881p22762r65049j157416j248861j213689j058268q18578
7959F857722n48651k99794r7434P0539K44533M68593P65797J125550J504398J836755
$$ plain form
8020 32269767 33366968 34338275 35170623 35843705 36323515 36565368 36523996 36166058 35481705
8011 35481705 34492824 33254492 31846622 30357476 28865706 27427035 26066130 24771569
8003 24771569 23496033 22168103 20716910 19099372 17314955 15401997 13423315 11452539
7995 11452539 9564866 7828356 6294198 4991252 3930578 3117382 2560615 2272794 2261636
7986 2261636 2521435 3030877 3758402 4671055 5740510 6941606 8243917 9602254 10952695
7977 10952695 12216735 13312547 14171638 14757716 15079957 15189967 15158214 15039054 14843007
7968 14843007 14532226 14042345 13319583 12354534 11197118 9948257 8734568 7676300 6857722
7959 6857722 6309071 6009277 5911843 5982382 6226915 6695508 7461305 8586855 10091253 11928008
7949A1928008K052246K095513J941513J599915J108595N22243r7823o91539j207611
7940A9251060j610861j886715k040175k089596k057534j961753j809677j599529
7932D195220j328216j001732o42155k88131J1213K07898K69593J91194k914k67123
7922A344847n48448p99412r85875j088470j099284j018719q56928o37729l97608
7913f087626j76483n401J01576J49217J57516J52835J55996J74541K04845K40467
7903d932517K77898L16655L57696M02860M53347N06920N57056N95529O15283O11500
7893b37773N83082N35456M80944M34514M09130M15200M60554N44360O47360P30432
7883E003259P49262O78227N27432L41641J82198J02338J27979K51934M42561O60706
$$ plain form
7949 11928008 13980254 16075767 18017280 19617195 20725790 21248033 21150210 20458671 19251060
7940 19251060 17640199 15753484 13713309 11623713 9566179 7604426 5794749 4195220
7932 4195220 2867004 1865272 1223117 934986 946199 1154097 1423690 1614884 1611970 1344847
7922 1344847 796399 -3013 -988888 -2077358 -3176642 -4195361 -5052289 -5690018 -6087626
7913 -6087626 -6264109 -6269510 -6167934 -6018717 -5861201 -5708366 -5552370 -5377829 -5172984 -4932517
7903 -4932517 -4654619 -4337964 -3980268 -3577408 -3124061 -2617141 -2060085 -1464556 -849273 -237773
7893 -237773 345309 880765 1361709 1796223 2205353 2620553 3081107 3625467 4272827 5003259
7883 5003259 5752521 6430748 6958180 7299821 7482019 7584357 7712336 7964270 8406831 9067537
7873I067537Q74490J063480J212281J302214J310075J214863J006226O89320K85893
7864A8026379j67396o24548j039437j374542j604963j718674j716243j609800
7856H170776j418805j164046q64997n42420k21640O8583L01615M59786N40276
7847E329128N57919N40990N18254N03625M90286M60205M01428L18825K31179J60096
7837I511935J20915J19994J55432K17832K91567L58767M06029M30213M38265M38365
7827A2489314M27036L83310K78606R7392j47370m16350o60838q42716r48200r92123
7817I668061j011174j046778j124961j244602j379685j491425j542535j508613
7809f81712j383835j179241r15641o16819l06332n014K73841N28162P63415R82545
$$ plain form
7873 9067537 9942027 11005507 12217788 13520002 14830077 16044940 17051166 17740486 18026379
7864 18026379 17858983 17234435 16194998 14820456 13215493 11496819 9780576 8170776
7856 8170776 6751971 5587925 4722928 4180508 3958868 4027451 4329066 4788852 5329128
7847 5329128 5887047 6428037 6946291 7449916 7940202 8400407 8801835 9120660 9351839 9511935
7837 9511935 9632850 9752844 9908276 10126108 10417675 10776442 11182471 11612684 12050949 12489314
7827 12489314 12916350 13299660 13578266 13675658 13528288 13111938 12451100 11608384 10660184 9668061
7817 9668061 8656887 7610109 6485148 5240546 3860861 2369436 826901 -681712
7809 -681712 -2065547 -3244788 -4160429 -4777248 -5083580 -5088594 -4814753 -4286591 -3523176 -2540631
7799b540631J178823J338738J451855J517703J543747J537930J503808J442053
7791H974026J354770J246888J123885R89582Q46145O94407N33125L59653J73784
7782A6296265j8557k06818l81092n33934o54905p23801p12738o00376l89732j14941
7772A1959371J71519M24691O27490P90062R29721J049097J129483J141251J059847
7763A9282532Q76422O01550K65431q5665m00588o40979p94868q74459q98620q74769
7753A6455987p95437o51216m48016k14866K650J58947K26207K04718J20733J3279
7743A5072986q2377j46277j77091j89272k06697k52666l36364m41400n26725n45299
7733A2168818m71652l19646j38461P255N7326l1932k78771o65363j131780j586502
$$ plain form
7799 -2540631 -1361808 -23070 1428785 2946488 4490235 6028165 7531973 8974026
7791 8974026 10328796 11575684 12699569 13689151 14535296 15229703 15762828 16122481 16296265
7782 16296265 16277708 16070890 15689798 15155864 14500959 13777158 13064420 12464044 12074312 11959371
7772 11959371 12130890 12555581 13183071 13973133 14902854 15951951 17081434 18222685 19282532
7763 19282532 20158954 20760504 21025935 20940270 20539682 19898703 19103835 18229376 17330756 16455987
7753 16455987 15660550 15009334 14561318 14346452 14349102 14508049 14734256 14938974 15059707 15072986
7743 15072986 14990609 14844332 14667241 14477969 14271272 14018606 13682242 13240842 12714117 12168818
7733 12168818 11697166 11377520 11239059 11246314 11303640 11271708 10992937 10327574 9195794 7609292
7723G609292j935192k114217k110119j955254j704661j409512j102345p98911
7715e520919n09032k44106j5165J74643L35143M86329O47597Q24075R98912J138758
7705a683765J210986J201428J121250J001026Q78768P87800P45999P47978P65331
7696F776801P58413O95705N71274M11936K69959K01485K37930L66612N36943O91988
7686A1519046Q03025Q79397R46297J010555J043662R94606Q20415N11687R9722
7677A8628412l52197p64517j060395j188050j140650r60244p17694m79201k82640
7668A1682824j38694m9816k6508q6952k43521m90701q05016j154932j510350j844061
7658E332273k127684k330712k427553k408533k286294k092582j866691j641715
$$ plain form
7723 7609292 5674100 3559883 1449764 -505490 -2210151 -3619663 -4722008 -5520919
7715 -5520919 -6029951 -6274057 -6289222 -6114579 -5779436 -5293107 -4645510 -3821435 -2822523 -1683765
7705 -1683765 -472779 728649 1849899 2850925 3729693 4517493 5263492 6011470 6776801
7696 6776801 7535214 8230919 8802193 9214129 9484088 9685573 9923503 10290115 10827058 11519046
7686 11519046 12322071 13201468 14147765 15158320 16201982 17196588 18017003 18528690 18628412
7677 18628412 18276215 17511698 16451303 15263253 14122603 13162359 12444665 11965464 11682824
7668 11682824 11544130 11494314 11467806 11380854 11137333 10646632 9841616 8686684 7176334 5332273
7658 5332273 3204589 873877 -1553676 -3962209 -6248503 -8341085 -10207776 -11849491
7650a1849491j435547j250856j082247r23290p66968o00982m06539j66771J19961
7641a8362730M34109P43375J019187J247175J423898J545234J598251J563416
7633h788085J424492J179149Q44990M59363P3490k57284m84459n75472n18634
7624f642450l23935k1829L38629O94972R84401J163209J222003J185878J099585
7615b99537J007608R38002Q92604Q46067P58150N97704L64301R1200j72400l85548
7605D638151n29643o07046o30173o10615n54976m68476l62165k57348j82967j65585
7595B69157k16091l21162m47457n57985o28337o48995o13685n07969l10532n339
7585c988395M06197Q99825J428718J927555K322238K546997K565193K384008K053782
$$ plain form
7650 -11849491 -13285038 -14535894 -15618141 -16541431 -17308399 -17909381 -18315920 -18482691 -18362730
7641 -18362730 -17928621 -17185246 -16166059 -14918884 -13494986 -11949752 -10351501 -8788085
7633 -8788085 -7363593 -6184444 -5339454 -4880091 -4806601 -5063885 -5548344 -6123816 -6642450
7624 -6642450 -6966385 -6988214 -6649585 -5954613 -4970212 -3807003 -2585000 -1399122 -299537
7615 -299537 708071 1646073 2538677 3384744 4142894 4740598 5104899 5196099 5023699 4638151
7605 4638151 4108508 3501462 2871289 2260674 1705698 1237222 875057 617709 434742 269157
7595 269157 53066 -268096 -715553 -1273538 -1901875 -2550870 -3164555 -3672524 -3983056 -3988395
7585 -3988395 -3582198 -2682373 -1253655 673900 2996138 5543135 8108328 10492336 12546118
7576A2546118J650650J251687R15822O76855N44597N06936N31392N69694N67688
7567A9761439M78510K75219m0761m38848q67526j268308j589279j793986j865331
7558A2651129j804953j628266j357486j017463o36781k50790R9015L71121N33149
7549F958675N70708M93082L32048J31624o7683k41051l81161m91552n78760o47795
7539F078135p00029p32171p38084p14777o68623o15351n72294n48929n42997n43352
7529b98472n35276n04615m40956l41258k12692p1126O6074J89213L00867M12062
7519a436179N32541O61356P82534Q67104Q81432Q01115O25579L84157J27842q8149
7509D139332k18492k32237j12588J40521N05707R39813J384538J776592K058225
$$ plain form
7576 12546118 14196768 15448455 16364277 17041132 17585729 18092665 18624057 19193751 19761439
7567 19761439 20239949 20515168 20474407 20035559 19168033 17899725 16310446 14516460 12651129
7558 12651129 10846176 9217910 7860424 6842961 6206180 5955390 6054405 6425526 6958675
7549 6958675 7529383 8022465 8354513 8486137 8418454 8177403 7796242 7304690 6725930 6078135
7539 6078135 5378106 4645935 3907851 3193074 2524451 1909100 1336806 787877 244880 -298472
7529 -298472 -833748 -1338363 -1779319 -2120577 -2333269 -2404395 -2338321 -2149108 -1848241 -1436179
7519 -1436179 -903638 -242282 540252 1407356 2288788 3089903 3715482 4099639 4227481 4139332
7509 4139332 3920840 3688603 3576015 3716536 4222243 5162056 6546594 8323186 10381411
7500A0381411K188362K152331J963570J653429J254928P91504K76488k79013q54735
7491A9528275j411358j889081k221253k359687k295411k058839j699989j266261
7483D326396p94678l19636J16855M65673O84241P55014O96700N59765M06230K83033
7473G179593K03874J51359R8995L7778j3015k0105L4790J33682K24807K46784
7463H278542J57349n0394l49406o90622j015272j263801j384331j343660j138624
7454A199781q01951l97886o506K99805M79371N33181M99651M35971L96256M15044
7444C052717M99196O27930P59638Q42984Q30117O91565M30426Q7481k71613n82613
7434F967828q04293r21257r33551q49851o90401m89758k89377j23828j2056M1620
$$ plain form
7500 10381411 12569773 14722104 16685674 18339103 19594031 20385535 20662023 20383010 19528275
7491 19528275 18116917 16227836 14006583 11646896 9351485 7292646 5592657 4326396
7483 4326396 3531718 3212082 3328937 3794610 4478851 5233865 5930565 6490330 6896560 7179593
7473 7179593 7383467 7534826 7633821 7671599 7658584 7638479 7673269 7806951 8031758 8278542
7463 8278542 8435891 8385497 8036091 7345469 6330197 5066396 3682065 2338405 1199781
7454 1199781 397830 -56 -6562 293243 772614 1305795 1805446 2241417 2637673 3052717
7444 3052717 3551913 4179843 4939481 5782465 6612582 7304147 7734573 7822054 7550441 6967828
7434 6967828 6163535 5242278 4308727 3458876 2768475 2278717 1989340 1865512 1853456 1895076
7424A895076M2228R01o5994j38725j98270k30272k26209j82645j01445Q811J34053
7413I37509K60637L80251M85717N59460N68880M80509K86335K0718k48237m48358
7403C283421n34191n01154l79267k14367m7631R9082K27627L55597M99269O58168
7393C446554Q12558R34191R98054R84452Q75593O59415L42948l8106m26233p61982
7383G827444j002596j130825j155250j104592j015599r17528q22134p25188o15191
7374f61459m81041l17027j28132O6110K35887L54354M10023M08420L65009K99740
7364E51884K37570K08018K36126L28503M67055O17948P49994Q48870R18672R72962
7354F137602J023366J072041J109570J116648J068060R39033P15442M06561N3123
$$ plain form
7424 1895076 1937304 1938205 1872211 1733486 1535216 1304944 1078735 896090 794645 803456 937509
7413 937509 1198146 1578397 2064114 2623574 3192454 3672963 3959298 3980016 3731779 3283421
7403 3283421 2749230 2248076 1868809 1654442 1606811 1705893 1933520 2289117 2788386 3446554
7393 3446554 4259112 5193303 6191357 7175809 8051402 8710817 9053765 9015659 8589426 7827444
7383 7827444 6824848 5694023 4538773 3434181 2418582 1501054 678920 -46268 -661459
7374 -661459 -1142500 -1459527 -1587659 -1521549 -1285662 -931308 -521285 -112865 252144 551884
7364 551884 789454 997472 1233598 1562101 2029156 2647104 3397098 4245968 5164640 6137602
7354 6137602 7160968 8233009 9342579 10459227 11527287 12466320 13181762 13588323 13641446
7345A3641446k79541n25993o51063o66207o20184n70581n55135n78592o17724
7336H576426o36590o03015n01224l37418j34496Q3583L07824N46461Q09890J090969
7326I202410J357177J558940J645810J582081J359028J001865N67002J27982k44902
7317A8157393n03685o34500o57434o12623n39281m61818l91693l38426l15714
7308A3702219l36691m04286n05466o13673o98848p40025p31983o80356n90003
7299H400888m58407k80165n7581J91326M31532O17337P06451O78161N44933L46787
7289A1121262J28836q4267k99727n45929q46990j199858j569551j904303k158317
7280B641156k306259k343167k276279k120176j900215j657654j444625j305311
$$ plain form
7345 13641446 13361905 12835912 12184849 11518642 10898458 10327877 9772742 9194150 8576426
7336 8576426 7939836 7336821 6835597 6498179 6363683 6447266 6755090 7301551 8111441 9202410
7326 9202410 10559587 12118527 13764337 15346418 16705446 17707311 18274313 18402295 18157393
7317 18157393 17653708 17019208 16361774 15749151 15209870 14748052 14356359 14017933 13702219
7308 13702219 13365528 12961242 12455776 11842103 11143255 10403230 9671247 8990891 8400888
7299 8400888 7942481 7662316 7604735 7796061 8227593 8844930 9551381 10229542 10774475 11121262
7289 11121262 11250098 11165831 10866104 10320175 9473185 8273327 6703776 4799473 2641156
7280 2641156 334897 -2008270 -4284549 -6404725 -8304940 -9962594 -11407219 -12712530
7272a2712530j254320j269151j302419j303329j233399j071224q11206m62323
7264b1419901m8506L91582Q08884J155189J398894J535962J586763J580058J536647
7255a1474428J464720J367126J250943J130352J021892R37408Q80724Q50373Q45416
7246a725474Q67557R15084R72716J008193R83204Q73333O83517M49207K24336
7237E251673O2854J91M0637J57265L05576M41140N28348N38779M50596K57851
7227H034910j6650l19451n81504p41930p67271o58764m47777j83437Q2619L09031
7217D709776M70785N57971N71682N23603M40282L64606L45171M14773N71883P79798
7207I750330R85247J143982J237478J272773J269570J245887J211013J164522
$$ plain form
7272 -12712530 -13966850 -15236001 -16538420 -17841749 -19075148 -20146372 -20957578 -21419901
7264 -21419901 -21468407 -21076825 -20267941 -19112752 -17713858 -16177896 -14591133 -13011075 -11474428
7255 -11474428 -10009708 -8642582 -7391639 -6261287 -5239395 -4301987 -3421263 -2570890 -1725474
7246 -1725474 -857917 57167 1029883 2038076 3021280 3894613 4578130 5027337 5251673
7237 5251673 5314527 5314718 5355355 5512620 5818196 6259336 6787684 7326463 7777059 8034910
7227 8034910 8018260 7698809 7117305 6375375 5608104 4949340 4501563 4318126 4400745 4709776
7217 4709776 5180561 5738532 6310214 6833817 7274099 7638705 7983876 8398649 8970532 9750330
7207 9750330 10735577 11879559 13117037 14389810 15659380 16905267 18116280 19280802
$$ [...]
##END NTUPLES=NMR SPECTRUM
##END=
