##TITLE=31Pdec_DE-55rm3h
 
 64 sc
 2.5.2024
##JCAMPDX= 6.0         $$ Bruker NMR JCAMP-DX V2.0
##DATA TYPE= NMR SPECTRUM
##DATA CLASS= NTUPLES
##ORIGIN= UXNMR, Bruker Analytische Messtechnik GmbH
##OWNER= root
$$ XWIN-NMR		Version 3.5
$$ Thu May  2 16:06:48 2024 Russian Standard Time (UT+4h)  she@DPX200
##.OBSERVE FREQUENCY= 81.013821
##.OBSERVE NUCLEUS= ^31P
##.ACQUISITION MODE= SIMULTANEOUS
##.ACQUISITION SCHEME= undefined
##.AVERAGES= 64
##.DIGITISER RES= 16
##SPECTROMETER/DATA SYSTEM= spect
##.PULSE SEQUENCE= zgpg30
##.SOLVENT NAME= CDCl3
##.SHIFT REFERENCE= (INTERNAL, CDCl3, 0, 248.564)
##AUDIT TRAIL= $$ (NUMBER, WHEN, WHO, WHERE, WHAT)
$$ ##TITLE= Audit trail, XWIN-NMR		Version 3.5
$$ ##JCAMPDX= 5.01
$$ ##ORIGIN= Bruker BioSpin GmbH
$$ ##OWNER= she
$$ F:/spectra/data/she/nmr/P31/1/pdata/1/auditp.txt
$$ ##AUDIT TRAIL=  $$ (NUMBER, WHEN, WHO, WHERE, WHAT)
(   1,<2024-05-02 16:05:58.03 +0400>,<she>,<DPX200>,
      <continue with go, POWCHK disabled, PULCHK disabled
       configuration hash MD5:
       00 E9 B6 7A A2 85 ED C7 34 08 36 98 17 FE 4E 26
       data hash MD5: 32K
       3C E9 C4 35 B1 E4 77 D1 65 F6 2C C0 C6 F3 A7 85>)
(   2,<2024-05-02 16:06:00.59 +0400>,<she>,<DPX200>,
      <Start of raw data processing
       efp BC_mod = 2 LB = 10 FT_mod = 6 PKNL = 1 PHC0 = -13237.64 PHC1 = 82.08328 SI = 64K 
       data hash MD5: 64K
       06 1A 2D A7 99 C9 1D DC 1C BF 2D B0 7D FC 65 3F>)
(   3,<2024-05-02 16:06:15.59 +0400>,<she>,<DPX200>,
      <pk PHC0 = -11.09969 PHC1 = 0 
       data hash MD5: 64K
       24 87 07 2A 82 5A 49 74 D7 19 52 16 A7 0B EB 80>)
$$ ##END=
$$ 
$$ hash MD5
$$ 03 25 BB B3 C0 8D C0 EF BB 0F 92 08 0A 4B 7B 2D
##$RELAX= 
##$RELAX= 
##$RELAX= 
##$RELAX= 
##$RELAX= 
##$RELAX= 
##$RELAX= 
##$RELAX= 
##$RELAX= 
$$ Bruker specific parameters
$$ --------------------------
##$DU= <F:/spectra>
##$EXPNO= 1
##$NAME= <P31>
##$PROCNO= 1
##$TYPE= <nmr>
##$USER= <she>
##$AMP= (0..31)
100 100 100 100 100 100 100 100 100 100 100 100 100 100 100 100 100 100 
100 100 100 100 100 100 100 100 100 100 100 100 100 100 
##$AQSEQ= 0
##$AQ_mod= 1
##$AUNM= <au_zg>
##$AUTOPOS= <>
##$BF1= 81.014009
##$BF2= 200.13
##$BF3= 200.13
##$BF4= 200.13
##$BF5= 200.13
##$BF6= 200.13
##$BF7= 200.13
##$BF8= 200.13
##$BYTORDA= 1
##$CFDGTYP= 0
##$CFRGTYP= 5
##$CHEMSTR= <none>
##$CNST= (0..31)
1 1 145 1 1 1 1 1 1 1 1 1 1 1 1 1 1 1 1 1 1 1 1 1 1 1 1 1 1 1 1 1 
##$CPDPRG= <waltz16>
##$CPDPRG1= <>
##$CPDPRG2= <waltz16>
##$CPDPRG3= <>
##$CPDPRG4= <mlev>
##$CPDPRG5= <mlev>
##$CPDPRG6= <mlev>
##$CPDPRG7= <mlev>
##$CPDPRG8= <mlev>
##$CPDPRGB= <>
##$CPDPRGT= <>
##$D= (0..31)
0 1 0 0 0 0 0 0 0 0 0 0.03 2e-05 3e-06 0 0 0 0 0 0 0 0 0 0 0 0 0 0 0 0 
0 0 
##$DATE= 1714651480
##$DBL= (0..7)
120 120 120 11 120 120 24 19 
##$DBP= (0..7)
150 150 150 150 150 150 150 150 
##$DBP07= 0
##$DBPNAM0= <>
##$DBPNAM1= <>
##$DBPNAM2= <>
##$DBPNAM3= <>
##$DBPNAM4= <>
##$DBPNAM5= <>
##$DBPNAM6= <>
##$DBPNAM7= <>
##$DBPOAL= (0..7)
0.5 0.5 0.5 0.5 0.5 0.5 0.5 0.5 
##$DBPOFFS= (0..7)
$$ [...]
##$SUBNAM2= <"">
##$SUBNAM3= <"">
##$SUBNAM4= <"">
##$SUBNAM5= <"">
##$SUBNAM6= <"">
##$SUBNAM7= <"">
##$SUBNAM8= <"">
##$SUBNAM9= <"">
##$SW= 501.771253377433
##$SWIBOX= (0..15)
0 1 3 0 0 0 0 0 0 0 0 0 0 0 0 0 
##$SW_h= 40650.406504065
##$TD= 32768
##$TD0= 1
##$TE= 0
##$TE2= 300
##$TE3= 300
##$TEG= 300
##$TL= (0..7)
0 120 53 12 22 120 120 120 
##$TP= (0..7)
150 150 150 150 150 150 150 150 
##$TP07= 0
##$TPNAME0= <>
##$TPNAME1= <>
##$TPNAME2= <>
##$TPNAME3= <>
##$TPNAME4= <>
##$TPNAME5= <>
##$TPNAME6= <>
##$TPNAME7= <>
##$TPOAL= (0..7)
0.5 0.5 0.5 0.5 0.5 0.5 0.5 0.5 
##$TPOFFS= (0..7)
0 0 0 0 0 0 0 0 
##$TUNHIN= 0
##$TUNHOUT= 0
##$TUNXOUT= 0
##$USERA1= <user>
##$USERA2= <user>
##$USERA3= <user>
##$USERA4= <user>
##$USERA5= <user>
##$V9= 5
##$VALIST= <valist>
##$VCLIST= <CCCCCCCCCCCCCCC>
##$VD= 0
##$VDLIST= <DDDDDDDDDDDDDDD>
##$VPLIST= <PPPPPPPPPPPPPPP>
##$VTLIST= <TTTTTTTTTTTTTTT>
##$WBST= 1024
##$WBSW= 4
##$XGAIN= (0..3)
0 0 0 0 
##$XL= 0
##$YL= 0
##$YMAX_a= 12882
##$YMIN_a= -9184
##$ZGOPTNS= <>
##$ZL1= 120
##$ZL2= 120
##$ZL3= 120
##$ZL4= 120
##$ABSF1= 0
##$ABSF2= 0
##$ABSG= 0
##$ABSL= 0
##$ALPHA= 0
##$AQORDER= 0
##$ASSFAC= 0
##$ASSFACI= 0
##$ASSFACX= 0
##$ASSWID= 0
##$AUNMP= <proc_1d>
##$AZFE= 0.1
##$AZFW= 0.5
##$BCFW= 0
##$BC_mod= 2
##$BYTORDP= 0
##$COROFFS= 0
##$CY= -3
##$DATMOD= 1
##$DC= 0
##$DFILT= <>
##$DTYPP= 0
##$F1P= 0
##$F2P= 0
##$FCOR= 1
##$FTSIZE= 65536
##$FT_mod= 6
##$GAMMA= 0
##$GB= 0
##$INTBC= 1
##$INTSCL= 6.047779e-11
##$ISEN= 30
##$LB= 10
##$LEV0= 0
##$LPBIN= 0
##$MAXI= 10000
##$MC2= 0
##$MEAN= 0
##$ME_mod= 0
##$MI= 50
##$NCOEF= 0
##$NC_proc= -10
##$NLEV= 6
##$NOISF1= 182.463
##$NOISF2= 159.3651
##$NSP= 0
##$NTH_PI= 0
##$NZP= 0
##$OFFSET= 248.5645
##$PC= 4
##$PHC0= -13248.74
##$PHC1= 82.08328
##$PH_mod= 1
##$PKNL= yes
##$PPARMOD= 0
##$PSCAL= 0
##$PSIGN= 0
##$REVERSE= no
##$SF= 81.0140089999694
##$SI= 65536
##$SIGF1= 159.3651
##$SIGF2= -187.1042
##$SINO= 113.3802
##$SIOLD= 16384
##$SREGLST= <1H.CDCl3>
##$SSB= 0
##$STSI= 65536
##$STSR= 0
##$SW_p= 40650.406504065
##$SYMM= 0
##$S_DEV= 0
##$TDeff= 32768
##$TDoff= 0
##$TI= <>
##$TILT= no
##$TM1= 0
##$TM2= 0
##$TOPLEV= 0
##$USERP1= <user>
##$USERP2= <user>
##$USERP3= <user>
##$USERP4= <user>
##$USERP5= <user>
##$WDW= 1
##$XDIM= 65536
##$YMAX_p= 504033775
##$YMIN_p= -56036560
$$ End of Bruker specific parameters
$$ ---------------------------------
##NTUPLES= NMR SPECTRUM
##VAR_NAME=  FREQUENCY,     SPECTRUM/REAL,   SPECTRUM/IMAG
##SYMBOL=    X,             R,               I
##VAR_TYPE=  INDEPENDENT,   DEPENDENT,       DEPENDENT
##VAR_FORM=  AFFN,          ASDF,            ASDF
##VAR_DIM=   65536,         65536,           65536
##UNITS=     HZ,            ARBITRARY UNITS, ARBITRARY UNITS
##FACTOR=    0.620285442955139, 1,           1
##FIRST=     20137.2065510682, 0,            0
##LAST=      -20513.1999529968, 0,           0
##MIN=       -20513.1999529968, -56036560,   0
##MAX=       20137.2065510682, 504033775,    0
$$ Real data points
##PAGE= N=1
##DATA TABLE= (X++(R..R)), XYDATA
$$ [...]
42976b3025179j608523j276545q67345m04772P6383N35131R35055J252790J479141
42967b2903864J614157J661452J626429J519182J358133J169341R79750Q08150
42959a2167270O59538N25722L90810K38699O0204j42184l53451n48866o99055
42950a2035853p76755p65139o64732m93451k78438m5606J85634M01512N91482
42941a3881346P47521Q64818R43072R88034J011315J026327J042359J062297J086201
42932e109402J116925J162313J231332J324796J425332J495581J491810J387927
42924E526614J192827R47492P04603N05526L67637K85771K44360K31579K45230
42915A0251639K86509L49527M18149M72355M96566M84410M41182L84625L39419
$$ plain form
42976 -23025179 -24633702 -25910247 -26777592 -27182364 -27105981 -26570850 -25635795 -24383005 -22903864
42967 -22903864 -21289707 -19628255 -18001826 -16482644 -15124511 -13955170 -12975420 -12167270
42959 -12167270 -11507732 -10982010 -10591200 -10352501 -10292297 -10434481 -10787932 -11336798 -12035853
42950 -12035853 -12812608 -13577747 -14242479 -14735930 -15014368 -15059974 -14874340 -14472828 -13881346
42941 -13881346 -13133825 -12269007 -11325935 -10337901 -9326586 -8300259 -7257900 -6195603 -5109402
42932 -5109402 -3992477 -2830164 -1598832 -274036 1151296 2646877 4138687 5526614
42924 5526614 6719441 7666933 8371536 8877062 9244699 9530470 9774830 10006409 10251639
42915 10251639 10538148 10887675 11305824 11778179 12274745 12759155 13200337 13584962 13924381
42906A3924381L24155L39846L70870L97504M08214M02296L83552L51246K94439
42897A7196503J94964M0878j56864l59305n13938n79213n40541m09076k10311
42888A4663097K6373K73391N07771P12200Q74502R87079J046927J053507J003743
42879B1148590Q89741P04968M54643J58933j55032m63915p52038j008676j224839
42870A9752375j391601j497862j528529j467414j305730j050480p25687l64625
42862A0420447K449L56905O90457R95199J254084J441050J531149J512646J392471
42853A9596857J191925R35418O39179L08599n2573m28963p89818j099928j336205
42844A8964491j496302j594807j652524j686304j703008j698814j663819j589311
$$ plain form
42906 13924381 14248536 14588382 14959252 15356756 15764970 16167266 16550818 16902064 17196503
42897 17196503 17391467 17432345 17275481 16916176 16402238 15823025 15282484 14873408 14663097
42888 14663097 14689470 14962861 15470632 16182832 17057334 18044413 19091340 20144847 21148590
42879 21148590 22038331 22743299 23197942 23356875 23201843 22737928 21985890 20977214 19752375
42870 19752375 18360774 16862912 15334383 13866969 12561239 11510759 10785072 10420447
42862 10420447 10422896 10779801 11470258 12465457 13719541 15160591 16691740 18204386 19596857
42853 19596857 20788782 21724200 22363379 22671978 22619405 22190442 21400624 20300696 18964491
42844 18964491 17468189 15873382 14220858 12534554 10831546 9132732 7468913 5879602
42836E879602j472602j315800j119744q78603n80413k14920K15387O87574J158239
42827B358720J570501J864633J989622J913999J633381J171828N76959q7438p46935
42818A2245270j320209j725511j894610j792822j436006q92641k66104L35963
42810C253330Q31092J179218J384894J486859J538468J584208J641219J694753
42802A4594041J709198J647362J488332J238653R35225O37608M07720K81981K50734
42793B3190854K60505K41556J44907l4758k63777m94911o92829q43110r45115
42784B0563322j002092j018539j002062r60843q95931p97834o55249m71271k73716
42775A3485785j10287l0693o5895k14999m45542p05641r40377j104521j169528
$$ plain form
42836 5879602 4407000 3091200 1971456 1092853 512440 297520 512907 1200481 2358720
42827 2358720 3929221 5793854 7783476 9697475 11330856 12502684 13079643 12992205 12245270
42818 12245270 10925061 9199550 7304940 5512118 4076112 3183471 2917367 3253330
42810 3253330 4084422 5263640 6648534 8135393 9673861 11258069 12899288 14594041
42802 14594041 16303239 17950601 19438933 20677586 21612811 22250419 22658139 22940120 23190854
42793 23190854 23451359 23692915 23837822 23803064 23539287 23044376 22351547 21508437 20563322
42784 20563322 19561230 18542691 17540629 16579786 15683855 14886021 14230772 13759501 13485785
42775 13485785 13375498 13344805 13278910 13063911 12618369 11912728 10972351 9867830 8698302
42766H698302j127864r95058q04279n90490l72204j45019J07196L92570O97423
42757E860577R85715J209962J328631J323989J211776J034749Q41888O66767N19395
42748A4983449L93800K81626J81159R9003M7474M0464Q8308J92673L43893N22129
42738A7173978P00946Q51255R45933R66621R11436P98637O62305N41234M66394
42729B4018739M51435M88863N53947O16865O57548O72936O70893O56806O25590
42720B9413622N65355M67252L31504J65644k1062k21022m27280o29801q12565
42711B8831647r54066j032660j035719r68211q54135p27520o18093n42098n03927
42702B1595218n03576n40726o13063p13992q33425r59186j075656j161431j190012
$$ plain form
42766 8698302 7570438 6575380 5771101 5180611 4808407 4663388 4770584 5163154 5860577
42757 5860577 6846292 8056254 9384885 10708874 11920650 12955399 13797287 14464054 14983449
42748 14983449 15377249 15658875 15840034 15939037 15986511 16026975 16115283 16307956 16651849 17173978
42738 17173978 17874924 18726179 19672112 20638733 21550169 22348806 23011111 23552345 24018739
42729 24018739 24470174 24959037 25512984 26129849 26787397 27460333 28131226 28788032 29413622
42720 29413622 29978977 30446229 30777733 30943377 30922315 30701293 30274013 29644212 28831647
42711 28831647 27877581 26844921 25809202 24840991 23986856 23259336 22641243 22099145 21595218
42702 21595218 21091642 20550916 19937853 19223861 18390436 17431250 16355594 15194163 14004151
42693A4004151j134661r75894p10270l57935L6296M11840P07457Q75082Q89668
42684A3745734P56944N16882K35217j8794j96463k79871k74766j96655o1533J16282
42674A4342977L23001N43773P61384R56005J107346J199618J228053J203667J151639
42665B2817463J101642J075209J079211J109259J157151J213472J263515J283222
42657C2100144J242600J117259R00353O04969K54368j29908n28220r10789j230256
42648C3420520j433680j486696j387510j161090q46805m94922j67756P0278J75986
42639B6688325J46831J9340j51684l16990m46166n28936n70246n83293n80458
42630B3676723n63089n17100m22686k75303j00853N0874J30763J12607j984j92660
$$ plain form
42693 14004151 12869490 11893596 11183326 10825391 10861687 11273527 11980984 12856066 13745734
42684 13745734 14502678 15019560 15254777 15235983 15039520 14759649 14484883 14288228 14226695 14342977
42674 14342977 14665978 15209751 15971135 16927140 18034486 19234104 20462157 21665824 22817463
42665 22817463 23919105 24994314 26073525 27182784 28339935 29553407 30816922 32100144
42657 32100144 33342744 34460003 35360356 35965325 36219693 36089785 35561565 34650776 33420520
42648 33420520 31986840 30500144 29112634 27951544 27104739 26609817 26442061 26512339 26688325
42639 26688325 26835156 26854496 26702812 26385822 25939656 25410720 24840474 24257181 23676723
42630 23676723 23113634 22596534 22173848 21898545 21797692 21848566 21979329 22091936 22089952 21897292
42620B1897292m31883o93695r60184j223397j479778j721325j931930k090731
42612A1364369k175932k165303k038029j782734j408366r49976m65293k2816L16148
42603F72068N16262N78218N32814M22839K86157J50083L5716l5867m1519M1418
42593C158189K29144N23355R03351J322636J714611K008563K151170K123861J947287
42584A6082167J671061J354642J048952P86299N81560M41062L70737L75660M51177
42575B3163317N74449P05534P98886Q18184P46979N91995L79265J44544p9129
42566B7844024k71782m29665n59307o65918p44090p78672p56793o82073n78692
42557B2377032m80818m15655l92597m03602m29453m44772m21253l34146j74301
$$ plain form
42620 21897292 21465409 20771714 19811530 18588133 17108355 15387030 13455100 11364369
42612 11364369 9188437 7023134 4985105 3202371 1794005 844029 378736 355920 672068
42603 672068 1188330 1766548 2299362 2722201 3008358 3158441 3194157 3158290 3116771 3158189
42593 3158189 3387333 3910688 4814039 6136675 7851286 9859849 12011019 14134880 16082167
42584 16082167 17753228 19107870 20156822 20943121 21524681 21965743 22336480 22712140 23163317
42575 23163317 23737766 24443300 25242186 26060370 26807349 27399344 27778609 27923153 27844024
42566 27844024 27572242 27142577 26583270 25917352 25173262 24394590 23637797 22955724 22377032
42557 22377032 21896214 21480559 21087962 20684360 20254907 19810135 19388882 19054736 18880435
42548A8880435M0089K62304M31937N00096M51005L07076J14694p9764k48773l87636
42538B0271463n05217o11237p08949p94790q61025q97928q95550q46666p50214
42529A3399887o12377m43214k50821l7828J97143M55480P35669J031056J325385
42520A5800380J588496J780338J866378J833991J695613J477399J206213R04809
42512B8153617N91312K75272m7149l89393p61122j155705j547892j899885k168969
42503B1050086k315244k312161k158035j880157j525918j145582p78072m46818
42495H488099j62833P2354K66800M37270O02674P73071R41076J081814J162219
42486A3662544J155273J052578Q69399O39472M01940J87378J1145j21976k05860
$$ plain form
42548 18880435 18920524 19182828 19614765 20114861 20565866 20872942 20987636 20907872 20659099 20271463
42538 20271463 19766246 19155009 18446060 17651270 16790245 15892317 14996767 14150101 13399887
42529 13399887 12787510 12344296 12093475 12055647 12252790 12708270 13443939 14474995 15800380
42520 15800380 17388876 19169214 21035592 22869583 24565196 26042595 27248808 28153617
42512 28153617 28744929 29020201 28973052 28583659 27822537 26666832 25118940 23219055 21050086
42503 21050086 18734842 16422681 14264646 12384489 10858571 9712989 8934917 8488099
42495 8488099 8325266 8397620 8664420 9101690 9704364 10477435 11418511 12500325 13662544
42486 13662544 14817817 15870395 16739794 17379266 17781206 17968584 17979729 17857753 17651893
42477A7651893k24367j55623J0825K55939N27528P57422Q90955R11209Q43746
42468B1469527P40283O52473O10539O15224O42672O57524O29607N48712M30255
42459B6996816L07216K11738J57293J32424J10145O7693M143n7131q4671o3184
42449B7782482p852M1436M0907l5208j82372l64933n23831n90877n09472k58165
42439B5392115J34073N93919J032515J380518J607281J715795J724263J650594
42431C5231073J507158J302946J047528P52995M33297J04484k09840m70626o24597
42422C9074418o22496m45942j23181K77999O74069R91429J184305J242810J190579
42413D3443990J070921R24804P70933N99877L86435J11779k19512n76781r11603
$$ plain form
42477 17651893 17427526 17271903 17282728 17538667 18066195 18823617 19714572 20625781 21469527
42468 21469527 22209810 22862283 23472822 24088046 24730718 25388242 26017849 26566561 26996816
42459 26996816 27304032 27515770 27673063 27805487 27915632 27983325 27987468 27930337 27845666 27782482
42449 27782482 27774630 27816066 27856973 27821765 27639393 27274460 26750629 26159752 25650280 25392115
42439 25392115 25526188 26120107 27152622 28533140 30140421 31856216 33580479 35231073
42431 35231073 36738231 38041177 39088705 39841700 40274997 40379481 40169641 39699015 39074418
42422 39074418 38451922 38005980 37882799 38160798 38834867 39826296 41010601 42253411 43443990
42413 43443990 44514911 45439715 46210648 46810525 47196960 47308739 47089227 46512446 45600843
42404D5600843j167879j290919j240951j012847o50924k42763J10971L34402M00115
42395D0840048L29103J73985k450j46464k28390k50143k40907k41539k86167l91070
42385C9556006n54259p61237r90457j215988j409199j542305j593952j553774
42377B9934835j422534j208512r25241n94449k51029N8087K85123L97193L86614
42368B6660087K71512R0235j06144k64522l45821l40460k70597j74088q2092q665
42358B5429445M2972P0663P3574N9941M9010O1119J03803J66197K26384K66907
42348B6550015K88373L11831L67062M73912O28841Q03835R56112J043252J039085
42339C2462318R44557P86883O06975M45069L35314L07992L88328N85739Q80701
$$ plain form
42404 45600843 44432964 43142045 41901094 40888247 40237323 39994560 40105531 40439933 40840048
42395 40840048 41169151 41343136 41340686 41194222 40965832 40715689 40474782 40233243 39947076 39556006
42385 39556006 39001747 38240510 37250053 36034065 34624866 33082561 31488609 29934835
42377 29934835 28512301 27303789 26378548 25784099 25533070 25591157 25876280 26273473 26660087
42368 26660087 26931599 27021834 26915690 26651168 26305347 25964887 25694290 25520202 25438110 25429445
42358 25429445 25472417 25543080 25616654 25676595 25725605 25786724 25890527 26056724 26283108 26550015
42348 26550015 26838388 27150219 27517281 27991193 28620034 29423869 30379981 31423233 32462318
42339 32462318 33406875 34193758 34800733 35245802 35581116 35889108 36277436 36863175 37743876
42330C7743876J221567J536434J754826J829722J751914J551949J288585J027101
42322D9705974Q15442O68900N71635M94325M15627L32182K52893J88023J45608
42313E3590609J34370J61610K21680K86834L15277K74832J63285Q627j49527k82014
42303E4725583l81719m60900n38406o25075p16691p99486q62613r05055r30908
42294D8504730r40447r28107q87776q16479p12827n77449m20747k69582j59330
42285D2791986j12396j21781j56602j85921k00940k19224k70731l77581n40514
42276D0606296p38485r39095j110967j229895j278792j248740j145354r94547
42268C1920421q37990p16851o53489o42661o56184o56208o08867m92341k98465
$$ plain form
42330 37743876 38965443 40501877 42256703 44086425 45838339 47390288 48678873 49705974
42322 49705974 50521416 51190316 51761951 52256276 52671903 53004085 53256978 53445001 53590609
42313 53590609 53724979 53886589 54108269 54395103 54710380 54985212 55148497 55157124 55007597 54725583
42303 54725583 54343864 53882964 53344558 52719483 52002792 51203306 50340693 49435638 48504730
42294 48504730 47564283 46636176 45748400 44931921 44219094 43641645 43220898 42951316 42791986
42285 42791986 42679590 42557809 42401207 42215286 42014346 41795122 41524391 41146810 40606296
42276 40606296 39867811 38928716 37817749 36587854 35309062 34060322 32914968 31920421
42268 31920421 31082431 30365580 29712091 29069430 28413246 27757038 27148171 26655830 26357365
42259B6357365l1344K93129O46821R90771J280195J471691J531127J442242J215262
42250C5197259Q91316N36530K23579O226j00983j25367j17168j18927j42168j66039
42240C6084258j56831r2812K3096J69001L19644M57426N71423O49887O77803O43888
42230C9346783N49842M11745K51802Q7805p1995k27153l80322n33400o85315q30054
42220C7919738r54196j036359j052864r90687q61310p04608n76304n23740n63528
42211C0656142o73840q04557q97839r07107q06982n94842k89620O9230M25828
42202B6176413P20392R08977R79661R53294Q68030P60585O57859N80076N45422
42193C3150709N69298O61136Q23967J054883J340377J646511J912880K060588
$$ plain form
42259 26357365 26326021 26619150 27265971 28256742 29536937 31008628 32539755 33981997 35197259
42250 35197259 36088575 36625105 36848684 36854910 36753927 36628560 36511392 36392465 36250297 36084258
42240 36084258 35927427 35834615 35857711 36026712 36346356 36803782 37375205 38025092 38702895 39346783
42230 39346783 39896625 40308370 40560172 40647977 40575982 40348829 39968507 39435107 38749792 37919738
42220 37919738 36965542 35929183 34876319 33885632 33024322 32319714 31743410 31219670 30656142
42211 30656142 29982302 29177745 28279906 27372799 26565817 25970975 25681355 25750585 26176413
42202 26176413 26896805 27805782 28785443 29738737 30606767 31367352 32025211 32605287 33150709
42193 33150709 33720007 34381143 35205110 36259993 37600370 39246881 41159761 43220349
42185D3220349K016821J747502J281702P12114J67505k30944m08833l57391j27889
42176D8020936J92452N11515P57369Q89061Q94378P82309N75975L05736J135l15862
42166E2615004o32111r38238j221063j458845j622901j685481j630020j459081
42158D1967264j197410q89477n89765l45047j74711o1668L7290J66834L49761
42149C9263071N77770Q17805J026983J168280J221766J188449J085715R36831
42141D7286670P60333N65629L57104J43510n3789j99822k55172j93046j5776K39960
42131D8635601N13484P39355Q64614Q58764P17839M63147J32786k31881n95976
42122E2097733r30568j205741j387681j445506j364258j155282q56608n22290
$$ plain form
42185 43220349 45237170 46984672 48266374 48978488 49145993 48915049 48506216 48148825 48020936
42176 48020936 48213388 48724903 49482272 50371333 51265711 52048020 52623995 52929731 52930866 52615004
42166 52615004 51982893 51044655 49823592 48364747 46741846 45056365 43426345 41967264
42158 41967264 40769854 39880377 39290612 38945565 38770854 38709186 38746476 38913310 39263071
42149 39263071 39840841 40658646 41685629 42853909 44075675 45264124 46349839 47286670
42141 47286670 48047003 48612632 48969736 49113246 49059457 48859635 48604463 48411417 48395641 48635601
42131 48635601 49149085 49888440 50753054 51611818 52329657 52792804 52925590 52693709 52097733
42122 52097733 51167165 49961424 48573743 47128237 45763979 44608697 43752089 43229799
42114D3229799k06723M8008K19197L07671L38184L49781L75455M24343M82371
42105D5568086N31119N67281O05810O65228P47158Q25521Q55153P97339O46172
42096E1808867M36967K31325Q9869M7437R8939J99885K84226K94385K06497L4159
42086E3732556j89092m31692o73772r02582j103871j259833j355213j384045j349182
42077D5083274j255739j106983r07700o70111m14702j65262N6852K36219L64662
42068D1220510M39505M58192M13969K99012J14102j23953l83101o23048q04496
42059D1010692r00054r04811q39318p39991o42772n71498n35712n33187n52241
42050C4791108n74347n78918n48888m74295l53554j93363p363J86595L69595N24405
$$ plain form
42114 43229799 43023076 43071084 43290281 43597952 43936136 44285917 44661372 45085715 45568086
42105 45568086 46099205 46666486 47272296 47937524 48684682 49510203 50365356 51162695 51808867
42096 51808867 52245834 52477159 52567028 52614465 52713404 52913289 53197515 53491900 53698397 53732556
42086 53732556 53543464 53111772 52438000 51535418 50431547 49171714 47816501 46432456 45083274
42077 45083274 43827535 42720552 41812852 41142741 40728039 40562777 40619629 40855848 41220510
42068 41220510 41660015 42118207 42532176 42831188 42945290 42821337 42438236 41815188 41010692
42059 41010692 40110638 39205827 38366509 37626518 36983746 36412248 35876536 35343349 34791108
42050 34791108 34216761 33637843 33088955 32614660 32261106 32067743 32060380 32246975 32616570 33140975
42040C3140975O38754P09090P41753P48663P40053P20707O92147O55568O09646
42031C9397356N45222M45313K94370R0507j49547l96227o17976p89551q94893
42022C7924574r26251q82200p66412n88107l63537j15730J29657L50725N33636
42013C5296355O72607P67865Q24766Q54115Q71336Q93503R35497J006370J106473
42004D3228887J227009J353923J474408J580403J666810J729545J769967J803371
41996E5834323J860912J977759K172376K429644K698235K905056K982096K895302
41988G5755703K662212K348856K045938J834609J756849J804204J930336K079982
41980I2218689K216200K328666K419597K479667K472320K338721K022441J500097
$$ plain form
42040 33140975 33779729 34488819 35230572 35979235 36719288 37439995 38132142 38787710 39397356
42031 39397356 39942578 40387891 40682261 40772768 40623221 40226994 39609018 38819467 37924574
42022 37924574 36998323 36116123 35349711 34761604 34398067 34282337 34411994 34762719 35296355
42013 35296355 35968962 36736827 37561593 38415708 39287044 40180547 41116044 42122414 43228887
42004 43228887 44455896 45809819 47284227 48864630 50531440 52260985 54030952 55834323
41996 55834323 57695235 59672994 61845370 64275014 66973249 69878305 72860401 75755703
41988 75755703 78417915 80766771 82812709 84647318 86404167 88208371 90138707 92218689
41980 92218689 94434889 96763555 99183152 101662819 104135139 106473860 108496301 109996398
41972A09996398P99009r306q34482j594733k232444k715805l032887l185239l184947
41963I4005564l055087k829557k547219k240604j926593j606627j275931r33822
41955G7590124n88277k54225N0570L08568N03188O18098O37347N48943L52600
41946G9766936O8645k58581n69421q10181r56795j025001j058289j101827j181193
41937G2874293j298518j442021j595711j742570j865597j952471k001126k019241
41929E8957038k017924k007821k001725k016176k063703k141381k231190k317381
41921D2159737k406071k527302k715701k984184l308187l628005l866188l951257
41913A6772842l838100l518687l022653k410571j760823j149603o28389k09681
$$ plain form
41972 109996398 110795407 110786101 109951619 108356886 106124442 103408637 100375750 97190511 94005564
41963 94005564 90950477 88120920 85573701 83333097 81406504 79799877 78523946 77590124
41955 77590124 77001847 76747622 76798192 77106760 77609948 78228046 78865393 79414336 79766936
41946 79766936 79835581 79577000 79007579 78197398 77240603 76215602 75157313 74055486 72874293
41937 72874293 71575775 70133754 68538043 66795473 64929876 62977405 60976279 58957038
41929 58957038 56939114 54931293 52929568 50913392 48849689 46708308 44477118 42159737
41921 42159737 39753666 37226364 34510663 31526479 28218292 24590287 20724099 16772842
41913 16772842 12934742 9416055 6393402 3982831 2222008 1072405 444016 234335
41905B34335J29445M27246P13118R94149J258850J491865J686115J843333J966132
41896A0744588K052561K099022K106686K082507K032628J953954J831092J641351
41888B6544389J366090J003960N80116J45264k37739n15101o60722o82220o11597
41879B6932440m86133l29526j42398R2395L90931P46490J121308J460685J720198
41870C1506390J885157J969660K001317K006398K002940J999512J995566J982249
41862D7349189J943179J855409J693914J443235J112499P42170L94710J34341
41854E6668646Q889M1336K28342N39891R19557J290969J575726J720236J718753
41845F4712345J616648J487840J398664J381267J431642J527701J649743J788970
$$ plain form
41905 234335 363780 791026 1504144 2498293 3757143 5249008 6935123 8778456 10744588
41896 10744588 12797149 14896171 17002857 19085364 21117992 23071946 24903038 26544389
41888 26544389 27910479 28914439 29494555 29639819 29402080 28886979 28226257 27544037 26932440
41879 26932440 26446307 26116781 25974383 26066778 26457709 27204199 28325507 29786192 31506390
41870 31506390 33391547 35361207 37362524 39368922 41371862 43371374 45366940 47349189
41862 47349189 49292368 51147777 52841691 54284926 55397425 56139595 56534305 56668646
41854 56668646 56677535 56718871 56947213 57487104 58406661 59697630 61273356 62993592 64712345
41845 64712345 66328993 67816833 69215497 70596764 72028406 73556107 75205850 76994820
41837G6994820J942712K103758K251773K351645K360834K243888J986904J602877
41829I3839211J124735N92488M4381m84066r58015j344867j620637j776710j822357
41820H7594163j781987j688826j577161j475396j402140j366548j370845j410849
41812G5520411j472506j528617j543504j488608j361304j192651j035555r39050
41804F4958616r24844r80049j068499j151749j207247j234737j249585j269175
41796E5872731j301948j345358j391079j430263j453809j449629j402437j298223
41788D4799985j129772q98712o14120k91375M7303L73873O61022Q92557J069888
41779D4910649J208108J323273J420271J489550J512818J471583J353841J159008
$$ plain form
41837 76994820 78937532 81041290 83293063 85644708 88005542 90249430 92236334 93839211
41829 93839211 94963946 95556434 95600815 95116749 94158734 92813867 91193230 89416520 87594163
41820 87594163 85812176 84123350 82546189 81070793 79668653 78302105 76931260 75520411
41812 75520411 74047905 72519288 70975784 69487176 68125872 66933221 65897666 64958616
41804 64958616 64033772 63053723 61985224 60833475 59626228 58391491 57141906 55872731
41796 55872731 54570783 53225425 51834346 50404083 48950274 47500645 46098208 44799985
41788 44799985 43670213 42771501 42157381 41866006 41913309 42287182 42948204 43840761 44910649
41779 44910649 46118757 47442030 48862301 50351851 51864669 53336252 54690093 55849101
41771E5849101R01669O11021L22927O7608j39653l00764m32459n61609p16444
41762E5601397r13300j146256j389295j611174j791791j928747k032024k112362
41754D2676448k170254k191311k150934k024872j797043j460077j014533m74484
41746B9392940J24128P25121J269063J714423K046662K270173K391943K408962
41738D2343415K305870K062886J670439J143898N30525r7352o62095j104290j396830
41729D6796466j542201j558536j468023j295733j073862q40562o29491m56773
41721C7931285l15568j84171m5013R6678K08806K48944J91058M2609j60082l72808
41711C7641738n64731p27475q70428j009143j155270j312121j473729j623883
$$ plain form
41771 55849101 56750770 57361791 57684718 57752326 57612673 57311909 56879450 56317841 55601397
41762 55601397 54688097 53541841 52152546 50541372 48749581 46820834 44788810 42676448
41754 42676448 40506194 38314883 36163949 34139077 32342034 30881957 29867424 29392940
41746 29392940 29517068 30242189 31511252 33225675 35272337 37542510 39934453 42343415
41738 42343415 44649285 46712171 48382610 49526508 50057033 49959681 49297586 48193296 46796466
41729 46796466 45254265 43695729 42227706 40931973 39858111 39017549 38388058 37931285
41721 37931285 37615717 37431546 37386533 37483211 37692017 37940961 38132019 38174628 38014546 37641738
41711 37641738 37077007 36349532 35479104 34469961 33314691 32002570 30528841 28904958
41703B8904958j736326j781880j743527j630191j476086j322367j192419j077833
41695A6944329r43583p47149m58636p2258L91658Q89562J359275J728191J928734
41686B1020123J919901J705844J338796R01098M75520J21447j32450k83304l46781
41677B6720194l49950l20099k70587j93328o5386J34842M13636P57778J138881
41668B7965981J519635J856787K101959K207674K143441J913955J562536J152761
41660D2424729P41856L66489M6578k04914l78940m74817n04527m90491m55571
41651D1070392m10075l45455k42439q9938R9441K89271M34690N04461M99050M54996
41641D2264394M30226M76404O15903Q37597J108330J385178J620454J764981J777161
$$ plain form
41703 28904958 27168632 25386752 23643225 22013034 20536948 19214581 18022162 16944329
41695 16944329 16000746 15253597 14794961 14722703 15114361 16003923 17363198 19091389 21020123
41686 21020123 22940024 24645868 25984664 26885762 27361282 27482729 27350279 27066975 26720194
41677 26720194 26370244 26050145 25779558 25586230 25520844 25655686 26069322 26827100 27965981
41668 27965981 29485616 31342403 33444362 35652036 37795477 39709432 41271968 42424729
41660 42424729 43166585 43533074 43579652 43374738 42995798 42520981 42016454 41525963 41070392
41651 41070392 40660317 40314862 40072423 39982485 40081926 40371197 40805887 41310348 41809398 42264394
41641 42264394 42694620 43171024 43786927 44624524 45732854 47118032 48738486 50503467 52280628
41632E2280628J635299J344674R36171M60910j5219m19436o86222p74569o78186
41623E4084050m21793m8602L88795Q29083J202444J440627J495337J352280J031471
41614F1353692N77067M7338m89564r57572j279917j394937j275949r45187m72961
41605E5162010L9489M86903P86560Q96407Q21144O06676L25798N8804j26548j90647
41595E8866596j28361L5146K55439M81153O64504P69310P75948O82863N05873
41586F2908471K76581L7880j66814l08837l85857m22486m60219n42432o99996
41577F0236291r40660j244384j565383j840176k001463j997684j813199j478171
41569D7355171j060192o41617k94574o2041N2650Q4843R2000J25593K06849L20692
$$ plain form
41632 52280628 53915927 55260601 56196772 56657682 56642463 56223027 55536805 54762236 54084050
41623 54084050 53662257 53613655 54002450 54831533 56033977 57474604 58969941 60322221 61353692
41614 61353692 61930759 61978097 61488533 60530961 59251044 57856107 56580158 55634971 55162010
41605 55162010 55201499 55688402 56474962 57371369 58192513 58799189 59124987 59183791 59057243 58866596
41595 58866596 58738235 58773381 59028820 59509973 60174477 60943787 61719735 62402598 62908471
41586 62908471 63185052 63222932 63056118 62747281 62361424 61938938 61478719 60936287 60236291
41577 60236291 59295631 58051247 56485864 54645688 52644225 50646541 48833342 47355171
41569 47355171 46294979 45653362 45358788 45296747 45349397 45434240 45526240 45651833 45858682 46179374
41559D6179374M28352M87584M69542L66973J92694k8339k65627m83474o40661
41550D6706418o99633o44787m95115k97967j07684L4244J06475J06003M6386m2680
41540D4711660j21816j58902j47967j13912r5588j18108j74856k30615k40061
41531D3309835j67253L641K67253O01199R70885J332725J637801J839542J905089
41522E1700717J823982J608083J284254Q86263M50229J2866l88890p17524r36711
41513E5723269j019557r61765p89468n51928l01626p5741J09403K52196L57766
41504E2742549M34827M95082N50185O05908O57800O91158O84252O13603M62516
41495E7937880K32267n0471l37649n75068p19601p49395o65548m88051k46723
$$ plain form
41559 46179374 46607726 47095310 47564852 47931825 48124519 48096180 47830553 47347079 46706418
41550 46706418 46006785 45361998 44866883 44568916 44461232 44495476 44601951 44707954 44754340 44711660
41540 44711660 44589844 44430942 44282975 44169063 44073475 43955367 43780511 43549896 43309835
41531 43309835 43142582 43146223 43413476 44014675 44985560 46318285 47956086 49795628 51700717
41522 51700717 53524699 55132782 56417036 57303299 57753528 57766394 57377504 56659980 55723269
41513 55723269 54703712 53741947 52952479 52400551 52098925 52023184 52132587 52384783 52742549
41504 52742549 53177376 53672458 54222643 54828551 55486351 56177509 56861761 57475364 57937880
41495 57937880 58170147 58119676 57782027 57206959 56487358 55737963 55072415 54584364 54337641
41486E4337641L2919L43210O96882J113627J599131K132450K671027L168133L589472
41477F9684492L919673M159274M318471M412694M461235M487846M521306M594023
41469A04559014M738245M981780N345310N840382O465136P196908P985042Q748486
41461A55860303R380134R756151R746665R226442Q090312O282341L839283R27676
41453B13109307k159599n065561p468765r169883j0123609j0411601j0184823
41446A58525466r609716q836841p990180p164657o422190n787187n249630m779979
41438A02685086m349892l947073l576695l250376k970649k721869k475850k210439
41430G7182243j927296j653268j422629j253894j138439j046878r45425q10394
$$ plain form
41486 54337641 54370560 54713770 55410652 56524279 58123410 60255860 62926887 66095020 69684492
41477 69684492 73604165 77763439 82081910 86494604 90955839 95443685 99964991 104559014
41469 104559014 109297259 114279039 119624349 125464731 131929867 139126775 147111817 155860303
41461 155860303 165240437 174996588 184743253 193969695 202060007 208342348 212181631 213109307
41453 213109307 210949708 205884147 198415382 189245499 179121890 168710289 158525466
41446 158525466 148915750 140078909 132088729 124924072 118501882 112714695 107465065 102685086
41438 102685086 98335194 94388121 90811426 87561050 84590401 81868532 79392682 77182243
41430 77182243 75254947 73601679 72179050 70925156 69786717 68739839 67794414 66984020
41422F6984020o34501m25700k02325J2762J98298L40411M36194M93283N26004
41413F7728446N50718N82035O29821O97240P81896Q80673R95434J135341J314817
41404G5296421J548945J848011K212464K631234L086208L560317M042106M522969
41396I8748675M991426N431192N824033O153519O407940O583739O687816O731866
41388A47560206O714920O600362O301587N688717M621420L003140Q39731j725541
41380A79604542m426131o937931q968728j0330592j0968609j0945695j0400960
41373A16625896r502602q411945p267296o183862n255113m543369m063475l776566
41365F7621668l605625l466851l299148l078060k811738k525317k243017j976339
$$ plain form
41422 66984020 66349519 65923819 65721494 65734256 65932554 66272965 66709159 67202442 67728446
41413 67728446 68279164 68861199 69491020 70188260 70970156 71850829 72846263 73981604 75296421
41404 75296421 76845366 78693377 80905841 83537075 86623283 90183600 94225706 98748675
41396 98748675 103740101 109171293 114995326 121148845 127556785 134140524 140828340 147560206
41388 147560206 154275126 160875488 167177075 172865792 177487212 180490352 181330083 179604542
41380 179604542 175178411 168240480 159271752 148941160 137972551 127026856 116625896
41373 116625896 107123294 98711349 91444053 85260191 80005078 75461709 71398234 67621668
41365 67621668 64016043 60549192 57250044 54171984 51360246 48834929 46591912 44615573
41357D4615573j722069j468081j202583r23793o46849m02241k22360j22994r4872
41348C7809731j13983j62302k40056l58430n19968p04826q74728r90260j027023
41339C2818155r80915q64603p01821n21215l47648j93398n5441Q0138K33297M28516
41329B9895065O90889J033867J444893J882432K288476K605995K789250K806018
41321D5436885K638925K289934J785293J175629N28595q4768o04751r92087j228308
41312E0945347j311419j253714j083150q42160n78682l32912j29362K1215J15817
41303D5550980J58268J64407J64825J96564K85349M29078N94070P27897P83340
41294D9054778P41253O20585M71364L56643L33585M40089O87884J061587J523598
$$ plain form
41357 44615573 42893504 41425423 40222840 39299047 38652198 38249957 38027597 37904603 37809731
41348 37809731 37695748 37533446 37293390 36934960 36414992 35710166 34835438 33845178 32818155
41339 32818155 31837240 30972637 30270816 29749601 29401953 29208555 29153114 29233252 29466549 29895065
41329 29895065 30585954 31619821 33064714 34947146 37235622 39841617 42630867 45436885
41321 45436885 48075810 50365744 52151037 53326666 53855261 53770493 53165742 52173655 50945347
41312 50945347 49633928 48380214 47297064 46454904 45876222 45543310 45413948 45435163 45550980
41303 45550980 45709248 45873655 46038480 46235044 46520393 46949471 47543541 48271438 49054778
41294 49054778 49796031 50416616 50887980 51244623 51578208 52018297 52706181 53767768 55291366
41285E5291366K022757K502679K908004L190299L314246L261071L027694K626373
41277G8144489K089426J473806Q53569K97191j56167n02956p60700r47215j070668
41268G9420775j134214j146054j124155j092086j069827j066721j081991j112522
41260G0593205j160818j234508j335831j449471j540787j568536j504066j343143
41252E9456045j103233q12131n00469k03772L3751J66018J64327L6059j72640
41243E7063955l93404n60613o30711n88959m45529k26935L2380K96898N36168
41234E5083250P30081Q70663R58569R96938R88223R36224Q49711P43177O34540
41225F2791376N43011M88105M87268N50388O73738Q37869J011338J158774J250934
$$ plain form
41285 55291366 57314123 59816802 62724806 65915105 69229351 72490422 75518116 78144489
41277 78144489 80233915 81707721 82561290 82858481 82702314 82199358 81438658 80491443 79420775
41268 79420775 78286561 77140507 76016352 74924266 73854439 72787718 71705727 70593205
41260 70593205 69432387 68197879 66862048 65412577 63871790 62303254 60799188 59456045
41252 59456045 58352812 57540681 57040212 56836440 56870191 57036209 57200536 57236595 57063955
41243 57063955 56670551 56109938 55479227 54890268 54444739 54217804 54250184 54547082 55083250
41234 55083250 55813331 56683994 57642563 58639501 59627724 60563948 61413659 62156836 62791376
41225 62791376 63334387 63822492 64309760 64860148 65533886 66371755 67383093 68541867 69792801
41216F9792801J274198J235378J157740J069466R92612R40013R19011R35107R92751
41207G9309077J096715J255325J479873J775451K128292K500561K837602L082811
41199I5465707L191909L141088K926915K559452K054013J427718P02152r1423
41191A11377531r08292j690717k376205k915220l291116l528070l678716l797780
41183H9191415l916283m027303m087479m033984l811366l395902k805417k092490
41175F1021191j329227n92017N1424N53045Q91500J071641J116151J053933R11849
41166F4749490P12937M77779K23064m3073l21409o11805q99055j148061j315000
41157F1824867j366779j295529j121771q88533o50709m62255l63392l71033m74726
$$ plain form
41216 69792801 71066999 72302377 73460117 74529583 75522195 76462208 77381219 78316326 79309077
41207 79309077 80405792 81661117 83140990 84916441 87044733 89545294 92382896 95465707
41199 95465707 98657616 101798704 104725619 107285071 109339084 110766802 111468954 111377531
41191 111377531 110469239 108778522 106402317 103487097 100195981 96667911 92989195 89191415
41183 89191415 85275132 81247829 77160350 73126366 69315000 65919098 63113681 61021191
41175 61021191 59691964 59099947 59151371 59704416 60595916 61667557 62783708 63837641 64749490
41166 64749490 65462427 65940206 66163270 66120197 65798788 65186983 64287928 63139867 61824867
41157 61824867 60458088 59162559 58040788 57152255 56501546 56039291 55675899 55304866 54830140
41148E4830140o38318q06962r19730r26909q06544n71556k62499O9514L79263
41139E0346399O36135Q25773R47434J007168J008290R46613Q17027O25908L94603
41130E7555350J47609j02964l59964o28267q99525j147947j338467j439775j434889
41121E0351161j325921j132320q84400o16475l62920j54818j1222P4822J43733
41112D6081640K56432M62007P66395J124804J461982J704717J808111J767413
41104E5433501J614917J403120J179928R69666P73158N85646M16023K90814K40839
41095F2907612K82197M05078N75812P48040Q75192R19710Q60101O97965M62514
41086F8734221K06819o623j25976j26988j9617J58059L55828N29131O48859O99490
$$ plain form
41148 54830140 54191822 53384860 52465130 51538221 50731677 50160121 49897622 49967136 50346399
41139 50346399 50982534 51808307 52755741 53762909 54771199 55717812 56534839 57160747 57555350
41130 57555350 57702959 57599995 57240031 56611764 55712239 54564292 53225825 51786050 50351161
41121 50351161 49025240 47892920 47008520 46392045 46029125 45874307 45863085 45937907 46081640
41112 46081640 46338072 46800079 47566474 48691278 50153260 51857977 53666088 55433501
41104 55433501 57048418 58451538 59631466 60601132 61374290 61959936 62375959 62666773 62907612
41095 62907612 63189809 63594887 64170699 64918739 65793931 66713641 67573742 68271707 68734221
41086 68734221 68941040 68934417 68808441 68681453 68661836 68819895 69175723 69704854 70353713 71053203
41076G1053203O72060N62508L78844J49625p7101k47864l23623k93316j72905
41067G1701431Q837K27801M73490P44220J034029J323123J580071J773685J885163
41058H0751850J912270J864670J755448J594584J386992J134154Q36088M91594
41050I1727650R8701l40538q10804j276761j686514j984980k129316k099986j907047
41041G9590405j592385j224800q84399o39231n23188n25033n94745o66955o91340
41032G2248329o51986n62959m46034l11039j53719L2403K43496M60548O52486
41023G1511525P85629Q36733Q01781O92601N24117L05692M5091k42003n29716
41014G4731450p88678r92253j116638j140671j052628q60723n97399l13145o4834
$$ plain form
41076 71053203 71725263 72287771 72666615 72816240 72739139 72491275 72167652 71874336 71701431
41067 71701431 71710268 71938069 72411559 73155779 74189808 75512931 77093002 78866687 80751850
41058 80751850 82664120 84528790 86284238 87878822 89265814 90399968 91236056 91727650
41050 91727650 91826351 91485813 90675009 89398248 87711734 85726754 83597438 81497452 79590405
41041 79590405 77998020 76773220 75888821 75249590 74726402 74201369 73606624 72939669 72248329
41032 72248329 71596343 71033384 70587350 70276311 70122592 70154995 70398491 70859039 71511525
41023 71511525 72297154 73133887 73935668 74628269 75152386 75458078 75503169 75261166 74731450
41014 74731450 73942772 72950519 71833881 70693210 69640582 68779859 68182460 67869315 67804481
41005F7804481R5525J30570K5951k06374n33397r12613j303183j672773k000103
40996F1428084k273045k481068k605492k616451k482413k187191j742760j190887
40988D3848777n94622k3809M61870Q27333J067291J199130J248001J233321J164009
40979E0431301J043750Q80938O94130N07831L43451K15279J33317J03702J20065
40970E4473764J54330J62001J03950l0661k16844m04255n36914n72902m98447
40961E2634022l32208j17420R5120K64887L71981M16926M13493L81171L41416
40952E4469388L16062L24447L79776M88510O52855Q70664J129546J401056J643442
40943F1675746J813102J876229J814223J624460J320203R29179M88242L5625l94100
$$ plain form
41005 67804481 67900006 68030576 68056527 67850153 67316756 66404143 65100960 63428187 61428084
40996 61428084 59155039 56673971 54068479 51452028 48969615 46782424 45039664 43848777
40988 43848777 43254155 43230346 43692216 44519549 45586840 46785970 48033971 49267292 50431301
40979 50431301 51475051 52355989 53050119 53557950 53901401 54116680 54249997 54353699 54473764
40970 54473764 54628094 54790095 54894045 54863384 54646540 54242285 53705371 53132469 52634022
40961 52634022 52301814 52184394 52279514 52544401 52916382 53333308 53746801 54127972 54469388
40952 54469388 54785450 55109897 55489673 55978183 56631038 57501702 58631248 60032304 61675746
40943 61675746 63488848 65365077 67179300 68803760 70123963 71053142 71541384 71577009 71182909
40934G1182909p69988j063094j248391j311059j252324j088914q44591n38949
40926F3065599j82035K19932O51204J077238J450814J733353J916016K021634
40918G1953755K083576K119256K121716K074842J974514J834175J671872J495359
40910H7329065J300911J083547Q43771N82945K96136k3506l67649o97772r48054
40901H9399394j047629r48931o46157j76304L93523R82786J511106J909963K137149
40892I3514900K191461K115802J980557J855325J786852J792677J865462J979909
40884A09082945K101125K195493K240176K225993K154396K033229J873046J683649
40876A25590052J473427J254699J051102Q97574Q29540Q69002J017673J259432
$$ plain form
40934 71182909 70412921 69349827 68101436 66790377 65538053 64449139 63604548 63065599
40926 63065599 62883564 63103496 63754700 64831938 66282752 68016105 69932121 71953755
40918 71953755 74037331 76156587 78278303 80353145 82327659 84161834 85833706 87329065
40910 87329065 88629976 89713523 90557294 91140239 91436375 91412869 91045220 90347448 89399394
40901 89399394 88351765 87402834 86756677 86580373 86973896 87956682 89467788 91377751 93514900
40892 93514900 95706361 97822163 99802720 101658045 103444897 105237574 107103036 109082945
40884 109082945 111184070 113379563 115619739 117845732 120000128 122033357 123906403 125590052
40876 125590052 127063479 128318178 129369280 130266854 131096394 131965396 132983069 134242501
40868A34242501J567143J908704K250235K557614K799905K957669L032718L049624
40860A54366113L043510L041622L052926L071457L086122L087148L067746L025861
40852A78842505K968060K911971K883504K910079L014623L213471L517098L930734
40844B04192045M453962N081092N803786O614114P504541Q463492R469105J0485898
40836B62068035J1467804J2366983J3142256J3758543J4173888J4322432J4109548
40829C55409489J3430587J2209879J0443922Q229491N762967L307745J139467
40822D09933547n11207j498123j771712j366915l77897J068799K834076M775872
40814D13086440O751439Q617790J0232340J1451173J2124021J2092517J1202634
$$ plain form
40868 134242501 135809644 137718348 139968583 142526197 145326102 148283771 151316489 154366113
40860 154366113 157409623 160451245 163504171 166575628 169661750 172748898 175816644 178842505
40852 178842505 181810565 184722536 187606040 190516119 193530742 196744213 200261311 204192045
40844 204192045 208646007 213727099 219530885 226144999 233649540 242113032 251582137 262068035
40836 262068035 273535839 285902822 299045078 312803621 326977509 341299941 355409489
40829 355409489 368840076 381049955 391493877 399723368 405486335 408794080 409933547
40822 409933547 409422340 407924217 406152505 404785590 404407693 405476492 408310568 413086440
40814 413086440 419837879 428455669 438688009 450139182 462263203 474355720 485558354
40807D85558354R337127O462647K675647j774007o500693j1047978j4984864j7998067
40799D51728166j9944354k0848454k0859478k0191919j9070873j7688688j6176456
40792C16947944j4596884j2963016j1275036r554777p857683o256325m807603
40785B49636620l525707k378550j309268k67193P72041J805916K816096L778561
40777B51328516M669806N475040O200379O880003P566913Q307492R113956R951168
40769C09493273J0744116J1399250J1827055J1956452J1739099J1147713J0174172
40762C88481130Q830897P155117N212002L091365Q95342j279900l360801n304863
40754D03720289p099381q752732j0280425j1688198j2958074j4045826j4893493
$$ plain form
40807 485558354 494895481 501358128 504033775 502259768 495759075 484711097 469726233 451728166
40799 451728166 431783812 410935358 390075880 369883961 350813088 333124400 316947944
40792 316947944 302351060 289388044 278113008 268558231 260700548 254444223 249636620
40785 249636620 246110913 243732363 242423095 242155902 242927943 244733859 247549955 251328516
40777 251328516 255998322 261473362 267673741 274553744 282120657 290428149 299542105 309493273
40769 309493273 320237389 331636639 343463694 355420146 367159245 378306958 388481130
40762 388481130 397312027 404467144 409679146 412770511 413665853 412385953 409025152 403720289
40754 403720289 396620908 387868176 377587751 365899553 352941479 338895653 324002160
40747C24002160j5449868j5686763j5604323j5228449j4605839j3798419j2876642
40740B20751857j1913438j0980277j0141924r444442q898851q473020q103109
40733A52796796p720962p280080o764289o178473n534416m844326m123084l390814
40725A06960352k670150j981962j346252p87580l37009k5360J28576J27723J003
40716A00069341j98133m00383n37412n62127m63883k73172n5250J07404J43380
40707I7829765K3327k23266n18767p71373r12222r16037p99394o04339l79294
40698I2728400j65660P752J25163J83139J90586J68530J47143J58254K24368L49678
40688I4117353N20559P17597R30403J161739J416474J685960J942866K150510
$$ plain form
40747 324002160 308552292 292865529 277261206 262032757 247426918 233628499 220751857
40740 220751857 208838419 197858142 187716218 178271776 169372925 160899905 152796796
40733 152796796 145075834 137795754 131031465 124852992 119318576 114474250 110351166 106960352
40725 106960352 104290202 102308240 100961988 100174408 99837399 99812039 99940615 100068338 100069341
40716 100069341 99871208 99470825 98933413 98371286 97907403 97634231 97578981 97686385 97829765
40707 97829765 97853092 97629826 97111059 96339686 95427464 94511427 93712033 93107694 92728400
40698 92728400 92562740 92570492 92695655 92878794 93069380 93237910 93385053 93543307 93767675 94117353
40688 94117353 94637912 95355509 96285912 97447651 98864125 100550085 102492951 104643461
40680A04643461K277158K304272K226997K052824J802703J512430J229387J002654
40672A19051886Q70074Q50251R46867J164629J524393K060609K795408L704317
40664A32968434M699788N648394O413606O899471P073642O964266O638496O173185
40656A83479282N626550N019803M338363L555617K668465J723633Q17609O9497
40648B07298819m17527n85859m32310K178O51139J438735K289814L137006L928678
40639B17310673M636669N258113N806698O295296O719020P049334P242735P256248
40631B67574786P056885O619620N921878M947595L703881K238118O38609r86884
40623B97714488k542505l964813n220539o289567p153654p802893q250918q539038
$$ plain form
40680 104643461 106920619 109224891 111451888 113504712 115307415 116819845 118049232 119051886
40672 119051886 119921960 120772211 121719078 122883707 124408100 126468709 129264117 132968434
40664 132968434 137668222 143316616 149730222 156629693 163703335 170667601 177306097 183479282
40656 183479282 189105832 194125635 198463998 202019615 204688080 206411713 207229322 207298819
40648 207298819 206881292 206295433 205863123 205865301 206516440 207955175 210244989 213381995 217310673
40639 217310673 221947342 227205455 233012153 239307449 246026469 253075803 260318538 267574786
40631 267574786 274631671 281251291 287173169 292120764 295824645 298062763 298701372 297714488
40623 297714488 295171983 291207170 285986631 279697064 272543410 264740517 256489599 247950561
40615B47950561q721220q840748q914170q927596q842541q610917q199750p616151
40607A79277468o913844o171313n454343m789716m167519l566838k983745k442104
40599A42788046j981596j632590j395057j235679j105985r71296q32758p27663
40591A32905422p06123p97246r84676j204701j366236j382496j202428q31413
40583A24430103l32067J98117O63271J000283J189062J243021J194044J083746
40575A30669580R59830Q68684Q40793Q76393R43440R92995R84675R06991P80756
40566A38824137O45706N40634M88485M91176N32554N85969O23068O20029N58327
40557A43910085M21448J93542j34669n53984j027143j490770j871215k106376
$$ plain form
40615 247950561 239229341 230388593 221474423 212546827 203704286 195093369 186893619 179277468
40607 179277468 172363624 166192311 160737968 155948252 151780733 148213895 145230150 142788046
40599 142788046 140806450 139173860 137778803 136543124 135437139 134465843 133633085 132905422
40591 132905422 132199299 131402053 130417377 129212676 127846440 126463944 125261516 124430103
40583 124430103 124098036 124296153 124959424 125959707 127148769 128391790 129585834 130669580
40575 130669580 131629410 132498094 133338887 134215280 135158720 136151715 137136390 138043381 138824137
40566 138824137 139469843 140010477 140498962 140990138 141522692 142108661 142731729 143351758 143910085
40557 143910085 144331533 144525075 144390406 143836422 142809279 141318509 139447294 137340918
40549A37340918k160303k023165j701761j213031n87029J26786Q61077J544298
40541A32187790K120424K564392K885663L117902L299806L458197L604049L741466
40533A56979689L877410M019271M160995M272549M307073M224997M019744L728152
40525A89589880L420379L177117L067172L135038L400564L865825M521116N344912
40517B19522003O300868P340321Q414326R488249J0547713J1592961J2629498
40510B85835939J3662876J4696191J5723593J6718190J7620391J8333904J8731615
40503D01322699J8669156J8003578J6617181J4448920J1532659Q029420M228701
40496D92852314M99492k799670n411925p231479q295690q736689q722161q407786
$$ plain form
40549 137340918 135180615 133157450 131455689 130242658 129655629 129782415 130643492 132187790
40541 132187790 134308214 136872606 139758269 142876171 146175977 149634174 153238223 156979689
40533 156979689 160857099 164876370 169037365 173309914 177616987 181841984 185861728 189589880
40525 189589880 193010259 196187376 199254548 202389586 205790150 209655975 214177091 219522003
40517 219522003 225822871 233163192 241577518 251065767 261613480 273206441 285835939
40510 285835939 299498815 314195006 329918599 346636789 364257180 382591084 401322699
40503 401322699 419991855 437995433 454612614 469061534 480594193 488623613 492852314
40496 492852314 493351806 490552136 485140211 477908732 469613042 460876353 452154192 443746406
40488D43746406p911361p309132o647397n958144n270529m617224m038432l582775
40480C98411412l300617l227669l363839l657948m009149m289064m376934m190115
40472C67996077l694153k891555j803465m59669J099837K819043M622396O413938
40464C74102449Q078228R485634J0503980J1013564J0922021J0181847Q814562
40457D43102285O931830M728553K430304K10400j877736l909512o029628q351934
40449D37234562j0865930j3394761j5629498j7229949j7946270j7701952j6601923
40442C27864279j4874160j2785837j0575791q421936o437513m679207l154425
40435B66935410j826284o22683N45561J759644L068869M476000N936335P369841
$$ plain form
40488 443746406 435835045 428525913 421878516 415920372 410649843 406032619 401994187 398411412
40480 398411412 395110795 391883126 388519287 384861339 380852190 376563126 372186192 367996077
40472 367996077 364301924 361410369 359606904 359147235 360247072 363066115 367688511 374102449
40464 374102449 382180677 391666311 402170291 413183855 424105876 434287723 443102285
40457 443102285 450034115 454762668 457192972 457403372 455525636 451616124 445586496 437234562
40449 437234562 426368632 412973871 397344373 380114424 362168154 344466202 327864279
40442 327864279 312990119 300204282 289628491 281206555 274769042 270089835 266935410
40435 266935410 265109126 264486443 265032004 266791648 269860517 274336517 280272852 287642693
40427B87642693Q680633R774720J0568577J0987623J0960130J0414327R284004
40420C58312707P524139N134406K184548j168144m681031q056439j0997808j3274301
40412C34978077j4767866j5483420j5522369j5037385j4190752j3129311j1975679
40405B34871295j0826151r745820q760535p855743o991508o129227n252915m372294
40397A74937102l511810k699379j961644j321213p91022l68726l6774K31941M67365
40388A64945840O97045R41815J213534J517362J857150K237615K659748L114488
40380A79184597L583049M044681M483804M888835N244034N522163N683462N680604
40372B18315229N467091N007904M290694L333004K180858Q99039m41530j774354
$$ plain form
40427 287642693 296323326 306098046 316666623 327654246 338614376 349028703 358312707
40420 358312707 365836846 370971252 373155800 371987656 367306625 359250186 348252378 334978077
40412 334978077 320210211 304726791 289204422 274167037 259976285 246846974 234871295
40405 234871295 224045144 214299324 205538789 197683046 190691538 184562311 179309396 174937102
40397 174937102 171425292 168725913 166764269 165443056 164652034 164283308 164246534 164478475 164945840
40388 164945840 165642885 166584700 167798234 169315596 171172746 173410361 176070109 179184597
40380 179184597 182767646 186812327 191296131 196184966 201429000 206951163 212634625 218315229
40372 218315229 223782320 228790224 233080918 236413922 238594780 239493819 239052289 237277935
40364B37277935l044628m212696n251267o135832o835018p311872p539643p522239
40356A89424740p303477o957170o563758o186424n856883n573684n310718n032278
40348A40640348m710782m341382l945820l560986l216590k914855k624616k293517
40340A13031800j872185j338880p12258m4668N99978J167812J621508J933420
40332A14386527K080920K054038J867844J564633J201763Q34791N06786K45539
40324A24742841O3612m3077r7892j43285k33261m18245p29193j170072j721319
40315A20250109k347783l003335l631471m168011m550537m732710m697095m460761
40307H8658406m071558l596490l105928k658593k291538k016695j823054j683310
$$ plain form
40364 237277935 234233307 230020611 224769344 218633512 211798494 204486622 196946979 189424740
40356 189424740 182121263 175164093 168600335 162413911 156557028 150983344 145672626 140640348
40348 140640348 135929566 131588184 127642364 124081378 120864788 117949933 115325317 113031800
40340 113031800 111159615 109820735 109108477 109063809 109663787 110831599 112453107 114386527
40332 114386527 116467447 118521485 120389329 121953962 123155725 123990516 124497302 124742841
40324 124742841 124806453 124763376 124665484 124522199 124288938 123870693 123141500 121971428 120250109
40315 120250109 117902326 114898991 111267520 107099509 102548972 97816262 93119167 88658406
40307 88658406 84586848 80990358 77884430 75225837 72934299 70917604 69094550 67411240
40299F7411240j564598j440956j300707j142625r64201p54747n02245k07297J11291
40290E9645155M25153P09075R44621J114342J197643J176630J048451Q33667N73518
40281F7668255L17055J04816m3729j34421j92622k48550l19094l95333m43777
40272F6312600m20836k92150m7712K91030O73506J033201J309128J464975J494257
40263G1817999J410995J237296R97631P18482M26108J40541j29189l83999o28259
40254G5607605q61313j070788j231185j309509j275692j112618q21781m23804
40246F7500915M5670N43436J025925J451497J777937J961560J963274J758654
40238G8028868J345338P46379J3311p72161j506692k089088k450570k574654k497077
$$ plain form
40299 67411240 65846642 64405686 63104979 61962354 60998153 60243406 59741161 59533864 59645155
40290 59645155 60070308 60779383 61724004 62838346 64035989 65212619 66261070 67094737 67668255
40281 67668255 67985310 68090126 68046397 67911976 67719354 67470804 67151710 66756377 66312600
40272 66312600 65891764 65599614 65551902 65842932 66516438 67549639 68858767 70323742 71817999
40263 71817999 73228994 74466290 75463921 76182403 76608511 76749052 76619863 76235864 75607605
40254 75607605 74746292 73675504 72444319 71134810 69859118 68746500 67924719 67500915
40246 67500915 67546585 68090021 69115946 70567443 72345380 74306940 76270214 78028868
40238 78028868 79374206 80120585 80133896 79361735 77855043 75765955 73315385 70740731 68243654
40229F8243654k288875k031123j788927j592002j429908j265000j056149p80553
40221E6011117m44400q1183K58438N20709O63483O68973N51198L54089J38485
40212E8640909l7375j33904j35057m2997J30548L71269O66779J007935J384552
40203F1852659J776395K147069K449497K643000K711582K670721K557946K413669
40195H1222538K265119K123526J994396J889880J830251J830401J879349J925727
40187I6961187J878877J629435J087181K24426q97235k137644l326282m321371
40179I1098574n045933n487215n672970n647096n455745n141599m741879m289633
40171D9616504l817843l361603k953236k611200k330537k083426j832071j547254
$$ plain form
40229 68243654 65954779 63923656 62134729 60542727 59112819 57847819 56791670 56011117
40221 56011117 55566717 55485534 55743972 56264681 56928164 57597137 58148335 58502424 58640909
40212 58640909 58603534 58469630 58334573 58291576 58422124 58793393 59460172 60468107 61852659
40203 61852659 63629054 65776123 68225620 70868620 73580202 76250923 78808869 81222538
40195 81222538 83487657 85611183 87605579 89495459 91325710 93156111 95035460 96961187
40187 96961187 98840064 100469499 101556680 101781106 100883871 98746227 95419945 91098574
40179 91098574 86052641 80565426 74892456 69245360 63789615 58648016 53906137 49616504
40171 49616504 45798661 42437058 39483822 36872622 34542085 32458659 30626588 29079334
40163B9079334j220953q65447n02085j50627J72662M50513O62356P88727Q18345
40154B9232825P51235N96065L65552P4248k60159o14112r57171j254820j474385
40145B6459278j590784j589412j467085j234007r17092n60474k18859N5679K27644
40136A9164888K86217K44788J34199n485j31704k05096j94990q2746J39612M72832
40126A9822515R09142J424127J969552K477200K874810L105811L144633L004508
40118C8732298K736649K418940K135333J952546J902530J975849K126981K289163
40110E6270289K392953K381880K222879J913493J484583R91690M93000K6353l96792
40101F7780328p76972j108621j377051j571644j699108j781469j839238j874037
$$ plain form
40163 29079334 27858381 26992934 26490849 26340222 26512884 26963397 27625753 28414480 29232825
40154 29232825 29984060 30580125 30945677 31019925 30759766 30145654 29188483 27933663 26459278
40145 26459278 24868494 23279082 21811997 20577990 19660898 19100424 18881565 18937244 19164888
40136 19164888 19451105 19695893 19830092 19824607 19692903 19487807 19292817 19210071 19349683 19822515
40126 19822515 20731657 22155784 24125336 26602536 29477346 32583157 35727790 38732298
40118 38732298 41468947 43887887 46023220 47975766 49878296 51854145 53981126 56270289
40110 56270289 58663242 61045122 63268001 65181494 66666077 67657767 68150767 68177120 67780328
40101 67780328 67003356 65894735 64517684 62946040 61246932 59465463 57626225 55752188
40093E5752188j865401j784138j611162j348148j016173o49522k92167M641J90676
40084D7380794K32183J25641j00664l98749p18577j021979j289722j522657j736376
40075D0949894j947674k156683k336204k438779k419912k263541j994657j673126
40067B3719318j372726j154683j046251j032945j066868j085849j034785q83374
40059A5041837o37691l42047o6221J21245J81998J21833j9060j91372l59089n05893
40049A3345540o26541p14221p54426p29312o29393m64427k64405o7506R7944K25158
40039I418411L27099M23822N26197O22337O73075O22678M23858O3512m28189r89862
40029A1682938j549716k039978k402349k592221k586369k389792k035068j573421
$$ plain form
40093 55752188 53886787 52102649 50491487 49143339 48127166 47477644 47185477 47190118 47380794
40084 47380794 47612977 47738618 47637954 47239205 46520628 45498649 44208927 42686270 40949894
40075 40949894 39002220 36845537 34509333 32070554 29650642 27387101 25392444 23719318
40067 23719318 22346592 21191909 20145658 19112713 18045845 16959996 15925211 15041837
40059 15041837 14404146 14062099 13995878 14117123 14299121 14420954 14401894 14210522 13851433 13345540
40049 13345540 12718999 12004778 11250352 10521040 9891647 9427220 9162815 9095309 9193253 9418411
40039 9418411 9745510 10169332 10695529 11317866 11990941 12613619 13037477 13100989 12672800 11682938
40029 11682938 10133222 8093244 5690895 3098674 512305 -1877487 -3912555 -5485976
40021e485976j062472n56517j02456K60038N00191O05199N92682N12406M27673
40012d309232L86163M03602M72738N85159P42805R50313J200089J466318J712538
40003C610493J906459K033264K100899K133826K157226K180608K191453K162738
39995B0476966K069106J902153J676951J426764J188968R90185Q38819P27820
39987C1297732O43181N70478M94371L93472K40047J2545k83682o05092q82814
39978C1880238j054642j094854j024310r00295p96152p78678q87919j125457j456767
39969B2761164j825258k168084k426188k550039k506617k288807j922001j461183
39961E612987r76312n31184j66120J07447L01001M39236N52374O69616Q10631
$$ plain form
40021 -5485976 -6548448 -7104965 -7207421 -6947383 -6447192 -5841993 -5249311 -4736905 -4309232
40012 -4309232 -3923069 -3519467 -3046729 -2461570 -1718765 -768452 431637 1897955 3610493
40003 3610493 5516952 7550216 9651115 11784941 13942167 16122775 18314228 20476966
39995 20476966 22546072 24448225 26125176 27551940 28740908 29731093 30569912 31297732
39987 31297732 31940913 32511391 33005762 33399234 33639281 33651826 33368144 32763052 31880238
39978 31880238 30825596 29730742 28706432 27806137 27009985 26231307 25343388 24217931 22761164
39969 22761164 20935906 18767822 16341634 13791595 11284978 8996171 7074170 5612987
39961 5612987 4636675 4105491 3939371 4046818 4347819 4787055 5339429 6009045 6819676
39952F819676R76820J148499J292177J375837J385039J331974J252848J194682
39944A6777552J196876J273622J402693J526918J573231J484708J248625R02095
39936B7386320N11752J42073j67970m10005n96330p45099q70070r77828j068515
39927B3204328j135558j166597j151425j094511j019308r55405r17416q95327
39919A4868781q66021q15937p55743p16132p28498q04016r24169j046821j121408
39910G090036j103225r61986o86376k86604K05976P42925J264820J708184K014670
39901I988420K143469K083591J860094J530230J169354Q50279O23096N03179M71072
39892B1222784M82008M80654M18121K68065L6697k37723m95610o73108p21428
$$ plain form
39952 6819676 7796496 8944995 10237172 11613009 12998048 14330022 15582870 16777552
39944 16777552 17974428 19248050 20650743 22177661 23750892 25235600 26484225 27386320
39936 27386320 27898072 28040145 27872175 27462170 26865840 26120741 25250671 24272843 23204328
39927 23204328 22068770 20902173 19750748 18656237 17636929 16681524 15764108 14868781
39919 14868781 14002760 13186823 12431080 11714948 10986450 10182434 9258265 8211444 7090036
39910 7090036 5986811 5024825 4338449 4051845 4257821 5000746 6265566 7973750 9988420
39901 9988420 12131889 14215480 16075574 17605804 18775158 19625437 20248533 20751712 21222784
39892 21222784 21704792 22185446 22603567 22871632 22908329 22670606 22174996 21501888 20780460
39883B0780460o23670m01696j07321J98418M65264O62105P73325P91626P15406
39874B3253917N52267L23477O2333j96024m27687o26322p98214r50765j083997
39865B0108985j191013j266143j313795j350253j395485j460273j538611j610450
39857H982962j650160j632482j534060j335620j028409o21854j46618L48859Q06680
39848B189298J170907J400575J480247J422559J261450J041114Q06684N97362
39840A1370196M39450L40105K87415K59906K40653K27064K31498K74507L74761
39831A4045555N38382P50553R73883J157550J256119J250144J156907J023032
39823B2152125R01064Q23595P91067P79301P58396P09102O29133N30975M35447
$$ plain form
39883 20780460 20156790 19755094 19647773 19846191 20311455 20973560 21746885 22538511 23253917
39874 23253917 23806184 24129661 24191994 23995970 23568283 22941961 22143747 21192982 20108985
39865 20108985 18917972 17651829 16338034 14987781 13592296 12132023 10593412 8982962
39857 8982962 7332802 5700320 4166260 2830640 1802231 1180377 1033759 1382618 2189298
39848 2189298 3360205 4760780 6241027 7663586 8925036 9966150 10772834 11370196
39840 11370196 11809646 12149751 12437166 12697072 12937725 13164789 13396287 13670794 14045555
39831 14045555 14583937 15334490 16308373 17465923 18722042 19972186 21129093 22152125
39823 22152125 23053189 23876784 24667851 25447152 26205548 26914650 27543783 28074758 28510205
39814B8510205L62740L22183L05632K91053K56988J98360J30285P5612M6873L8640
39804C0538571L5394K4663K144l3414q6688j65376k72866l99953n21752o02972
39794B8517751o09982n23198l42561q4827K22111N42905Q37292J065249J195672
39785C0820412J215728J136833R93168Q30085O85855N77058M97027M26195L45077
39776C7527438K43085J23453M256q8703j38446j53049j67166k24669l53682n50142
39766C6222375p78114r84492j120516j161318j114591j012624q90951p67179o35077
39757B7757513m77520k86691p5395J26684K84544L67174L52521K33140K4575k30194
39747B8076351m69700o36720p02060o72628n77647m43385k74712n5564K33054
$$ plain form
39814 28510205 28872945 29195128 29500760 29791813 30048801 30247161 30377446 30453058 30499931 30538571
39804 30538571 30573965 30598628 30600772 30567358 30480670 30315294 30042428 29642475 29120723 28517751
39794 28517751 27907769 27384571 27042010 26957183 27179294 27722199 28559491 29624740 30820412
39785 30820412 32036140 33172973 34166141 34996226 35682081 36259139 36756166 37182361 37527438
39776 37527438 37770523 37893976 37898232 37809529 37671083 37518034 37350868 37126199 36772517 36222375
39766 36222375 35444261 34459769 33339253 32177935 31063344 30050720 29159769 28392590 27757513
39757 27757513 27279993 26993302 26917907 27044591 27329135 27696309 28048830 28281970 28306545 28076351
39747 28076351 27606651 26969931 26267871 25595243 25017596 24574211 24299499 24243935 24476989
39738B4476989N89205R75110J321751J552467J612260J486062J199302Q07475
39730C4020621L83276J744k79326m38771m98749n11431n32149n94581p00947q29710
39720C0019977r52468j048063j107292j130711j124924j098529j056563r96359
39712B1505068r10064p92610o46593m79177k96724j05394Q3854K54993L95990
39703A9009343N10354O19964P54090R30252J139345J345373J499876J560676J503313
39694B8872586J322342J028363O46630K16667k11494n86379q66337j027619j066200
39685B8328559r94757q38425o30868m09071k06160m5440O0520J06576R2486K3764
39675B5487184q6633k19437l52940m67156n47540n88989n98648n93143n88258
$$ plain form
39738 24476989 25066194 26041304 27363055 28915522 30527782 32013844 33213146 34020621
39730 34020621 34403897 34405641 34126315 33687544 33188795 32677364 32145215 31550634 30849687 30019977
39720 30019977 29067509 28019446 26912154 25781443 24656519 23557990 22501427 21505068
39712 21505068 20595004 19802394 19155801 18676624 18379900 18274506 18358360 18613353 19009343
39703 19009343 19519697 20139661 20893751 21824003 22963348 24308721 25808597 27369273 28872586
39694 28872586 30194928 31223291 31869921 32086588 31875094 31288715 30422378 29394759 28328559
39685 28328559 27333802 26495377 25864509 25455438 25249278 25203838 25264358 25370934 25463420 25487184
39675 25487184 25400551 25181114 24828174 24361018 23813478 23224489 22625841 22032698 21444440
39666B1444440n86581n73217n25192m29380k96851j64091p9947q4236j87223l59782
39656A8157940n40573o57715o53129m97348j92014K33964P29042J225298J649375
39647A9454840J937546K050737J984977J773374J476748J164155Q92065O93385
39639C1427827N79936N50802N96973P01000Q37770R79901J103862J192106J231849
39630C9202026J213945J132438R83548P65756M83959J55724j86361m98638p33438
39621D2518959q47746q16537o49169l96195j34453O4144J58561J43231L5665j36676
39611C9939784l41431n43189p10072q24243q87639r16253r25886r19252q82351
39602C2989468p90964o22968l71491n4277K85466N89188Q00755Q84028Q33083
$$ plain form
39666 21444440 20857859 20284642 19759450 19330070 19033219 18869128 18789181 18704945 18517722 18157940
39656 18157940 17617367 16959652 16306523 15809175 15617161 15851125 16580167 17805465 19454840
39647 19454840 21392386 23443123 25428100 27201474 28678222 29842377 30734442 31427827
39639 31427827 32007763 32558565 33155538 33856538 34694308 35674209 36778071 37970177 39202026
39630 39202026 40415971 41548409 42531957 43297713 43781672 43937396 43751035 43252397 42518959
39621 42518959 41671213 40854676 40205507 39809312 39674859 39739003 39897564 40040795 40076460 39939784
39611 39939784 39598353 39055164 38345092 37520849 36633210 35716957 34791071 33871819 32989468
39602 32989468 32198504 31575536 31204045 31149768 31435234 32024422 32825177 33709205 34542288
39593C4542288O71423M40085J79035q8097l54826o16390q50290j010684j045038
39584C1867506r24183o64898l27463J2252K97465N08316O53754P49594Q03116
39575C2975459Q14383P88062P41911P02851O91667P05879P13078O61600N04396
39566C9299286K22806j62568n97136j007978j322247j484126j467511j280031
39558C2200495r55243n36978o5982M23722R01011J334686J696346J966985K141560
39549C9106602K227677K238704K185855K075340J912962J711400J492186J279209
39541E4229935J088370R20538P61492N88334L79202J21694j84255n29024q96529
39532E6479757j263373j595232j846936j971201j934285j730457j385827r47469
$$ plain form
39593 34542288 35213711 35653796 35832831 35744734 35389908 34773518 33923228 32912544 31867506
39584 31867506 30943323 30278425 29950962 29963214 30260679 30768995 31422749 32172343 32975459
39575 32975459 33789842 34577904 35319815 36022666 36714333 37420212 38133290 38794890 39299286
39566 39299286 39522092 39359524 38762388 37754410 36432163 34948037 33480526 32200495
39558 32200495 31245252 30708274 30642292 31066014 31967025 33301711 34998057 36965042 39106602
39549 39106602 41334279 43572983 45758838 47834178 49747140 51458540 52950726 54229935
39541 54229935 55318305 56238843 57000335 57588669 57967871 58089565 57905310 57376286 56479757
39532 56479757 55216384 53621152 51774216 49803015 47868730 46138273 44752446 43804977
39524D3804977m63664L1408N17212R71356J353299J604683J671915J537419J236323
39515E2264928Q45615M54038J33105p7511j71533j71570j21575p5590q3907j80130
39505E2815870l72853o45007r61556j281070j563689j773535j881766j875235
39497D2461159j765409j587959j392150j227970j136532j142132j245389j422681
39489C1540937j635400j843027k010448k107558k108403j996403j774066j469083
39481A6596549j129824q10557n54401l83449k98444k82663l05165l25792l06555
39472A2199699k26085q6604R2760K90428M93635P01570R22961J170903J454294
39463A7013561J766406K076570K333200K480435K481162K333383K070321J744491
$$ plain form
39524 43804977 43341313 43372721 43889933 44861289 46214588 47819271 49491186 51028605 52264928
39515 52264928 53110543 53564581 53697686 53620175 53448642 53277072 53155497 53079907 52996000 52815870
39505 52815870 52443017 51798010 50836454 49555384 47991695 46218160 44336394 42461159
39497 42461159 40695750 39107791 37715641 36487671 35351139 34209007 32963618 31540937
39489 31540937 29905537 28062510 26052062 23944504 21836101 19839698 18065632 16596549
39481 16596549 15466725 14656168 14101767 13718318 13419874 13137211 12832046 12506254 12199699
39472 12199699 11973614 11887010 11979770 12270198 12763833 13465403 14388364 15559267 17013561
39463 17013561 18779967 20856537 23189737 25670172 28151334 30484717 32555038 34299529
39455C4299529J405646J084378P87481N04455K21112o5653l40355n74796p43406
39446C6578391q35124q53300q09001p18448o05376m98797m21151l74561l36889
39437C1125744k71501j45714N1235L00648N63942Q04690J006981J175867J321573
39428C5933465J441627J512926J495949J347977J041140N78670J253o20332j202874
39419D1529801j671715j978542k110220k084546j934867j692243j374990r90196
39411B7692482n45161o1429M18645Q39784J152795J331815J378977J317266J180929
39402C4706103J010046Q47697P34096O95049P28464P98134Q43606Q06141O58053
39393D1827389M17525J39576j10425k84527l67666l77433l53409l42479l83071
$$ plain form
39455 34299529 35705175 36789553 37577034 38081489 38302601 38236948 37896593 37321797 36578391
39446 36578391 35743267 34889967 34080966 33362518 32757142 32258345 31837194 31462633 31125744
39437 31125744 30854243 30708529 30759764 31060412 31624354 32429044 33436025 34611892 35933465
39428 35933465 37375092 38888018 40383967 41731944 42773084 43351754 43353007 42732675 41529801
39419 41529801 39858086 37879544 35769324 33684778 31749911 30057668 28682678 27692482
39411 27692482 27147321 27085892 27504537 28344321 29497116 30828931 32207908 33525174 34706103
39402 34706103 35716149 36563846 37297942 37992991 38721455 39519589 40363195 41169336 41827389
39393 41827389 42244914 42384490 42274065 41989538 41621872 41244439 40891030 40548551 40165480
39384D0165480m89338o40196p82248q51265q03719o39699m02720j57823L7261
39375C5435733J52363J90420J80964J67167J90995K80345M41915O62245R15754
39366C8617901J175091J418253J629523J796196J906046J948952J920987J826198
39358E2239147J674395J478433J254923J027302Q26160O83305O21004O41567P23755
39349F1169991Q30526R26309R93673J037923J077590J130705J208080J314901
39341F9689698J453040J618039J793424J950153K055448K086839K041535J934347
39333H4622523J787144J619751J449091J293298J172150J100090J076423J080078
39325I5200548J072762J009731Q55060N97298K60308r5636l85266n20840m39117
$$ plain form
39384 40165480 39676142 39035946 38253698 37402433 36598714 35959015 35556295 35398472 35435733
39375 35435733 35588096 35778516 35959480 36126647 36317642 36597987 37039902 37702147 38617901
39366 38617901 39792992 41211245 42840768 44636964 46543010 48491962 50412949 52239147
39358 52239147 53913542 55391975 56646898 57674200 58500360 59183665 59804669 60446236 61169991
39349 61169991 62000517 62926826 63920499 64958422 66036012 67166717 68374797 69689698
39341 69689698 71142738 72760777 74554201 76504354 78559802 80646641 82688176 84622523
39333 84622523 86409667 88029418 89478509 90771807 91943957 93044047 94120470 95200548
39325 95200548 96273310 97283041 98138101 98735399 98995707 98900071 98514805 97993965 97554848
39316I7554848j22253L95975J039695J710552K311296K769819L057888L194592
39308A11912412L229044L211536L171943L116019L033308K904994K709583K431291
39300A35720130K070122J644409J181104P01600K14523k81317p88915j304853
39292A39156803j812997k283046k678058k970160l155835l259605l321495l375102
39284A16300505l431285l479352l503394l497479l465185l405681l302478l127581
39276H9088070k858200k493337k059863j606177j187788q51319o22551n01316
39268G6907519m63752m71628m86871m85442m63086m30484m03091l92966m05485
39259G2904714m39370m88040n41171n85678o06763n91088n31967m32158l00074
$$ plain form
39316 97554848 97432595 97828570 98868265 100578817 102890113 105659932 108717820 111912412
39308 111912412 115141456 118352992 121524935 124640954 127674262 130579256 133288839 135720130
39300 135720130 137790252 139434661 140615765 141317365 141531888 141250571 140461656 139156803
39292 139156803 137343806 135060760 132382702 129412542 126256707 122997102 119675607 116300505
39284 116300505 112869220 109389868 105886474 102388995 98923810 95518129 92215651 89088070
39276 89088070 86229870 83736533 81676670 80070493 78882705 78031386 77408835 76907519
39268 76907519 76443767 75972139 75485268 74999826 74536740 74106256 73703165 73310199 72904714
39259 72904714 72465344 71977304 71436133 70850455 70243692 69652604 69120637 68688479 68388405
39250F8388405j41439M7038K77672N66136R22521J342005J800179K258315K677172
39241G8138004L029787L303935L494710L596221L599898L499328L296015L001148
39233A04959046K632445K209332J750944J278367Q16909L92842K5288k78750n20182
39224A13266241o99056q11899q58597q50611q11269p68757p48817p69889q38006
39215A06109340r41870j054750j146989j202635j228803j252759j310816j435974
39207I6534744j648271j949242k320708k727125l120161l445104l650225l699238
39199G3974670l583220l325276k972910k580252k190083j826033j496993j207053
39191E4792850r63517p80502o77385o69877p54761q98350j041277j120285j092280
$$ plain form
39250 68388405 68246966 68294004 68571676 69137812 70060333 71402338 73202517 75460832 78138004
39241 78138004 81167791 84471726 87966436 91562657 95162555 98661883 101957898 104959046
39233 104959046 107591491 109800823 111551767 112830134 113647043 114039885 114065173 113786423 113266241
39224 113266241 112567185 111755286 110896689 110046078 109234809 108466052 107717235 106947346 106109340
39215 106109340 105167470 104112720 102965731 101763096 100534293 99281534 97970718 96534744
39207 96534744 94886473 92937231 90616523 87889398 84769237 81324133 77673908 73974670
39199 73974670 70391450 67066174 64093264 61513012 59322929 57496896 55999903 54792850
39191 54792850 53829333 53048831 52371446 51701569 50946808 50048458 49007181 47886896 46794616
39182D6794616r44902o91930l63760m25L54802O65118R10069J088348J211822
39173D9023758J296538J356123J396470J409259J368427J238215R94599O49202
39165E8732591K59448q4042k88526k94568r8853K46953O60154J059656J390021
39156F1582834J628934J782327J875738J946158K033829K172802K380774K649752
39148G8053148K940109L182898L295270L207743K891956K373658J724295J038343
39140I8707420M09389q8087m11462n57259n59254m75135l64908k67825j85473
39131I6207406q0384J03269M03750Q12797J274189J708992K046945K244397K284889
39122A07006250K170100J910165J519844J023789M67082q0477n36620q33573r45177
$$ plain form
39182 46794616 45849714 45157784 44794024 44793599 45148401 45813519 46723588 47811936 49023758
39173 49023758 50320296 51676419 53072889 54482148 55850575 57088790 58083389 58732591
39165 58732591 58992039 58907997 58619471 58324903 58226050 58473003 59133157 60192813 61582834
39156 61582834 63211768 64994095 66869833 68815991 70849820 73022622 75403396 78053148
39148 78053148 80993257 84176155 87471425 90679168 93571124 95944782 97669077 98707420
39140 98707420 99116809 99028722 98617260 98060001 97500747 97025612 96660704 96392879 96207406
39131 96207406 96127022 96230291 96634041 97446838 98721027 100430019 102476964 104721361 107006250
39122 107006250 109176350 111086515 112606359 113630148 114097230 114016753 113480133 112646560 111701383
39113A11701383q97370p55031n92756m67342m07143m19254n01159o43892q27205
39104A06190231j017850j177693j275923j295349j230956j088028q85199o57601
39096I7561632m51279l08379k53439k90020m05624n76186p67714r41168j063889
39087I2503934j120407j112381j046942r24065p34144m67467j26971K67309O87445
39078H7926311J114614J550806K016090K534191L116976L755688M419434N058981
39070A11493091N616729O043412O316028O446368O473375O443325O389756O323987
39062A61546071O239517O125706N981713N820969N661832N510204N347670N134950
39054B07368632M827859M394616L826516L141155K378958J591933Q27047J13207
$$ plain form
39113 111701383 110804013 110048982 109456226 108988884 108581741 108162487 107661328 107017436 106190231
39104 106190231 105172381 103994688 102718765 101423416 100192460 99104432 98219233 97561632
39096 97561632 97110353 96801974 96548535 96258515 95852891 95276705 94508991 93567823 92503934
39087 92503934 91383527 90271146 89224204 88300139 87565995 87098528 86971557 87238866 87926311
39078 87926311 89040925 90591731 92607821 95142012 98258988 102014676 106434110 111493091
39070 111493091 117109820 123153232 129469260 135915628 142389003 148832328 155222084 161546071
39062 161546071 167785588 173911294 179893007 185713976 191375808 196886012 202233682 207368632
39054 207368632 212196491 216591107 220417623 223558778 225937736 227529669 228356716 228469923
39046B28469923n39613j130393j656191k109427k484721k789745l051168l308391
39038B11400274l595434l921392m262749m572275m798069m902642m875278m733954
39030A75738481m514673m251401l957470l620700l215001k719543k133269j478841
39022A49847583p97112j35525M66118R87313J429559J808159K140149K438983
39014A58185227K719398L004618L325562L710619M174131M711819N303571N918093
39006A91053038O514750P043133P445144P663839P657693P412028O939524O270875
38998B48000024N446187M515206L541842K600565J759766J061320N10629Q2469
38990B67518008k63888n70385q72372j197348j567924k005903k533911l171577
$$ plain form
39046 228469923 227930310 226799917 225143726 223034299 220549578 217759833 214708665 211400274
39038 211400274 207804840 203883448 199620699 195048424 190250355 185347713 180472435 175738481
39030 175738481 171223808 166972407 163014937 159394237 156179236 153459693 151326424 149847583
39022 149847583 149050471 148914946 149381064 150368377 151797936 153606095 155746244 158185227
39014 158185227 160904625 163909243 167234805 170945424 175119555 179831374 185134945 191053038
39006 191053038 197567788 204610921 212056065 219719904 227377597 234789625 241729149 248000024
38998 248000024 253446211 257961417 261503259 264103824 265863590 266924910 267435539 267518008
38990 267518008 267254120 266683735 265811363 264614015 263046091 261040188 258506277 255334700
38982B55334700l926832m787764n722299o688040p645972q567604r430978j0210897
38974A98354314j0872084j1368806j1649893j1670409j1412306j0907281j0242970
38967A20230565r537178q888616q334775p844647p347666o775731o092530n300558
38959F0108864m432674l539569k678351j901172j243006p12922k95935L2543K87759
38950D5625537M66078N53220N44344M58610L33988K04965Q1958m9835k11583m07945
38940D7599337o16673p95056q96910q91455p77142n84319l63715j65156j7678
38931D2491233P9109J50791K36850L78638O09577R47517J389268J907859K453599
38922E0644441K959729L352366L562164L533742L231501K645397J800271P64145
$$ plain form
38982 255334700 251407868 246620104 240897805 234209765 226563793 217996189 208565211 198354314
38974 198354314 187482230 176113424 164463531 152793122 141380816 130473535 120230565
38967 120230565 110693387 101804771 93469996 85625349 78277683 71501952 65409422 60108864
38959 60108864 55676190 52136621 49458270 47557098 46314092 45601170 45305235 45337778 45625537
38950 45625537 46091615 46644835 47189179 47647789 47981777 48186742 48268700 48218865 48007282 47599337
38940 47599337 46982664 46187608 45290698 44399243 43622101 43037782 42674067 42508911 42491233
38931 42491233 42570342 42721133 42957983 43336621 43946198 44893715 46282983 48190842 50644441
38922 50644441 53604170 56956536 60518700 64052442 67283943 69929340 71729611 72493756
38914G2493756l56483j440410k383677l119616l617575l870407l887139l695774
38906E0122675l347145k909387k451808k025732j652469j324901j021445p23035
38898C4666753m22264j21502J73656M58240P28658R84800J234383J494480J785777
38889D0982981K122141K502805K911924L323816L709058M038006M281519M411028
38881F8283278M401664M241419L944314L558887L162582K841121K662827K660204
38873I5756296K824354L109865L445673L748233L933422L924234L656661L091391
38865A23490129K234825J158769j604j081744j939470k494974k739933k720664
38857A15905334k513473k204143j872388j580025j364608j238739j191749j192945
$$ plain form
38914 72493756 72137273 70696863 68313186 65193570 61575995 57705588 53818449 50122675
38906 50122675 46775530 43866143 41414335 39388603 37736134 36411233 35389788 34666753
38898 34666753 34244489 34122987 34296643 34754883 35483541 36468341 37702724 39197204 40982981
38889 40982981 43105122 45607927 48519851 51843667 55552725 59590731 63872250 68283278
38881 68283278 72684942 76926361 80870675 84429562 87592144 90433265 93096092 95756296
38873 95756296 98580650 101690515 105136188 108884421 112817843 116742077 120398738 123490129
38865 123490129 125724954 126883723 126882119 125800375 123860905 121365931 118625998 115905334
38857 115905334 113391861 111187718 109315330 107735305 106370697 105131958 103940209 102747264
38849A02747264j200763j179448j114683j016103r04545p94835o87498n74117
38841I5275272m50585l27561k29902j84403k03136k72052l51056l86722l33626
38832I2536229j74721P1316L60568O43367Q78832J039688J113740J106509J040028
38823I8615556R42181Q31635P10470N69780M01415K05310j1350k38906m68722
38814A01557369o94445r13193j126761j339757j554066j765605j969306k167845
38806I0026391k371384k583480k785482k936807k993715k932470k761656k519757
38798F8141640k262339k043734j898450j830005j813596j811423j791586j740783
38790E2949724j666303j589194j533930j519310j552434j625966j720283j812326
$$ plain form
38849 102747264 101546501 100367053 99252370 98236267 97331722 96536887 95849389 95275272
38841 95275272 94824687 94497126 94267224 94082821 93879685 93607633 93256577 92869855 92536229
38832 92536229 92361508 92432824 92793392 93436759 94315591 95355279 96469019 97575528 98615556
38823 98615556 99557737 100389372 101099842 101669622 102071037 102276347 102264997 102026091 101557369
38814 101557369 100862924 99949731 98822970 97483213 95929147 94163542 92194236 90026391
38806 90026391 87655007 85071527 82286045 79349238 76355523 73423053 70661397 68141640
38798 68141640 65879301 63835567 61937117 60107112 58293516 56482093 54690507 52949724
38790 52949724 51283421 49694227 48160297 46640987 45088553 43462587 41742304 39929978
38782C9929978j887707j946645j997357k042894k074615k077821k041460j961226
38774B3900253j835987j665651j454372j213964r61974p16806m96179l19678k09036
38765A5026606j81078k37370l60391n21212o92610q55881r96417j095019j126047
38756H960581j065076q98388o26258k60563J77227O55264J131701J560521J902092
38747A1537101K133761K256139K292678K282027K264474K266501K289476K308379
38739B9630536K282711K174385J962033J643538J229424P37600J95756l53622
38731C9502361q55343j253238j505183j594004j531135j352437j107024q43978
38723B9460019o04990m25470l36493l58734m90864p04641r53446j187795j367225
$$ plain form
38782 39929978 38042271 36095626 34098269 32055375 29980760 27902939 25861479 23900253
38774 23900253 22064266 20398615 18944243 17730279 16768305 16051499 15555320 15235642 15026606
38765 15026606 14845528 14608158 14247767 13726555 13033945 12178064 11181647 10086628 8960581
38756 8960581 7895505 6997117 6370859 6110296 6287523 6942787 8074488 9635009 11537101
38747 11537101 13670862 15927001 18219679 20501706 22766180 25032681 27322157 29630536
38739 29630536 31913247 34087632 36049665 37693203 38922627 39660227 39855983 39502361
38731 39502361 38647018 37393780 35888597 34294593 32763458 31411021 30303997 29460019
38723 29460019 28855029 28429559 28093066 27734332 27243468 26538827 25585381 24397586 23030361
38714B3030361j466177j477580j414263j303359j173047j039219r01168p48367
38706A3507181n73302l82413j97704m6371N5023J09107J32142J40965J44357J42835
38696A3031820J32213J07771P0379L2367J5150L5620R1855J62310K19708K46669
38686A4145862K41403K13757J78842J52067J44909J61727K00528K58412L37294
38677A6034801M43610N80077P35388Q81925R87205J032491J023616R84490R40499
38668B3644102R08736R03149R44530J059325J264148J548678J871218K169407
38660C4313293K378516K449193K359955K120838J765771J336752Q69698L91386
38652D7985402p2669m89846q22454j040859j137450j129977j051720r35724q02703
$$ plain form
38714 23030361 21564184 20086604 18672341 17368982 16195935 15156716 14255548 13507181
38706 13507181 12933879 12551466 12353762 12307391 12362414 12471521 12603663 12744628 12888985 13031820
38696 13031820 13164033 13271804 13342183 13374550 13389700 13425320 13517175 13679485 13899193 14145862
38686 14145862 14387265 14601022 14779864 14931931 15076840 15238567 15439095 15697507 16034801
38677 16034801 16478411 17058488 17793876 18675801 19663006 20695497 21719113 22703603 23644102
38668 23644102 24552838 25455987 26400517 27459842 28723990 30272668 32143886 34313293
38660 34313293 36691809 39141002 41500957 43621795 45387566 46724318 47594016 47985402
38652 47985402 47912733 47422887 46600433 45559574 44422124 43292147 42240427 41304703 40502000
38643D0502000o58282m99882l29180j62294k9157L9721L0646m4546j54398k63366
38633C8431262l47144m01141m40610m93389n87433p37371r36264j157410j365546
38624C1964954j530450j634497j671304j640220j543359j386683j181150r40917
38616B0436374o80690m15772j64464N1689K13115L10798L52210L59817L62920
38607B0825997L87987M52059N59434O99301Q44212R52905R80431Q93356O83389
38598B7279071L72983J0760l40865o21159p84799q10570p03838m93405k24006
38589B3684172N4834L02380M98567O46993P64363Q61422R29151R41374Q71564
38580B9554820P10186M70264J79604j32344m43045p35887r92440j186772j289387
$$ plain form
38643 40502000 39843718 39343836 39014656 38852362 38823205 38862926 38893572 38849026 38694628 38431262
38633 38431262 38084118 37682977 37242367 36748978 36161545 35424174 34487910 33330500 31964954
38624 31964954 30434504 28800007 27128703 25488483 23945124 22558441 21377291 20436374
38616 20436374 19755684 19339912 19175448 19227137 19440252 19751050 20103260 20463077 20825997
38607 20825997 21213984 21666043 22225477 22924778 23768990 24721895 25702326 26595682 27279071
38598 27279071 27652054 27662814 27321949 26700790 25915991 25105421 24401583 23908178 23684172
38589 23684172 23739006 24041386 24539953 25186946 25951309 26812731 27741882 28683256 29554820
38580 29554820 30265006 30735270 30914874 30782530 30339485 29603598 28611158 27424386 26134999
38571B6134999j279815j158571r49319o89821m17726j59468P2021K70640M28162
38562B2251102N31808N70876N45076M65191L45741J98382L3251j34579k82737
38553B4524111l88520m40783m47067m29927m14984m18655m41881m70925m83402
38544B0587967m57950l85073k73998j50108m3222K5766N1050L8352l029o5344
38534A9324411j42041k25146l04281l67838m04027m01459l51892k56890j35075
38525A6735762k3127L3922M94j32738l42865n82750p96653r33926r56978q47045
38515A2154096o09884k76214J08930N03807Q81865J230101J538676J792563J970553
38506A9294493K049904K013550J858083J599841J275367R35218O34166M20339
$$ plain form
38571 26134999 24855184 23696613 22747294 22057473 21639747 21480279 21552300 21822940 22251102
38562 22251102 22782910 23353786 23898862 24364053 24709794 24908176 24941427 24806848 24524111
38553 24524111 24135591 23694808 23247741 22817814 22402830 21984175 21542294 21071369 20587967
38544 20587967 20130017 19744944 19470946 19320838 19277616 19303382 19354432 19392784 19389755 19324411
38534 19324411 19182370 18957224 18652943 18285105 17881078 17479619 17127727 16870837 16735762
38525 16735762 16712635 16746557 16747051 16614313 16271448 15688698 14892045 13958119 13001141 12154096
38515 12154096 11544212 11267998 11376928 11880735 12762600 13992701 15531377 17323940 19294493
38506 19294493 21344397 23357947 25216030 26815871 28091238 29026456 29660622 30080961
38498C0080961L22867L38849M27104N18397N42660M59451K73461K6885k24247
38489C2766388m35385n88741o94060p77102q63591r68533j095927j244248j407825
38480B4690976j570371j698726j748652j684585j501652j234856r49765p20245
38472A3582124o02900o16633p34861q95935j029519j085831j051573r45516q00133
38463E819223o42556m85752l32726j87469o1311L2281Q9744J24243J60372K21230
38453D737279L17414M43365N81129P09271Q13023Q89907R47125R92990J028475
38444A1459978J043196J016541R23749P45978M80714J46645k20650n80487r00848
38435A4114816j167891j386608j571629j732184j859045j921267j875849j686143
$$ plain form
38498 30080961 30403828 30742677 31169781 31688178 32230838 32690289 32963750 32990635 32766388
38489 32766388 32331003 31742262 31048202 30271100 29407509 28438976 27343049 26098801 24690976
38480 24690976 23120605 21421879 19673227 17988642 16486990 15252134 14302369 13582124
38472 13582124 12979224 12362591 11627730 10731795 9702276 8616445 7564872 6619356 5819223
38463 5819223 5176667 4690915 4358189 4170720 4109409 4141690 4231434 4355677 4516049 4737279
38453 4737279 5054693 5498058 6079187 6788458 7601481 8491388 9438513 10431503 11459978
38444 11459978 12503174 13519715 14443464 15189442 15670156 15816801 15596151 15015664 14114816
38435 14114816 12946925 11560317 9988688 8256504 6397459 4476192 2600343 914200
38427I14200j339183q53051k73353L35023Q96409J335525J594692J652196J530224
38418E792682J285649R88643P00676M60695K81639J55122O0706k3691j13426k13339
38408I375356l19693m25581n24924o11550o75033o98513o62091n51571l69545
38399D536855j43690P4522K25083K64456J87694L4560j24501k15421j86791k3095
38389D629672K58619O21990J024222J423528J782908K073443K277253K388954
38381A6480589K415259K372393K280253K154027J997695J804181J562723J269076
38373C2336196R32891N78578K39216n4018k82519m46490n63919o62739p70511
38364C1306685r06815j079754j282992j491166j658124j725094j638825j371510
$$ plain form
38427 914200 -424983 -1278034 -1551387 -1216364 -319955 1015570 2610262 4262458 5792682
38418 5792682 7078331 8066974 8767650 9228345 9509984 9665106 9725812 9702121 9588695 9375356
38408 9375356 9055663 8630082 8105158 7493608 6818575 6120062 5457971 4906400 4536855
38399 4536855 4393165 4467687 4692770 4957226 5144920 5179480 5054979 4839558 4652767 4629672
38389 4629672 4888291 5510281 6534503 7958031 9740939 11814382 14091635 16480589
38381 16480589 18895848 21268241 23548494 25702521 27700216 29504397 31067120 32336196
38373 32336196 33269087 33847665 34086881 34032863 33750344 33303854 32739935 32077196 31306685
38364 31306685 30399870 29320116 28037124 26545958 24887834 23162740 21523915 20152405
38356B0152405r33558l75331K23330P75302J213364J508554J668882J721190J689617
38347B7643755J582774J393112J106263P15884K37415k87324p99064j239472j568457
38338B8784886j771132j853602j834380j737931j590292j413778j222013j020343
38330A6341415q11949o02804m00673k12047m3127R6502J93786K36925K19698J42368
38320A5160094J1399j59875l51501n39833p01879q19747q85430r04126q91677
38311I917425q65794q38663q18135q13908q37349q90201r51530r77557r18944
38302B005344p44876m57037q4535L34545P70397J206110J629442K021088K350120
38293I030598K581126K688871K670977K550122K363796K147226J918941J677150
$$ plain form
38356 20152405 19218847 18843516 19066846 19842148 21055512 22564066 24232948 25954138 27643755
38347 27643755 29226529 30619641 31725904 32441788 32679203 32391879 31592815 30353343 28784886
38338 28784886 27013754 25160152 23325772 21587841 19997549 18583771 17361758 16341415
38330 16341415 15529466 14926662 14525989 14313942 14270815 14367317 14561103 14798028 15017726 15160094
38320 15160094 15171493 15011618 14660117 14120284 13418405 12598658 11713228 10809102 9917425
38311 9917425 9051631 8212968 7394833 6580925 5743576 4853375 3901845 2924288 2005344
38302 2005344 1260468 803431 718896 1053441 1823838 3029948 4659390 6680478 9030598
38293 9030598 11611724 14300595 16971572 19521694 21885490 24032716 25951657 27628807
38285B7628807J409406J109424P88686M73275J88292n6625k69068m63840o51726
38276C0156631q35119j009696j167497j299880j401160j471338j513838j528185
38268A9929918j504836j429921j298140j121759r25664p32141n49767l76477k12628
38259A1778585p1458K1421L8021l9288k08938m49870p30656j022518j305739j563707
38249F445853j771650j894855j902891j788797j574776j297789r87241o52762
38241e424908k89032J09611N35930R64423J355334J666664J869169J956865J948604
38232D692660J882587J806962J766150J783126J846544J915728J945287J913262
38224A9552306J832598J740417J676357J663746J699361J751810J768740J692629
$$ plain form
38285 27628807 29038213 30147637 30936323 31409598 31597890 31541265 31272197 30808357 30156631
38276 30156631 29321512 28311816 27144319 25844439 24443279 22971941 21458103 19929918
38268 19929918 18425082 16995161 15697021 14575262 13649598 12917457 12367690 11991213 11778585
38259 11778585 11707127 11728548 11766569 11727281 11518343 11068473 10337817 9315299 8009560 6445853
38249 6445853 4674203 2779348 876457 -912340 -2487116 -3784905 -4772146 -5424908
38241 -5424908 -5713940 -5604329 -5068399 -4103976 -2748642 -1081978 787191 2744056 4692660
38232 4692660 6575247 8382209 10148359 11931485 13778029 15693757 17639044 19552306
38224 19552306 21384904 23125321 24801678 26465424 28164785 29916595 31685335 33377964
38216C3377964J480659J120830O37306Q1954m85138j016332j485543j880790k189524
38207B9641386k391854k466868k403260k203873j884216j472293j012246n65309
38199A5241467k00262K6248R0514J2314j50890l23580m36157m43216l31607j20051
38189A3364780J46836M10355O16287P35666P76806P79518P93687Q54967R70878
38180A9449780J121926J274041J394863J465759J483022J448773J361594J217947
38172C0217705J023322P99759N79239L87565K32499J04155j5135j38335k63322
38163C2927452l68392m17344l74083k19703L7687L65234P16302J042449J301501
38154C5011103J462414J509891J448080J298393J089187Q43067N71984K84162
$$ plain form
38216 33377964 34858623 35979453 36616759 36698713 36213575 35197243 33711700 31830910 29641386
38207 29641386 27249532 24782664 22379404 20175531 18291315 16819022 15806776 15241467
38199 15241467 15041205 15067453 15157967 15170281 15019391 14695811 14259654 13816438 13484831 13364780
38189 13364780 13511616 13921971 14538258 15273924 16050730 16830248 17623935 18478902 19449780
38180 19449780 20571706 21845747 23240610 24706369 26189391 27638164 28999758 30217705
38172 30217705 31241027 32040786 32620025 33007590 33240089 33344244 33329109 33190774 32927452
38163 32927452 32559060 32141716 31767633 31547930 31585617 31950851 32667153 33709602 35011103
38154 35011103 36473517 37983408 39431488 40729881 41819068 42662135 43234119 43518281
38146D3518281l847k61482m51153n44197n35528m47799l23686k12307j57091j87444
38136D0393747l12943n20176p74895j030496j239915j366597j391445j313902
38128C2443378j146792r08096o15704k88242N2111L81640O83269R54144J204421
38119C2760129J446028J678928J884991K033640K093887K043804J873981J589544
38111D7404932J214951P97184L97590P0077j61983l12270m14942m97344n62830
38102D7935365n94895n75607n01312l84163k41781q6404P7212K45016M05077N34400
38092D6812908O02413N77486M32915J52482k62827p87682j368842j929781k385645
38083D1843427k665489k732789k593474k287710j872931j409444r52259n44668
$$ plain form
38146 43518281 43514434 43252952 42801799 42257602 41722074 41274275 40950589 40738282 40581191 40393747
38136 40393747 40080804 39560628 38785733 37755237 36515322 35148725 33757280 32443378
38128 32443378 31296586 30388490 29772786 29484544 29536655 29918295 30601564 31555708 32760129
38119 32760129 34206157 35885085 37770076 39803716 41897603 43941407 45815388 47404932
38111 47404932 48619883 49417067 49814657 49884734 49722751 49410481 48995539 48498195 47935365
38102 47935365 47340470 46764863 46263551 45879388 45637607 45551203 45628415 45873431 46278508 46812908
38092 46812908 47415321 47992807 48425722 48578204 48315377 47527695 46158853 44229072 41843427
38083 41843427 39177938 36445149 33851675 31563965 29691034 28281590 27329331 26784663
38075B6784663k10944M7350K46479M09674N57625P04082Q54485J004677J139607
38066C1537698J235184J267045J225791J128876J014984R18456Q42466P56067
38058C9926567O19757M17301J67620q8771l13951m90936o29127p56745r03639
38049C7948076j083092j284397j481103j646895j765703j830470j836377j777041
38041B5242998j646368j442727j171857q47594m90743j25654K25450N47694Q34140
38032B1125339J080326J277080J408372J457583J418717J305008J148223R86760
38024C1207408Q47388P30828O10860M47946K07827j27069n57419j071895j649281
38015C0646593k256383k846975l367375l768567m018673m108183m045469l847615
$$ plain form
38075 26784663 26573719 26621069 26867548 27277222 27834847 28538929 29393414 30398091 31537698
38066 31537698 32772882 34039927 35265718 36394594 37409578 38328034 39170500 39926567
38058 39926567 40546324 40963625 41131245 41042474 40728523 40237587 39608460 38851715 37948076
38049 37948076 36864984 35580587 34099484 32452589 30686886 28856416 27020039 25242998
38041 25242998 23596630 22153903 20982046 20134452 19643709 19518055 19743505 20291199 21125339
38032 21125339 22205665 23482745 24891117 26348700 27767417 29072425 30220648 31207408
38024 31207408 32054796 32785624 33396484 33844430 34052257 33925188 33367769 32295874 30646593
38015 30646593 28390210 25543235 22175860 18407293 14388620 10280437 6234968 2387353
$$ [...]
##END NTUPLES=NMR SPECTRUM
##END=
