##TITLE=31Pdec_DE-55rm30m
 
 64 sc
 2.5.2024
##JCAMPDX= 6.0         $$ Bruker NMR JCAMP-DX V2.0
##DATA TYPE= NMR SPECTRUM
##DATA CLASS= NTUPLES
##ORIGIN= UXNMR, Bruker Analytische Messtechnik GmbH
##OWNER= root
$$ XWIN-NMR		Version 3.5
$$ Thu May  2 13:53:07 2024 Russian Standard Time (UT+4h)  she@DPX200
##.OBSERVE FREQUENCY= 81.013821
##.OBSERVE NUCLEUS= ^31P
##.ACQUISITION MODE= SIMULTANEOUS
##.ACQUISITION SCHEME= undefined
##.AVERAGES= 64
##.DIGITISER RES= 16
##SPECTROMETER/DATA SYSTEM= spect
##.PULSE SEQUENCE= zgpg30
##.SOLVENT NAME= CDCl3
##.SHIFT REFERENCE= (INTERNAL, CDCl3, 0, 248.564)
##AUDIT TRAIL= $$ (NUMBER, WHEN, WHO, WHERE, WHAT)
$$ ##TITLE= Audit trail, XWIN-NMR		Version 3.5
$$ ##JCAMPDX= 5.01
$$ ##ORIGIN= Bruker BioSpin GmbH
$$ ##OWNER= she
$$ F:/spectra/data/she/nmr/P31/1/pdata/1/auditp.txt
$$ ##AUDIT TRAIL=  $$ (NUMBER, WHEN, WHO, WHERE, WHAT)
(   1,<2024-05-02 13:52:02.23 +0400>,<she>,<DPX200>,
      <continue with go, POWCHK disabled, PULCHK disabled
       configuration hash MD5:
       00 E9 B6 7A A2 85 ED C7 34 08 36 98 17 FE 4E 26
       data hash MD5: 32K
       F9 02 38 5E 56 6A 5A 5D 4B 74 E1 C9 F8 1F 14 86>)
(   2,<2024-05-02 13:52:16.98 +0400>,<she>,<DPX200>,
      <Start of raw data processing
       efp BC_mod = 2 LB = 10 FT_mod = 6 PKNL = 1 PHC0 = -13239.36 PHC1 = 79.68328 SI = 64K 
       data hash MD5: 64K
       F9 71 E8 87 33 0F A9 3F A2 95 D7 3F 05 C3 B9 C5>)
(   3,<2024-05-02 13:52:38.09 +0400>,<she>,<DPX200>,
      <pk PHC0 = 1.716795 PHC1 = 2.400002 
       data hash MD5: 64K
       32 9E 56 30 18 D3 23 45 29 22 E4 C7 43 EA 9B D5>)
$$ ##END=
$$ 
$$ hash MD5
$$ 4E 0A 8E 36 50 5E 89 4C 6E 3B DB 01 C5 64 06 89
##$RELAX= 
##$RELAX= 
##$RELAX= 
##$RELAX= 
##$RELAX= 
##$RELAX= 
##$RELAX= 
##$RELAX= 
##$RELAX= 
$$ Bruker specific parameters
$$ --------------------------
##$DU= <F:/spectra>
##$EXPNO= 1
##$NAME= <P31>
##$PROCNO= 1
##$TYPE= <nmr>
##$USER= <she>
##$AMP= (0..31)
100 100 100 100 100 100 100 100 100 100 100 100 100 100 100 100 100 100 
100 100 100 100 100 100 100 100 100 100 100 100 100 100 
##$AQSEQ= 0
##$AQ_mod= 1
##$AUNM= <au_zg>
##$AUTOPOS= <>
##$BF1= 81.014009
##$BF2= 200.13
##$BF3= 200.13
##$BF4= 200.13
##$BF5= 200.13
##$BF6= 200.13
##$BF7= 200.13
##$BF8= 200.13
##$BYTORDA= 1
##$CFDGTYP= 0
##$CFRGTYP= 5
##$CHEMSTR= <none>
##$CNST= (0..31)
1 1 145 1 1 1 1 1 1 1 1 1 1 1 1 1 1 1 1 1 1 1 1 1 1 1 1 1 1 1 1 1 
##$CPDPRG= <waltz16>
##$CPDPRG1= <>
##$CPDPRG2= <waltz16>
##$CPDPRG3= <>
##$CPDPRG4= <mlev>
##$CPDPRG5= <mlev>
##$CPDPRG6= <mlev>
##$CPDPRG7= <mlev>
##$CPDPRG8= <mlev>
##$CPDPRGB= <>
##$CPDPRGT= <>
##$D= (0..31)
0 1 0 0 0 0 0 0 0 0 0 0.03 2e-05 3e-06 0 0 0 0 0 0 0 0 0 0 0 0 0 0 0 0 
0 0 
##$DATE= 1714643387
##$DBL= (0..7)
120 120 120 11 120 120 24 19 
##$DBP= (0..7)
150 150 150 150 150 150 150 150 
##$DBP07= 0
##$DBPNAM0= <>
##$DBPNAM1= <>
##$DBPNAM2= <>
##$DBPNAM3= <>
##$DBPNAM4= <>
##$DBPNAM5= <>
##$DBPNAM6= <>
##$DBPNAM7= <>
##$DBPOAL= (0..7)
0.5 0.5 0.5 0.5 0.5 0.5 0.5 0.5 
##$DBPOFFS= (0..7)
$$ [...]
##$SUBNAM2= <"">
##$SUBNAM3= <"">
##$SUBNAM4= <"">
##$SUBNAM5= <"">
##$SUBNAM6= <"">
##$SUBNAM7= <"">
##$SUBNAM8= <"">
##$SUBNAM9= <"">
##$SW= 501.771253377433
##$SWIBOX= (0..15)
0 1 3 0 0 0 0 0 0 0 0 0 0 0 0 0 
##$SW_h= 40650.406504065
##$TD= 32768
##$TD0= 1
##$TE= 0
##$TE2= 300
##$TE3= 300
##$TEG= 300
##$TL= (0..7)
0 120 53 12 22 120 120 120 
##$TP= (0..7)
150 150 150 150 150 150 150 150 
##$TP07= 0
##$TPNAME0= <>
##$TPNAME1= <>
##$TPNAME2= <>
##$TPNAME3= <>
##$TPNAME4= <>
##$TPNAME5= <>
##$TPNAME6= <>
##$TPNAME7= <>
##$TPOAL= (0..7)
0.5 0.5 0.5 0.5 0.5 0.5 0.5 0.5 
##$TPOFFS= (0..7)
0 0 0 0 0 0 0 0 
##$TUNHIN= 0
##$TUNHOUT= 0
##$TUNXOUT= 0
##$USERA1= <user>
##$USERA2= <user>
##$USERA3= <user>
##$USERA4= <user>
##$USERA5= <user>
##$V9= 5
##$VALIST= <valist>
##$VCLIST= <CCCCCCCCCCCCCCC>
##$VD= 0
##$VDLIST= <DDDDDDDDDDDDDDD>
##$VPLIST= <PPPPPPPPPPPPPPP>
##$VTLIST= <TTTTTTTTTTTTTTT>
##$WBST= 1024
##$WBSW= 4
##$XGAIN= (0..3)
0 0 0 0 
##$XL= 0
##$YL= 0
##$YMAX_a= 11216
##$YMIN_a= -8683
##$ZGOPTNS= <>
##$ZL1= 120
##$ZL2= 120
##$ZL3= 120
##$ZL4= 120
##$ABSF1= 0
##$ABSF2= 0
##$ABSG= 0
##$ABSL= 0
##$ALPHA= 0
##$AQORDER= 0
##$ASSFAC= 0
##$ASSFACI= 0
##$ASSFACX= 0
##$ASSWID= 0
##$AUNMP= <proc_1d>
##$AZFE= 0.1
##$AZFW= 0.5
##$BCFW= 0
##$BC_mod= 2
##$BYTORDP= 0
##$COROFFS= 0
##$CY= -3
##$DATMOD= 1
##$DC= 0
##$DFILT= <>
##$DTYPP= 0
##$F1P= 0
##$F2P= 0
##$FCOR= 1
##$FTSIZE= 65536
##$FT_mod= 6
##$GAMMA= 0
##$GB= 0
##$INTBC= 1
##$INTSCL= 6.047779e-11
##$ISEN= 30
##$LB= 10
##$LEV0= 0
##$LPBIN= 0
##$MAXI= 10000
##$MC2= 0
##$MEAN= 0
##$ME_mod= 0
##$MI= 50
##$NCOEF= 0
##$NC_proc= -9
##$NLEV= 6
##$NOISF1= 182.463
##$NOISF2= 159.3651
##$NSP= 0
##$NTH_PI= 0
##$NZP= 0
##$OFFSET= 248.5645
##$PC= 4
##$PHC0= -13237.64
##$PHC1= 82.08328
##$PH_mod= 1
##$PKNL= yes
##$PPARMOD= 0
##$PSCAL= 0
##$PSIGN= 0
##$REVERSE= no
##$SF= 81.0140089999694
##$SI= 65536
##$SIGF1= 159.3651
##$SIGF2= -187.1042
##$SINO= 113.3802
##$SIOLD= 16384
##$SREGLST= <1H.CDCl3>
##$SSB= 0
##$STSI= 65536
##$STSR= 0
##$SW_p= 40650.406504065
##$SYMM= 0
##$S_DEV= 0
##$TDeff= 32768
##$TDoff= 0
##$TI= <>
##$TILT= no
##$TM1= 0
##$TM2= 0
##$TOPLEV= 0
##$USERP1= <user>
##$USERP2= <user>
##$USERP3= <user>
##$USERP4= <user>
##$USERP5= <user>
##$WDW= 1
##$XDIM= 65536
##$YMAX_p= 350078495
##$YMIN_p= -65413641
$$ End of Bruker specific parameters
$$ ---------------------------------
##NTUPLES= NMR SPECTRUM
##VAR_NAME=  FREQUENCY,     SPECTRUM/REAL,   SPECTRUM/IMAG
##SYMBOL=    X,             R,               I
##VAR_TYPE=  INDEPENDENT,   DEPENDENT,       DEPENDENT
##VAR_FORM=  AFFN,          ASDF,            ASDF
##VAR_DIM=   65536,         65536,           65536
##UNITS=     HZ,            ARBITRARY UNITS, ARBITRARY UNITS
##FACTOR=    0.620285442955139, 1,           1
##FIRST=     20137.2065510682, 0,            0
##LAST=      -20513.1999529968, 0,           0
##MIN=       -20513.1999529968, -65413641,   0
##MAX=       20137.2065510682, 350078495,    0
$$ Real data points
##PAGE= N=1
##DATA TABLE= (X++(R..R)), XYDATA
$$ [...]
58184c726887l2911K6553Q0201J20591J50130J79279K19842K76957L44536M06818
58174a954891M45194M46680M09601L43770K65651J91592J32369R1123O5289N1549
58164D87927N0620O7833J08466J71618K47826L21818L76900L97315L68600K79126
58154B878049J24885q3984l19529n39857p01590p76074p60640o78341n66880m63936
58144a887897l96628l78066m08706m78787n70100o58337p17788p27956o78853
58135f903118n71758m15592k22564o732K14430M18949N83122O87681P23201O90718
58125d801663N97807M54183K70687O1111j56726l63547n43964o91035q06179q93693
58115f873019r53253r76413r50576q67457p29090n47229l38558j20697Q8949K73230
$$ y = [-3726887, -3759798, -3733245, -3653044, -3532453, -3382323, -3203044, -2983202, -2706245, -2361709, -1954891, -1509697, -1063017, -653416, -309646, -43995, 147597, 279966, 371089, 436378, 487927, 538547, 606380, 714846, 886464, 1134290, 1456108, 1833008, 2230323, 2598923, 2878049, 3002934, 2918950, 2599421, 2059564, 1357974, 581900, -178740, -857081, -1423961, -1887897, -2284525, -2662591, -3071297, -3550084, -4120184, -4778521, -5496309, -6224265, -6903118, -7474876, -7890468, -8113032, -8119764, -7905334, -7486385, -6903263, -6215582, -5492381, -4801663, -4203856, -3749673, -3478986, -3417875, -3574601, -3938148, -4482112, -5173147, -5979326, -6873019, -7826272, -8802685, -9753261, -10620718, -11349808, -11897037, -12235595, -12356292, -12267343, -11994113]
58105a1994113M15969N03349N25510M78952L69807K16044M5965j07380k13411
58096i759308k50059k08073r4302O7081K38578L79606M58728M60960L87227K49251
58086h070311O4828j44789l56402n46564o94419p86542q21985q12609p75604p22800
58076a3667197o55763n70085m63267l38817k04816o9808O1574J91477L27430M75423
58066a4913849O31751P80638Q99609R67622R70711R05296P81558O25264M72750
58057g878650L57463K94856K76446K78344K78322K68671K56095K51300K59027
58048e358126K76636K99709L26656L57000L86051M03026L96102L60502L02580
58039b249864K37273J82210J52760J58248J97740K56907L10242L29531K93832
$$ y = [-11994113, -11578144, -11074795, -10549285, -10070333, -9700526, -9484482, -9438517, -9545897, -9759308, -10009367, -10217440, -10311742, -10244661, -10006083, -9626477, -9167749, -8706789, -8319562, -8070311, -8005483, -8150272, -8506674, -9053238, -9747657, -10534199, -11356184, -12168793, -12944397, -13667197, -14322960, -14893045, -15356312, -15695129, -15899945, -15969753, -15908179, -15716702, -15389272, -14913849, -14282098, -13501460, -12601851, -11634229, -10663518, -9758222, -8976664, -8351400, -7878650, -7521187, -7226331, -6949885, -6671541, -6393219, -6124548, -5868453, -5617153, -5358126, -5081490, -4781781, -4455125, -4098125, -3712074, -3309048, -2912946, -2552444, -2249864, -2012591, -1830381, -1677621, -1519373, -1321633, -1064726, -754484, -424953, -131121]
58030a31121J95416M0719j51640l55147n42632o94133q00255q58927q69787q32365
58020d999872p49387o30983m95480l66048k64956k07092j94125k12208k36469
58011h356620k42377k18841j75261j37670j35681j87557k91662m28248n68843
58002a0742760o86318p60444p79317p40550o53478n38839m22042l22052k43618
57993a5889418j79015j17472n3786J1089P6504J47716K33971L40621M63268N89794
57983a4376728P07969Q11384Q99436R73452J033586J078732J108539J125491J135279
57974e502860J144161J153848J156763J135624J069055R41289P51197N15786K65667
57965B630530L4566j51408k79389l49236l69974l56306l25628k94532k74558k68502
$$ y = [-131121, 64295, 105014, -46626, -401773, -944405, -1638538, -2438793, -3297720, -4167507, -4999872, -5749259, -6380242, -6875722, -7241770, -7506726, -7713818, -7907943, -8120151, -8356620, -8598997, -8817838, -8993099, -9130769, -9266450, -9454007, -9745669, -10173917, -10742760, -11429078, -12189522, -12968839, -13709389, -14362867, -14901706, -15323748, -15645800, -15889418, -16068433, -16185905, -16239691, -16228602, -16152098, -16004382, -15770411, -15429790, -14966522, -14376728, -13668759, -12857375, -11957939, -10984487, -9950901, -8872169, -7763630, -6638139, -5502860, -4358699, -3204851, -2048088, -912464, 156591, 1097880, 1849077, 2364863, 2630530, 2665096, 2513688, 2234299, 1885063, 1515089, 1158783, 833155, 538623, 264065, -4437]
57955d437k69340k63651k39559j95607j44105j05066r3715j09757j35104j40847
57945a701188r9219N028J68726L72381N88974P94069R71246J110740J204722J244426
57935D659905J221559J131815R76544P61502M95420J91184j31710m47997p32458
57926H125764r67002j143512j261401j323627j334939j302650j237758j154598
57918a599723j068284r90450r24919q66187q02371p21229o15548m85007l34690
57909h408408j72581q147J47885K83757L87952M51031M66964M33854L55109K41337
57899e821247J10857j3994j14677j83903k27071k56396k82133l06884l25349l27643
57889g748440l03495k46353j56903m4540P4373J80551K55968K87466K70411K11733
$$ y = [-4437, -273777, -537428, -776987, -972594, -1116699, -1221765, -1315480, -1425237, -1560341, -1701188, -1800407, -1795379, -1626653, -1254272, -665298, 128771, 1100017, 2210757, 3415479, 4659905, 5881464, 7013279, 7989823, 8751325, 9246745, 9437929, 9306219, 8858222, 8125764, 7158762, 6015250, 4753849, 3430222, 2095283, 792633, -445125, -1599723, -2668007, -3658457, -4583376, -5449563, -6251934, -6973163, -7588711, -8073718, -8408408, -8580989, -8589136, -8441251, -8157494, -7769542, -7318511, -6851547, -6417693, -6062584, -5821247, -5710390, -5724384, -5839061, -6022964, -6250035, -6506431, -6788564, -7095448, -7420797, -7748440, -8051935, -8298288, -8455191, -8499731, -8425358, -8244807, -7988839, -7701373, -7430962, -7219229]
57879g219229J29507M7240j4789m5770m4604j5413L7206J09392J95511K84704
57869f536245L59638L99112L84399L07447J77106J8760j34344k53667l24103l44245
57859e946142l20403k60401j70920n8096P1078K08416L45949M78196O02788P17191
57849d332344Q12625Q70583Q67427P86605O30529M22863J99271o198j70090k81477
57839b00206l40812l58576l51900l37270l23133l08864k91113k70771k53528k44721
57829c280894k45359k53817k70019k95865l30435l65403l86501l80939l45258
57820f154490k88566k29930j91090j86481k14427k55115k78624k59668j90537
57811h248928q4805K9474J22022J70433J63589J00024j3432j60134l12864m39006
$$ y = [-7219229, -7089722, -7042482, -7057271, -7103041, -7147645, -7163058, -7125852, -7016460, -6820949, -6536245, -6176607, -5777495, -5393096, -5085649, -4908543, -4889783, -5024127, -5277794, -5601897, -5946142, -6266545, -6526946, -6697866, -6755962, -6684884, -6476468, -6130519, -5652323, -5049535, -4332344, -3519719, -2649136, -1781709, -995104, -364575, 58288, 257559, 251361, 81271, -200206, -541018, -899594, -1251494, -1588764, -1911897, -2220761, -2511874, -2782645, -3036173, -3280894, -3526253, -3780070, -4050089, -4345954, -4676389, -5041792, -5428293, -5809232, -6154490, -6443056, -6672986, -6864076, -7050557, -7264984, -7520099, -7798723, -8058391, -8248928, -8333733, -8304259, -8182237, -8011804, -7848215, -7748191, -7761623, -7921757, -8234621, -8673627]
57801h673627n11350n18305m67236l79853k83221k01187j49190j32411j45631
57792a1462011j74772k02314k16264k16455k11438k08012k03917j91021j64532
57783a3250736j28384r2838o8838o4302q2787j22272j73607k20470k42477k21325
57773a4668036j47712k6192J24032K72759L86227M37188M14640L28774K07887
57764a2670433Q8505L392k7751k254O7554J60877K56271L37405L95781M31149
57754a0959504M50200M63358M80360N06464N40993N78702O13191O40154O57490
57745f028592O61905O45749N98892N15267L98354K60837J19397j1081j21459k10513
57735c171244k85157l57834m41412n44136o67224q05440r48650j082386j187871
$$ y = [-8673627, -9184977, -9703282, -10170518, -10550371, -10833592, -11034779, -11183969, -11316380, -11462011, -11636783, -11839097, -12055361, -12271816, -12483254, -12691266, -12895183, -13086204, -13250736, -13379120, -13471958, -13540796, -13605098, -13687885, -13810157, -13983764, -14204234, -14446711, -14668036, -14815748, -14841940, -14717908, -14445149, -14058922, -13621734, -13207094, -12878320, -12670433, -12581928, -12578536, -12606287, -12608541, -12540987, -12380110, -12123839, -11786434, -11390653, -10959504, -10509304, -10045946, -9565586, -9059122, -8518129, -7939427, -7326236, -6686082, -6028592, -5366687, -4720938, -4122046, -3606779, -3208425, -2947588, -2828191, -2839272, -2960731, -3171244, -3456401, -3814235, -4255647, -4799783, -5467007, -6272447, -7221097, -8303483, -9491354]
57726i491354j244297j235310j157099j021731q51398o66481m75976k77176o3900
57717a6484722J64178L98577O26298Q35778J018754J167774J273684J326619J319948
57708h353112J254437J140025R93480Q31987O65999M96723L20463J35968n1286
57699b565316k30277l88886n18508o16960o88339p39140p72308p83262p61297
57690h064293o95957n84860m38338k77823j28254q509P4561J24903J50020J52920
57680i695630J29618P5293m814q9011j44192j39803o0904Q7441K84169M99662
57670i058171P03424Q71312R90951J062631J095039J099109J084288J058179J026825
57661f6413R92779R51730Q91427P95565O51001M53934K12087n6844l28913n78839
$$ y = [-9491354, -10735651, -11970961, -13128060, -14149791, -15001189, -15667670, -16143646, -16420822, -16484722, -16320544, -15921967, -15295669, -14459891, -13441137, -12273363, -10999679, -9673060, -8353112, -7098675, -5958650, -4965170, -4133183, -3467184, -2970461, -2649998, -2514030, -2565316, -2795593, -3184479, -3702987, -4319947, -5008286, -5747426, -6519734, -7302996, -8064293, -8760250, -9345110, -9783448, -10061271, -10189525, -10198034, -10123473, -9998570, -9848550, -9695630, -9566012, -9490719, -9495533, -9584544, -9728736, -9868539, -9929443, -9842002, -9557833, -9058171, -8354747, -7483435, -6492484, -5429853, -4334814, -3235705, -2151417, -1093238, -66413, 926366, 1878096, 2769523, 3565088, 4216089, 4670023, 4882110, 4825266, 4496353, 3917514]
57651C917514p85333r34892j022416j049146j020272r44045q32105o99326n61478
57642c931499m31090l14029k09689j14720k6993N3195J24000J82734K26295K53069
57632d188727K65700K71145K76217K82027K82445K67421K27394J55330M6742j00008
57622b214314k82329m91923p14347r29697j114559j245573j304361j281991j180653
57613a0759747j012155p95247n53654l14097j02090O4379J79717K50532K90671
57604a2751691L15154L35907L59358L84976M05202M08234L83427L26576K41599
57595i591258J38051K7365p8599j66752k23131k36759k04878j35618m7086L5246
57585a0483419Q2944P3147L15j16773k41167l35666l80741l80723l56688l33965
$$ y = [3917514, 3132181, 2197289, 1174873, 125727, -894545, -1838590, -2670695, -3370021, -3931499, -4362589, -4676618, -4886307, -5001027, -5028020, -4974825, -4850825, -4668091, -4441796, -4188727, -3923027, -3651882, -3375665, -3093638, -2811193, -2543772, -2316378, -2161048, -2114306, -2214314, -2496643, -2988566, -3702913, -4632610, -5747169, -6992742, -8297103, -9579094, -10759747, -11771902, -12567149, -13120803, -13434900, -13536990, -13472611, -13292894, -13042362, -12751691, -12436537, -12100630, -11741272, -11356296, -10951094, -10542860, -10159433, -9832857, -9591258, -9453207, -9425842, -9504441, -9671193, -9894324, -10131083, -10335961, -10471579, -10518665, -10483419, -10400475, -10327328, -10327013, -10443786, -10684953, -11020619, -11401360, -11782083, -12138771, -12472736]
57575a2472736l32581l63323m26984n14691o09910o93733p52225p81390p86125
57566a7733698p74702p53773p26845o94425o53171n94738n07545l82198k17430
57557b3038525k2555J85008L85640N64059P13451Q35049R33294J009378J057431
57548a7377770J066344J027100R41384Q25176P03728O00335N26412M79065M46617
57539a0761609M17333L85858L54251L27882L09496K95908K79830K55061K20831
57530g915159J82444J48598J27259J22028J30921J48704J71067J96462K23575
57521f464101K47894K62678K64299K55885K44433K34027K22152K02289J69557
57512d360887J24412P2946K5110q035j8442n972J8462L4941K2994k6523j03264
$$ y = [-12472736, -12805317, -13168640, -13595624, -14110315, -14720225, -15413958, -16166183, -16947573, -17733698, -18508400, -19262173, -19989018, -20683443, -21336614, -21931352, -22438897, -22821095, -23038525, -23061080, -22876072, -22490432, -21926373, -21212922, -20377873, -19444579, -18435201, -17377770, -16311426, -15284326, -14342942, -13517766, -12814038, -12213703, -11687291, -11208226, -10761609, -10344276, -9958418, -9604167, -9276285, -8966789, -8670881, -8391051, -8135990, -7915159, -7732715, -7584117, -7456858, -7334830, -7203909, -7055205, -6884138, -6687676, -6464101, -6216207, -5953529, -5689230, -5433345, -5188912, -4954885, -4732733, -4530444, -4360887, -4236475, -4163529, -4138419, -4146454, -4164896, -4170868, -4152406, -4117465, -4094471, -4120994, -4224258]
57501d224258j79578k23693k16268j59675p4529J3363Q7065J45679K01250K67561
57491d363083L47735M28986M88339N05157M71411L93317K85470J63258L8004q4408
57481a325814k02243l14326m15191m92036n26688n02743m14135k70632r7490P1234
57471d490064K03678K80887L01724K79588K34099J83235J39208J07776Q9795Q4060
57461b586014Q9930J07675J36269J71278K05535K32651K50941K65224K85227L20377
57451e20907L72920M33440M82772N00492M75350M11047L23583K31826J47583P1559
57441B929665l187q4223j74588k71711l69144m59437n36864n98729o43988o70394
57431h82600o73338o48319n95143n20531m37390l60879l02010k60785k23559j69081
$$ y = [-4224258, -4403836, -4627529, -4843797, -5003472, -5078001, -5064638, -4977573, -4831894, -4630644, -4363083, -4015348, -3586362, -3098023, -2592866, -2121455, -1728138, -1442668, -1279410, -1241406, -1325814, -1528057, -1842383, -2257574, -2749610, -3276298, -3779041, -4193176, -4463808, -4561298, -4490064, -4286386, -4005499, -3703775, -3424187, -3190088, -3006853, -2867645, -2759869, -2670074, -2586014, -2496084, -2388409, -2252140, -2080862, -1875327, -1642676, -1391735, -1126511, -841284, -520907, -147987, 285453, 768225, 1268717, 1744067, 2155114, 2478697, 2710523, 2858106, 2929665, 2926478, 2842255, 2667667, 2395956, 2026812, 1567375, 1030511, 431782, -212206, -882600, -1555938, -2204257, -2799400, -3319931, -3757321, -4118200, -4420210, -4680995, -4904554, -5073635]
57421e073635q2148L3581J53351K42225K72108K34069J39635J2738j21314k44097
57411d433487l47261m30749m97579n48046n77135n77209n43773m79446l93086
57402h827771k96020j99715j16877o2693n1520q8493j61966k44396l03259l15124
57392a0667834k73489j86766p0557N9108J88827L08835M14090N04939N85339O58604
57382h478904P23703P75849Q11294Q31640Q42330Q45252Q31683P82815O79352
57373a354986N14245K99583O2956j63863l55820m98788n87532o22664o09984n60648
57363c877501m89171m09592l32592k64413k06094j52996r7263l4394L0026P9333
57353e754657R2326N3336l9951j74163l23307m55154n38437n49403m77471l29548
$$ y = [-5073635, -5155783, -5122202, -4968851, -4726626, -4454518, -4220449, -4080814, -4068076, -4189390, -4433487, -4780748, -5211497, -5709076, -6257122, -6834257, -7411466, -7955239, -8434685, -8827771, -9123791, -9323506, -9440383, -9503076, -9554596, -9643089, -9805055, -10049451, -10352710, -10667834, -10941323, -11128089, -11198646, -11139538, -10950711, -10641876, -10227786, -9722847, -9137508, -8478904, -7755201, -6979352, -6168058, -5336418, -4494088, -3648836, -2817153, -2034338, -1354986, -840741, -541158, -478202, -642065, -997885, -1496673, -2084205, -2706869, -3316853, -3877501, -4366672, -4776264, -5108856, -5373269, -5579363, -5732359, -5829622, -5864016, -5833990, -5754657, -5662331, -5608995, -5648946, -5823109, -6146416, -6601570, -7140007, -7689410, -8166881, -8496429]
57343h496429j30744Q1149K66640L95901M55151M47012L87482L01602K17317J57265
57333e917654J31680J37185J62957J99551K43364K94056L49060M01599M43933
57324c554269M71144M80559M68189M28284L58708K66836J68369P8300J525o9186
57314i01541j47087k42326l54812m71621n70216o26915o26639n67602m58281l10673
57304e277713j36693M9418K26251L64429M33574M14257L06926J30763q6384l18194
57294c893366n42718p39928q91836r88164j031210j032310j000948r35882q26302
57285a1882664o61769m42068j79370J06673L94071O58905Q73615J009343J044391
57276i078873R73886Q14324O00153L73501J70368R035j12328k06344k81615l33431
$$ y = [-8496429, -8627173, -8546024, -8279384, -7883483, -7428332, -6981320, -6593838, -6292236, -6074919, -5917654, -5785974, -5648789, -5485832, -5286281, -5042917, -4748861, -4399801, -3998202, -3554269, -3083125, -2602566, -2134377, -1706093, -1347385, -1080549, -912180, -833880, -832355, -901541, -1048628, -1290954, -1645766, -2117387, -2687603, -3314518, -3941157, -4508759, -4967040, -5277713, -5414406, -5364988, -5138737, -4774308, -4340734, -3926477, -3619551, -3488788, -3575172, -3893366, -4436084, -5176012, -6067848, -7056012, -8087222, -9119532, -10120480, -11056362, -11882664, -12544433, -12986501, -13165871, -13059198, -12665127, -12006222, -11132607, -10123264, -9078873, -8104987, -7290663, -6690510, -6317009, -6146641, -6137606, -6249934, -6456278, -6737893, -7071324]
57266g071324l46165l04237k03743n8524J01403K38446L19912L28947K68381J55962
57256f570942J5214j31630k65400l68960m27789m33022l83762k86248j51679M495
57246h999723J62965L03950M13507M87580N29907N46440N42135N22160M94117
57237d996962M67626M51606M51651M68377M96000N21954N30166N08328M54803
57228f46451L79233K96079K16663J46250Q7162M3747K4854M2618J08436K27380
57218I25971L92924N84733P71545R18565R96289R87271Q88868P12323M79842K20658
57208G878989l4577k61061m45813n87915o92632p64439q04660q14063p96552p61030
57198A916247p21369o94307o93924p23644p71456q14396q31148q13948p70965
$$ y = [-7071324, -7417489, -7721726, -7925469, -7983993, -7882590, -7644144, -7324232, -6995285, -6726904, -6570942, -6555728, -6687358, -6952758, -7321718, -7749507, -8182529, -8566291, -8852539, -9004218, -8999723, -8836758, -8532808, -8119301, -7631721, -7101814, -6555374, -6013239, -5491079, -4996962, -4529336, -4077730, -3626079, -3157702, -2661702, -2139748, -1609582, -1101254, -646451, -267218, 28861, 245524, 391774, 478936, 522683, 547537, 590155, 698591, 925971, 1318895, 1903628, 2675173, 3593738, 4590027, 5577298, 6466166, 7178489, 7658331, 7878989, 7844412, 7583351, 7137538, 6549623, 5856991, 5092552, 4287892, 3473829, 2677277, 1916247, 1194878, 500571, -193353, -916997, -1688453, -2502849, -3333997, -4147945, -4918910]
57189d918910p18627o71568o37897o20746o21239o38762o69180p04410p34786
57180a0936125p52184p51097p27025o74202n85649m57136k93529j13014N5656
57171a5234305J83699K55360K75203K64723K50787K54093K84456L43116M26533
57162a2696335N26849O30003P16802P69596P80190P51256O88998N94145M61187
57153f777309K87686Q4578j23370l08091m50503n44968n94772o04646n76531n10447
57143a0118373m08895k81572j46488k5320O4808J17109J34591J25093R7630O2611
57133a0378806L3086K2795M0933Q7887J55672K32469L07534L73701M27562M68784
57123h228383M99001N19971N31234N29249N09749M72495M24163L75206L31483
$$ y = [-4918910, -5637537, -6309105, -6947002, -7567748, -8188987, -8827749, -9496929, -10201339, -10936125, -11688309, -12439406, -13166431, -13840633, -14426282, -14883418, -15176947, -15289961, -15234305, -15050606, -14795246, -14520043, -14255320, -14004533, -13750440, -13465984, -13122868, -12696335, -12169486, -11539483, -10822681, -10053085, -9272895, -8521639, -7832641, -7238496, -6777309, -6489623, -6405045, -6528415, -6836506, -7287009, -7831977, -8426749, -9031395, -9607926, -10118373, -10527268, -10808840, -10955328, -10980648, -10915840, -10798731, -10664140, -10539047, -10441417, -10378806, -10345720, -10322925, -10281992, -10194105, -10038433, -9805964, -9498430, -9124729, -8697167, -8228383, -7729382, -7209411, -6678177, -6148928, -5639179, -5166684, -4742521, -4367315, -4035832]
57114d035832K87625K28992J41405J9896j31273l06013n02609p22219r61350j205132
57104g186510j426719j593131j674519j653375j530779j327091j075539q10306
57096a8277969n55499l22230j15168N8729J88604K66740K96390K91755K69425
57087a7899223K38165J94526J27226K8031r7003k23279l14552l38037k79001j46824
57077a8709971K9447K11961L65510M65657N02818M83352M27961L66254L27112
57068a5529899L28217L70558M41105N21054N94285O52687O97937P39753P90056
57059a0394247Q54554R26472R87359J015523R97346R34620Q43627P46804O62444
57050b425498N98638N53962N22104M95647M67323M30895L84009L31734K86334
$$ y = [-4035832, -3748207, -3519215, -3377810, -3357914, -3489187, -3795200, -4297809, -5020028, -5981378, -7186510, -8613229, -10206360, -11880879, -13534254, -15065033, -16392124, -17467663, -18277969, -18833468, -19155698, -19270866, -19212137, -19023533, -18756793, -18460403, -18168648, -17899223, -17661058, -17466532, -17339306, -17311275, -17408278, -17631557, -17946109, -18284146, -18563147, -18709971, -18680524, -18468563, -18103053, -17637396, -17134578, -16651226, -16223265, -15857011, -15529899, -15201682, -14831124, -14390019, -13868965, -13274680, -12621993, -11924056, -11184303, -10394247, -9539693, -8613221, -7625862, -6610339, -5612993, -4678373, -3834746, -3087942, -2425498, -1826860, -1272898, -750794, -255147, 212176, 643071, 1027080, 1358814, 1645148]
57041A645148K60472K56358K58192K34832J53444l128k25813m81776p27753r26460
57031D43516j058193j123311j135730j111957j062564r91234r00276p96035o88634
57022h424418n86433m90693l95681k94853j88612q7204n315M8017P5713Q9842
57012a0259637J03250J24023J56773K06358K77618L70086M72639N63575O17386
57003g367929O15041N51958M38686K94080J36405k0931j67426k91847l81942m27795
56993f621700m24838l73659k77908j44148J4758J76003L08766L83766L85664L20240
56983f253056K12184R6002N057l7879k6845K6212R6413J54886J77545J51311P7345
56972e320825k9168j44247k44923l19365l71579m17821m76870n59891o65620p82663
$$ y = [1645148, 1905620, 2161978, 2420170, 2655002, 2808446, 2805318, 2579505, 2097729, 1369976, 443516, -614677, -1737988, -2873718, -3985675, -5048239, -6039473, -6939749, -7735784, -8424418, -9010851, -9501544, -9897225, -10192078, -10380690, -10467894, -10473209, -10425192, -10349479, -10259637, -10156387, -10032364, -9875591, -9669233, -9391615, -9021529, -8548890, -7985315, -7367929, -6752888, -6200930, -5762244, -5468164, -5331759, -5352690, -5520116, -5811963, -6193905, -6621700, -7046538, -7420197, -7698105, -7842253, -7827495, -7651492, -7342726, -6958960, -6573296, -6253056, -6040872, -5944870, -5939813, -5977692, -6004537, -5978325, -5881912, -5727026, -5549481, -5398170, -5320825, -5349993, -5494240, -5739163, -6058528, -6430107, -6847928, -7324798, -7884689, -8550309, -9332972]
56962i332972q95450r88363j046197j054152j001031q84649p14548n08510k84707
56953a6710579n5143J74447L98004O01318P60794Q52131Q63966Q06659P09652
56944a1598751O09008N32629M91218M79127M83583M95529N13635N38387N62339
56935f893296N67178N32270M47923L21726J72937K1104j21307k48369l56311m40858
56925e997003m97951n25517n23803m93775m35267l47386k32447j01042K6711J27066
56915i000414J83013J92083J66291J24915Q5749O0496N5913P7400J29586K11386
56905g713582L09311L96817M44066M33479L70030K78139J87429J17952P4555N1403
56895e050401M0252L6077L8646N2263Q4756J44531K35069L49144M66645N58314
$$ y = [-9332972, -10228422, -11216785, -12262982, -13317134, -14318165, -15202814, -15917362, -16425872, -16710579, -16765722, -16591275, -16193271, -15591953, -14831159, -13979028, -13115062, -12308403, -11598751, -10989743, -10457114, -9965896, -9486769, -9003186, -8507657, -7994022, -7455635, -6893296, -6326118, -5793848, -5345925, -5024199, -4851262, -4830158, -4951465, -5199834, -5556145, -5997003, -6494954, -7020471, -7544274, -8038049, -8473316, -8820702, -9053149, -9154191, -9127480, -9000414, -8817401, -8625318, -8459027, -8334112, -8248363, -8187867, -8131954, -8054554, -7924968, -7713582, -7404271, -7007454, -6563388, -6129909, -5759879, -5481740, -5294311, -5176359, -5101804, -5050401, -5010149, -4974072, -4935426, -4883163, -4798407, -4653876, -4418807, -4069663, -3603018, -3044704]
56885c044704N94062N52426M27977K34976O111k15105l88060m90182n25411n20357
56875c368267n10450n24805n77483o66410p76087q80841r48877r49056q60012
56866a0062288o77850m18264j12246K01642M84655P03557Q35496Q72974Q27686
56857g344638P29861O19927N33839M89248M81730M93743N09320N23742N43174
56848b420054N77247O30664O98014P63766Q08071Q16371P87467P34465O77281
56839D073292O31443O00699N78382N55789N30258N06379M90371M83736M81789
56830H932138M77343M65365M44626M15275L74753L15759K28214J03453o2527k67160
56820A1427239m98795p33939r38696j077585j126484j082127r63121q03196o40658
$$ y = [-3044704, -2450642, -1898216, -1470239, -1235263, -1229152, -1444257, -1832317, -2322499, -2847910, -3368267, -3878717, -4403522, -4981005, -5647415, -6423502, -7304343, -8253220, -9202276, -10062288, -10740138, -11158402, -11270648, -11069006, -10584351, -9880794, -9045298, -8172324, -7344638, -6614777, -5994850, -5461011, -4971763, -4490033, -3996290, -3486970, -2963228, -2420054, -1842807, -1212143, -514129, 249637, 1057708, 1874079, 2661546, 3396011, 4073292, 4704735, 5305434, 5883816, 6439605, 6969863, 7476242, 7966613, 8450349, 8932138, 9409481, 9874846, 10319472, 10734747, 11109500, 11425259, 11653473, 11756926, 11694399, 11427239, 10928444, 10194505, 9255809, 8178224, 7051740, 5969613, 5006492, 4203296, 3562638]
56811C562638n08128m25229l95239m05520m31571m44517m20115l45442k21201
56802c4324o1300J08668K55986L50662L76690L36826K48525J36730K8902m9617
56792A697748q3961p8695n8429n6128r5937j81999k99546m25531n41157o39189
56782g62824p23190q00897q76656r47557j004740j038168j041516j014645r63171
56773i173364q96549q26081p62835p14528o81601o55016o18741n57268m64418
56764a5350401l47692k25188j17152l7632R552K9719L2596K6203J2028j5467o4125
56753a6047559j36956k27678l22148m04538m64061m98277n11800n12550n08559
56744a9634126n06476n10239n18679n23617n11324m67321l81038k47546o7526
$$ y = [3562638, 3054510, 2629281, 2234042, 1828522, 1396951, 952434, 532319, 186877, -34324, -95624, 13044, 269030, 619692, 996382, 1333208, 1581733, 1718463, 1747365, 1697748, 1613787, 1535092, 1476663, 1420535, 1324598, 1142599, 843053, 417522, -123635, -762824, -1486014, -2286911, -3163567, -4111124, -5115864, -6154032, -7195548, -8210193, -9173364, -10069913, -10895994, -11658829, -12373357, -13054958, -13709974, -14328715, -14885983, -15350401, -15698093, -15923281, -16040433, -16078065, -16068513, -16038794, -16006198, -15979995, -15967967, -15983434, -16047559, -16184515, -16412193, -16734341, -17138879, -17602940, -18101217, -18613017, -19125567, -19634126, -20140602, -20650841, -21169520, -21693137, -22204461, -22671782, -23052820, -23300366, -23367892]
56735b3367892J51827L95184O40076Q61984J040662J163456J224800J225081J171506
56726a5493316J080005R74815Q83738Q30500Q27674Q73166R51265J037479J105162
56717f929512J131900J104453J021782Q95758P47937O01500M71119L57512K51623
56708c45928J45525M0609n3394j25980j72526j96290k07296k19391k44230k83526
56698a662427l26198l55615l62649l53192l43372l46835l64397l82681l81243
56689d878609l43337k64946j58227m8173L5626O8506L8725m7531j65322k76156
56679f039444l39948l30569k47612j17064K0312J25762J74122J55094O8078q1304
56669f612573k78868m97359o97104q35338q80412q22996o78845m83049k79007
$$ y = [-23367892, -23216065, -22820881, -22180805, -21318821, -20278159, -19114703, -17889903, -16664822, -15493316, -14413311, -13438496, -12554758, -11724258, -10896584, -10023418, -9072153, -8034674, -6929512, -5797612, -4693159, -3671377, -2775619, -2027682, -1426182, -955063, -597551, -345928, -200403, -159794, -213188, -339168, -511694, -707984, -915280, -1134671, -1378901, -1662427, -1988625, -2344240, -2706889, -3060081, -3403453, -3750288, -4114685, -4497366, -4878609, -5221946, -5486892, -5645119, -5693292, -5657666, -5589160, -5550435, -5597966, -5763288, -6039444, -6379392, -6709961, -6957573, -7074637, -7054325, -6928563, -6754441, -6599347, -6531269, -6612573, -6891441, -7388800, -8085904, -8921242, -9801654, -10624650, -11303495, -11786544, -12065551]
56660a2065551j05617J3523P4455Q7989O8716K5823l8080j21285k17191l13853
56650a2591071l98529m62372n01318n13682m98071m53790l82052k85160j64251
56641a6250296j9219J47485L26333N00152O48618P55027Q11888Q23211Q02423
56632a1454378P65890P24738O79915O24109N49421M55516L52830K59217J92710
56623f850032J65094J79568K32636L17687M27054N50713O73019P71692Q22335
56614b710234Q06988P20806N72366L79147J63127n0938k36669l69613m33151m24290
56604a582461l56478k57617j62802j03583r8270j47982k39402l50800m56791n30831
56594d287017n48228m92116l60257j67301N9954K90644M95406O48099P27726P23489
$$ y = [-12065551, -12171168, -12157645, -12083190, -11995201, -11926485, -11900662, -11938742, -12060027, -12277218, -12591071, -12989600, -13451972, -13953290, -14466972, -14965043, -15418833, -15800885, -16086045, -16250296, -16269515, -16122030, -15795697, -15295545, -14646927, -13891900, -13080012, -12256801, -11454378, -10688488, -9963750, -9283835, -8659726, -8110305, -7654789, -7301959, -7042742, -6850032, -6684938, -6505370, -6272734, -5955047, -5527993, -4977280, -4304261, -3532569, -2710234, -1903246, -1182440, -610074, -230927, -67800, -118738, -355407, -725020, -1158171, -1582461, -1938939, -2196556, -2359358, -2462941, -2561211, -2709193, -2948595, -3299395, -3756186, -4287017, -4835245, -5327361, -5687618, -5854919, -5794965, -5504321, -5008915, -4360816, -3633090, -2909601]
56584b909601O39847M95898L18215J32600l9802j82770k86398l51061l89437m21497
56574b994006m63874n20874n83306o34534o58323o43736n86385m87950l55706
56565g928694k01949m1878J10773K48395L70891M82263N85370O79444P61994Q32268
56555d101123Q92412R44770R87055J009258R95764R32794Q16223O53797M60824
56546C591774K54655N3043j24803k59906l39704l64140l45559l01871k48616j96108
56536A718765j52478j27219j29332j60183k08051k51142k67953k46541j86101
56527a0235r2612K4474J51364K68639L54179L89590L65132K80421J42861l3218
56517A840595k26707m11066n57274o37466o29185n21312l20768n5798K28687M83886
$$ y = [-2909601, -2269754, -1773856, -1455641, -1323041, -1362843, -1545613, -1832011, -2183072, -2572509, -2994006, -3457880, -3978754, -4562060, -5196594, -5854917, -6498653, -7085038, -7572988, -7928694, -8130643, -8172521, -8061748, -7813353, -7442462, -6960199, -6374829, -5695385, -4933391, -4101123, -3208711, -2263941, -1276886, -267628, 728136, 1660930, 2477153, 3130950, 3591774, 3846429, 3899472, 3774669, 3514763, 3175059, 2810919, 2465360, 2163489, 1914873, 1718765, 1566287, 1439068, 1309736, 1149553, 941502, 690360, 422407, 175866, -10235, -102847, -78373, 72991, 341630, 695809, 1085399, 1450531, 1730952, 1873813, 1840595, 1613888, 1202822, 645548, 8082, -621103, -1142415, -1463183, -1518981, -1290294, -806408]
56507h06408O72499P79259Q11687P91691P43331O83048O16260N40413M51499L49686
56497E632965K40384J30605K4792p5301j66944k44410l02864l45820l88751m53413
56487D051243n54626o87660q25404r28356r61182r04540p56024n24917k30050
56478b321516R6628M08157O50964P83173P92557P02352N60731M20002L17305K66201
56468B676554K60506K84429L21728L60387L93480M18747M38809M61699M99137
56459F115476N60014O40806P19727P61145P29881O07428M00826J40438j30585
56450A0545156l69315n43445o36150o44705n75086m37157k44373j7177K15633
56441G293381M22070N76548O66693O92907O63510N91380M94117L94222L14990
$$ y = [-806408, -133909, 645350, 1457037, 2248728, 2992059, 3675107, 4291367, 4831780, 5283279, 5632965, 5873349, 6003954, 6028746, 5953445, 5786501, 5542091, 5239227, 4893407, 4504656, 4051243, 3496617, 2808957, 1983553, 1055197, 94015, -810525, -1566549, -2091466, -2321516, -2224888, -1816731, -1165767, -382594, 409963, 1112315, 1673046, 2093048, 2410353, 2676554, 2937060, 3221489, 3543217, 3903604, 4297084, 4715831, 5154640, 5616339, 6115476, 6675490, 7316296, 8036023, 8797168, 9527049, 10134477, 10535303, 10675741, 10545156, 10175841, 9632396, 8996246, 8351541, 7776455, 7339298, 7094925, 7077748, 7293381, 7715451, 8291999, 8958692, 9651599, 10315109, 10906489, 11400606, 11794828, 12109818]
56432A2109818K72202K66225K80240K86567K57624J75443L6187j49666l59917
56423A3174723n66596p45183q82752r78834j038327j063273j050651r96493r01047
56414D951567p71008o19118m62599l20391k08815j37132j05452j05781j24893
56405B096378j47423j58792j48275j11926n4205J3003P4201J15446J28021J08778
56395A915206N8379j9051j13301k05866k73076k94794k63041j84887p9168K9628
56385E70029J18145J70959J85565J72658J51452J43193J65584K27761L25068M35668
56375B666082N23110N46252M73418K94353K4294l01628o40202r52241j210253
56366A423185j400100j517327j561040j530429j427608j263895j061559q47214
$$ y = [12109818, 12382020, 12648245, 12928485, 13215052, 13472676, 13648119, 13684306, 13534640, 13174723, 12608127, 11862944, 10980192, 10001358, 8963031, 7899758, 6849107, 5852614, 4951567, 4180559, 3561441, 3098842, 2778451, 2569636, 2432504, 2327052, 2221271, 2096378, 1948955, 1790163, 1641888, 1529962, 1475757, 1488760, 1562961, 1678407, 1806428, 1915206, 1973585, 1954534, 1841233, 1635367, 1362291, 1067497, 804456, 619569, 540401, 570029, 688174, 859133, 1044698, 1217356, 1368808, 1512001, 1677585, 1905346, 2230414, 2666082, 3189192, 3735444, 4208862, 4503215, 4527509, 4225881, 3585679, 2633438, 1423185, 23085, -1494242, -3055282, -4585711, -6013319, -7277214, -8338773, -9185987]
56358i185987o42667m62114l16915k20593j87158k23020l18488m45532n65636
56349a2568110o45435o71209o51901o08012n54454m89356l95849k55023o1415
56340a6900764J69534M07246O19940P85386Q91721R32053R01059P96856O25342
56331a0771627M03229J58078p5527k63622l81775m21213l89977l09745k09592
56322a2261771j17655n3186k2857k2952m4576p6936j06514j14692p8927J9510
56312a2880556J84172L96488O20159Q15740R56457J035910J065306J064665J053826
56303e687833J046271J046294J049635J047386J031435R97681R44646Q69576P67256
56294C112347O33792M71523K89465R8862r1222k74395m44580n94035p13189p92298
$$ y = [-9185987, -9828654, -10290768, -10607683, -10828276, -11015434, -11238454, -11556942, -12002474, -12568110, -13213545, -13884754, -14536655, -15144667, -15699121, -16188477, -16584326, -16839349, -16900764, -16731230, -16323984, -15704044, -14918658, -14026937, -13094884, -12193825, -11396969, -10771627, -10368398, -10210320, -10285847, -10549469, -10931244, -11352457, -11742434, -12052179, -12261771, -12379426, -12432612, -12455469, -12478421, -12522997, -12599933, -12706447, -12821139, -12900066, -12880556, -12696384, -12299896, -11679737, -10863997, -9907540, -8871630, -7806324, -6741659, -5687833, -4641562, -3595268, -2545633, -1498247, -466812, 530869, 1475515, 2345091, 3112347, 3746139, 4217662, 4507127, 4605989, 4514767, 4240372, 3795792, 3201757, 2488568, 1696270]
56284A696270q25129q13589p69876p13370o64278o38909o48026o95197p73327
56275d845431q62762r35672r65851r37953q51262p18172n59939m01412k65654
56266a1344108j70151j25762j37020k01407l07775m36841n65234o70845p36171
56257a4695314p49474p05836o08994m71677l12092j47319J2431J64758L10594
56248a7202923M47688N66957O54257O95840O83434O16130M99403L43408J61979
56239a2533827k8058k08656l64003m84111n65817o10191o18585n91030n28061
56230a6532339m33081l11697j68236l899J79751L74129N60904P17735Q28372Q88306
56220a3900055R01816Q75380Q14809P27346O23940N17644M19099L32593K55274
$$ y = [1696270, 871141, 57552, -712324, -1425694, -2089972, -2728881, -3376907, -4072104, -4845431, -5708193, -6643865, -7609716, -8547669, -9398931, -10117103, -10677042, -11078454, -11344108, -11514259, -11640021, -11777041, -11978448, -12286223, -12723064, -13288298, -13959143, -14695314, -15444788, -16150624, -16759618, -17231295, -17543387, -17690706, -17678275, -17513517, -17202923, -16755235, -16188278, -15534021, -14838181, -14154747, -13538617, -13039214, -12695806, -12533827, -12561885, -12770541, -13134544, -13618655, -14184472, -14794663, -15413248, -16004278, -16532339, -16965420, -17277117, -17445353, -17449252, -17269501, -16895372, -16334468, -15616733, -14788361, -13900055, -12998239, -12122859, -11308050, -10580704, -9956764, -9439120, -9020021, -8687428, -8432154]
56211h432154J80309J02870K5094m4536r8014j35479j67096k07697k68330l50083
56201i395116m42526n26348n78906n81590n27428m25754l00214j79018q1759j0758
56191a3049417M7696J13248J98805L02301M07191M91471N39684N49834N30750
56182i868437M93619M45896L92200L39307K98893K84772L06590L64632M48727
56173f493801N40930O19510O62758O52936N80246M45041K56834L1897k07635m33656
56163c344940o15245p27214p59869p22544o37422n27694m08123k84106j58531
56154h185688l9559N8345J21601J46463J41277J19548Q9545M8918j1711r9355
56144g610616k10878l32206m43977n28374n72665n69563n17412m21883k97933
$$ y = [-8432154, -8251845, -8148975, -8123881, -8168417, -8266431, -8401910, -8569006, -8776703, -9045033, -9395116, -9837642, -10363990, -10942896, -11524486, -12051914, -12477668, -12777882, -12956900, -13038659, -13049417, -13001721, -12888473, -12689668, -12387367, -11980176, -11488705, -10949021, -10399187, -9868437, -9374818, -8928922, -8536722, -8197415, -7898522, -7613750, -7307160, -6942528, -6493801, -5952871, -5333361, -4670603, -4017667, -3437421, -2992380, -2735546, -2703649, -2911284, -3344940, -3960185, -4687399, -5447268, -6169812, -6807234, -7334928, -7743051, -8027157, -8185688, -8225247, -8166902, -8045301, -7898838, -7757561, -7638013, -7548468, -7499550, -7511261, -7610616, -7821494, -8153700, -8597677, -9126051, -9698716, -10268279, -10785691, -11207574, -11505507]
56135a1505507j69788o7123j6917l2944j08525k18422l29903m15664m60880m63284
56125a3788957m30102l74047l07392k35125j52269m9262P7876K20818L61192M80386
56115a4196882N70182O37188O98150P69578Q58977R62662J068916J161996J225158
56106f244075J244128J211239J127899J003789Q54413O98581N55022M37036L47382
56097A235414K77180K10068J29240K4181j05520k51230m01245n47931o90326q30042
56087i50211r64211j081797j166186j202147j182705j112354j005567q81740p58694
56078a0305612o46690n44855m42024l22900j77307q061J66606L17044M11121M24941
56068a1127737L51224K01789L671k08038l97429n34056n98002n82021m89558l30999
$$ y = [-11505507, -11675295, -11742418, -11759335, -11792279, -11900804, -12119226, -12449129, -12864793, -13325673, -13788957, -14219059, -14593106, -14900498, -15135623, -15287892, -15337154, -15259278, -15038460, -14677268, -14196882, -13626700, -12989512, -12291362, -11521784, -10662807, -9700145, -8631229, -7469233, -6244075, -4999947, -3788708, -2660809, -1657020, -802607, -104026, 450996, 888032, 1235414, 1512594, 1722662, 1851902, 1876083, 1770563, 1519333, 1118088, 570157, -120169, -950211, -1914422, -2996219, -4162405, -5364552, -6547257, -7659611, -8665178, -9546918, -10305612, -10952302, -11497157, -11939181, -12262081, -12439388, -12447449, -12280843, -11963799, -11552678, -11127737, -10776513, -10574724, -10571053, -10779091, -11176520, -11710576, -12308578, -12890599, -13380157, -13711156]
56058a3711156j22393J13173L46362N48070O98499P92411Q37880Q51071Q50323
56049h795760Q50545Q58493Q70720Q75396Q57020Q01872P02811N62246L91592
56040b025065K06977K3844j46491k98012m30359n47995o56406p56545q42421r04856
56030f377329r37882r41416r18431q71097q00736p11053o10264n09313m17977
56021a3095498l42602k86618k51594k36289k34212k32473k13877j61911o7027
56012a5122101O7944K26163L81318N07182N86874O16916O05679N69078N25455
56003a1035492M89915M69584M63043M65222M74088M93463N29854N86695O61109
55994f402519P44998Q27766Q97223R38675R35814Q75920P56967N91310M02674
$$ y = [-13711156, -13833549, -13720376, -13374014, -12825944, -12127445, -11335034, -10497154, -9646083, -8795760, -7945215, -7086722, -6216002, -5340606, -4483586, -3681714, -2978903, -2416657, -2025065, -1818088, -1794244, -1940735, -2238747, -2669106, -3217101, -3873507, -4630052, -5472473, -6377329, -7315211, -8256627, -9175058, -10046155, -10846891, -11557944, -12168208, -12677521, -13095498, -13438100, -13724718, -13976312, -14212601, -14446813, -14679286, -14893163, -15055074, -15122101, -15054157, -14827994, -14446676, -13939494, -13352620, -12735704, -12130025, -11560947, -11035492, -10545577, -10075993, -9612950, -9147728, -8673640, -8180177, -7650323, -7063628, -6402519, -5657521, -4829755, -3932532, -2993857, -2058043, -1182123, -425156, 166154, 568828]
55985E68828K17942N7793o9713j69381k51978l23662l79103m03728l82972l11090
55975a447064j94011m7170J08077K48133L51730M04441M00454L41113K33478R1017
55965D90198o5906k13526l31259m06586m36000m24792l88082l50313l38957l73473
55955b838696m55942n69000o81599p59747p78516p30757o28238m94278l52401
55946h289174k17698r4862J7903J22746K17980K98134L57436L93243M06592M00166
55936f387534L76354L37163K85282K24818J61162J00350M8047P987j9471l7057
55926d902899m7940n2554m7884l0190J395M3507R0066J34983J74411K07917K37880
55915d191308K66795K93955L14352L20714L06765K69404K09937J35520N9946J316
$$ y = [568828, 786770, 844563, 774850, 605469, 353491, 29829, -349274, -753002, -1135974, -1447064, -1641075, -1688245, -1580168, -1332035, -980305, -575864, -175410, 165703, 399181, 490198, 424292, 210766, -120493, -527079, -963079, -1387871, -1775953, -2126266, -2465223, -2838696, -3294638, -3863638, -4545237, -5304984, -6083500, -6814257, -7442495, -7936773, -8289174, -8506872, -8601734, -8583831, -8461085, -8243105, -7944971, -7587535, -7194292, -6787700, -6387534, -6011180, -5674017, -5388735, -5163917, -5002755, -4902405, -4854358, -4846371, -4865842, -4902899, -4950839, -5003393, -5051277, -5081467, -5080072, -5036565, -4946499, -4811516, -4637105, -4429188, -4191308, -3924513, -3630558, -3316206, -2995492, -2688727, -2419323, -2209386, -2073866, -2013920, -2012604]
55905b012604k4379j1112L3120R0041J41918J82732K21168K72316L44076M28387
55895c34337N02939N41071N23316M45190L18706J67784J9840j02550j86469k28385
55885A667105k29843j92264j15398j933J34733K67384L62025L91871L48429K42320
55875B874429R5192o9911k33686l80530m96470n68604n87601n51863m70080l59984
55865g49108k44736j50141j02633j23851k19791l70373n30032o43559o69191n94709
55855d398124m38096k35336k4579J65190L18071M29132M99685N33255N34054N07734
55845b109014M62446M08180L53584L01754K47788J80552Q8799l0898j68829l03313
55835e68951m08757m66684m73494m41126l91329l47469l27533l40013l83068m46421
$$ y = [-2012604, -2036983, -2048095, -2014975, -1924934, -1783016, -1600284, -1379116, -1106800, -762724, -334337, 168602, 709673, 1232989, 1678179, 1996885, 2164669, 2184509, 2081959, 1895490, 1667105, 1437262, 1244998, 1129600, 1127667, 1262400, 1529784, 1891809, 2283680, 2632109, 2874429, 2969621, 2899710, 2666024, 2285494, 1789024, 1220420, 632819, 80956, -389124, -749108, -993844, -1143985, -1246618, -1370469, -1590260, -1960633, -2490665, -3134224, -3803415, -4398124, -4836220, -5071556, -5096135, -4930945, -4612874, -4183742, -3684057, -3150802, -2616748, -2109014, -1646568, -1238388, -884804, -583050, -335262, -154710, -65911, -96809, -265638, -568951, -977708, -1444392, -1917886, -2359012, -2750341, -3097810, -3425343, -3765356, -4148424, -4594845]
55825d594845n14467n68932n91004n64640m81727l46745j77187J380J63068K88568
55815g386531L69357M08441M16816M06216L82351L44346K91433K30589J76989
55806d359993J45869J42669J59375J79019J84206J64674J21443O6724J8917o355
55796c183452n031J2499K6869K0034j6479p9693j58558k38425l03773l39802l34850
55785d600661k84308j94147q1223L1298J22305J81458K14018K38545K76943L40861
55775c754911M22272M95415N30176N08490M33083L24303K09415J11793M4295P133
55765f68536j0195k2718m0846o3087p6283o4422k0043N0081J28701J97976K49156
55754c40216K87420L30063L98850N09707O64739Q49884J038149J196664J295995
$$ y = [-4594845, -5109312, -5678244, -6269248, -6833888, -7315615, -7662360, -7839547, -7838167, -7675099, -7386531, -7017174, -6608733, -6191917, -5785701, -5403350, -5059004, -4767571, -4536982, -4359993, -4214124, -4071455, -3912080, -3733061, -3548855, -3384181, -3262738, -3196014, -3177097, -3183452, -3188483, -3175984, -3149115, -3129081, -3145560, -3225253, -3383811, -3622236, -3926009, -4265811, -4600661, -4884969, -5079116, -5160339, -5129041, -5006736, -4825278, -4611260, -4372715, -4095772, -3754911, -3332639, -2837224, -2307048, -1798558, -1365475, -1041172, -831757, -719964, -675669, -668536, -678731, -701449, -742295, -805382, -881665, -946087, -966130, -916049, -787348, -589372, -340216, -52796, 277267, 676117, 1185824, 1850563, 2700447, 3738596, 4935260, 6231255]
55745F231255J319391J267530J155301J002414Q23910O25686M06344J63975r5466
55736A2900340l53222n80510p48205q37952q49026p98409p13756o21515n36444
55727F861301m59785l86914l17079k56891k16204k00646k05104k11216j91756
55718D415706j22181O178J79673L66436N28024O32262O62042O17357N10897L60920
55708H157314J85816K199j74594l29253m46082n11183n17119m66512l70629k44048
55698E285909j00769M4902J75516K70696L12703K95156K29766J45229P6056M6747
55688F781911O1765J07504J62469K06716K25948K12306J65319R2869J0175o3348
55678G963634j07086j01247l0281J10079L05516N23125P22464Q71695R57955R86779
$$ y = [6231255, 7550646, 8818176, 9973477, 10975891, 11799801, 12425487, 12831831, 12995806, 12900340, 12547118, 11966608, 11218403, 10380451, 9531425, 8733016, 8019260, 7397745, 6861301, 6401516, 6014602, 5697523, 5440632, 5224428, 5023782, 4818678, 4607462, 4415706, 4293525, 4299703, 4479376, 4845812, 5373836, 6006098, 6668140, 7285497, 7796394, 8157314, 8343130, 8345329, 8170735, 7841482, 7395400, 6884217, 6367098, 5900586, 5529957, 5285909, 5185140, 5230042, 5405558, 5676254, 5988957, 6284113, 6513879, 6659108, 6735164, 6781911, 6843676, 6951180, 7113649, 7320365, 7546313, 7758619, 7923938, 8016807, 8026982, 7963634, 7856548, 7755301, 7725020, 7835099, 8140615, 8663740, 9386204, 10257899, 11215854, 12202633]
55668A2202633R74500R40341R00901Q66170Q36785Q03639P50699O60557N20929
55659A9457154L29513R4631j68071m39713p00214r29014j107087j220681j264305
55650A4052213j240465j156357j020087q39290o22962l84316j40949Q9095K92550
55641I029432M63149N99694P03047P75431Q22166Q52714Q78633R09246R47990
55632A5981502R91614J032142J060470J070657J063453J046791J032257J030124
55624B4309010J046953J086640J151776J242720J355313J479889J602302J705706
55616C4980309J772433J786726J739248J632878J487368J339216J234203J214618
55608D7186999J307177J517414J831755K224398K665100L125048L579770M010550
$$ y = [12202633, 13177133, 14117474, 15018375, 15884545, 16721330, 17524969, 18275668, 18936225, 19457154, 19786667, 19881298, 19713227, 19273514, 18573300, 17644286, 16537199, 15316518, 14052213, 12811748, 11655391, 10635304, 9796014, 9173052, 8788736, 8647787, 8736882, 9029432, 9492581, 10092275, 10795322, 11570753, 12392919, 13245633, 14124266, 15033512, 15981502, 16973116, 18005258, 19065728, 20136385, 21199838, 22246629, 23278886, 24309010, 25355963, 26442603, 27594379, 28837099, 30192412, 31672301, 33274603, 34980309, 36752742, 38539468, 40278716, 41911594, 43398962, 44738178, 45972381, 47186999, 48494176, 50011590, 51843345, 54067743, 56732843, 59857891, 63437661, 67448211]
55600F7448211M407141M772299N124393N493505N910888O397039O954769P570515
55592A14078760Q222537Q890981R563630J0234712J0899958J1553515J2188287
55585A85632380J2796100J3364417J3870968J4280376J4544929J4608425J4411609
55578B83509204J3898875J3025838J1766634J0119598Q110920N795887L256567
55571C49483523N94972k077157m648746p017532r096599j0821263j2156190j3099411
55563B91161597j3680157j3950375j3972827j3809419j3512721j3121925j2662393
55556A96451780j2146906j1577975j0952426j0268584r533008q762768p981923
55549A25228190p215024o481797n795127n161974m585246m065247l600704l189904
$$ y = [67448211, 71855352, 76627651, 81752044, 87245549, 93156437, 99553476, 106508245, 114078760, 122301297, 131192278, 140755908, 150990620, 161890578, 173444093, 185632380, 198428480, 211792897, 225663865, 239944241, 254489170, 269097595, 283509204, 297408079, 310433917, 322200551, 332320149, 340431069, 346226956, 349483523, 350078495, 348001338, 343352592, 336335060, 327238461, 316417198, 304261008, 291161597, 277481440, 263531065, 249558238, 235748819, 222236098, 209114173, 196451780, 184304874, 172726899, 161774473, 151505889, 141972881, 133210113, 125228190, 118013166, 111531369, 105736242, 100574268, 95989022, 91923775, 88323071, 85133167]
55541H5133167k831590k524764k268099k060576j902581j793887j727584j685294
55533F8338792j640336j568567j459406j320185j172956j046610r67228r49855
55525E8213649r95490j094599j233821j400808j584938j774871j955099k104358
55517D6069665k199152k222758k174516k071985j943598j816841j709100j624309
55509C0307406j553974j480431j381790j238857j043317q04398n50034l19811
55501B1934794j51308o6082o2631j19309k04296k87087l47650l82000m02982m34576
55491A9476873n00313o11295p60957r29306j092505j231026j332803j392580j410354
55482A0215734j390711j342455j276822j203250j124550j035511r27545p96795
$$ y = [85133167, 82301577, 79776813, 77508714, 75448138, 73545557, 71751670, 70024086, 68338792, 66698456, 65129889, 63670483, 62350298, 61177342, 60130732, 59163504, 58213649, 57218159, 56123560, 54889739, 53488931, 51903993, 50129122, 48174023, 46069665, 43870513, 41647755, 39473239, 37401254, 35457656, 33640815, 31931715, 30307406, 28753432, 27273001, 25891211, 24652354, 23609037, 22804639, 22254605, 21934794, 21783486, 21717404, 21654773, 21535464, 21331168, 21044081, 20696431, 20314431, 19911449, 19476873, 18976560, 18365265, 17604308, 16675002, 15582497, 14351471, 13018668, 11626088, 10215734, 8825023, 7482568, 6205746, 5002496, 3877946, 2842435, 1914890, 1118095]
55474A118095o49610n01594l72052k78366k32110k35810k80062l43812m00202
55465b175523m25972m08733l47848k49532j20863L2538K03614L78738N35598O47624
55455a930359O93527O66428N77081M49448L11313J84984Q2402N511n0410r2871
55445H97054j27910j55373j66555j48146r1908l426R6764J80368K22289K10077
55435I13234J48260N5504m4368j32088j97471k37674k53255k45712k16475j66258
55425c76303r5359o188R3333J88829K63424L05751L17364L13839L17021L42884
55415A664595L93534M58632N23518N76791O12613O28143O19410N79058M98020
55406F554314L71037K03052J2073j74281l27543m27960m69836m60340m13945l46921
$$ y = [1118095, 468485, -33109, -405161, -683527, -915637, -1151447, -1431509, -1775321, -2175523, -2601495, -3010228, -3358076, -3607608, -3728471, -3695933, -3492319, -3113581, -2577983, -1930359, -1236832, -570404, 6677, 456125, 767438, 952422, 1034824, 1040335, 989925, 897054, 769144, 613771, 447216, 299070, 207162, 203736, 300500, 480868, 703157, 913234, 1061494, 1116998, 1072630, 940542, 743071, 505397, 252142, 6430, -210045, -376303, -471662, -477850, -384517, -195688, 67736, 373487, 690851, 1004690, 1321711, 1664595, 2058129, 2516761, 3040279, 3617070, 4229683, 4857826, 5477236, 6056294, 6554314, 6925351, 7128403, 7140476, 6966195, 6638652, 6210692, 5740856, 5280516, 4866571, 4519650]
55396D519650k74420k08891j57776j21149r2207o1761k3842K1741P1342J21243
55386C793930J69566K15621K59409L03248L53160M15589M89403N59946O02454
55377G162326N94457N28397M15706K81252J54014N9767J6422K9604Q8449J65725
55367I496119K25877K38555J89862Q5083n6581k10055l50984m60064n25852n46391
55357H085569n29664m92633m57763m46174m69483n24993n97157o63165o98321
55348C206216o79906n91899m31490k13771L0035K61160M44217N55529N87029N46134
55338C713254M52373L31350K07406R7096O005o9486j35912j95421k42658k68566
55328C895441k68168k45267k09232j66289j13576m2693M9062J49121K30219K61073
$$ y = [4519650, 4245230, 4036339, 3878563, 3757414, 3665207, 3603446, 3579604, 3601345, 3672687, 3793930, 3963496, 4179117, 4438526, 4741774, 5094934, 5510523, 5999926, 6559872, 7162326, 7756783, 8285180, 8700886, 8982138, 9136152, 9195919, 9212341, 9241945, 9330394, 9496119, 9721996, 9960551, 10150413, 10235496, 10178915, 9968860, 9617876, 9157812, 8631960, 8085569, 7555905, 7063272, 6605509, 6159335, 5689852, 5164859, 4567702, 3904537, 3206216, 2526310, 1934411, 1502921, 1289150, 1319185, 1580345, 2024562, 2580091, 3167120, 3713254, 4165627, 4496977, 4704383, 4801479, 4807484, 4737998, 4602086, 4406665, 4164007, 3895441, 3627273, 3382006, 3172774, 3006485, 2892909, 2850216, 2899278, 3048399, 3278618, 3539691]
55318C539691K19744J02242p5908k83532m80858o27801o91770o54423n17420l05325
55308B24640o1362J65313L35737M32175M59680M39464L97698L53725L13015K69226
55298C329311K13614J43509O3165k1635j07967j94223k73965l31203l43006k90340
55288B187260j70941m715J72397L21304M10983M24084L58311K25154M5880j54645
55278C815072l53529n32474o78001p81038q36649q43427q02390p16336n90612
55269b319384m35052k65413j02364L2362J21365J56478J41596R2100L0157k2576
55259b570731n1231n0220k2386K3147P3838J18164J50661J74154J96714K25274
55249a732616K60668K97427L27342L43264L40996L19766K82276K33653J78524
$$ y = [3539691, 3759435, 3861677, 3785769, 3502237, 3021379, 2393578, 1701808, 1047385, 529965, 224640, 163278, 328591, 664328, 1096503, 1556183, 1995647, 2393345, 2747070, 3060085, 3329311, 3542925, 3686434, 3749599, 3727964, 3619997, 3425774, 3151809, 2820606, 2477600, 2187260, 2016319, 2011604, 2184001, 2505305, 2916288, 3340372, 3698683, 3923837, 3969717, 3815072, 3461543, 2929069, 2251068, 1470030, 633381, -210046, -1012436, -1728772, -2319384, -2754436, -3019849, -3122213, -3089851, -2968486, -2812008, -2670412, -2578312, -2548155, -2570731, -2621962, -2672182, -2694568, -2671421, -2597583, -2479419, -2328758, -2154604, -1957890, -1732616, -1471948, -1174521, -847179, -503915, -162919, 156847, 439123, 672776, 851300]
55240H51300J18096N0240k7211j13240k02941k88121l57622l98489l99538l55997
55230a123523k72336j62235m6018N5033J27377J72427K05904K48173L12125L96263
55220h6810M85423N56902N88792N67787M93095L74556K26830O4656r7798k45316
55210B928117l62417m38289m71881m71020m44699l95326l18922k13725q9623K9861
55200b47924J14918J42003J04853J8175q8167j81055k35063k37524j88178r6579
55190h94541K0973J45075K57265L43531L96499M15865M06442L74342L24037K59014
55180B048502J85627J16047O6653N2289Q0521J49646K50527L69015M86557N80401
55170D385785O26535O05895N10511L46339J32292j03446l29567n19692o59472
$$ y = [851300, 969396, 1019636, 992425, 879185, 676244, 388123, 30501, -367988, -767526, -1123523, -1395859, -1558094, -1604112, -1549079, -1421702, -1249275, -1043371, -795198, -483073, -86810, 398613, 955515, 1544307, 2112094, 2605189, 2979745, 3206575, 3271231, 3173433, 2928117, 2565700, 2127411, 1655530, 1184510, 739811, 344485, 25563, -188162, -277785, -247924, -133006, 8997, 113850, 132025, 43858, -137197, -372260, -609784, -797962, -894541, -873568, -728493, -471228, -127697, 268802, 684667, 1091109, 1465451, 1789488, 2048502, 2234129, 2350176, 2416829, 2469118, 2549639, 2699285, 2949812, 3318827, 3805384, 4385785, 5012320, 5618215, 6128726, 6475065, 6607357, 6503911, 6174344, 5654652, 4995180]
55161D995180p48825p98046q20472q25987q18404p97334p62620p17656o68795
55152a962959o21542n77185n32828m84351m29603l69875l09511k54517k10741
55143e753112j82069j69292j70136j79673j89712j87383j55825p9770M5325K06446
55133f815201L73758N08936N76784N55680M44322K62773M6206j66961l46497m75082
55123e035282n45958n59130n21065m46711l58727k81674k34347k25160k52666
55114h460720l09813l88703m82500n83017o76500p42921p61343p18060o11906
55105a3735483m54533k67072p4604J00407K42979L45791M05797M22088L97323
55096a2617307L39676K61617J76321R5210K8189j4847k3433J1482R2671K11377
$$ y = [4995180, 4246355, 3448309, 2627837, 1801850, 983446, 186112, -576508, -1294164, -1962959, -2584501, -3161686, -3694514, -4178865, -4608468, -4978343, -5287854, -5542371, -5753112, -5935181, -6104473, -6274609, -6454282, -6643994, -6831377, -6987202, -7066972, -7021647, -6815201, -6441443, -5932507, -5355723, -4800043, -4355721, -4092948, -4046742, -4213703, -4560200, -5035282, -5581240, -6140370, -6661435, -7108146, -7466873, -7748547, -7982894, -8208054, -8460720, -8770533, -9159236, -9641736, -10224753, -10901253, -11644174, -12405517, -13123577, -13735483, -14190016, -14457088, -14531692, -14431285, -14188306, -13842515, -13436718, -13014630, -12617307, -12277631, -12016014, -11839693, -11744483, -11716294, -11731141, -11754574, -11743092, -11650421, -11439044]
55086a1439044L46336M69511N55394N88114N63678M89195L81271K63162J58995
55077g623388Q5600M6155L0793K4570J6299M24k8441q0369j67299k94628m55055
55066h445339o29692p94850r29973j022985j071311j079274j054227j003106r28726
55057a6959483q25463o76467m55196j32388L11101Q66272J480199K057827K491056
55048a1842542K703130K679371K463967K129928J747049J366321J020529P30283
55040B998036N07490L56106K73241K51188K78172L37420M08485M74449N31324
55031F415911N90609O70356P80266R10936J033392J108824J104727J010773Q45988
55022A4471782O51795M74123L44555K70195K35875K15797J87585J41326P9985
$$ y = [-11439044, -11092708, -10623197, -10067803, -9479689, -8916011, -8426816, -8045545, -7782383, -7623388, -7537788, -7491633, -7460840, -7436270, -7419971, -7419547, -7447988, -7528357, -7695656, -7990284, -8445339, -9075031, -9869881, -10799854, -11822839, -12894150, -13973424, -15027651, -16030757, -16959483, -17784946, -18461413, -18916609, -19048997, -18737896, -17871624, -16391425, -14333598, -11842542, -9139412, -6460041, -3996074, -1866146, -119097, 1247224, 2267753, 2998036, 3505526, 3861632, 4134873, 4386061, 4664233, 5001653, 5410138, 5884587, 6415911, 7006520, 7676876, 8457142, 9368078, 10401470, 11510294, 12615021, 13625794, 14471782, 15123577, 15597700, 15942255, 16212450, 16448325, 16664122, 16851707, 16993033, 17073018]
55013A7073018J3236n0485j09967j73318k54778l66770n11087o74729q33088r58980
55003A3153052j033480j053670j032724r91479r46508r02666q54308p92665p13578
54994D831974o21133n25892m39198l67130l07836k53519j95588j30234o1748j352
54984A928344L8732N2777M5450K9526J9494K5387M9770Q8289J32676J74521K08412
54973B793378K33659K54258K76538L05101L39406L73437L97686M00428L67855
54964E741746K86435J49768l3970k41253m41499o08853p28924p97047q12104p72719
54954A741580o79281n39711l74201k15023j00055o1023j10679k35786m01595n66642
54944a542416o99302p86375q30104q38185q15163p61044o76782n70783m60452
$$ y = [17073018, 17086254, 17035769, 16925802, 16752484, 16497706, 16130936, 15619849, 14945120, 14112032, 13153052, 12119572, 11065902, 10033178, 9041699, 8095191, 7192525, 6338217, 5545552, 4831974, 4210841, 3684949, 3245751, 2878621, 2570785, 2317266, 2121678, 1991444, 1929696, 1928344, 1967076, 2019853, 2065303, 2094829, 2114323, 2139710, 2189480, 2277769, 2410445, 2584966, 2793378, 3027037, 3281295, 3557833, 3862934, 4202340, 4575777, 4973463, 5373891, 5741746, 6028181, 6177949, 6143979, 5902726, 5461227, 4852374, 4123450, 3326403, 2514299, 1741580, 1062299, 522588, 148387, -66636, -166691, -227714, -338393, -574179, -975774, -1542416, -2241718, -3028093, -3858197, -4696382, -5511545, -6272589, -6949371, -7520154, -7980606]
54935g980606l67922l13947l13558l73202m87603o37329p90459r09855r63417
54926a3137898r33055q19784o44200m41984k53921j12079k7456J3589M0870Q4509
54916a6231409J61412K70775L98040N21981O20688O74903O69297N93513M45596
54907a1875204K37631j376k30940m12060n19514n45913m97295l86130k27140l7150
54897a4495091J62835L46723M86917N62985N70906N25508M53027L78776L19040
54888a0688374K81482K70115K87836L34161M01998M77880N45568N90126O00963
54879f898245N74771N18292M48074L85106L46170L36679L48570L63805L62028
54870c214750L29738K66950J87423J11729N7181L1100L1506N3813R7145J64036
$$ y = [-7980606, -8348528, -8662475, -8976033, -9349235, -9836838, -10474167, -11264626, -12174481, -13137898, -14070953, -14890737, -15534937, -15976921, -16230842, -16342921, -16370377, -16356788, -16315918, -16231409, -16069997, -15799222, -15401182, -14879201, -14258513, -13583610, -12914313, -12320800, -11875204, -11637573, -11638949, -11869889, -12281949, -12801463, -13347376, -13844671, -14230801, -14457941, -14495091, -14332256, -13985533, -13498616, -12935631, -12364725, -11839217, -11386190, -11007414, -10688374, -10406892, -10136777, -9848941, -9514780, -9112782, -8634902, -8089334, -7499208, -6898245, -6323474, -5805182, -5357108, -4972002, -4625832, -4289153, -3940583, -3576778, -3214750, -2885012, -2618062, -2430639, -2318910, -2261729, -2230629, -2199123, -2145310, -2048165, -1884129]
54860a884129K53126L51999M38247M89124M91448M43589L50292K18070N6319j18841
54850A089244k84466m16684m98828n26413n06611m53681l83169l07177k31799
54841b519584j57102p9473M673R5585J88909K76281L46263L85012L78308L16851
54831g64277K03446N7261q8997j98339k40475k00189q1613R1790K82621M50647
54821d88125N65895O16529O06839N48055M49707L17324J56236k2940k01471l54603
54811B193446m58070m95870m64793l73533k38379p9395Q1275K20649L17454L55656
54801A058440L27375K34425Q8536q9941k75192m40469n62765o26737o27459n71210
54791a484997m73000l50892k19741q8154L9889J60621K66476L44453L77328L47802
$$ y = [-1884129, -1631003, -1279004, -840757, -351633, 139815, 583404, 933696, 1151766, 1208085, 1089244, 804778, 388094, -110734, -637147, -1143758, -1597439, -1980608, -2287785, -2519584, -2676686, -2756159, -2751486, -2655901, -2466992, -2190711, -1844448, -1459436, -1081128, -764277, -560831, -503570, -592567, -790906, -1031381, -1231570, -1313183, -1221393, -938772, -488125, 77770, 694299, 1301138, 1849193, 2298900, 2616224, 2772460, 2749520, 2548049, 2193446, 1735376, 1239506, 774713, 401180, 162801, 83406, 164681, 385330, 702784, 1058440, 1385815, 1620240, 1708776, 1618835, 1343643, 903174, 340409, -286328, -913787, -1484997, -1957997, -2308889, -2528630, -2616784, -2576895, -2416274, -2149798, -1805345, -1428017, -1080215]
54781a080215K44851O9680j62120m23327o80734r00919j055067j122816j094585
54772f205252r71801p65705m96149j90650J17289L91504N98428P14161P31705
54763f076470O64475N42327M00656K68015J58515P1853N4o2788j13476j40772
54753d287611j34577r5984l9492J4401M9449N8820M3414P736m2076r7588j47643
54742d671151j80676j89171j73237j40273j00472o0608k0039K8206R1394J69502
54732e246525K50819L13678L33777K94075J93450N0142j03172k32211l15918l54605
54722d816490l66675l76861m03671m52416n15311n76409o18226o27392n98020
54713i351471n32843m42874l45617k60648k02465j73949j65220j59407j40924
$$ y = [-1080215, -835364, -765684, -927804, -1351131, -2031865, -2932784, -3987851, -5110667, -6205252, -7177053, -7942758, -8438907, -8629557, -8512268, -8120764, -7522336, -6808175, -6076470, -5411995, -4869668, -4469012, -4200997, -4042482, -3970629, -3970575, -4033363, -4146839, -4287611, -4422188, -4518172, -4557664, -4543263, -4493814, -4434994, -4391580, -4383844, -4425920, -4523508, -4671151, -4851827, -5040998, -5214235, -5354508, -5454980, -5515588, -5535627, -5507421, -5416027, -5246525, -4995706, -4682028, -4348251, -4054176, -3860726, -3810584, -3913756, -4145967, -4461885, -4816490, -5183165, -5560026, -5963697, -6416113, -6931424, -7507833, -8126059, -8753451, -9351471, -9884314, -10327188, -10672805, -10933453, -11135918, -11309867, -11475087, -11634494, -11775418]
54704a1775418j00555l6173M7736J40062K24961K87417L19058L18698K87159K22154
54694a0064901J18829k4527k00898l93658n80617p39904q54178r12161r09074
54685a4561089q47855p40257o05016m62134l26626k06166j03474j9768M4839R4167
54675a7733379J38041J89730K59155L46891M43635N35062O07769O52565O64982
54666a3895549O44803N95506N23510M37439L47884K67119K07936J81652J96216
54657a0493484K54736L54046M83533O25070P54602Q45344Q72976Q23040O98403
54648d781734N22212L32749J71638P0975M5009Q8369J79464K87090L79053M31762
54638b273413M38270M10822L75218L58325L74897M21133M78699N25896N48346
$$ y = [-11775418, -11875973, -11912146, -11864410, -11724348, -11499387, -11211970, -10892912, -10574214, -10287055, -10064901, -9946072, -9970599, -10171497, -10565155, -11145772, -11885676, -12739854, -13652015, -14561089, -15408944, -16149201, -16754217, -17216351, -17542977, -17749143, -17852617, -17872385, -17827546, -17733379, -17595338, -17405608, -17146453, -16799562, -16355927, -15820865, -15213096, -14560531, -13895549, -13250746, -12655240, -12131730, -11694291, -11346407, -11079288, -10871352, -10689700, -10493484, -10238748, -9884702, -9401169, -8776099, -8021497, -7176153, -6303177, -5480137, -4781734, -4259522, -3926773, -3755135, -3684160, -3639151, -3550782, -3371318, -3084228, -2705175, -2273413, -1835143, -1424321, -1049103, -690778, -315881, 105252, 583951, 1109847, 1658193]
54629A658193N42824N14152M69316M12539L42481K52433J35008j0040j70932l27593
54619C818381m61913n65731o40276o89622p15145p14720o85043o24352n34217
54610a812638m19749k87701j43638R115J67129L22843M62710N70347O33921O53061
54600A55400O39252O07773N66841N13338M39192L42371K32431J26501M0480j7029
54590C646550m4919m5938k3190K0581Q0930J49307K13481K61327K85034K82186
54580D825349K53283J98547J16883P430j27717k81813m44186o03131p48595q72395
54570B323655r66509j022205j031557r89983q98045p62605n97414m21603k54972
54561d621238j12797m575O2884Q2684M9454l6043j63748l14862m65340n90941
$$ y = [1658193, 2201017, 2715169, 3184485, 3597024, 3939505, 4191938, 4326946, 4316906, 4145974, 3818381, 3356468, 2790737, 2150461, 1460839, 745694, 30974, -654069, -1278421, -1812638, -2232387, -2520088, -2663726, -2654611, -2487482, -2164639, -1701929, -1131582, -497661, 155400, 794652, 1402425, 1969266, 2482604, 2921796, 3264167, 3496598, 3623099, 3663579, 3646550, 3601631, 3555693, 3532503, 3553084, 3634014, 3783321, 3996802, 4258129, 4543163, 4825349, 5078632, 5277179, 5394062, 5401492, 5273775, 4991962, 4547776, 3944645, 3196050, 2323655, 1357146, 334941, -696616, -1686599, -2584644, -3347249, -3944663, -4366266, -4621238, -4734035, -4738610, -4675726, -4593042, -4543588, -4579631, -4743379, -5058241, -5523581, -6114522]
54551f114522o73037p03411o85566o31892n58817m82283m13965l58179l10911
54542a0932583k62762k05070j35485n9699J0749O2511Q4319P0033K0587n5229
54532a1402629j41193k15712k56761k49576j93747j04721q290O8066J02412Q3323
54522a2318828J3797q7562j91774k70843l08877l06326k76367k37417k05902j91573
54512a4381672j96640k18171k50803k86655l13343l14288k73886j85122n4304
54503a6474884J00811K59013M05138N34626O49969P52570Q37647Q96618R23800
54494a1114692R20546Q93390Q48762P89681P17431O36274N55905M88056M39595
54485d825052M08518L86361L63852L34080K91526K30290J44892L3611r7814k34676
$$ y = [-6114522, -6787559, -7490970, -8176536, -8808428, -9367245, -9849528, -10263493, -10621672, -10932583, -11195345, -11400415, -11535900, -11595599, -11584850, -11522339, -11438020, -11367987, -11347400, -11402629, -11543822, -11759534, -12016295, -12265871, -12459618, -12564339, -12572629, -12504563, -12402151, -12318828, -12305031, -12392593, -12584367, -12855210, -13164087, -13470413, -13746780, -13984197, -14190099, -14381672, -14578312, -14796483, -15047286, -15333941, -15647284, -15961572, -16235458, -16420580, -16474884, -16374073, -16115060, -15709922, -15175296, -14525327, -13772757, -12935110, -12038492, -11114692, -10194146, -9300756, -8451994, -7662313, -6944882, -6308608, -5752703, -5264647, -4825052, -4416534, -4030173, -3666321, -3332241, -3040715, -2810425, -2665533, -2631922, -2729736, -2964412]
54475b964412l55788m40259m75867m64249m19808l63280l13496k81192k67375
54466f345726k66665k72454k79332k81239k68837k30332j55679m0843J09648K81219
54456g750240M49344N84081O59600O64152O03690M96729L63916K18906O5902r4840
54446c738760k57428m04260n09217n49174n16695m26418l11947k14918j70571
54437g099388j95695k84183m11829n46594o57754p20273p16109o36738m87596
54428a1756159k90152p6945J19209K75073L80687M38057M58900M62037M67594
54419i521699M88411N24091N62557N87351N84800N47333M73679L68200K40590
54410e144687J05681j8232j14356j74646k04085k17309k29138k46261k65528k77934
$$ y = [-2964412, -3320200, -3760459, -4236326, -4700575, -5120383, -5483663, -5797159, -6078351, -6345726, -6612391, -6884845, -7164177, -7445416, -7714253, -7944585, -8100264, -8141107, -8031459, -7750240, -7300896, -6716815, -6057215, -5393063, -4789373, -4292644, -3928728, -3709822, -3643920, -3738760, -3996188, -4400448, -4909665, -5458839, -5975534, -6401952, -6713899, -6928817, -7099388, -7295083, -7579266, -7991095, -8537689, -9195443, -9915716, -10631825, -11268563, -11756159, -12046311, -12123256, -12004047, -11728974, -11348287, -10910230, -10451330, -9989293, -9521699, -9033288, -8509197, -7946640, -7359289, -6774489, -6227156, -5753477, -5385277, -5144687, -5039006, -5057238, -5171594, -5346240, -5550325, -5767634, -5996772, -6243033, -6508561, -6786495]
54400f786495k73998k47543j97497j28225m9000K7298Q6902J19373J21091R5222
54390g232872M8986p896o2524j00108j10190r3435o1409k8376k056J9718M5621
54379g584541Q4015J36261J93209K37258K48825K12791J21952k0736j98825l80715
54369f950506n25138n94249n67419m48017k61253m6041J55590L09260L96277M15599
54359h115897L78813L01627J97429P6375n1209j71462k67590l24579l34682k99801
54349h610976k29380j35362k6956R2172K22415L62916N06594O40774P54153Q43767
54339e579883R14740R72716J016346J036500J021907R66266Q72638P53386O25464
54330B600080N02754L90422K85938J85681R0388M029p1771j40634k07219k68788
$$ y = [-6786495, -7060493, -7308036, -7505533, -7633758, -7682758, -7655460, -7568558, -7449185, -7328094, -7232872, -7183886, -7191782, -7254306, -7354414, -7464604, -7558039, -7619448, -7647824, -7649880, -7630162, -7584541, -7500526, -7364265, -7171056, -6933798, -6684973, -6472182, -6350230, -6370966, -6569791, -6950506, -7475644, -8069893, -8637312, -9085329, -9346582, -9392623, -9237033, -8927773, -8531496, -8115897, -7737084, -7435457, -7238028, -7161653, -7212862, -7384324, -7651914, -7976493, -8311175, -8610976, -8840356, -8975718, -9002674, -8910502, -8688087, -8325171, -7818577, -7177803, -6423650, -5579883, -4665143, -3692427, -2676081, -1639581, -617674, 348592, 1221230, 1974616, 2600080, 3102834, 3493256, 3779194, 3964875, 4055263, 4059292, 3987521, 3846887, 3639668, 3370880]
54320C370880l10262l08229k42458j07924P9423K85176M65200N77561N94582N10953
54310D914902L43845J24512j14092l47266n62021p54046r21266j058466j156609
54301D69493j207032j206708j160035j075952r63055q26683o69533m94061l03696
54292g437262j01856J08756L23833N32855P16807Q51634R16183R00091Q07867
54283b381092O58045M77979K96467J37152J4674o7003j15426j48716j90258k59174
54273a577352l61045m84684o07040p03348p56863p63659p31361o74461o09804
54264g269617n53496n17914n08124n19616n39897n53613n47947n15654m55811
54255a1981689l73716k79964j87238j04477l1084M4407J38889K64504M19570N86135
$$ y = [3370880, 3060618, 2752389, 2509931, 2402007, 2481430, 2766606, 3231806, 3809367, 4403949, 4914902, 5258747, 5383259, 5269167, 4921901, 4359880, 3605834, 2684568, 1626102, 469493, -737539, -1944247, -3104282, -4180234, -5143289, -5969972, -6639505, -7133566, -7437262, -7539118, -7430362, -7106529, -6573674, -5856867, -5005233, -4089050, -3188959, -2381092, -1723047, -1245068, -948601, -811449, -796775, -863778, -979204, -1127920, -1318178, -1577352, -1938397, -2423081, -3030121, -3733469, -4490332, -5253991, -5985352, -6659813, -7269617, -7823113, -8341027, -8849151, -9368767, -9908664, -10462277, -11010224, -11525878, -11981689, -12355405, -12635369, -12822607, -12927084, -12958168, -12913761, -12774872, -12510368, -12090798, -11504663]
54245a1504663P35723Q39703Q78372Q44633P42209N81411L75611J40126j06830
54236f473705l43186n44632o89633p65556p72256p21370o32341n27018m24224
54227a1893921l36319k69559k27107k10116k14382k26672k27144j98319j33557
54218a3937096l8605P2951J85269K84279L60788M12489M42577M54864M49323M22220
54208a0890941L70474K96077K07396J17393M0142j3886m2821n5848o9672r9185
54198a0140871j47656k03452k46220k58728k36836j91775j44790j18769j31758
54189a1820855j93515l03446m49150o07155p47380q39682q59231p89632o25989
54180a7236035l79677q2236K17203M64193O17129O62020O15138N12391L92606
$$ y = [-11504663, -10768940, -9929237, -9050865, -8206232, -7464023, -6882612, -6507001, -6366875, -6473705, -6816891, -7361523, -8051156, -8816712, -9588968, -10310338, -10942679, -11469697, -11893921, -12230240, -12499799, -12726906, -12937022, -13151404, -13378076, -13605220, -13803539, -13937096, -13975701, -13902750, -13717481, -13433202, -13072414, -12659925, -12217348, -11762484, -11313161, -10890941, -10520467, -10224390, -10016994, -9899601, -9859459, -9873345, -9916166, -9972014, -10041686, -10140871, -10288527, -10491979, -10738199, -10996927, -11233763, -11425538, -11570328, -11689097, -11820855, -12014370, -12317816, -12766966, -13374121, -14121501, -14961183, -15820414, -16610046, -17236035, -17615712, -17697948, -17480745, -17016552, -16399423, -15737403, -15122265, -14609874, -14217268]
54171a4217268K84921K05482J60683J50248J66729J94221K11436K00476J56418
54162a2486654R0908K7028j1146q175L8300J18683K15679L08705L77462M06039
54152a0923171L88747L35254K69907K22693K15771K53095L18494L82361M13371
54143h123478L90020L07065J74769J2977j55960l13087m47038n55652o43686p17333
54133a0071403p78507q21803q35186q04956p23919n98475m48438k98125j64803
54124a5545615n2638M5062J38585K34395L30787M18566M86616N29146N49789N59878
54114a2305429N72142N93672O22222O48278O61578O57251O37315O07642N73660
54105f731669N36886M92615M30187L38560K16386P9700m0317j10198j09985m2272
$$ y = [-14217268, -13932347, -13726865, -13566182, -13415934, -13249205, -13054984, -12843548, -12643072, -12486654, -12395746, -12368718, -12379864, -12388039, -12349739, -12231056, -12015377, -11706672, -11329210, -10923171, -10534424, -10199170, -9929263, -9706570, -9490799, -9237704, -8919210, -8536849, -8123478, -7733458, -7426393, -7251624, -7238647, -7394607, -7707694, -8154732, -8710384, -9354070, -10071403, -10849910, -11671713, -12506899, -13311855, -14035774, -14634249, -15082687, -15380812, -15545615, -15598253, -15553191, -15414606, -15180211, -14849424, -14430858, -13944242, -13415096, -12865307, -12305429, -11733287, -11139615, -10517393, -9869115, -9207537, -8550286, -7912971, -7305329, -6731669, -6194783, -5702168, -5271981, -4933421, -4717035, -4637335, -4677652, -4787850, -4897835, -4940107]
54095d940107P0070J94653L01754L71846L96698L76134L14051K16244R0812n0365
54085b658210j91650l16785m13629m77196n09304n16238n06896m92146m83819
54076f565873m91551n17876n55175n88439o03894n97520n76587n53356n37079
54067a1587350n30615n32168n37829n41473n32437m94248m07646k58477m6992
54058a5469235K07309M68978O96463Q53447R17635Q85875P75378O19872M59770
54049i584508L28421K40562J89812J57088J24020Q1965L1915k1261p3093j19016
54039h644095j51383j58344j26914m9229P1448K18830L67502M91026N70570O00637
54029f809952N89205N51364M99257M35051L52527K45980J18964j3314j27946k00799
$$ y = [-4940107, -4870037, -4675384, -4373630, -4001784, -3605086, -3228952, -2914901, -2698657, -2607845, -2658210, -2849860, -3166645, -3580274, -4057470, -4566774, -5083012, -5589908, -6082054, -6565873, -7057424, -7575300, -8130475, -8718914, -9322808, -9920328, -10496915, -11050271, -11587350, -12117965, -12650133, -13187962, -13729435, -14261872, -14756120, -15163766, -15422243, -15469235, -15261926, -14792948, -14096485, -13243038, -12325403, -11439528, -10664150, -10044278, -9584508, -9256087, -9015525, -8825713, -8668625, -8544605, -8462640, -8430725, -8451986, -8525079, -8644095, -8795478, -8953822, -9080736, -9129965, -9058517, -8839687, -8472185, -7981159, -7410589, -6809952, -6220747, -5669383, -5170126, -4735075, -4382548, -4136568, -4017604, -4030918, -4158864, -4359663]
54019d359663k12887j56359l9511J11944K60135L66601M05423L70918K75755J41636
54009b836008j0984j68576l24399m74432o12279p26303q01518q25604p94414p12482
53999h286999n88582m30918k45965m0898J73781L84675N79145P48859Q89345R95281
53989e822276J056368J059064R94025Q63302O81754M72795K62827P7479o1099
53980d15761j38272j52456j18898o7527l3600m4996j12332k26054l60318m81229
53970b151443n57025n67482n09051l93416k41507p7530P4378J92372K60497K73207
53960c697000K37904J73158J02480M5953J3383K431J934k627k4751p3624j50488
53949c371247k45885l41079m14417m48810m35805l75580k75340j48274j2939J08449
$$ y = [-4359663, -4572550, -4728909, -4768420, -4656476, -4396341, -4029740, -3624317, -3253399, -2977644, -2836008, -2846992, -3015568, -3339967, -3814399, -4426678, -5152981, -5954499, -6780103, -7574517, -8286999, -8875581, -9306499, -9552464, -9593362, -9419581, -9034906, -8455761, -7706902, -6817557, -5822276, -4765908, -3706844, -2712819, -1849517, -1167763, -694968, -432141, -354662, -415761, -554033, -706489, -825387, -892914, -926514, -971510, -1083842, -1309896, -1670214, -2151443, -2708468, -3275950, -3785001, -4178417, -4419924, -4497454, -4423076, -4230704, -3970207, -3697000, -3459096, -3285938, -3183458, -3137505, -3124122, -3121691, -3119757, -3122384, -3147135, -3220759, -3371247, -3617132, -3958211, -4372628, -4821438, -5257243, -5632823, -5908163, -6056437, -6069376, -5960927]
53939e960927J94338K30297K14006J54591O6241l8542j51162k65265l75315m76848
53929f408586n66548o41142o96560p28060p30153o96681o23650n15378l89182
53920a1995940k72775j94193j70095j99076k62801l33423l83341l93476l58274
53911a4563394k87445k03645j34591j01333j08954j45725j89961k18880k15221
53902a6169149j71449r1677J0390J17912K18154L05604L79496M38607M78181M91855
53892a3992076M77003M37943L82921L17764K43687J62272Q1679J6638j8201j5441
53882a1905811K1692P9762J38536J78177J88547J74697J53515J43257J53006J78147
53872a0496475K03095K09502J86519J38191Q3020M5112M2810Q2556J60265K65723
$$ y = [-5960927, -5766589, -5536292, -5322286, -5167695, -5101454, -5139996, -5291158, -5556423, -5931738, -6408586, -6975134, -7616276, -8312836, -9040896, -9771049, -10467730, -11091380, -11606758, -11995940, -12268715, -12462908, -12633003, -12832079, -13094880, -13428303, -13811644, -14205120, -14563394, -14850839, -15054484, -15189075, -15290408, -15399362, -15545087, -15735048, -15953928, -16169149, -16340598, -16432275, -16421885, -16303973, -16085819, -15780215, -15400719, -14962112, -14483931, -13992076, -13515073, -13077130, -12694209, -12376445, -12132758, -11970486, -11888807, -11872169, -11890370, -11905811, -11884119, -11804357, -11665821, -11487644, -11299097, -11124400, -10970885, -10827628, -10674622, -10496475, -10293380, -10083878, -9897359, -9759168, -9676148, -9631036, -9588226, -9505670, -9345405, -9079682]
53862i079682L84981N00727N93837O46903O47173N87441M66906K93745Q6900j27000
53852d998069l21777m80234n97919o80358p35676p66748p68110p30407o49645
53843a0728943n33685m00507k69851j54672n7610K7183J09471J98247K98252M07778
53833a1104337N17507O10954O68274O74008O25538N36147M29050L25597K36157
53824f481105J60014R2911L4857p853k6288j3895K9781R6457J67765K17811K21581
53813e507964J66025N6997q2562k21307l29231l83983l73840k99789j77500l6526
53803g189680Q6632J60793J71499J24153L7025p0434j85853l04769m26399n49370
53793h146403o69968p81879q76010r40688r63452r34311q49105p11833n35028
$$ y = [-9079682, -8694701, -8193974, -7600137, -6953234, -6306061, -5718620, -5251714, -4957969, -4871069, -4998069, -5319846, -5800080, -6397999, -7078357, -7814033, -8580781, -9348891, -10079298, -10728943, -11262628, -11663135, -11932986, -12087658, -12145268, -12118085, -12008614, -11810367, -11512115, -11104337, -10586830, -9975876, -9307602, -8633594, -8008056, -7471909, -7042859, -6717262, -6481105, -6321091, -6228180, -6193323, -6201176, -6227464, -6241359, -6211578, -6115121, -5947356, -5729545, -5507964, -5341939, -5284942, -5367504, -5588811, -5918042, -6302025, -6675865, -6975654, -7153154, -7189680, -7103048, -6942255, -6770756, -6646603, -6609578, -6680012, -6865865, -7170634, -7597033, -8146403, -8816371, -9598250, -10474260, -11414948, -12378400, -13312711, -14161816, -14873649, -15408677]
53784a5408677l37282j38292M5416K00898L16813L83970L99783L71303L11629
53775a3854439K32390J40264M1110n3237j22569j42371r1577L9667K44678M99247
53765a3066837P66069J003896J178637J272259J285315J231652J128747R90050
53757d210212Q23376O34063M28723K16886J0182j79900l44201m76181n70074o19138
53747d286476o16529n58709m48694k97091j21107N7394K14377L27613L82630L79255
53737d967337L34592K78349K40817K39886K74723L28996L80075M08284M01961
53728b079654L57217K74337J54761K048j73305l49313m93355n70838n59216m60375
53718c897693l03354j34467l57O6096N1141m1233j92559l73425n49183o88384
$$ y = [-15408677, -15745959, -15884251, -15838835, -15637937, -15321124, -14937154, -14537371, -14166068, -13854439, -13622049, -13481785, -13440675, -13493912, -13616481, -13758852, -13850429, -13810762, -13566084, -13066837, -12300768, -11296872, -10118235, -8845976, -7560661, -6329009, -5200262, -4210212, -3386836, -2752773, -2324050, -2107164, -2096982, -2276882, -2621083, -3097264, -3667338, -4286476, -4903005, -5461714, -5910408, -6207499, -6328606, -6271212, -6056835, -5729222, -5346592, -4967337, -4632745, -4354396, -4113579, -3873693, -3598970, -3269974, -2889899, -2481615, -2079654, -1722437, -1448100, -1293339, -1291291, -1464596, -1813909, -2307264, -2878102, -3437318, -3897693, -4201047, -4335514, -4335871, -4269775, -4218634, -4259867, -4452426, -4825851, -5375034, -6063418]
53708f063418p70566p88822p46028o48161m99804l04406o8021J96747M69134P22414
53698h500931R30178J074552J151525J169406J141769J080598R93562Q84223P52699
53689F77581N97076M17386K20645K2625j56107k97504l91853m38791m44048m15592
53679b08582l62723k97895k36796j93235j71553j63570j53675j28296q2733k1698
53669b020756M4781J06093J53211J77787J70485J21978K7382j08964k72320m40828
53659b041151n91143p04180p69681p88052p67925p20174o52171n66297m63519
53650h064293l49225k36775j45157r0859p9041j01242j42306j91081k45739l09359
53640i955077l80270m45668m83714m72433l99489k67467r3212R6658K71532M03147
$$ y = [-6063418, -6833984, -7622806, -8368834, -9016995, -9516799, -9821205, -9889226, -9692479, -9223345, -8500931, -7570753, -6496201, -5344676, -4175270, -3033501, -1952903, -959341, -75118, 677581, 1274657, 1692043, 1912688, 1935313, 1779206, 1481702, 1089849, 651058, 207010, -208582, -571305, -869200, -1105996, -1299231, -1470784, -1634354, -1788029, -1916325, -1999058, -2020756, -1975975, -1869882, -1716671, -1538884, -1368399, -1246421, -1219039, -1328003, -1600323, -2041151, -2632294, -3336474, -4106155, -4894207, -5662132, -6382306, -7034477, -7600774, -8064293, -8413518, -8650293, -8795450, -8886309, -8965350, -9066592, -9208898, -9399979, -9645718, -9955077, -10335347, -10781015, -11264729, -11737162, -12136651, -12404118, -12497330, -12400672, -12129140, -11725993]
53630a1725993M73125M80556M45582M04560L96786M48867N65421P30486R16043
53621f864567J089922J219339J273580J230556J085937Q58056N83842L07366O6247
53612H50278j19036k48750l37955m04201m57803n01580n37291n69439o01773o31202
53602c558752o46936o37039n97187n34564m63566l96518l36424k76879k07785
53593g655650j21711j7910R5528K01449K77522L04245K72422J85576N8008q7693
53583f488214k22821l17113l46721l02282j92352l9918J26411K82087M11906N08418
53573f580599N66355N78888N39206M45770L06979J41641k5786j73500k89912l76192
53563d867150m42444n00090n54366o00100o22433o02412n24982l85842j94648
$$ y = [-11725993, -11252868, -10772312, -10326730, -9922170, -9525384, -9076517, -8511096, -7780610, -6864567, -5774645, -4555306, -3281726, -2051170, -965233, -107177, 476665, 784031, 850278, 731242, 482492, 144537, -259664, -717467, -1219047, -1756338, -2325777, -2927550, -3558752, -4205688, -4842727, -5439914, -5974478, -6438044, -6834562, -7170986, -7447865, -7655650, -7777361, -7795271, -7699743, -7498294, -7220772, -6916527, -6644105, -6458529, -6400521, -6488214, -6711035, -7028148, -7374869, -7677151, -7869503, -7909421, -7783010, -7500923, -7089017, -6580599, -6014244, -5435356, -4896150, -4450380, -4143401, -4001760, -4027546, -4201046, -4490958, -4867150, -5309594, -5809684, -6364050, -6964150, -7586583, -8188995, -8713977, -9099819, -9294467]
53554i294467K6045K46028M35952N76007O60375O95688O95919O77218O54051O36519
53544c990665O29550O34340O49773O70865O85083O71693O08040M80378K92137
53535A331194O4211j72490l86825n54094o57876o89860o51348n56751m34720l22347
53525c030906k52755k42251k84120l51854m09690m26301l87306l01600j97374
53516e884157j08700o0213n8992r6515j56245k20884k77168l19074l49230l76715
53506g907893m10708m53063m94936n20712n17634m85222m38111l99817l90534
53497a2018630m15559m61006m99998n06756m70644m01689l24469k64798k37358
53488a5600907k40346k58358k70378k58173k11672j30909k5707Q6649J86373K57650
$$ y = [-9294467, -9268422, -9022394, -8586442, -8010435, -7350060, -6654372, -5958453, -5281235, -4627184, -3990665, -3361115, -2726775, -2077002, -1406137, -721054, -49361, 558679, 1039057, 1331194, 1395405, 1222915, 836090, 281996, -375880, -1065740, -1717088, -2273839, -2708559, -3030906, -3283661, -3525912, -3810032, -4161886, -4571576, -4997877, -5385183, -5686783, -5884157, -5992857, -6053070, -6112062, -6208577, -6364822, -6585706, -6862874, -7181948, -7531178, -7907893, -8318601, -8771664, -9266600, -9787312, -10304946, -10790168, -11228279, -11628096, -12018630, -12434189, -12895195, -13395193, -13901949, -14372593, -14774282, -15098751, -15363549, -15600907, -15841253, -16099611, -16369989, -16628162, -16839834, -16970743, -16996450, -16909801, -16723428, -16465778]
53478a6465778K93176K94423K69015K27975J83651J47420J27552J28300J50057
53469a4644209J89128K37383K83693L17618L33039L29278L09872K80737K48874
53460a2114587K21947K08725K19516K64628L49867M71074O11784P46419Q48108
53451h172519Q97627Q89342Q31205P38958O28414N11030L94681K86779J95363
53442b799120J27104Q4743O6392O6242P5120Q0959P1280L8348j5539p6907j26449
53431b407827j48637j39954j10214p6140n1658m1216l9039l2917j0083L6118J00635
53420b920932J66086K10061K17332J88840J40743R4276O3331M7321L2744J890
53410a758308n6342j39417k31628l11423l60758l71202l44291k87784k11307j23791
$$ y = [-16465778, -16172602, -15878179, -15609164, -15381189, -15197538, -15050118, -14922566, -14794266, -14644209, -14455081, -14217698, -13934005, -13616387, -13283348, -12954070, -12644198, -12363461, -12114587, -11892640, -11683915, -11464399, -11199771, -10849904, -10378830, -9767046, -9020627, -8172519, -7274892, -6385550, -5554345, -4815387, -4186973, -3675943, -3281262, -2994483, -2799120, -2672016, -2587273, -2520881, -2454639, -2379519, -2298560, -2227280, -2188932, -2204471, -2281378, -2407827, -2556464, -2696418, -2806632, -2882772, -2934430, -2975646, -3014685, -3047602, -3057685, -3021567, -2920932, -2754846, -2544785, -2327453, -2138613, -1997870, -1903594, -1840263, -1792942, -1760198, -1758308, -1814650, -1954067, -2185695, -2497118, -2857876, -3229078, -3573369, -3861153, -4072460, -4196251]
53400d196251l3209N2243J22826J67471J76424J45489P9204r333j02137j81816
53390c779089k36357k60947k55833k21999j58613o4780N6236J94528L35169M62638
53380c929047N65220O37273O78408O90201O72990O25804N49511M49713L35954
53371A276027K17882J02238o648j04168j84141k40874k72632k82816k77484k61794
53361c4410k39064k12756j88563j73964j75663j96783k35171k83436l31039l67631
53351b438480l85476l79780l48500k93950k25293j57978j07519q0535o9478n5559
53341d542548j8766N0908J46957K47588L23959L52135L23743K49781J54685O3453
53331b648105j0213o7467j18348j71846k29457k85925l34941l73937m03878m25232
$$ y = [-4196251, -4229460, -4177217, -4054391, -3886920, -3710496, -3565007, -3485803, -3495136, -3597273, -3779089, -4015446, -4276393, -4532226, -4754225, -4912838, -4977618, -4921382, -4726854, -4391685, -3929047, -3363827, -2726554, -2048146, -1357945, -684955, -59151, 490360, 940073, 1276027, 1493909, 1596147, 1589499, 1485331, 1301190, 1060316, 787684, 504868, 227384, -34410, -273474, -486230, -674793, -848757, -1024420, -1221203, -1456374, -1739810, -2070849, -2438480, -2823956, -3203736, -3552236, -3846186, -4071479, -4229457, -4336976, -4417511, -4486989, -4542548, -4561314, -4510406, -4363449, -4115861, -3791902, -3439767, -3116024, -2866243, -2711558, -2648105, -2658318, -2725785, -2844133, -3015979, -3245436, -3531361, -3866302, -4240239, -4644117, -5069349]
53321e069349m35033m28341m02566l60688l11264k66123k37448k34828k62699
53312h008339l18820l94726m78275n57446o23803o73604p05719p17830p04278
53303a3182840o57991n75353m59530l18619j60099J2082J93562L72783N30603
53294a4245402O49808P26402P71247Q00153Q21902Q34050Q27168P91735P23495
53285g299442O26935N16435M13123L37048K98227K91639K99016K97028K68132
53276c951859K08263J26249L5321n6460j49423k48147l55299m68515n80573o80857
53266f121300p57755q02314q11497p87697p34312o51224n34408l80148j90903
53257a1771558K0447K30154M07969N25518N65394N26279M21322K71233R6914q4107
$$ y = [-5069349, -5504382, -5932723, -6335289, -6695977, -7007241, -7273364, -7510812, -7745640, -8008339, -8327159, -8721885, -9200160, -9757606, -10381409, -11055013, -11760732, -12478562, -13182840, -13840831, -14416184, -14875714, -15194333, -15354432, -15342350, -15148788, -14776005, -14245402, -13595594, -12869192, -12097945, -11297792, -10475890, -9641840, -8814672, -8022937, -7299442, -6672507, -6156072, -5742949, -5405901, -5107674, -4816035, -4517019, -4219991, -3951859, -3743596, -3617347, -3582026, -3638486, -3787909, -4036056, -4391355, -4859870, -5440443, -6121300, -6879055, -7681369, -8492866, -9280563, -10014875, -10666099, -11200507, -11580655, -11771558, -11751111, -11520957, -11112988, -10587470, -10022076, -9495797, -9074475, -8803242, -8706328, -8790435]
53247h790435k56607m04907n11669n59627n35897m38103k80319r4579P5570J87621
53237a1608952K12012J38088k5299k51786n02136p33131r08642j007520j025434
53228a5712800r72754q71187p48464o29587n27301m38000l47078k40759j16261
53219b0604191J6683J43084K52190L42238M18713M89370N59564O28931O89636
53210a7063782P27290P24969O69102N55097L91175J98847Q631j48045k46685k73448
53200a4456849k24754j05705P0888K85476N14119P32577R21287J068989J172488
53191a0021484J232863J252129J233846J185493J117266J036764R45570Q42359
53183a175194P29180O13698N05523M11179L32152K65425K04286J39554O2739k9671
$$ y = [-8790435, -9047042, -9451949, -9963618, -10523245, -11059142, -11497245, -11777564, -11872143, -11796573, -11608952, -11396940, -11258852, -11284151, -11535937, -12038073, -12771204, -13679846, -14687366, -15712800, -16685554, -17556741, -18305205, -18934792, -19462093, -19900093, -20247171, -20487930, -20604191, -20587508, -20444424, -20192234, -19849996, -19431283, -18941913, -18382349, -17753418, -17063782, -16336492, -15611523, -14942421, -14387324, -13996149, -13797302, -13788671, -13936716, -14183401, -14456849, -14681603, -14787308, -14716420, -14430944, -13916825, -13184248, -12262961, -11193972, -10021484, -8788621, -7536492, -6302646, -5117153, -3999887, -2963123, -2017553, -1175194, -446014, 167684, 673207, 1084386, 1416538, 1681963, 1886249, 2025803, 2088542, 2058871]
53173B058871j33999k41128l40823m25314m89942n31053n43428n20046m55697
53164a622559l52877k25991r9941k413M6599M2172n177p5496j47563k05112k39729
53153b888087k50872k43706k25601k03204j82102j68940j73357k06910k78530
53144d821309l88603n25384o67060p89584q75754r19487r23770q96586q49240
53135a1656777p95932p50732p21918p08087o98954o79119o32146n44836m11788
53126a7600289k38137l8242J68264L59926N15971O19835O63582O50211N91972
53117a4306907N06514M13275L30332K71062K41966K43346K71805L21540L83481
53108a1323586M44576M89396N03282M74984L98708K76729J21778m4052j95470
$$ y = [2058871, 1924872, 1683744, 1342921, 917607, 427665, -103388, -646816, -1166862, -1622559, -1975436, -2201427, -2301368, -2303781, -2257182, -2215010, -2220187, -2295683, -2443246, -2648358, -2888087, -3138959, -3382665, -3608266, -3811470, -3993572, -4162512, -4335869, -4542779, -4821309, -5209912, -5735296, -6402356, -7191940, -8067694, -8987181, -9910951, -10807537, -11656777, -12452709, -13203441, -13925359, -14633446, -15332400, -16011519, -16643665, -17188501, -17600289, -17838426, -17876668, -17708404, -17348478, -16832507, -16212672, -15549090, -14898879, -14306907, -13800393, -13387118, -13056786, -12785724, -12543758, -12300412, -12028607, -11707067, -11323586, -10879010, -10389614, -9886332, -9411348, -9012640, -8735911, -8614133, -8658185, -8853655]
53099h853655l11856l81244l99192l66717k91282j88832q1512J0083P4523J11029
53089a0678655J25051J23400J12659R9890R2799R8884J24673J74966K50953L47504
53079i127876M52315N48995O22936O66165O78107O62143O20490N50857M47350
53070c878518L05706J29778o5225k55285m14521n22673n70077n59346n03971m23922
53060f758054l38615k59720j87468j12895k4665Q3887K11637L51247M92508O23723
53050e918415P30045P91560P85319O93224N12966K65671n535k47323m13390m78900
53040c284778m45744l37716j89682l6167R6537J93123K47284K57588K24796J52421
53030c122338M8923p1836j92985k97880l72272m06228l97482l54765k96964k46215
$$ y = [-8853655, -9165511, -9546755, -9945947, -10312664, -10603946, -10792778, -10874290, -10864207, -10789684, -10678655, -10553604, -10430204, -10317545, -10217655, -10124856, -10025972, -9901299, -9726333, -9475380, -9127876, -8675561, -8126566, -7503630, -6837465, -6159358, -5497215, -4876725, -4325868, -3878518, -3572812, -3443034, -3508259, -3763544, -4178065, -4700738, -5270815, -5830161, -6334132, -6758054, -7096669, -7356389, -7543857, -7656752, -7681417, -7597530, -7385893, -7034646, -6542138, -5918415, -5188370, -4396810, -3611491, -2918267, -2405301, -2139630, -2145165, -2392488, -2805878, -3284778, -3730522, -4068238, -4257920, -4294087, -4197550, -4004427, -3757143, -3499555, -3274759, -3122338, -3073415, -3145251, -3338236, -3636116, -4008388, -4414616, -4812098, -5166863, -5463827, -5710042]
53020e710042k18839k20583k48466k95119l50258l99181m23597m08470l51439
53011h625994k66833j80069j15877q7938r4941j23757j57520j84875k05675k29991
53001a0273470k71472l39275m31938n34486o20204o58474o26553n18374l44626
52992a4618872j25856J14459L52706N66190P36076Q51816R13338R29257R12659
52983i368227Q76641Q30340P76150P10021O25818N20969L98815K66174J29690
52974d233609n059j32133k44924l37701m06540m48549m61829m47688m12113l63124
52964g493269l06143k43151j77360j18364q1983q4440j34888k30224l54194m81241
52954i705257n83584o38040o29571n52001m08472k12164J5225K48995M68481O60619
$$ y = [-5710042, -5928881, -6149464, -6397930, -6693049, -7043307, -7442488, -7866085, -8274555, -8625994, -8892827, -9072896, -9188773, -9276711, -9371652, -9495409, -9652929, -9837804, -10043479, -10273470, -10544942, -10884217, -11316155, -11850641, -12470845, -13129319, -13755872, -14274246, -14618872, -14744728, -14630269, -14277563, -13711373, -12975297, -12123481, -11210143, -10280886, -9368227, -8491586, -7661246, -6885096, -6175075, -5549257, -5028288, -4629473, -4363299, -4233609, -4238668, -4370801, -4615725, -4953426, -5359966, -5808515, -6270344, -6718032, -7130145, -7493269, -7799412, -8042563, -8219923, -8338287, -8420270, -8504710, -8639598, -8869822, -9224016, -9705257, -10288841, -10926881, -11556452, -12108453, -12516925, -12729089, -12713864, -12464869, -11996388, -11335769]
52944a1335769Q17891R33682J000394J012691R73111Q95171Q01013P14263O51221
52935c536332O14130N89940N56094M91232L85549K45188Q8586o2677j93203k98350
$$ y = [-11335769, -10517878, -9584196, -8583802, -7571111, -6598000, -5702829, -4901816, -4187553, -3536332, -2922202, -2332262, -1776168, -1284936, -899387, -654199, -565613, -628290, -821493, -1119843]
$$ [...]
##END NTUPLES=NMR SPECTRUM
##END=
