##TITLE=31Pdec_DE-55_NaOH
 D2O, 64 sc
 28.6.2024
##JCAMPDX= 6.0         $$ Bruker NMR JCAMP-DX V2.0
##DATA TYPE= NMR SPECTRUM
##DATA CLASS= NTUPLES
##ORIGIN= UXNMR, Bruker Analytische Messtechnik GmbH
##OWNER= root
$$ XWIN-NMR		Version 3.5
$$ Fri Jun 28 16:23:02 2024 Russian Standard Time (UT+4h)  she@DPX200
##.OBSERVE FREQUENCY= 81.013821
##.OBSERVE NUCLEUS= ^31P
##.ACQUISITION MODE= SIMULTANEOUS
##.ACQUISITION SCHEME= undefined
##.AVERAGES= 64
##.DIGITISER RES= 17
##SPECTROMETER/DATA SYSTEM= spect
##.PULSE SEQUENCE= zgpg30
##.SOLVENT NAME= DMSO
##.SHIFT REFERENCE= (INTERNAL, DMSO, 0, 198.062)
##AUDIT TRAIL= $$ (NUMBER, WHEN, WHO, WHERE, WHAT)
$$ ##TITLE= Audit trail, XWIN-NMR		Version 3.5
$$ ##JCAMPDX= 5.01
$$ ##ORIGIN= Bruker BioSpin GmbH
$$ ##OWNER= she
$$ F:/spectra/data/she/nmr/P31/2/pdata/1/auditp.txt
$$ ##AUDIT TRAIL=  $$ (NUMBER, WHEN, WHO, WHERE, WHAT)
(   1,<2024-06-28 16:21:14.45 +0400>,<she>,<DPX200>,
      <created by zg, POWCHK disabled, PULCHK disabled
       configuration hash MD5:
       00 E9 B6 7A A2 85 ED C7 34 08 36 98 17 FE 4E 26
       data hash MD5: 32K
       EE C6 BE 7E 0C 7C 4A 30 DA E2 36 7B 70 28 53 3E>)
(   2,<2024-06-28 16:21:24.32 +0400>,<she>,<DPX200>,
      <Start of raw data processing
       efp BC_mod = 2 LB = 1.5 FT_mod = 6 PKNL = 1 PHC0 = 2845.612 PHC1 = 194.8863 SI = 64K 
       data hash MD5: 64K
       D6 E0 86 C4 D2 D1 0D 8A C8 66 DA CE C6 8B A7 E5>)
(   3,<2024-06-28 16:22:02.54 +0400>,<she>,<DPX200>,
      <pk PHC0 = 41.93757 PHC1 = -73.2 
       data hash MD5: 64K
       BA B4 A1 3D FC 21 FC B2 A3 66 54 A1 E2 05 B1 BF>)
(   4,<2024-06-28 16:22:06.40 +0400>,<she>,<DPX200>,
      <abs ABSG = 5 
       data hash MD5: 64K
       0D 0A 42 62 32 A4 4F 26 5E 95 9E 5D FC F7 DE E0>)
$$ ##END=
$$ 
$$ hash MD5
$$ 23 FB 3D 9D BD 94 F8 F9 DE 70 6C CD 4D 3B 3F E7
##$RELAX= 
##$RELAX= 
##$RELAX= 
##$RELAX= 
##$RELAX= 
##$RELAX= 
##$RELAX= 
##$RELAX= 
$$ Bruker specific parameters
$$ --------------------------
##$DU= <F:/spectra>
##$EXPNO= 2
##$NAME= <P31>
##$PROCNO= 1
##$TYPE= <nmr>
##$USER= <she>
##$AMP= (0..31)
100 100 100 100 100 100 100 100 100 100 100 100 100 100 100 100 100 100 
100 100 100 100 100 100 100 100 100 100 100 100 100 100 
##$AQSEQ= 0
##$AQ_mod= 1
##$AUNM= <au_zg>
##$AUTOPOS= <>
##$BF1= 81.014009
##$BF2= 200.13
##$BF3= 200.13
##$BF4= 200.13
##$BF5= 200.13
##$BF6= 200.13
##$BF7= 200.13
##$BF8= 200.13
##$BYTORDA= 1
##$CFDGTYP= 0
##$CFRGTYP= 5
##$CHEMSTR= <none>
##$CNST= (0..31)
1 1 145 1 1 1 1 1 1 1 1 1 1 1 1 1 1 1 1 1 1 1 1 1 1 1 1 1 1 1 1 1 
##$CPDPRG= <waltz16>
##$CPDPRG1= <>
##$CPDPRG2= <waltz16>
##$CPDPRG3= <>
##$CPDPRG4= <mlev>
##$CPDPRG5= <mlev>
##$CPDPRG6= <mlev>
##$CPDPRG7= <mlev>
##$CPDPRG8= <mlev>
##$CPDPRGB= <>
##$CPDPRGT= <>
##$D= (0..31)
0 1 0 0 0 0 0 0 0 0.06 0 0.03 2e-05 3e-06 0 0 0.0002 0 0 0 0 0 0 0 0 0 
0 0 0 0 0 0 
##$DATE= 1719577273
##$DBL= (0..7)
120 120 120 11 120 120 24 19 
##$DBP= (0..7)
150 150 150 150 150 150 150 150 
##$DBP07= 0
##$DBPNAM0= <>
##$DBPNAM1= <>
$$ [...]
##$SUBNAM3= <"">
##$SUBNAM4= <"">
##$SUBNAM5= <"">
##$SUBNAM6= <"">
##$SUBNAM7= <"">
##$SUBNAM8= <"">
##$SUBNAM9= <"">
##$SW= 400.765351723535
##$SWIBOX= (0..15)
0 1 3 0 0 0 0 0 0 0 0 0 0 0 0 0 
##$SW_h= 32467.5324675325
##$TD= 32768
##$TD0= 1
##$TE= 0
##$TE2= 300
##$TE3= 300
##$TEG= 300
##$TL= (0..7)
0 120 53 12 22 120 120 120 
##$TP= (0..7)
150 150 150 150 150 150 150 150 
##$TP07= 0
##$TPNAME0= <>
##$TPNAME1= <>
##$TPNAME2= <>
##$TPNAME3= <>
##$TPNAME4= <>
##$TPNAME5= <>
##$TPNAME6= <>
##$TPNAME7= <>
##$TPOAL= (0..7)
0.5 0.5 0.5 0.5 0.5 0.5 0.5 0.5 
##$TPOFFS= (0..7)
0 0 0 0 0 0 0 0 
##$TUNHIN= 0
##$TUNHOUT= 0
##$TUNXOUT= 0
##$USERA1= <user>
##$USERA2= <user>
##$USERA3= <user>
##$USERA4= <user>
##$USERA5= <user>
##$V9= 5
##$VALIST= <valist>
##$VCLIST= <CCCCCCCCCCCCCCC>
##$VD= 0
##$VDLIST= <DDDDDDDDDDDDDDD>
##$VPLIST= <PPPPPPPPPPPPPPP>
##$VTLIST= <TTTTTTTTTTTTTTT>
##$WBST= 1024
##$WBSW= 4
##$XGAIN= (0..3)
0 0 0 0 
##$XL= 0
##$YL= 0
##$YMAX_a= 4939
##$YMIN_a= -3184
##$ZGOPTNS= <>
##$ZL1= 120
##$ZL2= 120
##$ZL3= 120
##$ZL4= 120
##$ABSF1= 198.0616
##$ABSF2= -202.7028
##$ABSG= 5
##$ABSL= 3
##$ALPHA= 0
##$AQORDER= 0
##$ASSFAC= 0
##$ASSFACI= 0
##$ASSFACX= 0
##$ASSWID= 0
##$AUNMP= <proc_1d>
##$AZFE= 0.1
##$AZFW= 0.5
##$BCFW= 0
##$BC_mod= 2
##$BYTORDP= 0
##$COROFFS= 0
##$CY= -3
##$DATMOD= 1
##$DC= 0
##$DFILT= <>
##$DTYPP= 0
##$F1P= 0
##$F2P= 0
##$FCOR= 1
##$FTSIZE= 65536
##$FT_mod= 6
##$GAMMA= 0
##$GB= 0
##$INTBC= 1
##$INTSCL= 9.790993e-09
##$ISEN= 30
##$LB= 1.5
##$LEV0= 0
##$LPBIN= 0
##$MAXI= 10000
##$MC2= 0
##$MEAN= 0
##$ME_mod= 0
##$MI= 50
##$NCOEF= 0
##$NC_proc= -9
##$NLEV= 6
##$NOISF1= 182.463
##$NOISF2= 159.3651
##$NSP= 0
##$NTH_PI= 0
##$NZP= 0
##$OFFSET= 198.0616
##$PC= 4
##$PHC0= 2887.55
##$PHC1= 121.6863
##$PH_mod= 1
##$PKNL= yes
##$PPARMOD= 0
##$PSCAL= 0
##$PSIGN= 0
##$REVERSE= no
##$SF= 81.0140089999434
##$SI= 65536
##$SIGF1= 159.3651
##$SIGF2= -187.1042
##$SINO= 113.3802
##$SIOLD= 16384
##$SREGLST= <1H.CDCl3>
##$SSB= 0
##$STSI= 65536
##$STSR= 0
##$SW_p= 32467.5324675325
##$SYMM= 0
##$S_DEV= 0
##$TDeff= 32768
##$TDoff= 0
##$TI= <>
##$TILT= no
##$TM1= 0
##$TM2= 0
##$TOPLEV= 0
##$USERP1= <user>
##$USERP2= <user>
##$USERP3= <user>
##$USERP4= <user>
##$USERP5= <user>
##$WDW= 1
##$XDIM= 65536
##$YMAX_p= 372958346
##$YMIN_p= -47410292
$$ End of Bruker specific parameters
$$ ---------------------------------
##NTUPLES= NMR SPECTRUM
##VAR_NAME=  FREQUENCY,     SPECTRUM/REAL,   SPECTRUM/IMAG
##SYMBOL=    X,             R,               I
##VAR_TYPE=  INDEPENDENT,   DEPENDENT,       DEPENDENT
##VAR_FORM=  AFFN,          ASDF,            ASDF
##VAR_DIM=   65536,         65536,           65536
##UNITS=     HZ,            ARBITRARY UNITS, ARBITRARY UNITS
##FACTOR=    0.49542278885378, 1,            1
##FIRST=     16045.7642231865, 0,            0
##LAST=      -16421.768244346, 0,            0
##MIN=       -16421.768244346, -47410292,    0
##MAX=       16045.7642231865, 372958346,    0
$$ Real data points
##PAGE= N=1
##DATA TABLE= (X++(R..R)), XYDATA
$$ [...]
8625 -10365477 -7428817 -11402386 -15715603 -14432094 -9998320 -7857275 -8357184 -7380890
8617 -7380890 -2644999 3021506 4135203 -1870777 -10843076 -15022957 -11582548 -6082102
8609 -6082102 -4909917 -6740111 -5595645 -605573 2702797 896753 -2732664 -3398866
8601 -3398866 -425494 4202818 9093787 12637113 11833303 5303198 -3485374 -8547730
8593 -8547730 -7188997 -2558083 -469758 -3930112 -10432445 -14691636 -14426128 -12856414
8585 -12856414 -14754890 -20938684 -27823654 -31302844 -29412477 -22428722 -12911651 -5218845
8577 -5218845 -2361518 -3032465 -3500446 -2185717 -582745 -586236 -3556451 -11063418 -22570506
8568 -22570506 -32038224 -31213684 -18575266 -2179292 8682456 12549854 14471585 17802037
8560 17802037 20365809 18245738 10941188 2137881 -3893959 -6549381 -9437985 -15846375
8552 -15846375 -23791289 -27275833 -22987027 -13975591 -5752633 -551439 2995275 5931558
8544 5931558 6900549 3874945 -3149914 -11037819 -14773874 -11088479 -2096021 5397916
8536 5397916 5708643 -364762 -6337837 -5922493 1813808 11876874 17135058 13843746
8528 13843746 4924811 -2289988 -2423357 3518930 9729373 10836301 5796482 -1780254
8520 -1780254 -6310494 -4399560 2437994 9458803 13296687 14038771 12846135 9687784
8512 9687784 4671628 -359294 -3809292 -6853569 -11572732 -16917684 -18952844 -15640214
8504 -15640214 -9607451 -5321920 -4529698 -5052543 -3466424 1129516 5448733 4702699 -1797812
8495 -1797812 -8433145 -8800166 -3222395 2092177 3949004 6525270 14247503 23414972
8487 23414972 25525898 18227856 8494992 4189089 6384257 11415959 16327109 19189741
8479 19189741 17314229 9665737 -42191 -6513375 -8714962 -9311726 -9049104 -5908661
8471 -5908661 -111914 4456602 5270097 3821731 1620883 -2502947 -8597644 -12903497
8463 -12903497 -12522008 -9831884 -8456563 -7546731 -4677419 -2299298 -5530095 -13774703
8455 -13774703 -20030460 -19659341 -15276957 -11348372 -8193556 -3822776 1663006 6482736
8447 6482736 9838237 11687463 11680481 10667795 11568988 15988946 20895165 21375989 16652302
8438 16652302 11201551 9534109 11521326 13701294 14156479 14816931 18665340 25278519
8430 25278519 30032770 28192565 19673666 9866492 6071370 12057787 23865505 30947317
8422 30947317 24802430 8381280 -5864470 -9689250 -7694621 -8816549 -12852251 -11723197
8414 -11723197 -2589058 7601612 11557540 9083353 3210425 -4639029 -12333067 -15640490
8406 -15640490 -13677976 -11522449 -13079378 -15107145 -12656615 -6745590 -1769285 1352205
8398 1352205 3992661 4639193 1084804 -3749672 -4200845 477743 5978239 9624243 11835546
8389 11835546 11726954 7480656 1641730 227206 5196836 12581758 18823381 23673066
8381 23673066 25861865 22068683 12734298 3540373 -1907956 -6100731 -11331640 -14400617
8373 -14400617 -11644960 -5114585 507956 3530513 3665677 -1160681 -10947934 -19446736
8365 -19446736 -19821617 -13159690 -6263275 -2343011 834235 4647312 7298343 7771473
8357 7771473 6766130 3468162 -3130646 -9071344 -7620000 1332115 9498495 10684648
8349 10684648 8248891 8718664 12422707 14921111 14513514 13386629 12824626 11380365 7144401
8340 7144401 -769332 -11464335 -20639631 -22496947 -16954304 -12394443 -16513629 -26263430
8332 -26263430 -32075662 -30612093 -27070972 -25194782 -22293703 -16279690 -11075480 -11041193
8324 -11041193 -14536402 -16959508 -16789070 -15213255 -13081471 -11710463 -13522725 -18102138
8316 -18102138 -20442511 -16923419 -10386124 -5648806 -3141554 -1171799 -864612 -3346650
8308 -3346650 -5333062 -4231077 -4972591 -13722798 -26109124 -30685798 -24556789 -16330715
8300 -16330715 -11679112 -5953614 4214057 11441709 7601730 -3074669 -9553585 -8984895
8292 -8984895 -7915095 -10508812 -13599519 -13771730 -12810359 -14232041 -18363183 -22373685 -23184268
8283 -23184268 -20354603 -17429112 -18705818 -22902604 -23115184 -16196788 -8649027 -8344009
8275 -8344009 -13132602 -13599675 -5836662 4366748 9672402 8160013 2261135 -3945828
8267 -3945828 -5781837 -955583 7567825 14861103 19368989 21170828 17240768 4930398
8259 4930398 -10604664 -19770708 -20235990 -18637320 -19680140 -20811754 -19470837 -17664486
8251 -17664486 -15933822 -10421635 -751043 5993296 4817292 382073 -1108718 -1912168
8243 -1912168 -7244075 -14322219 -15476176 -9877415 -3974061 -1189406 1016117 3606524
8235 3606524 2947749 -2844401 -10360566 -15818549 -18854355 -19542754 -16121038 -8271647 626029
8226 626029 7026986 10802293 13706586 16590600 19643532 23010097 25196786 22802565
8218 22802565 14354316 3782595 -2029127 294343 7365111 12629484 12872677 10488946
8210 10488946 9185726 8808693 6084271 -269349 -7661743 -12913400 -14867315 -13591072
8202 -13591072 -10180345 -7929398 -9838093 -13642746 -13526101 -8536275 -4239216 -3184415
8194 -3184415 92207 9240320 17164268 15177168 7639941 7690725 18344727 26898110
8186 26898110 20981832 3605551 -11301600 -13967994 -6516816 1232166 1541707 -3874085
8178 -3874085 -6147076 -837212 5062602 2100032 -8118513 -15142186 -14277772 -11002095
8170 -11002095 -10450510 -11240255 -11840458 -14222270 -17468938 -16282132 -10748326 -9214103 -15111045
8161 -15111045 -19079207 -12587327 -2423133 -1338704 -9023982 -13577510 -9528591 -3096623
8153 -3096623 264017 2516358 5231047 5086133 1068243 -1900297 -1087805 -1071371 -5968763
8144 -5968763 -12389744 -15514604 -17288051 -22283147 -28783784 -30916540 -28524836 -28275856
8136 -28275856 -33651487 -38897350 -35866564 -24253064 -11920906 -5781586 -5148152 -5094182
8128 -5094182 -4054083 -4860782 -8404137 -10533850 -8178474 -5440241 -8741193 -16900069
8120 -16900069 -21357823 -17144370 -8736816 -3009584 -977642 543 -432607 -4980243
8112 -4980243 -12565377 -17515082 -15787124 -9425486 -4028884 -3448434 -7410715 -12877662
8104 -12877662 -16968722 -19151833 -20963361 -23547060 -25836327 -25378753 -20447771 -11326530
8096 -11326530 -586932 7529386 9371795 4747002 -2747434 -8622258 -10418190 -8334928
8088 -8334928 -4551186 -1963093 -1880444 -2745414 -2731507 -3055570 -5727626 -8202986 -4898247
8079 -4898247 4211411 11304655 10580975 6247621 5731066 8356192 7395045 1786332 -1736534
8070 -1736534 821909 4949499 5208838 3096828 3654658 8418823 15600000 23780221 31123301
8061 31123301 33520665 28256067 18437245 10021259 5377664 3125038 2874322 5656649
8053 5656649 9774027 10532503 5373320 -3276724 -10739832 -13523780 -10679423 -4976292
8045 -4976292 -2368384 -6377489 -12747237 -13850552 -8953722 -5093675 -6260086 -7674314
8037 -7674314 -4568860 -1053446 -3997832 -11512224 -14709144 -9809801 -1595957 5379025
8029 5379025 11949086 18699313 21893533 19314760 15268956 14465385 14137795 8247000 -1837502
8020 -1837502 -7174731 -2830809 5623184 9835027 9004821 8744722 11917430 15159848 14448782
8011 14448782 10017605 4199635 -2273508 -8880559 -12347932 -9182951 -1250541 4765701
8003 4765701 4831228 1883353 1211171 4044789 7732965 9836100 9232897 5124474 -1606903
7994 -1606903 -7187113 -8565799 -7455104 -7271765 -7076724 -3162232 3569773 7350422 5985280
7985 5985280 4059792 5119726 5983999 2943438 -1016191 -830684 1783198 430337 -5937448
7976 -5937448 -10991199 -9603860 -3683951 1700175 3994948 3331319 258806 -4421169
7968 -4421169 -8945724 -10989966 -8562478 -1508758 6547035 9729397 6282967 1707077
7960 1707077 1832493 4663705 4372117 2020306 4862936 13811245 19535843 15081233 5739700
7951 5739700 859220 1266074 1562549 680022 1877810 4107661 2023996 -4652789 -9354735
7942 -9354735 -8444368 -6225949 -6878455 -7019951 -1031472 9913339 19107471 22639530 22083418
7933 22083418 19910098 16372016 11269531 5824717 1914843 896686 3183160 7631486
7925 7631486 11681662 13489727 13508287 12756691 10601220 6289149 1901828 1050748 4304243
7916 4304243 8132978 9058144 7055535 4251658 2134548 1158887 1687900 3895246 7055782
7907 7055782 9421288 8693203 3512989 -4118756 -8959213 -7801683 -4338052 -5249768 -10935353
7898 -10935353 -14393749 -11115326 -5255905 -2249185 109610 7095634 16399377 19541100
7890 19541100 13704700 5051992 -844549 -4755718 -7626598 -6175311 439091 5760872
7882 5760872 4459706 1335987 4722375 13689963 19470471 18258438 14605460 11920999
7874 11920999 7977236 2299345 293646 5251106 11792320 12714329 8655351 5634897
7866 5634897 5613834 4991175 1303041 -3578694 -6826138 -7231759 -4439790 609599 4220783
7857 4220783 2793517 -1817814 -3312925 899258 5568433 4256542 -1954870 -5738523
7849 -5738523 -2895277 2978189 6257069 6838981 9067715 14264437 18134288 16909233
7841 16909233 12918435 11055899 11661694 10972211 8095287 6764023 8818947 10515819
7833 10515819 8394938 5188461 5494311 7789042 6005981 -1126635 -7335940 -6992278
7825 -6992278 -2196319 917796 344883 -648816 446487 1713383 285802 -2769075 -3486879
7816 -3486879 -630359 2165529 1190274 -2138171 -3169523 -229791 3940132 6778621
7808 6778621 8389367 8454047 4589761 -3388466 -10389743 -10863546 -5412028 283464 1923046
7799 1923046 -596074 -5030322 -8039924 -6027277 1225173 8339821 9685875 6671858
7791 6671858 5822830 9844066 15006126 17606540 17998757 16968799 13356046 7967852 5311637
7782 5311637 7620262 10270948 7052035 -1904053 -10640050 -14177848 -11930763 -5916057
7774 -5916057 1320043 7667432 12593992 16809882 19780063 19381078 15314787 10291871
7766 10291871 5946922 646676 -5965627 -9764930 -7711888 -3833640 -4356626 -8450738
7758 -8450738 -9552492 -5531913 -1633900 -2197270 -4784857 -4842661 -2044570 691937 1545250
7749 1545250 821813 34266 1701946 7509171 14791784 17412058 12446275 4159088 -589242
7740 -589242 833066 6023566 11141320 13204040 11016296 6402363 3028552 1888046
7732 1888046 -286747 -5912069 -12042693 -14065673 -12175926 -10505814 -10785944 -10771754 -8804960
7723 -8804960 -6112013 -3985922 -2121709 -704788 -881202 -1705711 289508 6240632 11922315
7714 11922315 12105570 6699499 483337 -2259676 -893488 2841192 6903615 9758160
7706 9758160 10930996 11282648 11836355 12298027 11630233 10085795 9673644 12103928 16486933
7697 16486933 19229884 16542696 7924325 -2419599 -8420966 -7213233 -1189995 4970559
7689 4970559 8364140 8785966 7317316 5236019 3252004 757289 -2884084 -5310497
7681 -5310497 -1855087 7987737 16680382 15459531 4972604 -4866043 -6322539 -1110131
7673 -1110131 5146849 10985266 17971770 24867551 28001984 26632577 23710060 21203233
7665 21203233 18209782 14202043 10772663 8855447 6864559 3282477 -774026 -3297272
7657 -3297272 -4465298 -6289062 -9619694 -12684413 -12726706 -8880463 -3530229 -498933 -1328253
7648 -1328253 -3776008 -4645067 -3278585 -1301520 -306371 -1705298 -7371272 -17115313 -25914109
7639 -25914109 -27460880 -21520370 -14711201 -12751459 -14726287 -16210101 -14754070 -10251930
7631 -10251930 -3070435 5181171 11251458 13507377 13732801 13155641 9364079 1023931
7623 1023931 -6687742 -6990757 -1747980 -1067429 -10232115 -21159996 -20930510 -7369546
7615 -7369546 7778788 12210607 6988186 4314385 11821414 23027632 26377508 20654162
7607 20654162 15314635 15867371 16688591 11756726 5064408 3406430 4152000 -480802 -9142043
7598 -9142043 -11330358 -2737106 8163739 11739356 8109106 3059253 -60352 92346
7590 92346 5199135 13475673 18014572 14717262 8605198 6971960 9363907 9808885 6076991
7581 6076991 607641 -5541573 -12850551 -18352327 -17385193 -10947557 -5281085 -2924515
7573 -2924515 167937 6649400 12197735 11105539 3855202 -3973759 -8000179 -7969875 -6486083
7564 -6486083 -6660640 -9165993 -10477789 -6516157 798241 3895559 -1264466 -9389300
7556 -9389300 -12443503 -9764167 -7695066 -10301816 -14778245 -16562577 -15138318 -12720309
7548 -12720309 -9748174 -4660871 2476089 8727725 11364781 10508759 7686789 3191064
7540 3191064 -3343076 -10534794 -15747028 -18059218 -18532229 -17200076 -12557243 -5223466
7532 -5223466 715435 2117493 229849 -2360394 -5456023 -9042555 -10397769 -7812238
7524 -7812238 -4995515 -6478776 -9861690 -8612717 -2584883 548951 -4181062 -12842977
7516 -12842977 -19135983 -21689650 -21902926 -19614784 -14806722 -9524586 -4311251 3406902
7508 3406902 13543847 20188276 19019789 14114960 11915541 11904487 9727831 6716202
7500 6716202 8436306 14724046 19163090 19135560 18706493 19683030 17525828 10000975 3331621
7491 3331621 4230894 10103469 12768073 9404613 4807661 4177121 7890555 12604805 14011677
7482 14011677 9026042 -1737174 -13685807 -22154063 -25826109 -25389304 -21445591 -15988124
7474 -15988124 -12857215 -13040455 -12000608 -5966642 1406097 3884999 2246171 2414031
7466 2414031 4860194 3999625 -345681 235734 9641371 18591823 16499503 6804633 1840586
7457 1840586 5363350 9600366 9123505 7824064 9565233 10662303 6753269 666854
7449 666854 -2655960 -4498167 -9023119 -14501837 -14889131 -9397608 -4064528 -2834352 -2417551
7440 -2417551 1876545 9200160 14898481 16876690 17417866 19169817 21163909 19593023
7432 19593023 12525084 3058000 -3681977 -6380093 -7615494 -7667241 -2767407 7455552
7424 7455552 15282416 13198504 4207066 -2318251 -3315263 -3569186 -5452568 -5532670 -2865252
7415 -2865252 -2222863 -5323275 -6195151 -390598 7273337 9983463 8798333 8680675 8647388
7406 8647388 3288601 -7621642 -17504779 -20417622 -15335020 -4413908 7870834 15013752
7398 15013752 13423407 7177568 3669920 4930443 7037022 6865992 4825873 1796759
7390 1796759 -1786928 -4089070 -3404237 -1089259 842740 3598927 8587886 12560769
7382 12560769 11641400 8684314 9778384 14061833 14467165 9074724 4122788 4150491 6450762
7373 6450762 7622602 8560579 9819703 8588301 4131708 803500 1991257 5740244
7365 5740244 9093163 11648246 12473363 9559328 5217050 5492287 10763947 13809415 11196282
7356 11196282 8926940 11411686 12914554 7557913 874196 2197317 10431081 16673021
7348 16673021 17546940 16931054 16931518 15865802 13694007 11597192 7555642 -395678 -8282791
7339 -8282791 -10738535 -9201325 -8177711 -6408898 -692683 4349214 1068946 -7820296
7331 -7820296 -11800923 -8514463 -5754597 -6614866 -5014684 1025857 4101382 655904
7323 655904 -1785977 2738207 8811414 9914340 9219714 11475586 12352436 6023147 -2705501
7314 -2705501 -4381115 800654 4450161 3050300 273236 -1980855 -5544810 -9092689
7306 -9092689 -7772182 -1261172 4273333 4018896 -359612 -4300440 -4953061 -1946999 2519393
7297 2519393 4295171 1528322 -2091575 -1744991 1858142 3983369 2718971 -62166
7289 -62166 -3357238 -7489064 -10323904 -8465798 -3038432 336552 -1469547 -5823611 -8797571
7280 -8797571 -9269642 -7938306 -6042272 -6020139 -9745311 -14716580 -15325145 -9667067 -2502556
7271 -2502556 175611 -2639513 -7582531 -11645381 -14301097 -15796739 -15139819 -10684354
7263 -10684354 -3038417 3387785 3790621 -1559634 -7545920 -10709222 -12384639 -13746477
7255 -13746477 -11889285 -4565308 4420590 9155843 8850309 6859128 4780747 2431472
7247 2431472 1750408 5176908 11044769 15489698 17697791 18329284 14907779 5472387 -4493275
7238 -4493275 -6530615 -861243 3858791 3104356 907055 238054 -2381593 -9075925 -15170311
7229 -15170311 -16444996 -15627826 -16712054 -18195774 -16876696 -13462370 -9551967 -3760996
7221 -3760996 4113345 9621067 9740871 8229415 9284960 9988208 5513021 -1440226 -3519425
7212 -3519425 720453 5580747 6532534 4106312 451016 -2559574 -2572849 704090 2940993
7203 2940993 206621 -4235510 -3418555 3561331 10667396 13629786 13941144 13752793 12567162
7194 12567162 10657510 10785425 14010881 17278266 17417602 15220670 14151111 16744208
7186 16744208 22518109 27481494 26271747 17424904 5931189 -2079354 -5936463 -8658427
7178 -8658427 -10828069 -11050948 -10762325 -12431638 -13613544 -9648549 -2898791 -2005915 -9659169
7169 -9659169 -17802547 -18350716 -12758154 -7195993 -4010402 -2813377 -5027889 -11387049
7161 -11387049 -18097987 -20959643 -20923497 -20720296 -18600152 -11125281 -638755 5924765
7153 5924765 5642843 2318377 540560 1335436 3916252 7448122 10164319 10414007 9723715
7144 9723715 11570947 15811667 17392352 12690337 5229882 2936875 10052997 22456427
7136 22456427 30656441 27852710 16357956 5939337 4551393 10988436 17806883 20127841
7128 20127841 18766841 15442808 9372730 669340 -6205281 -6192240 -186330 5228976
7120 5228976 5236527 1917848 817967 3895693 7830542 9048714 8252544 8742449 11648447
7111 11648447 14911922 16736394 17832281 19458829 21040069 21245048 20464387 20421228 21111331
7102 21111331 19269068 11052529 -2940725 -15525610 -17679923 -7314295 7547328 16571164
7094 16571164 17587678 16635214 18111162 19192208 15597379 8803616 4125851 3995474
7086 3995474 6584162 9615573 12097758 12849775 10486113 5481135 648350 -851290
7078 -851290 2052912 6555161 6559229 -1971763 -14887110 -22420142 -20165496 -13927930 -10691845
7069 -10691845 -9280020 -5127961 -249295 -808077 -6354419 -9556070 -7240518 -4256194
7061 -4256194 -4466278 -4722885 -855323 5918036 11744037 14584841 13318805 7496068 849985
7052 849985 -478251 3083196 2905749 -5848950 -15969555 -17648535 -11421007 -4981905
7044 -4981905 -1156695 3003540 7565901 8717769 6221545 4327572 4469948 3663765 1241641
7035 1241641 835304 3877259 6787870 6724679 5168802 3849106 1985937 -163301 386590
7026 386590 4833850 10042435 12586100 12039721 9249720 5514650 4128687 7202413 9803007
7017 9803007 4182398 -7562079 -12778487 -4836103 7143966 11552523 10042700 11251331
7009 11251331 14725629 12579496 4867634 1473172 7172015 14450264 14282954 6757152
7001 6757152 -2032119 -7567360 -8675422 -7086990 -7594610 -13847945 -22491688 -26607623
6993 -26607623 -25669341 -25451914 -27014245 -24259336 -15548980 -8679772 -8777536 -9691347 -4904541
6984 -4904541 570642 -1121263 -5662684 -1559723 12087778 23640253 24871483 19427255
6976 19427255 14232301 11151027 9391496 8438857 5551628 -3097192 -15479565 -23407363
6968 -23407363 -22210020 -15860894 -10021049 -5325641 -601057 2506896 2036251 -1093590
6960 -1093590 -5406007 -10306143 -12841066 -8613738 267730 3885634 -3407899 -14193949
6952 -14193949 -17104206 -10706878 -2027922 4833075 10786690 15017929 15146178 14079890
6944 14079890 18173544 26589352 29974737 23243340 13723852 12029031 18754087 24944642
6936 24944642 23701621 16997700 11117839 8427922 5326800 -1876060 -10525860 -13594827
6928 -13594827 -8894300 -3047117 -3357552 -8628579 -12351200 -12468598 -12112711 -12165255 -10275511
6919 -10275511 -7509981 -8342819 -12020650 -11357250 -3642458 3998501 4609570 607281 -2148890
6910 -2148890 -3417965 -5218652 -4883029 354841 5558443 3776985 -2396563 -3794370
6902 -3794370 1569097 6671942 7684069 8398428 10269833 7763587 -1345227 -9096187
6894 -9096187 -7482223 283149 5494199 6329412 6917921 7208588 2382741 -7819016 -16717123
6885 -16717123 -19375812 -18013317 -16579449 -14670085 -9931288 -3470605 372359 -1351305
6877 -1351305 -7466660 -13809612 -16461584 -14851924 -11711828 -8804163 -3739692 6144815
6869 6144815 17274786 21524069 16039062 7656513 4620185 6550051 6205447 -199816
6861 -199816 -8103379 -9895696 -2361823 11193245 23695898 28849876 25413593 18000596
6853 18000596 12159994 8300138 2420132 -6616033 -13325521 -11509450 -2539350 5114361
6845 5114361 4899816 -1308419 -6461049 -6351544 -2773616 443520 2181695 3867365 6199428
6836 6199428 8269234 9963590 13006239 18039768 21786621 19215067 8854578 -5194608
6828 -5194608 -16772552 -22288635 -22053075 -18692692 -15062767 -12596155 -10682760 -8216698
6820 -8216698 -6171042 -7349798 -12373795 -17076658 -16106937 -9329187 -2884450 -3016323 -9849073
6811 -9849073 -18020185 -22421400 -22005417 -18452541 -13032442 -5943438 1981315 8447992
6803 8447992 11210479 9862150 5644922 -14635 -6045900 -11207527 -14229106 -14838147
6795 -14838147 -13846167 -11883121 -8904328 -5371987 -2799512 -2172598 -2806322 -4065703 -7223043
6786 -7223043 -13359473 -19466328 -19341255 -10084983 3583096 13204797 14240921 8698737
6778 8698737 1245649 -4916396 -8321910 -8228852 -5251009 -1807237 -118293 -130154 -606744
6769 -606744 -1440639 -3100309 -4514574 -4221997 -3881012 -7479173 -15336733 -21577962 -20420813
6760 -20420813 -13394318 -7172160 -5138082 -4566126 -2060883 1926888 5025838 6128960
6752 6128960 5084665 2111152 -419202 1744042 9753298 18480167 21155807 16668102
6744 16668102 10380382 8549712 13534320 23020463 31580389 34021676 29706414 22962705
6736 22962705 17326007 10987242 965815 -9800000 -14196530 -10086916 -3345212 -208856
6728 -208856 -290937 503413 3208470 5380512 6176854 8479719 14973947 23333846 26670597
6719 26670597 19925033 6150180 -5206744 -7912930 -5346717 -4950325 -8150738 -9936874
6711 -9936874 -7613421 -4447062 -3275720 -1737668 3172419 9893120 15094550 18370853
6703 18370853 20540973 20301989 16783195 13115128 12867279 14321096 12790333 7922389
6695 7922389 4292833 4701921 6809369 6921437 3819584 -1590940 -7279508 -10173554 -8252591
6686 -8252591 -3491610 -437790 -1323944 -4571942 -7870952 -10012430 -9864371 -6930822 -3476218
6677 -3476218 -2758966 -4225198 -3736883 164782 3496564 2015334 -3926698 -11628043 -19792423
6668 -19792423 -27064737 -29664224 -24698355 -14940826 -6710836 -2968635 -1232816 1697737
6660 1697737 5842283 9487158 11815560 12484595 10501380 5901485 2014377 3594779
6652 3594779 11541073 20608050 23793594 18871247 9816894 2399981 -244377 1642347
6644 1642347 5386882 6824407 3021296 -4027181 -8398990 -6973589 -3166540 -1548123
6636 -1548123 -1192264 1603427 5499114 4351759 -3877518 -12952896 -15303856 -10282833
6628 -10282833 -3563052 -541208 -2110564 -5143487 -5373894 -910124 5834796 10254388
6620 10254388 9770129 5198109 -1158065 -6804954 -9372402 -8462247 -6752896 -6402864 -5203588
6611 -5203588 -39928 6699359 9141248 6234145 2335684 -906853 -6169563 -11913209
6603 -11913209 -10455766 198518 9628212 7585984 -1315509 -3588530 5177066 16432858
6595 16432858 21525986 20355182 16669857 12372730 9164234 10129900 15988316 22799618
6587 22799618 26035512 25127310 22688520 20992779 20128944 18472931 14932085 11383621
6579 11383621 11244764 14115233 14541138 9076898 1877941 -695834 1534849 4378004
6571 4378004 6837685 10587716 13580150 11621401 6358187 4323009 6949875 8854952
6563 8854952 7956186 9612305 16958274 23889655 22710802 13877643 3633272 -3501269
6555 -3501269 -5461616 -707343 8762012 15896240 15723634 11562380 9266418 8223077
6547 8223077 3954217 -2474924 -4516611 308478 6794836 9299037 8100138 6838059
6539 6838059 7162680 8221477 9508225 11992771 16357603 20718047 21049421 15545956 8551645
6530 8551645 7397258 13875568 21209731 21201359 12212383 -1247628 -13594824 -20614764
6522 -20614764 -20530064 -16218658 -13626932 -14500125 -13513628 -6302442 2988127 6875211 4096583
6513 4096583 -1597369 -9095634 -18951692 -26337256 -23677567 -11778320 -1034337 940731
6505 940731 -3288416 -8485835 -15047486 -25148226 -35414637 -39177825 -34256858 -24624087
6497 -24624087 -15631048 -10372512 -9268765 -10467282 -11344438 -11176710 -11328946 -12132703 -11716883
6488 -11716883 -9019443 -5540112 -2684707 225346 3777790 6759960 8252763 9082457
6480 9082457 9869217 10508476 12877421 19976184 29725487 33913230 27658685 16664738
6472 16664738 10018889 8329904 4934699 -2637253 -9478708 -12340588 -14958013 -21005209
6464 -21005209 -26679759 -24881573 -14423363 -1339832 7646161 10040251 7293184 2835178
6456 2835178 70186 -227853 -443610 -2232840 -3184397 -352010 3652824 2574504 -4348201
6447 -4348201 -9824654 -8296212 -4372199 -6357213 -13528108 -16333909 -9759891 -225510
6439 -225510 3582438 1650330 228949 2115134 4410962 4314417 2478759 1011503 1695879
6430 1695879 5649200 11350744 13697143 8773454 -708097 -8363581 -12059813 -14539393
6422 -14539393 -16187912 -12729473 -2401267 8996415 13692929 10195690 3220446 -2761648
6414 -2761648 -7323068 -12394414 -18721506 -23975123 -24357450 -19085436 -12575734 -10086101
6406 -10086101 -11985058 -15211422 -19229034 -25848117 -33145909 -35243108 -30050295 -22325856
6398 -22325856 -16692184 -12474158 -8314559 -6675316 -9378188 -12898647 -13036742 -11113876
6390 -11113876 -10865608 -12173933 -12732929 -13028084 -14213864 -13472808 -7571684 305077 3243599
6381 3243599 -364576 -5741957 -8973578 -9762096 -7503352 -1104760 6325927 8720818
6373 8720818 5062638 1070038 614670 195461 -5153006 -14521543 -23154562 -28837701 -32624378
6364 -32624378 -34854132 -33801879 -28298531 -20132316 -13672530 -12958001 -18090527 -24680969
6356 -24680969 -28155175 -28058626 -26562494 -24057451 -19070733 -11775047 -4466288 900987
6348 900987 2637990 -1801096 -12239657 -21753463 -22035754 -13868002 -6771631 -6363630 -7590840
6339 -7590840 -3573852 4127081 8795926 8444215 7128506 8143780 10665485 12841978
6331 12841978 14484337 16009843 16864799 15792150 12243686 7833557 6091962 9175294
6323 9175294 14843429 18750513 19571758 19131110 17845287 14323117 10240705 10531409 16134828
6314 16134828 20925599 19311591 13353504 8638040 6236799 3057918 -2034011 -6840237
6306 -6840237 -9469893 -9835906 -8348034 -5838469 -3627122 -1317447 3712070 12016679
6298 12016679 19250932 20574906 16115507 9178605 1183929 -8003599 -16270941 -19652217
6290 -19652217 -16203226 -7316285 3449455 11098006 11724610 7381699 5507897 9952412
6282 9952412 15714275 16717903 14987265 16233919 19671554 19877448 17218332 17968210 23246356
6273 23246356 25531152 18732206 6036410 -4521186 -7543655 -2073759 8536987 16666272
6265 16666272 15834247 8653371 4615159 7839307 12353692 12159064 10021728 11920398
6257 11920398 17643762 22052274 22301539 19095433 13658298 8123554 6469065 10211879
6249 10211879 14705260 14054365 8525266 3096102 -177226 -4001097 -10225545 -16280849
6241 -16280849 -18241644 -15355859 -10902737 -9291127 -11634976 -13763624 -10485216 -2510269
6233 -2510269 3796610 5001796 5269392 9823858 17460617 23220155 25071745 23543180
6225 23543180 18149443 9942963 4921496 7834997 13661177 12696919 4529499 -765280
6217 -765280 2509283 7184617 4032612 -5060418 -10897403 -10261492 -8679566 -10855232 -14180177
6208 -14180177 -13034854 -5914441 3385626 9786555 10967970 8460941 5602413 4393254
6200 4393254 4502782 5040319 5927012 7070341 7768302 7815598 7571787 5914728 330014
6191 330014 -8929281 -16747558 -18186947 -14568415 -11386800 -10767104 -9698072 -6164536 -2971994
6182 -2971994 -3349247 -5857864 -6744256 -5447627 -4351024 -3928853 -1892741 2171460 4523670
6173 4523670 1586481 -5187169 -10725734 -11798758 -9441055 -6393156 -3737843 -277158
6165 -277158 5802148 14940922 25207137 33099797 35958173 33925200 29401922 24691927
6157 24691927 20542068 16845723 14091964 13540624 15743299 19062745 20410068 18206239
6149 18206239 14203871 11292592 9857740 8020412 5407009 3990563 3995612 1872875 -4863122
6140 -4863122 -12817794 -16458611 -15826440 -16406129 -20854499 -24790150 -22439623 -13336643 -1487647
6131 -1487647 9109521 15404109 14526271 6460536 -3001353 -6053857 -1093222 5081349
6123 5081349 4658704 -3050586 -11981446 -16208364 -14530004 -9171385 -2964228 1154013
6115 1154013 521647 -4369907 -8217969 -5513170 2483520 8327704 7341106 3042708 1532390
6106 1532390 3661636 6430536 9452443 14540306 19589138 18991197 11951383 5470976
6098 5470976 5884261 10641195 11871488 6299920 -1291063 -3587954 2312088 12782749
6090 12782749 20896819 22003627 16760583 8718397 339451 -6673866 -8946045 -3857345
6082 -3857345 5243482 10815248 9818546 6894284 7203267 10077865 11942145 11421413 8758312
6073 8758312 4251994 792013 4001194 15286921 27552318 32401590 29630041 25527664
6065 25527664 23851103 22724540 18846221 10807796 -193541 -9391945 -10405462 -2265600
6057 -2265600 7507136 10953575 8648649 6607803 7299286 8925532 10529558 11349777 7680558
6048 7680558 -2035227 -10590328 -8914434 583191 6115749 2936194 -965754 2128468
6040 2128468 9325260 13537903 12891937 9105860 2731219 -4791024 -9121895 -8059127
6032 -8059127 -5071742 -4029306 -3982577 -2347062 772658 4520773 9047856 12089901 8907843
6023 8907843 -186520 -7175723 -6022064 -553744 2178694 1588859 685774 -1939491 -9875270
6014 -9875270 -21262379 -30334123 -34851662 -35951375 -32909473 -24992536 -16731717 -13598072
6006 -13598072 -12916217 -6966564 4102609 10349602 5606598 -3692761 -6990751 -2007603
5998 -2007603 5157050 8683165 7917116 5669908 4778306 5699017 6325396 5268282 5324661
5989 5324661 11102586 22215469 31210771 30100384 18402644 4388747 -1363929 4890124
5981 4890124 15754061 19260243 12018340 3433855 3410284 8862797 8396828 -1184068 -10609668
5972 -10609668 -11326011 -5539494 -178443 2449314 3296588 1285410 -4472177 -9992046
5964 -9992046 -9574149 -2491434 7438601 17222385 25404703 29142906 25859676 17896386
5956 17896386 11102697 8164131 7048710 6483913 8563645 14120357 19366069 20107056
5948 20107056 16901718 13210366 10314211 7081923 3277562 -509387 -5589021 -13741538
5940 -13741538 -22381787 -25159706 -19514384 -10549082 -4741247 -2434524 163521 3870711
5932 3870711 5861904 5118733 3960876 3984674 4484684 5087113 5741180 3962615 -2649258
5923 -2649258 -10019185 -9623107 400442 11653329 16417357 16650759 17654433 18581089
5915 18581089 15730689 10735164 7804095 5802699 971501 -4567615 -5510423 -3558747
5907 -3558747 -5761120 -11988410 -13357547 -5884800 2738868 4273901 686020 -1400924
5899 -1400924 -1134084 -2227332 -5140848 -6383230 -3999471 264207 2996947 1017194
5891 1017194 -6365750 -14807997 -17674511 -13784349 -9289495 -9431572 -12128965 -12768050 -11451839
5882 -11451839 -11445164 -13465332 -15569216 -16248569 -14196944 -8016708 49127 3420729 -1151684
5873 -1151684 -8092425 -10050749 -7603689 -6392633 -7378110 -6980923 -5530874 -7612265 -13053986
5864 -13053986 -14937802 -9405396 -1646317 1487930 428601 481870 3540181 6290537
5856 6290537 5251036 263119 -6524153 -12667281 -16386768 -17141683 -15643991 -12865560
5848 -12865560 -9257770 -5103707 -931973 2804228 5822548 7382801 6240621 2171503
5840 2171503 -2226736 -2088455 5718081 18265732 27667377 28412804 22705061 16292961
5832 16292961 10576015 3109317 -4726578 -7043933 -2895331 -250965 -5476456 -13190240
5824 -13190240 -12801042 -2660083 8600111 13640407 13132841 11071327 9493325 9199591
5816 9199591 10688173 12335257 11313008 8000740 6400976 8735140 12219159 12297552 7069543
5807 7069543 -1462049 -8039445 -6895145 2236198 11138265 10760968 2369573 -3715646
5799 -3715646 -1471236 4101251 5722212 3886040 4392525 9895089 18009988 24785956
5791 24785956 26172012 19030548 5435863 -5840546 -7004112 -52392 5826441 5289416
5783 5289416 1588904 299058 2175566 3570556 1192933 -5170224 -12834953 -17519162
5775 -17519162 -15698366 -7507260 2664563 9383466 10250301 6660053 1099318 -4980551
5767 -4980551 -10091598 -11347828 -7058941 -872126 79029 -6531156 -14201227 -14970789 -8952062
5758 -8952062 -2686819 516314 3324609 7253598 8634536 4394544 -2482326 -6876101
5750 -6876101 -8131570 -9281931 -11528995 -12680688 -10113402 -3095391 6609073 14625380
5742 14625380 16255994 11235032 4767676 1675278 1113256 -666348 -4374159 -7633244
5734 -7633244 -9195903 -9440707 -7581952 -2590779 2904048 3846680 -450585 -3852241 -106522
5725 -106522 9608926 17752116 18056456 10733242 1107628 -5177893 -5984128 -3473438 -1642243
5716 -1642243 -2229904 -2928758 -711116 2933063 2168868 -5995711 -16468854 -21385964 -19940362
5707 -19940362 -18108987 -17529201 -10958618 6199096 24663476 29542669 18729588 5408013
5699 5408013 1382806 5108041 8358121 7457097 3568481 -2242705 -8551039 -11834225
5691 -11834225 -10338512 -7319025 -6683138 -8267208 -10731786 -15013163 -20377672 -21399142
5683 -21399142 -14966949 -6903937 -4738316 -6393038 -3583068 5000172 11987628 12807175
5675 12807175 10864240 9937595 9035078 7488237 8388060 13146491 17794822 18405031 16161663
5666 16161663 14044856 12360730 10311230 8163061 5290134 40807 -5966489 -7867997
5658 -7867997 -4765317 -2171185 -3760027 -5696699 -3686290 -612630 -1113451 -2684352
5650 -2684352 581223 7935213 13126393 14220887 14620894 14613862 10160078 1833031 -2864830
5641 -2864830 74787 4671062 3667640 -1119721 -2764327 -204968 1095519 -1514471
5633 -1514471 -3808536 -1176602 5096025 10282329 12307297 12783265 13067468 11933994 7911052
5624 7911052 2388568 -1375307 -2256696 -2365949 -3270197 -3473565 -2351129 -4601821 -15546137
5615 -15546137 -31137717 -38315903 -29343743 -12111801 -1102005 -452676 -1978939 1068365
5607 1068365 5704179 6402764 3408326 -629674 -6711081 -15900933 -23381568 -23526467 -19522109
5598 -19522109 -20242499 -26983356 -31117779 -27685299 -23713891 -27329836 -34168722 -32423097
5590 -32423097 -19291092 -4877991 714678 -1978752 -5619730 -5279830 -1145092 4053503
5582 4053503 6974171 5246283 -109761 -5203869 -8082281 -11346725 -18001211 -26377084
5574 -26377084 -31654312 -31355218 -26938152 -20786889 -14309161 -8853740 -5808068 -4985107
5566 -4985107 -4759694 -4596715 -5819782 -8805853 -10750409 -7843856 466562 10173838 15501591
5557 15501591 12715912 2208458 -11597384 -22218779 -24514476 -17720960 -5606560 6519826
5549 6519826 15042172 18765007 17736147 12624945 5266364 -1218213 -3651476 -486697
5541 -486697 7179583 15791299 21098667 20908018 16404908 10517091 5548224 2987097 4118150
5532 4118150 8509711 12515089 12246050 8454944 5569723 5124617 3596471 -1456202 -6731868
5523 -6731868 -7875042 -6010759 -5506331 -6846492 -6021078 -538262 7567029 14430498 16902262
5514 16902262 13253936 5244382 -984214 -400434 4375195 6326752 4002601 3022297
5506 3022297 6434280 9329696 6274448 -512520 -4533195 -3414925 -18948 2470556
5498 2470556 2926739 1707496 1052925 4222723 10984161 15766360 13711548 7020643 2012381
5489 2012381 1557232 3879148 6845946 8973748 7611227 1513840 -4704367 -3853533 4724724
5480 4724724 13328617 14637860 8932980 1485100 -3472394 -4281049 -977252 4054610
5472 4054610 6613370 4747396 1495270 1860764 7805458 17052635 25257098 28238569
5464 28238569 24040781 14913416 6440055 3066186 4721969 8218752 10555044 10049449
5456 10049449 6193472 395505 -4038126 -4389960 -634908 5658752 13037620 19251024
5448 19251024 20386440 14048467 3543600 -3723926 -3398228 1375994 3640321 276290
5440 276290 -4708697 -4578475 2547016 10795725 12122375 5187506 -2556819 -2938905 3748944
5431 3748944 9663486 9111373 4546494 1882311 2589369 3228995 1512590 -717342 -1027003
5422 -1027003 303424 2342750 6316575 13198688 19609561 19886073 13051717 4763211
5414 4763211 735709 670137 901029 831173 3033999 7402206 9198920 4835090 -2626009
5405 -2626009 -6138918 -2320459 5211000 10074821 9400565 5444967 1936618 129409
5397 129409 -1012076 -1684732 -216744 4082409 8710911 10621185 10330288 10768738 11790467
5388 11790467 9064754 664098 -7670642 -7852736 32038 6553450 4323782 -2516461
5380 -2516461 -3894605 2545486 8274783 5551762 -2291620 -5909294 -2475634 1844344
5372 1844344 1337526 -2524516 -5142520 -5091238 -3741633 -2156980 -1680581 -4719316 -10941770
5363 -10941770 -14852553 -11789352 -5100474 -2271673 -4227332 -4166794 1759118 8414736
5355 8414736 9426780 6130666 4221840 4712658 3483543 -1505607 -7442590 -11063279
5347 -11063279 -11929891 -11088588 -9873299 -10273568 -13045198 -15030611 -12024708 -5164167 -534339
5338 -534339 -876217 -1877938 639068 4038985 3646760 1068191 2282420 8755130 15867018
5329 15867018 20012357 22021034 22987083 22150279 20542036 21356556 24056197 23387208 18001810
5320 18001810 14753243 18820862 24041592 20700302 10652480 6094863 12889722 23232397
5312 23232397 27200777 24238532 19374672 14675070 10121604 8230331 11167689 15562880
5304 15562880 15981759 12325505 8787003 6615646 3228277 -1791575 -5155617 -5193251 -4104020
5295 -4104020 -3513058 -1929349 1362682 3453365 1578345 -2653655 -5533795 -6272464 -7115621
5286 -7115621 -8940102 -9038810 -4198799 4623559 11601730 10981551 3085639 -5674104 -9571445
5277 -9571445 -8929751 -7378482 -5879162 -2649391 2060748 5234985 5690458 5714332 6716455
5268 6716455 6574108 3467245 -407127 -1808598 -1295465 -1906161 -3839470 -3819843 -356275
5259 -356275 3170418 2533170 -1783044 -5575595 -7304025 -10468556 -17737058 -25146122 -26092946
5250 -26092946 -20512959 -15270952 -14158457 -12803097 -7100812 -1762886 -4126813 -11973274
5242 -11973274 -14806547 -7503532 3549619 9196106 7022913 740125 -4580557 -4603363
5234 -4603363 1679107 8557199 7411896 -2933367 -13796469 -17454855 -15631245 -13587986
5226 -13587986 -11220561 -5839630 408069 3110518 3510185 6878823 13720849 19103786
5218 19103786 20748877 21350956 21941881 19419483 13142548 8400486 9577312 13719840
5210 13719840 14704572 11083737 6086330 1724719 -3088074 -8747779 -12411396 -10406340
5202 -10406340 -2240114 8202874 15289378 15881519 11420255 5834676 1946031 482511
5194 482511 1195353 2592893 1093169 -6291202 -17257709 -24791742 -24359132 -18883528 -14766681
5185 -14766681 -14452533 -15188173 -14194672 -12186321 -11171631 -11025492 -10105935 -8598796 -9141973
5176 -9141973 -13002471 -16813808 -15428876 -8494447 -1821169 -344627 -1611059 730969
5168 730969 7996021 14938203 17428614 17310316 17713802 17675400 14949726 10932248 7896795
5159 7896795 3207843 -7687259 -22111074 -30012532 -25721378 -15362204 -8947255 -8633514
5151 -8633514 -9239844 -7602432 -5497288 -3886378 -380193 5792464 11010572 12196924
5143 12196924 11116362 10866087 10893792 8840201 5341011 3358647 3592825 3740502 2078033
5134 2078033 -804271 -3675143 -5727322 -6003471 -3950378 -914367 458082 -1344287
5126 -1344287 -5566672 -9999438 -12278359 -11517838 -9494270 -8761616 -9017516 -7834461 -5832047
5117 -5832047 -7130594 -12302195 -15461601 -12526239 -7988781 -7807989 -9543704 -6929287
5109 -6929287 -1383416 -190555 -4265119 -6860938 -4887717 -2490657 -2186538 -1881089 -2806897
5100 -2806897 -10095475 -21338452 -24864292 -15681879 -4133716 -1573188 -5893748 -9325622
5092 -9325622 -12085931 -17823946 -22247735 -18461564 -9993367 -6936405 -10890205 -14117987
5084 -14117987 -12371343 -8525535 -4409088 811256 4319179 1901900 -2940714 -2178957
5076 -2178957 3375710 4209109 -2338048 -7292848 -4541467 123891 -70214 -1891678 1021146
5067 1021146 7153290 10221608 8608127 5499217 3405154 3830560 8689626 16722790
5059 16722790 21457891 17698115 7951497 -1320762 -7254404 -10744077 -11892183 -9671321
5051 -9671321 -4829097 52890 2665323 1893633 -1334086 -3359970 -1122690 2917672
5043 2917672 3050631 -1454728 -5056636 -4302311 -2039000 -1134120 -153155 1282907 -860548
5034 -860548 -8078832 -14447359 -14369318 -10670041 -9092467 -8909254 -5630310 147215 3551808
5025 3551808 3155529 1420911 -1208066 -6422958 -12867704 -16552186 -16506018 -15390542 -14701909
5016 -14701909 -13558095 -11733875 -9853562 -7298055 -3882545 -2497080 -5687240 -10631039
5008 -10631039 -12246475 -10553744 -9980940 -11825397 -12910962 -12144956 -12619383 -15244228 -15386461
4999 -15386461 -9336137 -970315 1960935 -2576430 -7994034 -6806484 -82061 3013031
4991 3013031 -3435743 -13048557 -13490161 -2106888 9680911 10007048 74761 -9519625
4983 -9519625 -11704350 -7228794 469294 8345564 12999814 12551173 9171348 5717487
4975 5717487 1133747 -6169703 -12078163 -10267958 -2154706 2695030 -2072689 -12119520
4967 -12119520 -17875480 -14099416 -3182081 7526989 10818909 5497567 -1830530 -3702726
4959 -3702726 -803886 -633855 -6975188 -14951643 -17961640 -15536092 -11829777 -9212809
4951 -9212809 -6428474 -1987549 3046776 6005441 5568780 3185434 948088 -1394143
4943 -1394143 -5131162 -8065356 -4993033 4821478 13914200 14218615 6404974 -2009362
4935 -2009362 -5821608 -5257453 -1980315 2517029 4969140 2207588 -3910183 -7485546
4927 -7485546 -5704039 -1795767 -584 -655645 -1551784 -1676033 -1833138 -2563607 -2831355
4918 -2831355 -1467163 -128549 -3114131 -11528263 -18797164 -16666055 -5941409 4120924
4910 4120924 8051823 9128816 10127152 7542031 -251 -5555841 -3255740 2525559
4902 2525559 4953339 5674226 9656297 14673435 15167627 11947003 8699692 3355843 -7131618
4893 -7131618 -17485981 -19998628 -16327136 -13537072 -12498274 -10537685 -10540894 -15541128 -19279491
4884 -19279491 -14895656 -7571180 -5038886 -2867377 4531313 7296237 -4224646 -16082333
4876 -16082333 -9761386 3755254 4969465 17757200 91844524 217639518 305574203
4869 305574203 284517422 188358373 107384063 79431086 72331821 56204113 40872302
4862 40872302 39436733 40168485 30663251 19788174 19301806 24665815 27462887 29860834
4854 29860834 34983588 36978109 31165777 22817216 17563258 13120658 6981993 2521786
4846 2521786 1913414 2261631 3058388 7834126 14679762 15328584 7651985 -750116 -4706414
4837 -4706414 -6852129 -7972764 -3849704 3898023 5857609 -399029 -4652693 431718
4829 431718 8529412 11163482 9906836 9602611 8765169 5010040 2112048 3528914 5738380
4820 5738380 5408536 6413885 12273863 18128341 18086236 14971488 15021547 17534654 17067232
4811 17067232 12239956 6209147 1757413 703524 4190349 9501108 11311844 9518836
4803 9518836 9814803 13162461 12537365 4850361 -2620859 -4146044 -5013688 -10818787 -15678337
4794 -15678337 -11510661 -2537606 774192 -2249856 -3692058 -1179457 198079 -1528643
4786 -1528643 -3084598 -3875992 -6522264 -9343787 -7112605 -4041 6139407 9303465
4778 9303465 13486031 20126912 24536309 23114487 18438117 15017482 14475389 16376668
4770 16376668 19771631 22672985 23222355 21847146 19675091 15866410 9852617 4496348
4762 4496348 2660439 2234767 -357664 -3012031 -241624 7467615 12536094 9897319
4754 9897319 3146245 -496927 2039762 8083385 12598417 12309055 8393953 5137642
4746 5137642 4623007 4208285 983072 -3816298 -7438303 -9459608 -9308410 -3618024 8250672
4737 8250672 18416927 16855625 3362810 -12143724 -21083469 -23045282 -21566588 -18739748
4729 -18739748 -15327103 -12141064 -9739489 -8765943 -10242677 -13572306 -16090786 -17239233
4721 -17239233 -20259074 -25951285 -28348655 -22176394 -11594457 -4878230 -2797581 171869
4713 171869 4826648 6256855 3815865 2834728 4494087 2727355 -5200989 -12641494 -12878201
4704 -12878201 -8626145 -7141507 -10077305 -12867712 -11320536 -5285663 1820491 4889516
4696 4889516 1554267 -3463031 -2331289 5437443 11005433 7690510 -83486 -3398960
4688 -3398960 -494205 3208707 3957714 2990740 2150010 1512634 1863686 5233763 11440351
4679 11440351 16834854 17963446 14654393 8508494 632631 -6920793 -9185320 -1891299
4671 -1891299 11614110 20480805 16923946 5201311 -3697047 -5246053 -4398178 -5681044
4663 -5681044 -6989091 -5768742 -4892443 -7475720 -10763246 -10829115 -9558753 -11105759 -14712548
4654 -14712548 -17226009 -19649712 -24186852 -27136918 -22472910 -11549469 -2063825 2066304
4646 2066304 2955109 1899641 -1928722 -6053383 -5891805 -2161904 229513 1113703 4956250
4637 4956250 11163881 13283357 9669399 6061181 4906548 1265766 -6787245 -12615135
4629 -12615135 -11065432 -6254320 -3868840 -3068829 -1853991 -3174607 -8740025 -13011195
4621 -13011195 -10838423 -6076151 -5465176 -8549931 -10807705 -12311574 -15465012 -17868559
4613 -17868559 -15922869 -13189654 -16651245 -25419613 -30989333 -29161857 -24862461 -23628112
4605 -23628112 -23884037 -20246640 -11461000 -2918856 -1643096 -8338982 -14714315 -11757933
4597 -11757933 -1416271 4551623 -488616 -9553556 -12078521 -6954479 -468004 3592553
4589 3592553 5196269 3468547 -1781353 -6325375 -6203658 -4471026 -7011919 -13393746
4581 -13393746 -18140760 -19248560 -18716349 -16220218 -9703037 -1818531 1399535 -1280797
4573 -1280797 -5639120 -9401461 -13649007 -16780825 -14595078 -8101975 -4429266 -7201289
4565 -7201289 -11552220 -11507228 -7640112 -4703400 -5627105 -10313958 -16966003 -22396775 -23729718
4556 -23729718 -21339178 -18067161 -15523605 -13887788 -14326496 -17304620 -19254324 -16279268
4548 -16279268 -11084009 -10204733 -13771615 -14903999 -11192490 -9256081 -13548457 -17256945
4540 -17256945 -11053466 2836222 12263897 9839748 423817 -6308402 -6369157 -3159893
4532 -3159893 -1574786 -2614430 -3479217 -1855541 964975 1943792 458814 -1058977 -576753
4523 -576753 1163152 2089572 1345105 45838 167796 2279994 3943911 1976136 -2557937
4514 -2557937 -4047025 634814 7337113 10168451 9232962 8359652 7494733 3601946 -1617065
4505 -1617065 -2022281 3280748 6654481 1378726 -9938044 -19186165 -21421470 -17294187
4497 -17294187 -10349097 -4748844 -3093020 -4072066 -4153515 -2624266 -2029968 -2663308 -825917
4488 -825917 4983348 10020792 8985217 3137877 -1754902 -2689378 -1204267 797708 3332725
4479 3332725 6207419 7270818 4202649 -2411326 -8583683 -10457722 -8753299 -8216695
4471 -8216695 -11333359 -14704652 -14452019 -13068374 -16305104 -24157276 -30332046 -31057179 -28798050
4462 -28798050 -25811078 -19991307 -10318294 -1327211 2118586 867313 -1599866 -4568160
4454 -4568160 -7792159 -7341759 -120653 8874700 10491362 3527369 -2726058 -257841
4446 -257841 8082884 14157097 15647096 16175947 16269962 11381373 887381 -7493988 -7572756
4437 -7572756 -4451169 -7103644 -13751790 -13965529 -5635047 758476 -1382304 -4673486
4429 -4673486 -1501901 1675955 -5296509 -18295227 -24142317 -20409704 -16972185 -18928681
4421 -18928681 -21064965 -20238794 -20300114 -21617889 -17822419 -7658475 646745 1921318
4413 1921318 731562 143813 -5423460 -18640019 -30213951 -30501098 -22875196 -16863408
4405 -16863408 -14351887 -11166283 -6609306 -2774516 828017 4118959 3093097 -2461041
4397 -2461041 -3525790 6882304 22078933 30704328 32366847 34053602 35826129 32483449
4389 32483449 26727374 27383548 34344188 37397330 31602029 22799718 15671136 7186951
4381 7186951 -4302017 -13222211 -15190325 -13812085 -14317538 -16619915 -18769724 -21205378
4373 -21205378 -23075321 -19684580 -8619048 5156451 14318138 16539509 14200217 10164429
4365 10164429 6845061 6595126 9824020 13980131 15939887 14324392 9604134 4036552
4357 4036552 824464 574175 -201409 -3668899 -5927832 -2806969 1690296 -64794 -6907680
4348 -6907680 -9273429 -3336463 3697293 5565349 5959371 10347176 15919017 16858863 14830152
4339 14830152 16235682 21227406 23151902 19207361 15085510 16597659 21216280 21734595
4331 21734595 16418929 11395438 12152964 16156047 17212236 15302893 16718338 23554740
4323 23554740 28923629 26101145 17429626 9271377 2794122 -3721594 -7465141 -4607910
4315 -4607910 713702 345498 -4657894 -3947352 6868724 19274960 23549982 20189099
4307 20189099 15719728 13615674 14042859 17316860 22526031 26252673 26616951 25614376
4299 25614376 24813736 22540957 17943478 13526932 10523117 5990116 -1911603 -9625321
4291 -9625321 -12938479 -12662870 -11956565 -11092092 -8634018 -5326485 -3338285 -3467181 -5549995
4282 -5549995 -9473450 -13694304 -15284352 -13588708 -11578153 -12027797 -14751450 -18331393
4274 -18331393 -21285594 -21100086 -16562251 -11840729 -12797529 -17558349 -16738848 -5968645
4266 -5968645 7531428 14510122 14393451 12160093 9651917 5425172 -237423 -5313256
4258 -5313256 -8900854 -10508126 -8960084 -4932120 -1610490 -183049 1967647 6195849
4250 6195849 9755753 10558517 10238301 9708032 6696134 968746 -3321975 -4234984 -5445733
4241 -5445733 -8961716 -10550231 -7608788 -5374442 -8684590 -13051446 -11701632 -7316429
4233 -7316429 -8322017 -15733645 -21576569 -19684195 -11585388 -1928239 6408451 12175901
4225 12175901 14490854 12301543 4345367 -8147319 -18468151 -19193883 -11696041 -5135257
4217 -5135257 -3880754 -3165429 -195310 -339435 -6613252 -12287908 -11836136 -10811911 -15670088
4208 -15670088 -21442634 -19852520 -13005870 -8208392 -5368008 -968687 1529580 -1945556
4200 -1945556 -4628472 2095026 12203563 12559958 4561251 2582375 11166050 19552529
4192 19552529 20607278 19776534 21428197 20632298 14320458 8545833 8194641 9242295 7061652
4183 7061652 3914328 2891416 1918794 -1453989 -5701925 -9388277 -13733332 -18618040
4175 -18618040 -21487947 -21468901 -19424174 -14832199 -8811575 -7532295 -14120494 -20097859
4167 -20097859 -15119341 -2597933 5609221 7048253 8234407 9425530 5062658 -2255031
4159 -2255031 -4436915 -3601283 -8149504 -14288831 -10496310 137209 3321873 -246989
4151 -246989 4192699 16714089 21506399 18002304 23201525 36615455 36845845 23436369
4143 23436369 23847746 43521167 54698616 61361324 121990001 256458114 372958346
4136 372958346 359014609 228042082 104436417 65265774 67763738 45692684 4635677
4129 4635677 -14791508 -11552531 -12162079 -18251914 -13544428 -3326068 -5646330 -15258166
4121 -15258166 -12233076 1357017 5465453 -2338712 -5051472 2043915 5341887 -270833
4113 -270833 -3218983 2350173 7052920 4282111 -37614 -1044578 -2959612 -8193962
4105 -8193962 -11816289 -12011004 -14172689 -19755698 -22032578 -17897817 -13816615 -14804006 -16445718
4096 -16445718 -13103534 -5967982 2196215 12511684 24195136 30104335 25200690 15097989
4088 15097989 9596411 10435894 11229664 7736994 2535249 -479299 -1463101 -2653156 -3776810
4079 -3776810 -2347548 1578596 3667122 627196 -4149345 -4125748 966371 4019111 1022228
4070 1022228 -2370112 774105 7580500 8761185 1405438 -7658129 -11252183 -9367869
4062 -9367869 -6338896 -4744630 -3919235 -2220310 370966 1214550 -2420420 -8760428 -12248088
4053 -12248088 -11279709 -11687724 -18180459 -25597109 -24957102 -16453045 -9221096 -8175074 -8514910
4044 -8514910 -5208917 -852346 -127817 -1895027 -1895347 -2566 233007 -2482475 -6203346
4035 -6203346 -9959124 -14718165 -19478317 -19885812 -13092392 -2745726 3230919 601589
4027 601589 -6568098 -10645638 -9391946 -8146398 -12387778 -20397465 -25305154 -22789761
4019 -22789761 -14224764 -3478853 5902598 10395538 7367192 -1503364 -9732121 -11580322
4011 -11580322 -7891071 -4784306 -6386586 -10399524 -12082205 -11478774 -13670710 -20716741
4003 -20716741 -26739202 -24953957 -17691365 -13868305 -16477013 -19059473 -16823815 -14463994
3995 -14463994 -17969269 -24232594 -25698948 -21779455 -18092814 -16403068 -13359757 -8753196
3987 -8753196 -6675708 -7168300 -4827150 1236193 3522055 -2970057 -11926161 -13544394
3979 -13544394 -6856081 1739248 8830050 15935604 22497255 24088334 19097982 12261586
3971 12261586 9389378 11573152 15919936 19208163 19473378 16594548 13077219 12434745
3963 12434745 15371202 19191676 21988975 25019199 29019375 30647587 26075377 17235206
3955 17235206 10840198 10652604 13620676 14559949 11913941 7548766 3638116 1970417
3947 1970417 3979715 8460858 10776896 7640855 1959979 -337911 1930861 3935426
3939 3935426 1730005 -2728349 -4628202 -2134840 1844812 2251554 -3778677 -13363140
3931 -13363140 -19378739 -18111242 -14301623 -14851502 -18748845 -18850332 -13621059 -10048645
3923 -10048645 -12643721 -16570672 -15906705 -12449423 -10680703 -9214732 -3985301 3857806
3915 3857806 10195137 15165578 20963898 24676906 21218878 12614140 6568010 5461312
3907 5461312 4220495 230243 -2163529 401648 4532819 5885457 5492736 6458863 8465813
3898 8465813 9382462 9236902 9109353 8337389 5757394 2199421 -229078 -125502 2612229
3889 2612229 6310500 7743271 5722594 4225491 8011264 15003252 17848933 13988987
3881 13988987 8904317 7586028 8423941 8555966 9752052 14528782 20762304 25033438
3873 25033438 27891848 30825606 30940945 24249206 12710815 2866985 -1915072 -3611529
3865 -3611529 -4771339 -5958442 -7741855 -10948039 -14166414 -14377984 -11171379 -7898826
3857 -7898826 -7630088 -9703165 -11135608 -10318289 -8610708 -8560038 -10653002 -12355880 -11461607
3848 -11461607 -9642876 -10109249 -11827137 -9862488 -2928752 3266372 3021010 -2067075
3840 -2067075 -6036967 -6247611 -4541100 -2714426 -695528 1778993 4887001 9246193
3832 9246193 14048053 15972136 12757013 6536300 1050142 -2509030 -3871556 -606800
3824 -606800 8618156 19204190 24188825 22361400 18298853 14753028 10257808 4825852
3816 4825852 2309239 4540911 7359441 5706558 147766 -4411305 -4795470 -2169552
3808 -2169552 43377 -1180054 -7094040 -16519074 -25952207 -30758739 -27328412 -16066644
3800 -16066644 -3073046 3615565 2006550 -1288401 552547 5338070 5324397 -933993
3792 -933993 -5717147 -2562168 5396034 10593963 10868724 9936568 9980622 8568890 3737043
3783 3737043 -1430298 -2018704 1996606 5099099 3140158 -1413593 -3239509 -1186390
3775 -1186390 2069134 6032311 12354090 18064632 15854246 5064086 -3871555 -2273669
3767 -2273669 4197958 3404877 -6173826 -14916131 -16771046 -14688796 -11076603 -3263515
3759 -3263515 8169755 15606241 14218836 8838363 5926289 4781913 2178993 2242
3751 2242 1550355 4255962 2902989 -2207874 -6042890 -5946634 -3105057 1000818 4776748
3742 4776748 5247423 1623297 -1586475 76997 4105368 4275009 -645594 -6298355 -9494395
3733 -9494395 -10668608 -10880574 -11360565 -14622373 -20548644 -22720137 -14936050 -760426
3725 -760426 10026322 14305359 17700104 23208350 26076789 22909667 18169978 16801736
3717 16801736 16420967 12330528 5739791 1427122 613522 1390803 3383617 6797369 9220092
3708 9220092 8674749 7976118 10566301 13374574 9856235 100294 -7904910 -8210871 -2994605
3699 -2994605 2928260 8575487 14629267 18795678 17879853 13092763 9525203 10224838 13095391
3690 13095391 13923218 10926504 6047297 2757297 2729735 4035251 2761697 -2921558 -10428896
3681 -10428896 -15036786 -14335386 -9901039 -4888161 -960363 2117887 4752668 6455205
3673 6455205 6654329 5807390 4888706 3810168 1276189 -3019946 -6464984 -5040694 2492459
3664 2492459 12380238 18720486 18738084 14789316 11030915 8849246 6231948 1007206 -6642660
3655 -6642660 -14894571 -21814325 -25216441 -22522674 -12888076 591699 12375098 18573279
3647 18573279 18923880 15496056 11303475 9792279 12840389 18193595 21220237 20658077
3639 20658077 20263127 22664288 24143212 19303553 9769121 3691835 5771735 11593477
3631 11593477 13710094 10190203 4577459 -2503 -3066195 -4356193 -3176986 -682304
3623 -682304 160250 -1905261 -4920556 -6700456 -7385915 -7871447 -7775186 -6905498 -7068112
3614 -7068112 -9739191 -12729341 -12164866 -8049107 -5017181 -6433769 -10100344 -11401973
3606 -11401973 -8628765 -3131312 3787683 10981761 15445210 13846591 6604314 -2336775
3598 -2336775 -10279021 -17471334 -23601609 -26478828 -26017603 -25567875 -26163621 -23290266 -14204615
3589 -14204615 -5491632 -6575190 -16228990 -22562371 -18054259 -8164895 -1961735 -351076
3581 -351076 1281889 3534586 2883654 -1025295 -4428136 -5348020 -5064094 -3860731 -737587
3572 -737587 2119712 101576 -6895352 -13118557 -14726975 -14499830 -16153271 -18241486 -17433087
3563 -17433087 -14539158 -12914386 -12759833 -11185154 -7260060 -3719156 -3684782 -7585092 -12644458
3554 -12644458 -14218815 -9542151 -1848746 1849890 -331491 -1430973 5332000 16353491
3546 16353491 21514856 16935941 8514542 3088874 1633780 2028741 3095593 3687288
3538 3687288 2149961 -685000 -1333104 1248835 3555000 2733587 765509 1026102 3716710
3529 3716710 7395106 12005683 17087045 19598916 17405176 13216167 11448964 12619343
3521 12619343 14402764 16519836 19771566 20773265 13287851 -3010067 -18884541 -23863162
3513 -23863162 -16998934 -7426182 -4834578 -10515669 -17363172 -17830029 -11582863 -4964295
3505 -4964295 -3137374 -4660020 -5166053 -4162858 -4693116 -6927574 -6478266 -807160 5938604
3496 5938604 7445196 3068855 -1732633 -2448626 -346937 569252 -503520 -282391 3679552
3487 3679552 8991080 10800099 7700464 3474241 2323529 4009494 5218411 4512808
3479 4512808 3586604 3815061 4116700 3286263 2569629 4109872 7520488 9681700 8202433
3470 8202433 4096476 435383 -1222117 -2212508 -4249026 -6328456 -5578389 -1464797 2417509
3461 2417509 2133445 -1795300 -4855850 -3382099 2522524 10352819 17225225 20129682
3453 20129682 16640842 7447276 -2524300 -7173940 -3887552 4699183 12553742 13551029
3445 13551029 4958627 -9971419 -23158367 -27707142 -23733024 -17210658 -12857199 -9888318
3437 -9888318 -5600214 -832738 818003 -1518936 -4229803 -3586439 262954 4523022
3429 4523022 7002566 6987395 4681286 1212538 -2301484 -6790999 -14096689 -22173356 -24547844
3420 -24547844 -18041793 -8584773 -4571841 -5719259 -4027867 4207093 13377814 17108930
3412 17108930 15936068 13315132 9196260 2330991 -4411431 -6071588 -1423679 6804964
3404 6804964 15696810 22718097 24764248 20919377 15046280 11984066 12217791 13325648
3396 13325648 14575227 16069158 15540049 11290395 7214947 9340038 17432803 25065447
3388 25065447 27887820 26537550 21452076 11378690 -1175301 -9125077 -8739777 -4194293
3380 -4194293 -1661534 -2811096 -6137383 -9957304 -11365512 -7135477 728189 4884271
3372 4884271 2164848 -1298223 656260 4181498 1062028 -8684521 -17220489 -20623795
3364 -20623795 -22514913 -25196613 -24604893 -17490504 -8412780 -5081736 -9225628 -15716743
3356 -15716743 -19486210 -20267827 -20723505 -22242391 -23624693 -23313953 -21874044 -21164757 -21013682
3347 -21013682 -18620194 -12889021 -7755288 -8285064 -13773290 -17762437 -15672893 -9789733
3339 -9789733 -5375545 -4274966 -4613534 -5163426 -6800496 -9397500 -10037909 -6273869 -218257
3330 -218257 2680229 -451440 -6232978 -8062928 -2597457 6884353 12875484 9403930
3322 9403930 -2976527 -16872755 -23972760 -22572689 -18133184 -15629159 -14157199 -11539340
3314 -11539340 -10564539 -14874041 -20259462 -17670557 -6590621 1700766 -1669406 -11324099
3306 -11324099 -15283265 -10049553 -1755147 4595401 9348662 12198296 9636593 1158976
3298 1158976 -6880502 -7145952 887058 10773913 15270157 12014082 4886616 321639
3290 321639 832659 2303616 -689886 -7685396 -12931583 -12454804 -7425403 -920330 4851830
3281 4851830 7756157 6402265 3248943 3432118 8289623 13091004 13648668 12241323 13647480
3272 13647480 17519625 18934685 15925412 12216783 11267906 10857048 6207407 -2882798
3264 -2882798 -10916865 -13267984 -11893870 -12737308 -17967873 -22735788 -20393828 -9838062
3256 -9838062 3235002 11656718 12595843 8810491 5190969 4003092 3298773 331915
3248 331915 -4090977 -6484428 -5995450 -6227475 -10276033 -16041935 -18571035 -15758838 -10004305
3239 -10004305 -5511121 -5508711 -10474980 -17139941 -20638629 -19348948 -16034894 -13099664 -9744528
3230 -9744528 -5801239 -4209229 -5721811 -5038501 2152545 11111700 13632554 9916957
3222 9916957 7472750 8779077 8470904 4339145 2532173 7428907 13161077 11319254
3214 11319254 3031652 -2666233 -773943 4184986 4451395 -1991321 -8995198 -8423353
3206 -8423353 226011 7498792 4651817 -4444294 -7731216 -1498274 5037411 4448934
3198 4448934 2177735 6633499 14795097 16504933 9833551 3143278 2522725 5412893
3190 5412893 7841775 10519942 14593479 16922989 14006349 7796420 3820979 4587995
3182 4587995 7620431 9766322 11007924 12670525 13123749 8357895 -1398808 -8366169
3174 -8366169 -5020933 5420192 11855616 9753607 6534367 9450797 14793621 15163503
3166 15163503 12013659 12515968 16840088 18006067 14351080 12907419 17764307 22915579
3158 22915579 21088523 13766658 7302057 3436683 -514906 -4514101 -4736012 542267
3150 542267 8560348 16294776 23391062 29492961 31863948 28560328 22497988 18996613
3142 18996613 19033227 18148050 13606227 9391174 10575470 15018052 15752438 10985525 5850183
3133 5850183 3348353 164704 -5497562 -8400812 -3869054 4094830 8480708 9220568
3125 9220568 10778981 12978490 11954230 8576666 7926720 10599391 12042107 10902029
3117 10902029 10495453 10953253 7737522 342612 -4794366 -3306579 1567748 5684149
3109 5684149 9713635 14176083 15145710 10242140 3920525 1501899 2231922 3226748 5542155
3100 5542155 10220594 12569971 7795206 -232067 -3337156 -917359 -118672 -4361459
3092 -4361459 -9104042 -10445452 -11069531 -14444859 -18397590 -18592470 -15056347 -11128233 -7799898
3083 -7799898 -2993240 3965143 10378584 13448662 13423680 12279962 10691262 8266143 6353231
3074 6353231 7789748 12275683 14302244 8920403 -1177799 -7829090 -6943528 -2609340
3066 -2609340 -1000946 -3621117 -7731503 -9842255 -7045014 1242817 10252610 12331613
3058 12331613 5892897 -1426846 -2587856 -892541 -4507634 -13325310 -17933117 -12305273
3050 -12305273 -1829517 3730294 1544949 -2693182 -2242281 4231113 12872220 19306323
3042 19306323 22431952 23944791 25152549 25733848 25470483 24782158 22573440 16224672 5847307
3033 5847307 -3556123 -6716552 -3461228 2574645 8646605 13740825 16620325 16298313
3025 16298313 13616398 9953351 5521528 901767 -1850629 -2182554 -2642318 -4368600
3017 -4368600 -3778643 2123717 9641236 12431106 9790694 6033977 3585269 2163801
3009 2163801 2838432 6266512 8094630 3459722 -4124764 -6037371 -1285098 2132338
3001 2132338 162261 -1679003 1083712 4148300 2511158 -862388 -528417 2961441
2993 2961441 6041324 8426684 10360852 8609374 2019128 -3338530 -1937577 2092181
2985 2092181 1473524 -2075220 -1399355 2542932 1237552 -6632942 -11231341 -5736341 3882211
2976 3882211 7919018 5298355 1800503 987295 2437191 5691012 10478852 14476909
2968 14476909 15183905 13517862 12480567 12701812 11812866 8119533 3110383 156890 1399951
2959 1399951 5661688 9455283 10796842 11269273 12644239 12721360 7938227 -152531 -5251130
2950 -5251130 -4195921 -334264 2794430 6833537 14484816 23479480 28746824 28734695 26145546
2941 26145546 23841126 22999691 23853030 25274581 24878921 22089198 19473913 18494317 16269096
2932 16269096 9995722 2267954 -2262774 -3592284 -4937884 -6325432 -5328791 -3253547
2924 -3253547 -4000515 -6440929 -4884378 1079734 4058323 -642987 -8179308 -11964603
2916 -11964603 -12715438 -14588713 -17058378 -16738347 -14059010 -12124696 -11201691 -9856242 -9307134
2907 -9307134 -10860258 -11161600 -6511104 -391823 407304 -3452944 -4558627 -698504 1666848
2898 1666848 -2166552 -8499925 -11795344 -11170251 -7245308 472205 8754785 10030136
2890 10030136 2455722 -4882194 -3145868 4519793 8930347 8107021 7040313 7672434
2882 7672434 7482074 6128184 5177421 2234306 -6167693 -15991538 -18978744 -15763721 -16616536
2873 -16616536 -25974328 -34669313 -32413724 -21041689 -9665554 -2468248 2198770 4899162
2865 4899162 4439001 2150236 903107 734611 -81350 -972275 -507217 -528805 -3956873
2856 -3956873 -8915303 -9747452 -4473714 2450835 5618130 4098846 878636 -718517
2848 -718517 428238 2503886 2581431 430204 -652389 1447961 4102282 4026904 2963635
2839 2963635 5071574 9814024 12513575 12059459 12566193 15687903 16519999 10645602 1532121
2830 1532121 -3405608 -2143527 740337 1530290 2065034 5927257 12611582 17553584 17378435
2821 17378435 13553055 10025075 7821164 3823382 -3849074 -10875555 -10281595 -1304291
2813 -1304291 8342633 10848393 6810162 3127112 3963346 6629943 5973246 63409 -8948718
2804 -8948718 -17242018 -21423237 -20119214 -15401663 -11835436 -12176754 -13935357 -11877049
2796 -11877049 -4690555 2156312 1712461 -6631032 -16003474 -18957026 -14335014 -6933765
2788 -6933765 -1927808 -971735 -2596734 -4039284 -2431184 3529034 11546613 16624007
2780 16624007 15859232 11904759 9703968 9754297 7121656 -1422827 -11563327 -15778514
2772 -15778514 -12730873 -8704551 -8974090 -11463209 -11311711 -8570694 -7505700 -9930428
2764 -9930428 -13496322 -16109494 -17707538 -17206786 -12178832 -3446224 3594466 4744186
2756 4744186 1646578 -1311062 -2225868 -1779052 -786367 -165761 -946557 -1621774 2079599
2747 2079599 11482899 20945931 23114803 17068786 8304336 2181811 592374 3247972
2739 3247972 8042867 11094930 10538096 9582789 11853369 14843082 13032859 6945613 3111680
2730 3111680 4187152 5263194 2396044 -827347 905583 6438676 10108500 9267882
2722 9267882 5861610 2174809 -1349859 -4608607 -6654760 -6082365 -2202882 2722473
2714 2722473 2768344 -6400057 -20321839 -28036733 -24315510 -15845959 -11906126 -12758404 -12051822
2705 -12051822 -7619822 -3682647 -3325093 -4800732 -5891146 -6749001 -6978064 -4456398 530529
2696 530529 3446264 736528 -5205500 -9146284 -9909166 -11244599 -15608531 -19617025 -17757044
2687 -17757044 -10011543 -3193477 -3162465 -7584350 -9263534 -5598046 -722711 1706987
2679 1706987 2577260 2264892 -2569408 -12351129 -19341215 -15805605 -5330666 873160
2671 873160 -1669290 -6799889 -8461283 -7913117 -7833508 -6236640 -1169865 3254783 1272711
2662 1272711 -6236598 -12640380 -13737078 -11251365 -8906116 -8663865 -10922929 -15284172
2654 -15284172 -20185988 -23647345 -25096481 -25300131 -24223750 -20195554 -11900417 -814910
2646 -814910 8790373 12609474 9513156 2123146 -5793103 -11732755 -13953490 -10651658
2638 -10651658 -2224588 6597655 10264826 8442513 5603833 4198410 1811766 -3604821
2630 -3604821 -9561673 -12708849 -13561948 -14365450 -14699990 -12748843 -9060684 -5253345 -325548
2621 -325548 7509400 15708496 18429381 13591561 5585551 -241601 -3015707 -4946125
2613 -4946125 -7184120 -9276556 -11303379 -14269875 -18325793 -21719445 -22013474 -18518812
2605 -18518812 -13585105 -10691950 -10449002 -9329830 -3849083 4442893 9911237 9029584
2597 9029584 4303139 1643957 4646110 11379209 15966498 13671365 5605954 -1740048
2589 -1740048 -2622705 2637345 9180903 13166353 13991260 12120788 7648558 1339471 -5162839
2580 -5162839 -10742766 -14776712 -15758471 -12279495 -5836104 -345313 2071077 2968836 4455787
2571 4455787 6017959 5431334 1445283 -4960049 -10602161 -11585641 -7091354 -1646521 -599543
2562 -599543 -3040879 -3061375 964893 3274068 -203819 -4452733 -2169638 5179025 9198538
2553 9198538 6171371 573714 -3224378 -6391164 -10470279 -12286257 -8348969 -1318158
2545 -1318158 2406148 492863 -3517367 -5920751 -7042240 -8889264 -11190782 -11675210
2537 -11675210 -9271590 -5174982 -676662 4437312 10309072 15002401 16123172 14518915
2529 14518915 14130304 16868014 19326784 16558819 8205893 -1119855 -7052754 -9044833
2521 -9044833 -8945401 -8289548 -7807586 -8342865 -11314838 -18044099 -27700635 -35613028 -35930824
2512 -35930824 -28185190 -19359869 -16315858 -17646486 -17103005 -13928074 -13914570 -19229705 -23514705
2503 -23514705 -20704192 -13778174 -9888822 -10401852 -11471096 -12142916 -15128861 -19514842
2495 -19514842 -19252311 -11437685 -1560573 2781681 709783 -2271120 -1443100 3238045
2487 3238045 9270394 14466797 17283267 16432048 11530471 3900996 -3720164 -8624181
2479 -8624181 -9934990 -9252999 -8890699 -9110715 -7916205 -4301892 -834856 -1382680 -6089261
2470 -6089261 -10222383 -9369143 -5067297 -3396768 -7515752 -13312045 -13949816 -7767866 222926
2461 222926 4411579 4114750 2630503 2661318 3853537 3940847 1443585 -2321307 -3822582
2452 -3822582 -734176 5404643 11041014 14403592 15558534 13865027 9102659 4989457
2444 4989457 6548691 12136281 13124633 4995956 -5757658 -10419634 -9556245 -9546932 -10868095
2435 -10868095 -8001025 -426348 4723068 3034540 -1260903 -2896666 -2880714 -4018819
2427 -4018819 -4491285 -1390999 2827620 3186066 -216251 -2560287 -1813360 -1655090 -6435033
2418 -6435033 -15922894 -25355066 -29147058 -25393501 -18351070 -15029365 -17290741 -19189538
2410 -19189538 -14852438 -6874822 -2826681 -4706143 -7026824 -5877917 -4476126 -6769902
2402 -6769902 -9531998 -5728831 5120653 14535946 14761513 8086217 3508393 5025199
2394 5025199 6902911 1929950 -8914194 -18385951 -22590340 -24007458 -25165660 -24693582
2386 -24693582 -21752327 -19605929 -20823509 -22078760 -18364641 -10885074 -6274923 -8106731
2378 -8106731 -12773754 -14222410 -9990129 -2084186 5712689 10467428 11372039 9214178
2370 9214178 4866481 -518426 -3936678 -2298373 2435956 3129236 -4156387 -13982643
2362 -13982643 -17501654 -12753046 -5039652 1063002 5118191 7449671 8068919 9135049
2354 9135049 12995052 16859632 14796210 6669659 -115783 -300238 2568329 2424578 -504811
2345 -504811 -1406811 1273141 4060157 3661867 846697 -785223 1505593 6471597 9068086
2336 9068086 5589555 -1180590 -4895715 -4287039 -4809790 -9876748 -15025654 -14410900 -9329394
2327 -9329394 -5563584 -4788272 -3902634 -1785781 -1414943 -4752780 -9716294 -13328870 -14682103
2318 -14682103 -13623973 -9285173 -1588036 7393054 14934814 19750671 22013520 22071971
2310 22071971 19602370 13840564 5047516 -3866906 -8248446 -5664936 1123180 6035836
2302 6035836 4711336 -2046744 -8920352 -10319029 -5510796 356198 2018147 453573
2294 453573 507948 2358179 385701 -7178821 -12795401 -8893530 856069 5992110 3722174
2285 3722174 2126760 7802936 16414038 18908633 13133864 5070609 427516 -740328
2277 -740328 -838024 205352 4090027 9549600 11949438 9066991 5009488 5371669 9667389
2268 9667389 12465714 11774726 11303511 13045697 13082817 8149127 1701435 -1046215 -425460
2259 -425460 42580 -408302 -1697224 -6965100 -17501595 -26154842 -24175458 -13903288
2251 -13903288 -6232908 -5162631 -3830428 2184483 6918509 3773653 -4566704 -11501969
2243 -11501969 -15505443 -17871781 -16962886 -11456688 -5474344 -3800798 -4608379 -2996826
2235 -2996826 482783 946720 -2753029 -7014516 -9621265 -11326957 -11948690 -10439828 -8754308
2226 -8754308 -10167751 -13239959 -12723403 -7724651 -4214462 -7562368 -16339304 -25159394
2218 -25159394 -30223961 -30581181 -27530985 -24882169 -26641622 -31881789 -34135758 -28310508
2210 -28310508 -16777407 -6916608 -4052308 -8110486 -15343954 -21285064 -22996087 -20343450
2202 -20343450 -15308075 -9964418 -5707972 -3552875 -2834141 194854 9177802 21965172
2194 21965172 31263393 32825510 29990557 27644657 25090307 19241608 12494981 11165595
2186 11165595 15533158 17476152 11289121 2522735 1139414 7941600 13321816 9799787
2178 9799787 730218 -5560465 -5991934 -3382800 -54252 3924703 7017572 6366455 2948749
2169 2948749 1753753 4171957 4253004 -3500224 -15174050 -20686227 -15024972 -2587485
2161 -2587485 8937042 15122182 15362546 11138490 5387570 1047930 -1309158 -3088531
2153 -3088531 -4810624 -5677909 -5976215 -7223696 -9384380 -10529546 -9911510 -8612096 -6348043
2144 -6348043 -908116 7515779 14441750 15987394 13479773 10842272 9317734 7337888
2136 7337888 4164865 1051310 -488053 220068 2526861 3532968 -580690 -9962349
2128 -9962349 -19158107 -22149790 -18333530 -11590392 -5154710 -106697 2628506 2295930
2120 2295930 -108822 -2993867 -6247829 -9822493 -11951702 -12184011 -14225307 -20749028
2112 -20749028 -26404490 -22237494 -7968340 6198118 12131975 12314444 12599965 12321279
2104 12321279 7201705 -1611089 -7861688 -8547418 -6989647 -7633806 -11310228 -15321562
2096 -15321562 -15430833 -8836975 1838402 9063646 8521918 5176153 6813162 12822718
2088 12822718 15043149 9925356 3760309 3615924 8141823 10776069 8564687 4152215
2080 4152215 1155005 892963 2792993 5682880 8946976 13167279 18564491 22703173
2072 22703173 22077355 16844481 11710927 11057720 15095562 20998644 24819468 22144337
2064 22144337 11565913 -607690 -3979499 4020910 13646603 14243973 6844146 941959
2056 941959 1760950 6181564 9543336 10631765 9839335 7026740 2112666 -4731448 -12862605
2047 -12862605 -19117998 -18747613 -12153091 -7478431 -10924097 -17256490 -17081916 -11613926
2039 -11613926 -11152131 -18430998 -23196021 -16823848 -4055587 4839351 6942353 6273940
2031 6273940 6147293 7866774 12540998 18181781 18718553 11931659 5121949 6488408 13376269
2022 13376269 15850792 10400765 3040436 -1030799 -3874928 -9166163 -15532912 -18473879
2014 -18473879 -16102800 -10986307 -7511640 -7644982 -8302678 -4459987 3322833 7373570
2006 7373570 2702503 -4406096 -3350879 6239119 13172536 8789965 -3023534 -11760993
1998 -11760993 -12062172 -7750129 -7298716 -16261551 -31041899 -39920874 -34258298 -19148364
1990 -19148364 -8555308 -9284114 -14908536 -16656859 -14008051 -11416977 -10388880 -9597383
1982 -9597383 -8757793 -7601149 -4265041 696063 1838830 -4411948 -12813061 -14489744
1974 -14489744 -7668935 1831151 9468942 15470218 19678783 19286318 13844916 7981219
1966 7981219 6437021 9210143 13242130 15931533 15291214 9906049 1496295 -4699865
1958 -4699865 -4945576 -1121951 2339836 4045658 5489601 6727867 5949737 3537733 2868684
1949 2868684 5265801 6788661 2809574 -5382480 -11305955 -10456652 -4349298 2738206
1941 2738206 8162675 10743111 9075042 3168184 -3288102 -5531039 -3007200 163960
1933 163960 437167 -1431355 -2375526 -681055 3176086 7447629 9751309 8473628 4899080
1924 4899080 2630788 3518078 5175720 3792016 -1442729 -7693645 -11328829 -10623803 -6913217
1915 -6913217 -3981021 -4720823 -7154454 -5720796 1400403 8106791 6680014 -2508545
1907 -2508545 -11008353 -12106197 -7153373 -1207563 3690569 7948687 9956986 6846429
1899 6846429 -298699 -5945908 -6488808 -4545989 -4963813 -8601959 -12488777 -14347903 -13580756
1890 -13580756 -8733406 1501008 13715992 20366165 17529460 9400684 2579225 -1446409
1882 -1446409 -5114011 -8772558 -10177720 -8798710 -6425171 -3773780 -118215 3899667
1874 3899667 6553403 7961859 9420456 10233074 8727634 5683630 2693853 -1735652
1866 -1735652 -9056014 -14454271 -10835612 -2844 7608150 6902888 4447192 7038168
1858 7038168 11469542 11433796 8077784 6408427 6025884 3153406 -1496432 -4335777 -5598961
1849 -5598961 -7056957 -5713584 1955116 11024917 11969147 3314286 -7290060 -14264080
1841 -14264080 -18076781 -18315231 -12782778 -5497582 -5479028 -13321004 -18032958 -12674118 -4603859
1832 -4603859 -3197594 -5233559 -1917146 5060406 5596624 -2331690 -8626568 -5115637
1824 -5115637 4239284 9889881 7603906 -80345 -8633391 -14332156 -15259606 -12743592
1816 -12743592 -10427785 -9961162 -8922603 -4619509 1394019 4632646 3259973 812185
1808 812185 2734636 10615800 20384347 26315474 26195528 21900402 15883959 9284682 3622632
1799 3622632 1421078 3053123 4729379 2189677 -4249678 -10442692 -13684028 -15012088
1791 -15012088 -16373713 -17802478 -17996680 -15849528 -10633905 -2411008 6466938 11635341
1783 11635341 10398842 4843820 -208918 -2217079 -2291066 -1683732 340761 3540684 4295580
1774 4295580 -227368 -6688477 -8829163 -6399843 -5813665 -9893405 -12204279 -5951220
1766 -5951220 5385309 11942046 9836254 3999138 71409 -477143 2354002 8160119
1758 8160119 13528936 14290175 11971423 12674113 17982234 22588757 22757809 20918031 19187523
1749 19187523 15137335 8326357 4672405 8458652 14977782 17202128 15306498 13084763
1741 13084763 9306063 664354 -9472122 -13749997 -11223241 -7416692 -4887206 -1713597
1733 -1713597 949491 -1162306 -6267623 -6050512 2284168 11023986 13249994 12375000 15307102
1724 15307102 21959470 27496259 30219104 30551939 25798302 13541484 -1056310 -8547377
1716 -8547377 -6377082 -1065089 1663918 3396854 7726268 13568368 17497979 19473761
1708 19473761 21950091 24716499 24703761 20917037 15923308 11289185 4758291 -5446974
1700 -5446974 -15579608 -19278004 -15329180 -9056883 -4984380 -1425444 5366507 14406121
1692 14406121 20853430 22433924 21363134 20017950 18054927 14478451 9652591 4120972
1684 4120972 -2110111 -7691144 -9492391 -6007771 69248 4515233 6187443 7398074
1676 7398074 9865712 11703884 9188053 1291694 -8209637 -13899036 -13975799 -11357242 -9266712
1667 -9266712 -7342708 -3386077 2403828 6756167 6185111 -652231 -11861575 -21727262
1659 -21727262 -23306638 -14956616 -3308639 3509110 4650224 4904859 5612955 2880386
1651 2880386 -4445120 -11057316 -12482492 -11465781 -13201262 -17625224 -20742309 -21217277
1643 -21217277 -21100308 -21253747 -20485742 -19002679 -18629478 -18825766 -15903550 -7925660 1890911
1634 1890911 8428113 10131221 9652426 9801798 10699467 11218064 11409204 11642948 10055839
1625 10055839 3876028 -5280921 -10143238 -5154572 5864429 13018474 11485426 6047390
1617 6047390 3860628 6323479 9943551 12105447 12913534 12768367 10957921 6822321 1291123
1608 1291123 -2690376 -1663277 4907077 12893159 17348688 18066510 18703377 20469543 20435909
1599 20435909 16998568 12844866 10462154 8647332 6202191 5274928 7392149 9386379
1591 9386379 7536241 3436370 1452401 2156746 2687387 2216558 2302174 2289544 -945609
1582 -945609 -7933107 -14763927 -17164987 -14144545 -7768855 -1869092 -571413 -5191883
1574 -5191883 -12434895 -17757969 -19939675 -20319742 -19277824 -16829319 -15163476 -16147415 -16880440
1565 -16880440 -12442365 -3405122 3912950 5656367 4748418 5687693 8876465 11771731
1557 11771731 12225901 8905189 1610252 -6691921 -10695884 -7638676 229677 8565892
1549 8565892 13772087 12919361 5289956 -4170143 -7259295 -1698762 5105469 4889376 -1198884
1540 -1198884 -4603738 123989 10324356 19612422 23767995 22511823 18542651 15641569
1532 15641569 16066878 19030507 21900617 22315034 19079921 12792824 6464685 3553793
1524 3553793 3977145 3928368 1102718 -2217803 -3381846 -4055826 -7244731 -11359466 -11579834
1515 -11579834 -6982947 -2189387 -809061 -753505 1797137 6290362 8635590 7234458
1507 7234458 5251824 6207498 9450452 11722771 11955691 11721714 10584851 4387306 -8880263
1498 -8880263 -23309432 -29319368 -24055071 -14117859 -7004340 -3426743 -199081 2676882
1490 2676882 1689305 -4589597 -12873563 -18217394 -17923133 -12927054 -7080476 -4571339 -6365969
1481 -6365969 -9380350 -10016232 -7447364 -2508003 4423395 11989428 16192707 13864507
1473 13864507 7417452 2666460 1548631 300739 -4162904 -9410143 -11263065 -10035711
1465 -10035711 -9925502 -12863592 -15735368 -14389596 -8754549 -2904208 -690453 -2099196
1457 -2099196 -3748441 -2646963 228570 20128 -7130750 -18208530 -23920881 -18187288
1449 -18187288 -6719903 -1926247 -7673714 -13847519 -9990161 49175 3708398 -2573665
1441 -2573665 -9655946 -9861346 -5837355 -2475194 1127025 6091647 7861238 3605634
1433 3605634 -189067 3649827 10814383 11597271 6522492 5046383 8909092 8367789 -1859406
1424 -1859406 -13338315 -16231406 -12509452 -10003005 -9897992 -8173252 -5004627 -4123336
1416 -4123336 -4753049 -2180814 3706025 7409726 6601718 6155145 11066890 19394574 24741199
1407 24741199 23224169 16069220 7189052 -110175 -4955484 -8306931 -10240504 -8767892
1399 -8767892 -2969454 3923275 7516505 7893847 8843939 11255040 11388906 7337251 3104684
1390 3104684 2951784 4616254 2483548 -3884420 -8917885 -8701841 -5141576 -1466227 2116534
1381 2116534 5766862 6723236 2844391 -2414394 -3093570 1454440 5933415 6699910 5689977
1372 5689977 5195568 3097931 -3193448 -10930001 -14418455 -12171131 -8132260 -6371213
1364 -6371213 -7763251 -11340642 -15227115 -16077295 -11503890 -4459323 -2092186 -8187855
1356 -8187855 -18480286 -24810562 -22541134 -13395896 -3228049 2081930 917121 -2310309
1348 -2310309 -1445462 4205896 8981235 8321758 4519547 2889014 4469838 5581469 3694932
1339 3694932 935165 1501746 7076717 14861761 19596341 18205678 12934870 8884759
1331 8884759 8343780 9336429 9789794 10076873 10416487 9394637 7382577 7894012 12091963
1322 12091963 14989874 11594532 4738649 1752893 4397380 7434284 7232607 6293155
1314 6293155 7697050 9904879 9869524 7936174 6633736 6741913 7202645 7497488 7865740
1305 7865740 8137750 8202587 8934088 11059053 13435759 13721705 11001420 7440438 7037439
1296 7037439 11815360 18535892 20456455 14147160 3827730 -3013302 -3512371 -648353
1288 -648353 2269313 4629264 6036784 4871234 729365 -4704731 -10313100 -15939224
1280 -15939224 -19248448 -16359100 -7783997 254298 3540834 5300903 10104910 15666190
1272 15666190 15844454 9981898 3851014 1780332 2869764 5332345 9533488 14985246
1264 14985246 18454534 17813210 15340753 14769323 16471636 17389998 14764883 8670545 1662922
1255 1662922 -3181039 -4422077 -2747623 1162371 8294309 18834801 28634401 31323008
1247 31323008 25062845 14866319 6999459 3214329 1657349 743895 -233913 -2271157
1239 -2271157 -5312096 -6586027 -3212420 3382088 7864933 6398666 371977 -5368056
1231 -5368056 -6790598 -3251707 2691635 7379188 8538207 6013716 379195 -7680611
1223 -7680611 -15659782 -18918759 -15048517 -8192045 -5858606 -10446448 -16451004 -17587424
1215 -17587424 -14384669 -12260447 -13445519 -13960079 -8975859 1147624 11308078 16706554
1207 16706554 16137722 11212731 4325413 -2048778 -5594612 -5637911 -4529726 -5892289 -10436499
1198 -10436499 -14701646 -15365438 -13635986 -13047550 -13586529 -11425312 -5289929 466866 1403966
1189 1403966 -1368692 -4209190 -6943052 -11320392 -14985049 -12738192 -4631299 2461037
1181 2461037 3559216 1337632 189912 -1090959 -6130807 -13614304 -18711681 -20427679
1173 -20427679 -21750295 -22622139 -18939887 -10430503 -3910397 -4774746 -9001294 -8345599 -1508596
1164 -1508596 4776288 5392010 2660798 934728 -568924 -5795807 -14208170 -19204435
1156 -19204435 -15426130 -5190404 4392277 9269104 10849610 11323041 10332867 7804136
1148 7804136 6915513 11072533 19216890 26950197 31495570 32948847 31691122 28063022
1140 28063022 24363334 23460579 24817921 25112507 23153901 20470512 16688682 9574391
1132 9574391 1715785 1312907 11478455 22937719 23657710 13884079 5496593 6896150
1124 6896150 14533015 20348954 21722253 20819578 18108425 11171566 -548343 -12791827
1116 -12791827 -19374996 -17628643 -10601297 -3606175 935199 3810051 4715548 1462022
1108 1462022 -4449933 -5495202 3773326 18177141 26586073 24420908 16765674 10068693
1100 10068693 6802563 8235454 15045513 22830632 23860702 17120418 10743212 10287673
1092 10287673 10832514 6565240 2121467 5622907 13909061 14864800 4620503 -6779661
1084 -6779661 -9477329 -5968038 -4988291 -8936064 -12646262 -11623405 -6782746 -2204130
1076 -2204130 -1387343 -4987037 -10098141 -12530940 -11145215 -8815515 -8302064 -9142283 -9721338
1067 -9721338 -9857496 -9451594 -7152988 -3101522 -909280 -3536881 -8343733 -9612544 -5565014
1058 -5565014 163319 3696575 4306973 2628387 -699808 -3333928 -1712186 4187210
1050 4187210 8907932 7285418 885376 -4150836 -4941348 -4446575 -6080353 -8932702 -9860088
1041 -9860088 -7999651 -5006493 -2148032 370857 1566905 -389870 -5652987 -11666704
1033 -11666704 -15659086 -17349276 -18451346 -20184334 -22090180 -23011528 -22559716 -21456460
1025 -21456460 -20450193 -18996048 -15710151 -10734586 -6697867 -5731858 -6001426 -3453579
1017 -3453579 2546099 7611037 7559765 3320974 -885600 -2418955 -1210777 2471795 8195649
1008 8195649 13473949 14502858 9962019 2911898 -1911820 -2419731 -824833 -1175384 -4774216
999 -4774216 -8185863 -7124316 -2209921 1638832 2137938 2398837 4808134 6462350 4978056
990 4978056 5078477 12654296 23681414 26641489 17224419 3968356 -3079206 -2984213 308751
981 308751 6501317 16944974 27601974 30820916 24083068 12922555 5263948 5350377
973 5350377 11757167 18228402 17777317 9219370 -1230433 -7142050 -8395482 -7557403 -3373482
964 -3373482 6139431 15941877 16802161 7199628 -3681973 -7225826 -4647405 -2354568
956 -2354568 -2961984 -5015809 -8104878 -13151745 -18652082 -20663924 -17049828 -9860696 -3537493
947 -3537493 -1565938 -3837075 -6482366 -5987683 -4410651 -7983941 -18575697 -29185022
939 -29185022 -31171482 -24216840 -15363303 -9260069 -4060633 2363033 7022612 5889347
931 5889347 623589 -2875855 -2190687 -967793 -2708350 -5258930 -4615011 -2545137 -5645041
922 -5645041 -15204187 -22126660 -16373173 -80167 13568181 15195894 8451410 2354884
914 2354884 -986938 -6236204 -14598864 -19822870 -16031864 -5607393 3682783 7653293
906 7653293 9000587 12120130 17318245 21304829 21842216 19865634 17048215 13304770 8122627
897 8122627 3246196 1876837 4953196 9923511 13980435 17172085 21077434 25132812
889 25132812 25834390 20240036 9977427 1053230 -1244747 2537451 6975434 8122139
881 8122139 7097600 6363520 5414351 3420200 3559498 9157144 16124752 15894656 7663397
872 7663397 1173497 3536976 9332445 9541090 5266265 4630427 8695963 9525535 2784241
863 2784241 -5895774 -9772544 -9573692 -9518179 -10066500 -9152146 -6944215 -4745511 -1395678
854 -1395678 5039756 13201023 19393251 21788437 21150245 18501496 14584917 10661931 7522412
845 7522412 4594939 1939508 1573308 4310792 6773720 4683657 -1665958 -8273799 -13154366
836 -13154366 -17848904 -23179315 -26836751 -26153315 -20887945 -12620072 -3690117 2774113
828 2774113 4572697 3465350 4113322 8281716 11863311 9464032 769672 -9114840 -14597060
819 -14597060 -13566372 -7691625 -604169 4630220 7620083 10172924 13178238 14787010
811 14787010 12546346 6425527 -1243841 -7641850 -9938802 -5599202 4769758 14992807
803 14992807 16990035 8652283 -3444562 -10626976 -10339302 -6661691 -4285218 -4414132
795 -4414132 -6079651 -8424333 -10344780 -9967109 -6730215 -3247518 -2919268 -5587711 -7500283
786 -7500283 -6277379 -4148604 -4797078 -8157747 -10399727 -9030818 -6213051 -6205412 -10501813
777 -10501813 -16313026 -19275252 -16940431 -10118067 -1887195 4505285 7666188 8888535
769 8888535 10907032 14979327 18721997 17545282 9308963 -2633779 -12319496 -17299681
761 -17299681 -20317984 -24140063 -26784954 -24260050 -17062183 -10917517 -10409736 -14060472
753 -14060472 -16657964 -14681588 -8528117 -1325146 3065275 2656049 -218130 -517462 3480675
744 3480675 7327489 6240970 2531981 3435074 11365957 20164149 22528707 17943599 10937781
735 10937781 4445019 -1343234 -4996145 -3412372 3335007 9852551 10598216 6164468
727 6164468 2559922 4511281 10893785 16954157 19764379 20440465 21394750 22890031 23324893
718 23324893 22186115 20922373 20327186 18537021 13052893 4174114 -4902603 -11206609
710 -11206609 -14082122 -14390842 -13135674 -11341694 -10132361 -9991905 -10294533 -10083901 -9181591
701 -9181591 -8309233 -8177540 -8432914 -7612083 -4737118 -1091277 709305 146387 -78974
692 -78974 2095304 4428382 3172013 -933431 -2573229 1517242 8600093 13852066 15680127
683 15680127 15364070 13746295 10849949 7461726 4643746 2260130 -365450 -3257795
675 -3257795 -6630444 -11161950 -15296891 -14297426 -5504993 6297493 12433584 9371407
667 9371407 1306354 -5912134 -9708754 -9458438 -4850183 2204350 7301652 7804931 5316009
658 5316009 2129568 -2190981 -8392498 -14261558 -17015737 -17451486 -18512512 -20543187 -20931621
649 -20931621 -18128840 -13357100 -8405599 -4195702 -1694206 -1877913 -4091142 -6171952
641 -6171952 -6940285 -7375030 -8906731 -11627460 -14564286 -16824827 -18058672 -18211003 -16944701
632 -16944701 -13416292 -7413835 -793139 3731878 5819737 7551402 9132912 7223902
624 7223902 163454 -7414284 -9108210 -5049707 -1796076 -4005879 -9931492 -15458390
616 -15458390 -18563813 -18572208 -14964303 -9280357 -5221633 -4209092 -2948350 2150149 9825009
607 9825009 15504103 16577724 14076896 10437896 7661340 6582659 6131766 4435892 2148933
598 2148933 2817285 7769443 12752104 12941166 9782889 8631562 9905040 7418193 -2675626
589 -2675626 -15092034 -20754015 -17012997 -9394782 -3906180 -825302 3067331 8703061
581 8703061 13557689 15530740 15469309 14999952 13829236 11055797 7881993 6370395 5830295
572 5830295 3503775 -433809 -1676103 2612393 9607238 14604761 16715679 17798704
564 17798704 17636743 14230155 8474699 4603697 5070511 7804363 9414103 8620836 5616005
555 5616005 599412 -5386567 -9913614 -11199501 -9922013 -8138337 -7285198 -7816299 -9650010
546 -9650010 -12075216 -13855745 -13977770 -12006723 -8025705 -3044750 1048909 3120015 3765371
537 3765371 3453514 1027529 -3652261 -6872119 -4409960 2393978 7400494 6902512 2755542
528 2755542 -1950849 -6140822 -8586337 -7132452 -2546474 747904 526224 -264424 776560
519 776560 834369 -3236357 -9025322 -12102098 -12235262 -11146904 -7367774 296180 6490401
510 6490401 4134300 -4671656 -9838241 -6594151 -1076629 -743658 -5292856 -9700064 -10715403
501 -10715403 -7267660 417592 8518588 11085245 7616330 4809203 6757933 8099689
493 8099689 2204467 -7884222 -13220758 -11164286 -7136265 -5543726 -5720712 -6671006 -8946026
484 -8946026 -10448912 -6637882 2351634 9688901 10142702 6655053 5404957 7329732 8107867
475 8107867 4758291 -968190 -4965235 -4295393 867212 6995291 9639029 7567404 3783989
466 3783989 1484951 358492 -1825162 -5516576 -9182822 -11671019 -12680527 -11558803
458 -11558803 -7873876 -3276104 -966092 -2676608 -7083317 -11449437 -14101736 -15145100
450 -15145100 -15392729 -14940028 -12846489 -8553025 -3553830 -667943 -996033 -2351080 -1594179
441 -1594179 1872281 5627721 6823179 4627038 642354 -2235138 -1670730 2432933 7790239
432 7790239 11413634 11452242 7773147 1785635 -3910137 -6714787 -5883943 -3032884 -465316
423 -465316 612976 217841 -1014463 -1992957 -1619903 218922 2672051 5164616 7565360
414 7565360 8759690 6636592 681116 -6470851 -11197570 -11793272 -8588300 -2873969 2842509
405 2842509 5242538 3296815 275931 539470 4773115 10244970 14867587 18383862 19970752
396 19970752 17848839 11981111 4593154 -2865596 -10845387 -18654694 -22751926 -19988981
388 -19988981 -11076282 603958 11938159 20218024 22384465 17089087 7053176 -2911036
380 -2911036 -10056348 -14103094 -14402394 -9965545 -3001399 863546 -1526784 -6285087 -6472858
371 -6472858 -193006 7810372 12664128 14453556 15347863 14614853 10193081 4323991 3124803
362 3124803 8745460 15128035 14579495 6869967 -1358769 -5225178 -5871830 -5874892 -4521231
353 -4521231 -82458 5772456 9097173 8622383 7163609 7923610 10987724 13683088 13199021
344 13199021 8749684 2294764 -2714470 -4403931 -4494233 -6032227 -8794905 -8760708 -3666790
335 -3666790 2329436 2356507 -4568212 -11501894 -11849002 -7361260 -4992552 -7295754 -10140910
326 -10140910 -10163899 -9685121 -11746660 -14309570 -13684473 -11341519 -12186583 -16611641 -19255403
317 -19255403 -16580498 -11355944 -7851521 -6259311 -4272960 -1272734 1788069 4520446
309 4520446 6488171 6195435 3325998 670602 1224325 4223927 6280110 5535323 2587543
300 2587543 -1549578 -5818836 -8346335 -8240929 -7870250 -10382179 -14670964 -15592051 -10090423
291 -10090423 -979682 6291033 8820410 7397614 4421902 2170377 1982914 3604787
283 3604787 5441797 6064952 5340399 4074845 3032238 2226677 688414 -2678543 -7217565
274 -7217565 -9984001 -8206942 -2097768 5535838 11674362 13967593 10621871 1954445
266 1954445 -8127683 -14584916 -15601501 -12931857 -8516689 -3504652 -443360 -2485372
258 -2485372 -8653749 -13083921 -11665134 -7291057 -5622197 -7124619 -6605804 -433891 8510340
249 8510340 13636871 10836652 1872391 -6803843 -8640915 -2294241 6830511 11226569
241 11226569 7878408 -228771 -8473132 -14703787 -18874639 -20784205 -19953456 -17153259
233 -17153259 -14514567 -13685337 -14355335 -14763763 -13387158 -10116484 -6175676 -3156945 -1859282
224 -1859282 -1502350 16680 4374577 10633199 15181431 14880975 10397873 5509348 2848871
215 2848871 1387029 -1238254 -5021539 -7616147 -7620026 -6210808 -5114565 -4310904 -2798286
206 -2798286 -809002 254103 131905 496619 2604601 5200067 6056597 5060702 4146807
197 4146807 4127418 3338304 208837 -4188884 -7234097 -7485551 -5445455 -2606467 -691923
188 -691923 -734833 -1692356 -918401 2862405 8159090 13261082 18212303 22400360 22548929
179 22548929 16525253 7780839 2115009 632593 -21554 -800745 1292951 6846062 11257247
170 11257247 10919886 8089751 6691796 7023367 7930140 10532053 15366320 18573641 15882732
161 15882732 8905411 2972873 -29457 -2066503 -3337562 -1687550 2237109 4565575
153 4565575 4109020 3889472 5070159 4033203 -1793705 -9155417 -13367036 -14431240 -15101698
144 -15101698 -15168030 -11874278 -5165142 1274470 4473160 4945739 4633569 4306750 3696742
135 3696742 2679603 1636719 1349262 2486392 4493637 5586069 4984671 4413876 5691586
126 5691586 7412807 6386969 2577915 35555 1669496 5267274 6719283 5627506
118 5627506 4989164 5908660 5819861 2871778 -646394 -1331734 510792 1465377 -320096
109 -320096 -3390023 -5670606 -6539263 -5956742 -3907512 -1534053 -705894 -1289954 -730459
100 -730459 2314867 5718273 6798857 5707326 4036618 1831077 -1572894 -5047038 -6718904
91 -6718904 -6689980 -6128598 -4535358 -961901 2517270 1994382 -3166882 -9298865 -12904109
82 -12904109 -13311893 -10713704 -5365883 -46233 535020 -4619237 -10465543 -11912880 -9888508
73 -9888508 -8641717 -9112744 -8541609 -5644226 -2548601 -1359635 -1541521 -1358952 -99379
64 -99379 1538029 1959520 -234878 -4198365 -6351325 -4012693 564662 2098492 -1287678
55 -1287678 -5792102 -7142696 -5916434 -5716590 -7463650 -8173630 -5516909 -1297954 857875
46 857875 -21272 -1764722 -2596407 -3241416 -4864377 -6515284 -6238860 -4156812 -2823599
37 -2823599 -4339700 -8189527 -12061038 -13833817 -12757604 -9885672 -7657068 -7956622 -10097672
28 -10097672 -11466690 -10372194 -7538176 -4929733 -4137813 -5604547 -7904709 -7976107 -4081271
19 -4081271 1215511 3268593 1255620 -473921 1774723 6057093 7475865 4213729 -1108730
10 -1108730 -4999781 -6174241 -5716045 -5475360 -5675642 -3555276 4003847 15530345 24721793
1 24721793 26855888
0 26855888
$$ Imaginary data points
##PAGE= N=2
##DATA TABLE= (X++(I..I)), XYDATA
65535 9289683 5029780 2177932 -773029 -2677349 -2379205 -103763 3635308 7781587
65527 7781587 9778591 7906620 4437744 3402823 5298774 7178916 7739306 8409875
65519 8409875 9182589 7920698 5093436 4621862 7728121 10124558 8382265 5458471
65511 5458471 6171276 10037614 12675598 12230020 10177373 7168444 2554326 -2282995
65503 -2282995 -4256179 -2799482 -582027 572935 1630407 3580597 5522366 6575664
65495 6575664 7353737 8221675 7967180 5651293 2519220 849039 1705886 4422661 7134965
65486 7134965 7275815 3270994 -2764666 -5269872 -359146 9258128 16158701 15623311
65478 15623311 10094165 5587130 4857775 5635074 5062396 3533332 3027085 3432069 2721147
65469 2721147 241597 -2342839 -3592557 -3910609 -4154746 -4349334 -4411209 -4475470 -3730097
65460 -3730097 -739082 3920358 7080218 6580424 4048536 2535243 2778101 3606819 4635401
65451 4635401 6124734 6993906 5662415 2923856 1670837 3146974 5077748 4233255
65443 4233255 18489 -4660170 -5556292 -646725 7537708 13790069 15389754 14379929
65435 14379929 13616125 12410266 8493888 2770396 -1283399 -2368564 -1989085 -557720
65427 -557720 2941506 6666390 5929699 -105974 -5643834 -5508438 -2116830 -1209453 -2981412
65418 -2981412 -2430419 2314799 7314649 9364847 10360511 12586994 13467258 9003504 705628
65409 705628 -5101607 -5103039 -2811918 -3247702 -6162561 -6783619 -2439522 3706906 6005068
65400 6005068 2261559 -4270437 -8273205 -7213487 -3176857 -529718 -1937776 -6366262
65392 -6366262 -10457314 -11434079 -8864743 -4562329 -1441741 -1817447 -5636173 -10278783
65384 -10278783 -12779851 -12133696 -8917874 -3627821 2905627 8071085 9181599 7278429
65376 7278429 6660672 9295586 12091528 11446535 7894331 3638314 -1901039 -10041558
65368 -10041558 -17887208 -20235999 -16461703 -11080451 -6971549 -2791242 1508124 1929306
65360 1929306 -3361041 -9328507 -10199478 -7498931 -7065914 -10008670 -12208755 -12128100 -12885876
65351 -12885876 -15151629 -13761695 -5023925 6506574 12952715 12755693 11103256 11651928
65343 11651928 12342922 10312786 7068682 6185512 7884495 8841173 7024570 4237180
65335 4237180 3006965 2610296 -129844 -6332666 -12812468 -15129535 -12323403 -7716914
65327 -7716914 -5078738 -4958202 -5343643 -5078840 -5212731 -6748311 -8406724 -7908775 -5114757
65318 -5114757 -2484616 -1910227 -2065792 110500 5580779 11715812 14785057 13464242
65310 13464242 9726385 6600447 5331723 4827891 3844690 3191892 4892179 9094991
65302 9094991 13084210 14237622 12931887 11072015 8537275 3404247 -3880908 -8814958
65294 -8814958 -7088460 307672 7741054 10523506 8792832 5954702 4416853 3451983
65286 3451983 850357 -4038206 -9361640 -12721550 -13300396 -11662115 -8614596 -5774929
65278 -5774929 -6375277 -12643136 -21599267 -26253012 -23164482 -16926479 -14396423 -15802282
65270 -15802282 -15106251 -8966307 -1307163 2391748 1734195 -239388 -2207990 -3966689
65262 -3966689 -2440742 6155235 19064112 26822349 23828588 16159322 14592084 21138139
65254 21138139 27219354 25677604 19770558 17437979 20085762 21509887 16995397 9184214
65246 9184214 3927383 3485815 5713489 7845528 8672759 7860318 5500348 2637930 675202
65237 675202 -333303 -1728601 -3945037 -5132464 -3305407 409399 2111732 -624451
65229 -624451 -5753919 -8920660 -7923437 -3913221 1024891 5414163 7624669 6257314
65221 6257314 2500314 -83485 213212 1189409 820618 1038312 4313079 8398524 8825530
65212 8825530 5948719 4673373 6612272 7569977 4839780 2242620 4376584 9496554
65204 9496554 12505770 12710464 13893284 17629021 20959687 20911620 17772201 13356871 8987579
65195 8987579 5863563 4980786 6007032 8039466 11343770 16126779 20065900 20179188
65187 20179188 17217285 14666846 12761686 7541886 -2296992 -11522196 -14412364 -11767035
65179 -11767035 -8397446 -6050227 -3092833 238826 1294337 -44298 -501915 997861
65171 997861 856037 -3565274 -8896503 -9642522 -5338493 -565360 1173718 359865 -1176176
$$ [...]
##END NTUPLES=NMR SPECTRUM
##END=
