##TITLE=31Pdec_DE-55DCM_K_d6
 DMSO-d6
 64 sc
 8.5.2024
##JCAMPDX= 6.0         $$ Bruker NMR JCAMP-DX V2.0
##DATA TYPE= NMR SPECTRUM
##DATA CLASS= NTUPLES
##ORIGIN= UXNMR, Bruker Analytische Messtechnik GmbH
##OWNER= root
$$ XWIN-NMR		Version 3.5
$$ Wed May  8 14:36:22 2024 Russian Standard Time (UT+4h)  she@DPX200
##.OBSERVE FREQUENCY= 81.013821
##.OBSERVE NUCLEUS= ^31P
##.ACQUISITION MODE= SIMULTANEOUS
##.ACQUISITION SCHEME= undefined
##.AVERAGES= 40
##.DIGITISER RES= 16
##SPECTROMETER/DATA SYSTEM= spect
##.PULSE SEQUENCE= zgpg30
##.SOLVENT NAME= CDCl3
##.SHIFT REFERENCE= (INTERNAL, CDCl3, 0, 248.564)
##AUDIT TRAIL= $$ (NUMBER, WHEN, WHO, WHERE, WHAT)
$$ ##TITLE= Audit trail, XWIN-NMR		Version 3.5
$$ ##JCAMPDX= 5.01
$$ ##ORIGIN= Bruker BioSpin GmbH
$$ ##OWNER= she
$$ F:/spectra/data/she/nmr/P31/1/pdata/1/auditp.txt
$$ ##AUDIT TRAIL=  $$ (NUMBER, WHEN, WHO, WHERE, WHAT)
(   1,<2024-05-08 14:34:53.14 +0400>,<she>,<DPX200>,
      <created by zg, POWCHK disabled, PULCHK disabled
       configuration hash MD5:
       00 E9 B6 7A A2 85 ED C7 34 08 36 98 17 FE 4E 26
       data hash MD5: 32K
       18 14 DA 83 06 90 68 DB 8E C5 D2 67 E3 BA 5C C3>)
(   2,<2024-05-08 14:34:55.31 +0400>,<she>,<DPX200>,
      <Start of raw data processing
       efp BC_mod = 2 LB = 10 FT_mod = 6 PKNL = 1 PHC0 = -13194.11 PHC1 = -4.916168 SI = 64K 
       data hash MD5: 64K
       34 7E 34 BE 24 44 EE E4 CC F2 73 83 8C 5E 43 A8>)
(   3,<2024-05-08 14:35:22.78 +0400>,<she>,<DPX200>,
      <pk PHC0 = -3.517681 PHC1 = 0 
       data hash MD5: 64K
       5C 92 2F 83 F1 88 CA 73 B4 C3 9C 06 3B B6 AA F3>)
(   4,<2024-05-08 14:35:51.15 +0400>,<she>,<DPX200>,
      <pk PHC0 = -21.20001 PHC1 = 0 
       data hash MD5: 64K
       46 97 37 96 5A 19 68 2B 97 F7 02 66 B6 E0 CE 7A>)
$$ ##END=
$$ 
$$ hash MD5
$$ 93 4B 7A B5 6E 9D 8F 40 BD 07 0F 31 23 A4 4F 6F
##$RELAX= 
##$RELAX= 
##$RELAX= 
##$RELAX= 
##$RELAX= 
##$RELAX= 
##$RELAX= 
##$RELAX= 
##$RELAX= 
$$ Bruker specific parameters
$$ --------------------------
##$DU= <F:/spectra>
##$EXPNO= 1
##$NAME= <P31>
##$PROCNO= 1
##$TYPE= <nmr>
##$USER= <she>
##$AMP= (0..31)
100 100 100 100 100 100 100 100 100 100 100 100 100 100 100 100 100 100 
100 100 100 100 100 100 100 100 100 100 100 100 100 100 
##$AQSEQ= 0
##$AQ_mod= 1
##$AUNM= <au_zg>
##$AUTOPOS= <>
##$BF1= 81.014009
##$BF2= 200.13
##$BF3= 200.13
##$BF4= 200.13
##$BF5= 200.13
##$BF6= 200.13
##$BF7= 200.13
##$BF8= 200.13
##$BYTORDA= 1
##$CFDGTYP= 0
##$CFRGTYP= 5
##$CHEMSTR= <none>
##$CNST= (0..31)
1 1 145 1 1 1 1 1 1 1 1 1 1 1 1 1 1 1 1 1 1 1 1 1 1 1 1 1 1 1 1 1 
##$CPDPRG= <waltz16>
##$CPDPRG1= <>
##$CPDPRG2= <waltz16>
##$CPDPRG3= <>
##$CPDPRG4= <mlev>
##$CPDPRG5= <mlev>
##$CPDPRG6= <mlev>
##$CPDPRG7= <mlev>
##$CPDPRG8= <mlev>
##$CPDPRGB= <>
##$CPDPRGT= <>
##$D= (0..31)
0 1 0 0 0 0 0 0 0 0 0 0.03 2e-05 3e-06 0 0 0 0 0 0 0 0 0 0 0 0 0 0 0 0 
0 0 
##$DATE= 1715164492
##$DBL= (0..7)
120 120 120 11 120 120 24 19 
##$DBP= (0..7)
150 150 150 150 150 150 150 150 
##$DBP07= 0
##$DBPNAM0= <>
$$ [...]
##$SUBNAM2= <"">
##$SUBNAM3= <"">
##$SUBNAM4= <"">
##$SUBNAM5= <"">
##$SUBNAM6= <"">
##$SUBNAM7= <"">
##$SUBNAM8= <"">
##$SUBNAM9= <"">
##$SW= 501.771253377433
##$SWIBOX= (0..15)
0 1 3 0 0 0 0 0 0 0 0 0 0 0 0 0 
##$SW_h= 40650.406504065
##$TD= 32768
##$TD0= 1
##$TE= 0
##$TE2= 300
##$TE3= 300
##$TEG= 300
##$TL= (0..7)
0 120 53 12 22 120 120 120 
##$TP= (0..7)
150 150 150 150 150 150 150 150 
##$TP07= 0
##$TPNAME0= <>
##$TPNAME1= <>
##$TPNAME2= <>
##$TPNAME3= <>
##$TPNAME4= <>
##$TPNAME5= <>
##$TPNAME6= <>
##$TPNAME7= <>
##$TPOAL= (0..7)
0.5 0.5 0.5 0.5 0.5 0.5 0.5 0.5 
##$TPOFFS= (0..7)
0 0 0 0 0 0 0 0 
##$TUNHIN= 0
##$TUNHOUT= 0
##$TUNXOUT= 0
##$USERA1= <user>
##$USERA2= <user>
##$USERA3= <user>
##$USERA4= <user>
##$USERA5= <user>
##$V9= 5
##$VALIST= <valist>
##$VCLIST= <CCCCCCCCCCCCCCC>
##$VD= 0
##$VDLIST= <DDDDDDDDDDDDDDD>
##$VPLIST= <PPPPPPPPPPPPPPP>
##$VTLIST= <TTTTTTTTTTTTTTT>
##$WBST= 1024
##$WBSW= 4
##$XGAIN= (0..3)
0 0 0 0 
##$XL= 0
##$YL= 0
##$YMAX_a= 5095
##$YMIN_a= -2888
##$ZGOPTNS= <>
##$ZL1= 120
##$ZL2= 120
##$ZL3= 120
##$ZL4= 120
##$ABSF1= 0
##$ABSF2= 0
##$ABSG= 0
##$ABSL= 0
##$ALPHA= 0
##$AQORDER= 0
##$ASSFAC= 0
##$ASSFACI= 0
##$ASSFACX= 0
##$ASSWID= 0
##$AUNMP= <proc_1d>
##$AZFE= 0.1
##$AZFW= 0.5
##$BCFW= 0
##$BC_mod= 2
##$BYTORDP= 0
##$COROFFS= 0
##$CY= -3
##$DATMOD= 1
##$DC= 0
##$DFILT= <>
##$DTYPP= 0
##$F1P= 0
##$F2P= 0
##$FCOR= 1
##$FTSIZE= 65536
##$FT_mod= 6
##$GAMMA= 0
##$GB= 0
##$INTBC= 1
##$INTSCL= 6.047779e-11
##$ISEN= 30
##$LB= 10
##$LEV0= 0
##$LPBIN= 0
##$MAXI= 10000
##$MC2= 0
##$MEAN= 0
##$ME_mod= 0
##$MI= 50
##$NCOEF= 0
##$NC_proc= -11
##$NLEV= 6
##$NOISF1= 182.463
##$NOISF2= 159.3651
##$NSP= 0
##$NTH_PI= 0
##$NZP= 0
##$OFFSET= 248.5645
##$PC= 4
##$PHC0= -13218.83
##$PHC1= -4.916168
##$PH_mod= 1
##$PKNL= yes
##$PPARMOD= 0
##$PSCAL= 0
##$PSIGN= 0
##$REVERSE= no
##$SF= 81.0140089999694
##$SI= 65536
##$SIGF1= 159.3651
##$SIGF2= -187.1042
##$SINO= 113.3802
##$SIOLD= 16384
##$SREGLST= <1H.CDCl3>
##$SSB= 0
##$STSI= 65536
##$STSR= 0
##$SW_p= 40650.406504065
##$SYMM= 0
##$S_DEV= 0
##$TDeff= 32768
##$TDoff= 0
##$TI= <>
##$TILT= no
##$TM1= 0
##$TM2= 0
##$TOPLEV= 0
##$USERP1= <user>
##$USERP2= <user>
##$USERP3= <user>
##$USERP4= <user>
##$USERP5= <user>
##$WDW= 1
##$XDIM= 65536
##$YMAX_p= 468798842
##$YMIN_p= -73317873
$$ End of Bruker specific parameters
$$ ---------------------------------
##NTUPLES= NMR SPECTRUM
##VAR_NAME=  FREQUENCY,     SPECTRUM/REAL,   SPECTRUM/IMAG
##SYMBOL=    X,             R,               I
##VAR_TYPE=  INDEPENDENT,   DEPENDENT,       DEPENDENT
##VAR_FORM=  AFFN,          ASDF,            ASDF
##VAR_DIM=   65536,         65536,           65536
##UNITS=     HZ,            ARBITRARY UNITS, ARBITRARY UNITS
##FACTOR=    0.620285442955139, 1,           1
##FIRST=     20137.2065510682, 0,            0
##LAST=      -20513.1999529968, 0,           0
##MIN=       -20513.1999529968, -73317873,   0
##MAX=       20137.2065510682, 468798842,    0
$$ Real data points
##PAGE= N=1
##DATA TABLE= (X++(R..R)), XYDATA
$$ [...]
40718C9545217j522554j480301j497094j572117j647971j642598j488547j156717
40710B7537318o61003n0208O09897J258567J850126K342052K677121K788094K630086
40701D0982050K213438J608682R22469K63664k83637o73598q97170r68743r10873
40692D2256282p47952n11115k46673j7146J12216R8977n2798k87611n16967o50240
40682C9436973o24634m27788j07187K44257N28057O84950P15273O64315N87587
40673D1701803N18351M51049L46637J59953j23329m64633p84086j001453j080870
40664C9723422j051056r87974r70485j037977j177349j342462j483297j561424
40656C0111398j551544j445610j265934j071673r39601r23009j016858j156449
$$ y = [39545217, 38022663, 36542362, 35045268, 33473151, 31825180, 30182582, 28694035, 27537318, 26876315, 26826107, 27436004, 28694571, 30544697, 32886749, 35563870, 38351964, 40982050, 43195488, 44804170, 45726639, 45990303, 45706666, 45033068, 44135898, 43167155, 42256282, 41508330, 40997215, 40750542, 40733396, 40845612, 40944589, 40891791, 40604180, 40087213, 39436973, 38812339, 38384551, 38277364, 38521621, 39049678, 39734628, 40449901, 41114216, 41701803, 42220154, 42671203, 43017840, 43177793, 43054464, 42589831, 41805745, 40804292, 39723422, 38672366, 37684392, 36713907, 35675930, 34498581, 33156119, 31672822, 30111398, 28559854, 27114244, 25848310, 24776637, 23837036, 22914027, 21897169, 20740720]
40648B0740720j250116j220665j029549o78782k03828L31260Q38588J220063J392851
40639B0140542J318816J023250N89469J27199k69508n48946o98146p19307o12132
40630B0351237l78159l8895L54671P34775J043757J253961J367794J403887J383756
40621B7476784J324099J229922J088176Q72266N63276J74798k41308o16677r00061
40612C0971275j078243j171014j206224j193696j116569r46552o72745l24075
40604B3262157L0486L05776M35572L99308K26183k1783k72847m62303n43212m96654
40594B2862683l38276j12201J27205L33132M74006N34094N12875M21673K75048
40585B5090239Q4145j39030l71817n82976p53625r00491j076315j340007j715759
$$ y = [20740720, 19490604, 18269939, 17240390, 16561608, 16357780, 16689040, 17527628, 18747691, 20140542, 21459358, 22482608, 23072077, 23199276, 22929768, 22380822, 21682676, 20963369, 20351237, 19973078, 19934183, 20288854, 21023629, 22067386, 23321347, 24689141, 26093028, 27476784, 28800883, 30030805, 31118981, 31991247, 32554523, 32729321, 32488013, 31871336, 30971275, 29893032, 28722018, 27515794, 26322098, 25205529, 24258977, 23586232, 23262157, 23292643, 23598419, 24033991, 24433299, 24659482, 24637699, 24364852, 23902549, 23359337, 22862683, 22524407, 22412206, 22539411, 22872543, 23346549, 23880643, 24393518, 24815191, 25090239, 25174384, 25035354, 24663537, 24080561, 23326936, 22426445, 21350130, 20010123, 18294364]
40576A8294364k170363k623524k981370l169983l153043k934493k554521k080759
40568c373692j590140j142405p57666m12436n7803L49733Q20384J319100J774206
40559c070719K101402K231873K134320J824977J362530Q28314L00238j65463n37046
40550G010426q01493r61154j032732j039585r95888q95728p19761m55528j14221
40541e664K69403O52625J002945J306095J560318J764347J909259J977063J942077
40532A2378468J774705J452994R81158M00896k17572p98289j276230j599198j726138
40523A1370794j634015j329292q51835k67942L41397Q92870J314477J558617J609381
40514A3004452J482671J222168Q90742N52867K50624j1670k59992n24129q12335
$$ y = [18294364, 16124001, 13500477, 10519107, 7349124, 4196081, 1261588, -1292933, -3373692, -4963832, -6106237, -6863903, -7276339, -7334142, -6984409, -6164025, -4844925, -3070719, -969317, 1262556, 3396876, 5221853, 6584383, 7412697, 7712935, 7547472, 7010426, 6208933, 5247779, 4215047, 3175462, 2179574, 1283846, 564085, 108557, -5664, 263739, 916364, 1919309, 3225404, 4785722, 6550069, 8459328, 10436391, 12378468, 14153173, 15606167, 16587325, 16988221, 16770649, 15972360, 14696130, 13096932, 11370794, 9736779, 8407487, 7555652, 7287710, 7629107, 8521977, 9836454, 11395071, 13004452, 14487123, 15709291, 16600033, 17152900, 17403524, 17391854, 17131862, 16607733, 15795398]
40505A5795398j103912j359265j534687j592436j506040j265244q82019l94848
40497F156947J32649O21601R96034J204158J233817J114881R08436O88312N20215
40488A3577050M42548M55222N24407O04349O64723P05603P49885Q18956R09340
40479A9452083R87178J004510R26073P49726N10357K67580Q2598q246j1335K7281
40469B3987805M6167k572j38785l57866o41484r65131j300922j617609j879664
40460A7129939k048944k093098j998781j781600j486585j179025r26770p76452
40452D838684p34799p71308q43797r24145r99583j053049j050321r51070p30749
40443c220137l90077N1641N63496J099803J595411J974988K178820K191265K052815
$$ y = [15795398, 14691486, 13332221, 11797534, 10205098, 8699058, 7433814, 6551795, 6156947, 6289596, 6911197, 7907231, 9111389, 10345206, 11460087, 12368523, 13056835, 13577050, 14019598, 14474820, 14999227, 15603576, 16268299, 16973902, 17723787, 18542743, 19452083, 20439261, 21443771, 22369844, 23119570, 23629927, 23897507, 23980105, 23971859, 23960524, 23987805, 24033972, 24031400, 23892615, 23534749, 22893265, 21928134, 20627212, 19009603, 17129939, 15080995, 12987897, 10989116, 9207516, 7720931, 6541906, 5615136, 4838684, 4103885, 3332577, 2488780, 1564635, 565052, -487997, -1538318, -2489388, -3220137, -3610214, -3558573, -2995077, -1895274, -299863, 1675125, 3853945, 6045210, 8098025]
40434H098025J844706J650984J517843J434742J348759J201217R62361O46011
40426A8704648L02070m720k19783l18521l13807k49810j87652j88997k99474n33292
40416A6690662q65724j240522j589906j855461k000151k011734j903464j714439
40408C509261j505060j340558j262504j262263j278521j229296j060829p79066
40400f208836m43203j32128Q8326J79413J28130n5532l34911o42606q89150r88660
40390i299157q88822n86634j24949M20107R53311J380509J636901J709931J639183
40381c159620J492869J338229J222304J167443J177558J247400J364712J502136
40373G353031J611913J640798J560996J388556J167351R31063O77281L74124r482
$$ y = [8098025, 9942731, 11593715, 13111558, 14546300, 15895059, 17096276, 18058637, 18704648, 19006718, 19001998, 18782215, 18463694, 18149887, 17900077, 17712425, 17523428, 17223954, 16690662, 15824938, 14584416, 12994510, 11139049, 9138898, 7127164, 5223700, 3509261, 2004201, 663643, -598861, -1861124, -3139645, -4368941, -5429770, -6208836, -6652039, -6784167, -6695841, -6516428, -6388298, -6443830, -6778741, -7421347, -8310497, -9299157, -10187979, -10774613, -10899562, -10479455, -9526144, -8145635, -6508734, -4798803, -3159620, -1666751, -328522, 893782, 2061225, 3238783, 4486183, 5850895, 7353031, 8964944, 10605742, 12166738, 13555294, 14722645, 15653708, 16330989, 16705113, 16695631]
40364A6695631m73356r73732j435483j783631j977074k022117j954858j805717
40356D269663j575913j246744q13575l14104J74127N65304Q02531Q77994Q28577
40347C567860P12067N75569M32296K60929K6980k92381o99472j183913j731339
40338A668596k320840k914468l451235l853914m047429l980065l637332l043893
40330b5580580k256953j356230m31027M36446J186544J788593K237272K544644
40322b1431291K730262K807410K770199K594709K258991J767515J161087N10138
40314d830980r6597n62284p97588p45221m03193J67750Q57763J537153K091169
40305b782028K448845K596148K571018K445238K298451K187944K123706K064048
$$ y = [16695631, 16222275, 15248543, 13813060, 12029429, 10052355, 8030238, 6075380, 4269663, 2693750, 1447006, 633431, 319327, 493454, 1058758, 1861289, 2739283, 3567860, 4279927, 4855496, 5287792, 5548721, 5575701, 5283320, 4583848, 3399935, 1668596, -652244, -3566712, -7017947, -10871861, -14919290, -18899355, -22536687, -25580580, -27837533, -29193763, -29624790, -29188344, -28001800, -26213207, -23975935, -21431291, -18701029, -15893619, -13123420, -10528711, -8269720, -6502205, -5341118, -4830980, -4927577, -5489861, -6287449, -7032670, -7435863, -7268113, -6410350, -4873197, -2782028, -333183, 2262965, 4833983, 7279221, 9577672, 11765616, 13889322, 15953370]
40297A5953370J936562J668477J206044N22621l68978j397543k430470l307291
40289A3782792l897627m145021m068432l728517l190374k508573j736653r43646
40281a0436051k18527L44723O74643P47526N96390K98738m9263l57692n58640
40272h958153o16498n37989l76066k15379j39492j98441l97040p07239j091442
40263a3237739j520666j977711k444561k885104l241878l456470l500344l390115
40255c5654588l174407k903358k602304k263624j859548j370425q14255k56916
40247e0899425K09720N11998O32391O15782N42366M88505N00603N91492P51300
40238d6055268R60786J202571J469668J767081K101750K466227K830302L149185
$$ y = [15953370, 17889932, 19558409, 20764453, 21287074, 20918096, 19520553, 17090083, 13782792, 9885165, 5740144, 1671712, -2056805, -5247179, -7755752, -9492405, -10436051, -10654578, -10309855, -9635212, -8887686, -8291296, -7992558, -8041821, -8399513, -8958153, -9574651, -10112640, -10488706, -10704085, -10843577, -11042018, -11439058, -12146297, -13237739, -14758405, -16736116, -19180677, -22065781, -25307659, -28764129, -32264473, -35654588, -38828995, -41732353, -44334657, -46598281, -48457829, -49828254, -50642509, -50899425, -50689705, -50177707, -49545316, -48929534, -48387168, -47898663, -47398060, -46806568, -46055268, -45094482, -43891911, -42422243, -40655162, -38553412, -36087185, -33256883, -30107698]
40230c0107698L382173L508901L535014L486079L392769L275068L135360K963177
40222c429157K743539K460720K100300J656502J142282N91330M8250m44640q54594
40213F014532j159156j344113j401479j330559j144506q76967n76762k87733k9818
40204b136561J99544M04951N74263O77849O83592N77134L80948J66134M3539J24737
40194A696130M66137J030613J694579K297437K703411K843743K724864K408178
40186A7865092J977852J513562J076799P07827M24568K20300O5966p6742k35278
40177B3539946m10591n74824o83035o94296n94728m11603k07847n6415r221p9285
40167A9818101k42955m54420o62331q25268r25867r78044j018901j085240j188333
$$ y = [-30107698, -26725525, -23216624, -19681610, -16195531, -12802762, -9527694, -6392334, -3429157, -685618, 1775102, 3875402, 5531904, 6674186, 7265516, 7313766, 6869126, 6014532, 4855376, 3511263, 2109784, 779225, -365281, -1242248, -1819010, -2106743, -2136561, -1937017, -1532066, -957803, -279954, 403638, 980772, 1361720, 1527854, 1571393, 1696130, 2162267, 3192880, 4887459, 7184896, 9888307, 12732050, 15456914, 17865092, 19842944, 21356506, 22433305, 23141132, 23565700, 23786000, 23851966, 23775224, 23539946, 23129355, 22554531, 21871496, 21177200, 20582472, 20170869, 19963022, 19906607, 19897386, 19818101, 19575146, 19120726, 18458395, 17633127, 16707260, 15729216, 14710315, 13625075, 12436742]
40158A2436742j304877j391048j409511j351117j239136j116397j024127r83683
40150B616846r90932j027178j077970j140905j211684j262616j241786j102559
40142f438784q39028m94051j34236J82940M25393N85909O78316P35339Q01256
40133d496946R15354J092962J315140J532759J682621J707076J567612J249002
40125F565580P59877J35887n58332j238098j818643k232508k433635k394915k113845
40116e328632j627084j016156l89116J55530N59849Q14979R47745R98322J001261
40107c883302R76095R28457Q58841P71853O78791N93372N28605N00945N35696
40098B489353O60070Q80725J162989J435451J624408J694803J666544J595775
$$ y = [12436742, 11131865, 9740817, 8331306, 6980189, 5741053, 4624656, 3600529, 2616846, 1625914, 598736, -479234, -1620139, -2831823, -4094439, -5336225, -6438784, -7277812, -7771863, -7906099, -7723159, -7297766, -6711857, -6033541, -5298202, -4496946, -3581592, -2488630, -1173490, 359269, 2041890, 3748966, 5316578, 6565580, 7325457, 7461344, 6903012, 5664914, 3846271, 1613763, -819872, -3214787, -5328632, -6955716, -7971872, -8360988, -8205458, -7645609, -6830630, -5882885, -4884563, -3883302, -2907207, -1978750, -1119909, -348056, 330735, 924107, 1452712, 1953657, 2489353, 3149423, 4030148, 5193137, 6628588, 8252996, 9947799, 11614343, 13210118]
40090A3210118J538958J526780J560911J626705J707038J787737J854444J886585
40082B6699276J856060J735708J515903J219306R01661O34390M77989M61804N79249
40073C6081346P94048J047466J264547J367672J301518J056978O74140K20325
40065D3808040k38273o50578r79351j199209j301503j298773j220866j106509
40057C5812978r98115r37907r56865j056324j195447j298598j283313j094898
40049B6991511p29930k38567K91958P61462J078033J173719J017945O28849P5020
40040C1050000n40589j112121j562065j855263j991294j986958j865330j657482
40032A8478898j408485j174758j009437r46195r94909j150610j402055j725085
$$ y = [13210118, 14749076, 16275856, 17836767, 19463472, 21170510, 22958247, 24812691, 26699276, 28555336, 30291044, 31806947, 33026253, 33927914, 34562304, 35040293, 35502097, 36081346, 36875394, 37922860, 39187407, 40555079, 41856597, 42913575, 43587715, 43808040, 43569767, 42919189, 41939838, 40740629, 39439126, 38140353, 36919487, 35812978, 34814863, 33876956, 32920091, 31863767, 30668320, 29369722, 28086409, 26991511, 26261581, 26023014, 26314972, 27076434, 28154467, 29328186, 30346131, 30974980, 31050000, 30509411, 29397290, 27835225, 25979962, 23988668, 22001710, 20136380, 18478898, 17070413, 15895655, 14886218, 13940023, 12945114, 11794504, 10392449, 8667364]
40024H667364k063531k319395k372747k128213j561950p41871J87270J044201
40016a288872J661117J929780J831815J443404R10681M01986N2706p5726m366
40007F862525J89547M15217O00829P03593P05322O07670M31343K15501J5086j04560
39997A0642073q0964J19593M74234Q98562J278645J521553J587240J482864J236845
39988A9160645Q84408M76153R1552j68199k14534j4198L88106Q83224J338880
39979B2826037J643107J727545J568760J182513O22776j9830o33973j120754j428186
39970B6367995j564759j582825j543058j482983j407229j300307j148129r53306
39962A5385399p39309n47542m29942m34454n82876q51588j171766j455469j633826
$$ y = [8667364, 6603833, 4284438, 1911691, -216522, -1778472, -2520343, -2333073, -1288872, 372245, 2302025, 4133840, 5577244, 6487925, 6889911, 6942617, 6866891, 6862525, 7052072, 7467289, 8068118, 8771711, 9477033, 10084703, 10516046, 10731547, 10746633, 10642073, 10561109, 10680702, 11154936, 12053498, 13332143, 14853696, 16440936, 17923800, 19160645, 20045053, 20521206, 20612758, 20444559, 20230025, 20215827, 20603933, 21487157, 22826037, 24469144, 26196689, 27765449, 28947962, 29570738, 29550908, 28916935, 27796181, 26367995, 24803236, 23220411, 21677353, 20194370, 18787141, 17486834, 16338705, 15385399, 14646090, 14098548, 13668606, 13234152, 12651276, 11799688, 10627922, 9172453, 7538627]
39953G538627j682818j621589j489719j323403j145797r71653q15977o97967o38254
39944b848550o51430p36932q73272j022650j147837j231995j285473j332243j385962
39935a2516344j434950j447250j389897j246323j019739p22223l59700P5239N97030
39926a9464157J211292J898952K609003L263884L776682M075146M124233L938556
39918E433591L580230L143372K729932K422555K260816K227594K251334K227117
39910B6276541K053681J674077J099521M01112l24837r92540j540878j926099
39902B6720578k110830k064232j773969j261720n92267J33591Q06527J346272
39894B1203950J726621J971316K126986K235673K323579K403801K479374K538964
$$ y = [7538627, 5855809, 4234220, 2744501, 1421098, 275301, -696352, -1512329, -2210296, -2848550, -3499980, -4236912, -5110184, -6132834, -7280671, -8512666, -9798139, -11130382, -12516344, -13951294, -15398544, -16788441, -18034764, -19054503, -19776726, -20136426, -20061187, -19464157, -18252865, -16353913, -13744910, -10481026, -6704344, -2629198, 1495035, 5433591, 9013821, 12157193, 14887125, 17309680, 19570496, 21798090, 24049424, 26276541, 28330222, 30004299, 31103820, 31504932, 31180095, 30187555, 28646677, 26720578, 24609748, 22545516, 20771547, 19509827, 18917560, 19051151, 19857678, 21203950, 22930571, 24901887, 27028873, 29264546, 31588125, 33991926, 36471300, 39010264]
39886C9010264K551351K471059K258575J903638J434403R05676L75088j17606
39878E0792448n58252r51456j303942j608583j841574j977076k007869j953247
39870C8590449j846193j710538j546310j332520j042720o62411k00377L08290
39862C0557670Q07104J230536J522493J655162J638558J513746J332565J136380
39854D1394214R46445P69522O11361M86188M14326M09570M65756N52070O19185
39845D6668637O10995M77035J85481k63436q30217j443649k021393k489306k786970
39836C8107177k863277k676837k208703j479579n58957M40536J384938K154846
39828C2300144K683829K977263L095618L111379L068508K967585K778719K470156
$$ y = [39010264, 41561615, 44032674, 46291249, 48194887, 49629290, 50534966, 50910054, 50792448, 50234196, 49282740, 47978798, 46370215, 44528641, 42551565, 40543696, 38590449, 36744256, 35033718, 33487408, 32154888, 31112168, 30449757, 30249380, 30557670, 31364774, 32595310, 34117803, 35772965, 37411523, 38925269, 40257834, 41394214, 42340659, 43110181, 43721542, 44207730, 44622056, 45031626, 45497382, 46049452, 46668637, 47279632, 47756667, 47942148, 47678712, 46848495, 45404846, 43383453, 40894147, 38107177, 35243900, 32567063, 30358360, 28878781, 28319824, 28760360, 30145298, 32300144, 34983973, 37961236, 41056854, 44168233, 47236741, 50204326, 52983045, 55453201]
39820E5453201K037597J518749R81809M92653Q3985k50887n38633p99230j030015
39811E7949229j206073j293237j266623j126167r02533o52524m47223l55001m21320
39802E0278528o52021j009314j423624j815120k115882k285842k317451k226658
39794C6432616k035646j760031j409723r99474n55914j11700L10187P08781J101477
39785C1680573J503231J902380K252269K487786K558193K456579K228278J952309
39777D9021598J704885J525885J408730J317588J214448J072875Q72300N88300
39769E8726609J97858l00155q68436j437738j936262k323153k604900k826460
39761D6627363l044028l294911l579292l860562m079828m174253m091984l803132
$$ y = [55453201, 57490798, 59009547, 59991356, 60484009, 60567994, 60317107, 59778474, 58979244, 57949229, 56743156, 55449919, 54183296, 53057129, 52154596, 51502072, 51054849, 50699848, 50278528, 49626507, 48617193, 47193569, 45378449, 43262567, 40976725, 38659274, 36432616, 34396970, 32636939, 31227216, 30227742, 29671828, 29560128, 29870315, 30579096, 31680573, 33183804, 35086184, 37338453, 39826239, 42384432, 44841011, 47069289, 49021598, 50726483, 52252368, 53661098, 54978686, 56193134, 57266009, 58138309, 58726609, 58924467, 58624312, 57755876, 56318138, 54381876, 52058723, 49453823, 46627363, 43583335, 40288424, 36709132, 32848570, 28768742, 24594489, 20502505, 16699373]
39753A6699373l306493k627596j805665q77603J26823J172062K194990L092434
39745A4668325L732997L994937L814187L215316K305928J239669J73049p62918
39737C2381490j475370j917163k092586k053890j882698j660859j442117j235289
39729A8621518j005651o95783k58515L13874R79400J658382K257582K693729K910755
39720B7475291K890872K658254K273192J819809J393964J091204R85818J099458
39712D1687862J377358J697431J916993J932498J717938J323595Q41720L62837
39704E2858232n1300l66316n57146n98813m79885k25623R5355L92638N89893O49864
39694E2306899N75400L94376J46489j19408l45884m78601m87772l82035k00877
$$ y = [16699373, 13392880, 10765284, 8959619, 8082016, 8208839, 9380901, 11575891, 14668325, 18401322, 22396259, 26210446, 29425762, 31731690, 32971359, 33144408, 32381490, 30906120, 28988957, 26896371, 24842481, 22959783, 21298924, 19856807, 18621518, 17615867, 16920084, 16661569, 16975443, 17954843, 19613225, 21870807, 24564536, 27475291, 30366163, 33024417, 35297609, 37117418, 38511382, 39602586, 40588404, 41687862, 43065220, 44762651, 46679644, 48612142, 50330080, 51653675, 52495395, 52858232, 52806932, 52440616, 51883470, 51284657, 50804772, 50579149, 50674504, 51067142, 51657035, 52306899, 52882299, 53276675, 53423164, 53303756, 52957872, 52479271, 51991499, 51609464, 51408587]
39685E1408587P742K04601L60531M50212M54510L75483K50341J44941J21540J99350
39675E3977838L37613M57038M86121M00348K29512L3158j34887k48955l10371
39666E5227415l29219l04335k14247k4146K93646P35416J253074J764294K182749
39657F0584647K450239K551190K503666K337300K075824J736838J346622R52690
39649G6539016O16575L87768K79088K61860K79454K64709J52977j05761n31604
39640G8144082j100603j741285k348331k811242l046529l018004k737078k249016
39632E9091994j617873r16445k17744M16110R44606J351854J638110J804528J842464
39623F4337604J736757J481163J093095O15435J05297l80751p96652j110223j302633
$$ y = [51408587, 51416329, 51620930, 51981461, 52431673, 52886183, 53261666, 53512007, 53656948, 53778488, 53977838, 54315451, 54772489, 55258610, 55658958, 55888470, 55921628, 55786741, 55537786, 55227415, 54898196, 54593861, 54379614, 54355468, 54649114, 55384530, 56637604, 58401898, 60584647, 63034886, 65586076, 68089742, 70427042, 72502866, 74239704, 75586326, 76539016, 77155591, 77543359, 77822447, 78084307, 78363761, 78628470, 78781447, 78675686, 78144082, 77043479, 75302194, 72953863, 70142621, 67096092, 64078088, 61341010, 59091994, 57474121, 56557676, 56339932, 56756042, 57700648, 59052502, 60690612, 62495140, 64337604, 66074361, 67555524, 68648619, 69264054, 69369351, 68988600, 68191948, 67081725, 65779092]
39614F5779092j367953j315601j173724r87089q06082o71806o04683n98983o23924
39605E7629247o35120n95868m94275l39852j43375R6738L86059P14831J049947
39596E7668332J346267J567475J702918J771912J811738J852285J890992J885894
39588G1497813J774517J508875J085253N49527k6379n80360j080713j516082j867124
39579G1345327k088363k117420j904096j439584p72318p035P14145J249548J506117
39570F6486321J474624J227616Q78569N30685K49703O8852M985O4470K39981N12032
39560G1737838Q58250J259937J700286K161313K625801L078666L499075L846899
39552I0768065M058345M060501L799052L263637K498528J595979O76516j38200
$$ y = [65779092, 64411139, 63095538, 61921814, 60934725, 60128643, 59456837, 58852154, 58253171, 57629247, 56994127, 56398259, 55903984, 55564132, 55420757, 55517495, 55903554, 56618385, 57668332, 59014599, 60582074, 62284992, 64056904, 65868642, 67720927, 69611919, 71497813, 73272330, 74781205, 75866458, 76415985, 76389606, 75809246, 74728533, 73212451, 71345327, 69256964, 67139544, 65235448, 63795864, 63023546, 63016511, 63730656, 64980204, 66486321, 67960945, 69188561, 70067130, 70597815, 70847518, 70916370, 70921355, 70985825, 71225806, 71737838, 72596088, 73856025, 75556311, 77717624, 80343425, 83422091, 86921166, 90768065, 94826410, 98886911, 102685963, 105949600, 108448128, 110044107, 110720623, 110582423]
39544A10582423p53960j125559j260500j200186r88561o50246j95428L52189R28839
39535A05689011J431587J753019J830260J677102J378522J050910P91167O41720
39527A16243298N86332N73203N48182M78529L57258J92094p613k35113m81014
39518A18255156p27163r47136j111728j192006j157853r79623o39783j48254M53205
39509A11804815J102855J735953K293444K722525K979324L038616K904995K618257
39501A31200784K250175J891996J632441J530858J596402J784125K012583K199048
39493A46098412K298361K322897K327244K366917K464009K604922K762550K915513
39485A66160825L050285L154544L212948L205435L106319K888737K535982K049951
$$ y = [110582423, 109828463, 108702904, 107442404, 106242218, 105253657, 104603411, 104407983, 104760172, 105689011, 107120598, 108873617, 110703877, 112380979, 113759501, 114810411, 115601578, 116243298, 116829630, 117402833, 117951015, 118429544, 118786802, 118978896, 118971283, 118736170, 118255156, 117527993, 116580857, 115469129, 114277123, 113119270, 112139647, 111499864, 111351610, 111804815, 112907670, 114643623, 116937067, 119659592, 122638916, 125677532, 128582527, 131200784, 133450959, 135342955, 136975396, 138506254, 140102656, 141886781, 143899364, 146098412, 148396773, 150719670, 153046914, 155413831, 157877840, 160482762, 163245312, 166160825, 169211110, 172365654, 175578602, 178784037, 181890356, 184779093, 187315075, 189365026]
39477A89365026J447801P52929o956p94371j561045k256982k842408l294796l610900
39468A77198298l804370l895556l895320l796119l581919l250048k824821k351250
39460A49798895j876978j439211j064387p74866n92574n34983o06069p88039j039001
39451A41082787j300455j515068j647623j695625j681757j636279j586201j557382
39443A28462397j579078j678887j869004k133067k419997k647737k720829k561553
39435A10852245k141459j494744p07005J10262Q46278J413683J765852J903050
39427A12548162J861610J689861J424733J082948O69467J92931l25745q55918
39419A18288049j363362j812231k165388k389906k466331k393808k189996j892399
$$ y = [189365026, 190812827, 191565756, 191558800, 190764429, 189203384, 186946402, 184103994, 180809198, 177198298, 173393928, 169498372, 165603052, 161806933, 158225014, 154974966, 152150145, 149798895, 147921917, 146482706, 145418319, 144643453, 144050879, 143515896, 142909827, 142121788, 141082787, 139782332, 138267264, 136619641, 134924016, 133242259, 131605980, 130019779, 128462397, 126883319, 125204432, 123335428, 121202361, 118782364, 116134627, 113413798, 110852245, 108710786, 107216042, 106509037, 106619299, 107465577, 108879260, 110645112, 112548162, 114409772, 116099633, 117524366, 118607314, 119276781, 119469712, 119143967, 118288049, 116924687, 115112456, 112947068, 110557162, 108090831, 105697023, 103507027, 101614628]
39411A01614628j560605j266792j067886r75356r49057r23719q49504p19502n71183
39402I2731024m67780m73422o31993r53073j406192j926383k433106k856857l160161
39393G8422057l341889l425406l441144l414685l363340l295542l205797l066816
39385E1867438k831940k458945j945888j350921p74882l15291k3209J11338J43581
39376D2421281J44884J77843K82366M69885P22775J001342J260449J468130J613001
39367D9561956J698045J733405J738179J743024J779791J861961J975334K087777
39359F4179472K164657K173821K082777J863218J508172J049034N55277J11456
39351G5687884k17442m12925n06664n59507o28531p39507q76759r92777j031014
$$ y = [101614628, 100054023, 98787231, 97719345, 96743989, 95794932, 94871213, 94021709, 93302207, 92731024, 92263244, 91789822, 91157829, 90204756, 88798564, 86872181, 84439075, 81582218, 78422057, 75080168, 71654762, 68213618, 64798933, 61435593, 58140051, 54934254, 51867438, 49035498, 46576553, 44630665, 43279744, 42504862, 42189571, 42166362, 42277700, 42421281, 42566165, 42744008, 43026374, 43496259, 44219034, 45220376, 46480825, 47948955, 49561956, 51260001, 52993406, 54731585, 56474609, 58254400, 60116361, 62091695, 64179472, 66344129, 68517950, 70600727, 72463945, 73972117, 75021151, 75576428, 75687884, 75470442, 75057517, 74550853, 73991346, 73362815, 72623308, 71746549, 70753772, 69722758]
39342F9722758r48905p29512l80770O8041N65393J037814J402906J595252J589581
39333G3922558J404492J084940O77524K14742k85398q09289j335836j828355k232101
39324G0813277k479074k502853k262373j765105j075120k97976M50698J075060
39316F1956534J512553J730888J721034J497186J101105N98323O0414m55167r09512
39307F8813358j268042j486759j520784j354362j027071o30923k76274m7410K6832
39298F1228565k6311j48967k87504m14818n28537o34329p35039q34380r43002
39289E6675678j070979j209105j318176j340529j227950r66246n80472j20888
39281D8841333L56015P96056J144384J345248J356861J174276Q39066M23312k535
$$ y = [69722758, 68773853, 68044341, 67663571, 67731612, 68297005, 69334819, 70737725, 72332977, 73922558, 75327050, 76411990, 77089514, 77304256, 77018858, 76209569, 74873733, 73045378, 70813277, 68334203, 65831350, 63568977, 61803872, 60728752, 60430776, 60881474, 61956534, 63469087, 65199975, 66921009, 68418195, 69519300, 70117623, 70178037, 69722870, 68813358, 67545316, 66058557, 64537773, 63183411, 62156340, 61525417, 61249143, 61201733, 61228565, 61202254, 61053287, 60765783, 60350965, 59822428, 59188099, 58453060, 57618680, 56675678, 55604699, 54395594, 53077418, 51736889, 50508939, 49542693, 48962221, 48841333, 49197348, 49993404, 51137788, 52483036, 53839897, 55014173, 55853239, 56276551, 56274016]
39272E6274016l96521p52290j085717j409788j711019j941690k035287j938177
39264D5003527j638473j174510o18875m9182M77132R32392J312989J627473J886856
39255D7759329K099074K265901K382998K445463K456480K430221K381887K309060
39247F6530413K178392J930070J501537Q61232L7737q71473j722621k375352k745691
39238F5324244k831794k699382k440857k134846j824167j514959j191110q35328
39230D9851801m46780m7776L20746O09919P76431P97461O82417M73447K31844
39221E3249510J7288j28417j86574j57779n7236Q3735K12337K57640J52351j34945
39211E3307910n78704j100984j596946j967237k147273k126685j949675j692044
$$ y = [56274016, 55877495, 55125205, 54039488, 52629700, 50918681, 48976991, 46941704, 45003527, 43365054, 42190544, 41571669, 41522487, 41999619, 42932011, 44245000, 45872473, 47759329, 49858403, 52124304, 54507302, 56952765, 59409245, 61839466, 64221353, 66530413, 68708805, 70638875, 72140412, 73001644, 73039381, 72167908, 70445287, 68069935, 65324244, 62492450, 59793068, 57352211, 55217365, 53393198, 51878239, 50687129, 49851801, 49405021, 49357245, 49677991, 50287910, 51064341, 51861802, 52544219, 53017666, 53249510, 53266798, 53138381, 52951807, 52794028, 52736792, 52820527, 53032864, 53290504, 53442855, 53307910, 52729206, 51628222, 50031276, 48064039, 45916766, 43790081, 41840406, 40148362]
39203D0148362j426830j200812j033617r30978q95035r22899r97859j084291j134913
39194C0521128j109416r92968q01232n69089l32649j15833P4687K48004M22359
39185B7344991O14594Q29883J056952J269927J434425J516811J497126J382260
39177C6946969J210553J041305R32468R17598R92129J113711J217768J245605
39169D5618106J173738J026378Q60892P36301O87489P18027Q05204R06627R69569
39160E3502331R50383Q39165O71010N10813M19418M22192M96648N82981O11542
39151E9006483N35576L54190J13457j15687k71316l29156l12744k81983l07412
39142E8391408m42586p04183j063494j450800j774361j950543j932023j718531
$$ y = [40148362, 38721532, 37520720, 36487103, 35556125, 34661090, 33738191, 32740332, 31656041, 30521128, 29411712, 28418744, 27617512, 27048423, 26715774, 26599941, 26674628, 26922632, 27344991, 27959585, 28789468, 29846420, 31116347, 32550772, 34067583, 35564709, 36946969, 38157522, 39198827, 40131295, 41048893, 42041022, 43154733, 44372501, 45618106, 46791844, 47818222, 48679114, 49415415, 50102904, 50820931, 51626135, 52532762, 53502331, 54452714, 55291879, 55962889, 56473702, 56893120, 57315312, 57811960, 58394941, 59006483, 59542059, 59896249, 60009706, 59894019, 59622703, 59293547, 58980803, 58698820, 58391408, 57948822, 57244639, 56181145, 54730345, 52955984, 51005441, 49073418, 47354887]
39134D7354887j347012q73168l58678J32869N38177Q01773Q89963Q05611N93049
39125D8537471L23490O3984j50666l22743m72681o16785p59765r00176j034879
39116D4667250j157541j258950j334719j393420j454945j539779j659495j814723
39108C3053678j996425k185021k350020k456104k473636k383445k171584j823391
39100A5214052j329685p04237L374P14325J345531J837596K168939K349801K403649
39091B4003345K351565K210795K004203J766175J534057J329139J142029R35281
39083C7276589O64876L09718j09306n35326r04271j175556j342893j422821j437459
39074C1323551j406124j343983j257626j136969r55746o89734l43615L6386L78653
$$ y = [47354887, 46007875, 45134707, 44776029, 44908898, 45447075, 46248848, 47138811, 47944422, 48537471, 48860961, 48924945, 48774279, 48451536, 47978855, 47362070, 46602305, 45702129, 44667250, 43509709, 42250759, 40916040, 39522620, 38067675, 36527896, 34868401, 33053678, 31057253, 28872232, 26522212, 24066108, 21592472, 19209027, 17037443, 15214052, 13884367, 13180130, 13183504, 13897829, 15243360, 17080956, 19249895, 21599696, 24003345, 26354910, 28565705, 30569908, 32336083, 33870140, 35199279, 36341308, 37276589, 37941465, 38251183, 38141877, 37606551, 36702280, 35526724, 34183831, 32761010, 31323551, 29917427, 28573444, 27315818, 26178849, 25223103, 24533369, 24189754, 24226140, 24604793]
39065B4604793O21371P41123P57725P18942O78381O74373P13816P69972Q01693
39056C1082189P84107P26058O60572O21250O27807O87941Q03755R70799J170892
39047C8135370J367553J510669J551527J463556J258573R87274P20878N23035
39039D7518435M26546M24622M77239N27035N18526M16634K21753k4638k51950
39030E0254202l91966m15860l52467k72203k45994l07711m44776o17932p89016
39021D6416277r34710j043341j109373j136969j146101j167072j223458j320284
39013C7334969j449474j602764j772214j934598k038522k014408j805894j400219
39005B3316876q35170j79833M92395J116077J626685J953556K035363J855992
$$ y = [24604793, 25226164, 25967287, 26725012, 27443954, 28122335, 28796708, 29510524, 30280496, 31082189, 31866296, 32592354, 33252926, 33874176, 34501983, 35189924, 35993679, 36964478, 38135370, 39502923, 41013592, 42565119, 44028675, 45287248, 46274522, 46995400, 47518435, 47944981, 48369603, 48846842, 49373877, 49892403, 50309037, 50530790, 50506152, 50254202, 49862236, 49446376, 49093909, 48821706, 48575712, 48268001, 47823225, 47205293, 46416277, 45481567, 44438226, 43328853, 42191884, 41045783, 39878711, 38655253, 37334969, 35885495, 34282731, 32510517, 30575919, 28537397, 26522989, 24717095, 23316876, 22481706, 22301873, 22794268, 23910345, 25537030, 27490586, 29525949, 31381941]
38997C1381941J470823R95660N61897K68069J54267K04537L68539N91613Q40296
38988C6837642J109152J405500J727126K053122K352144K596010K767037K858573
38980E3706306K872282K813015K683331K484239K225290J935562J661847J450384
38972G1832256J323684J268625J242629J191830J070069Q51823N38195J56204
38964G9475315k50393o37512r75264j249220j447512j547413j517135j334302
38956G0516564j005379n67278o7792M58156R93871J522588K004080K369998K542940
38947G8767748K464317K115405J528034P85859J1624o63519j139892j378703j405847
38938H1085026j290480j112232r34198p92440p01512o66863o94476p92914r67075
$$ y = [31381941, 32852764, 33848424, 34410321, 34678390, 34832657, 35037194, 35405733, 35997346, 36837642, 37946794, 39352294, 41079420, 43132542, 45484686, 48080696, 50847733, 53706306, 56578588, 59391603, 62074934, 64559173, 66784463, 68720025, 70381872, 71832256, 73155940, 74424565, 75667194, 76859024, 77929093, 78780916, 79319111, 79475315, 79224922, 78587410, 77612146, 76362926, 74915414, 73368001, 71850866, 70516564, 69511185, 68943907, 68876115, 69334271, 70328142, 71850730, 73854810, 76224808, 78767748, 81232065, 83347470, 84875504, 85661363, 85672987, 85009468, 83869576, 82490873, 81085026, 79794546, 78682314, 77748116, 76955676, 76254164, 75587301, 74892825, 74099911, 73132836]
38929G3132836j206661j477975j729993j915541k012980k031223j996461j934566
38921E8827436j861642j782712j691998j571908j392840j116866p07996j50591
38913D8550883N28239J245654J875841K291951K418195K259992J892291J416040
38905F2479086R13222M24562m7972n24784j027338j557710k087556k564718k934561
38896E3072231l160963l232076l148491k906189k493317j911199j207561m91401
38888C4521034R2481M18319M27724J44258l45675r29068j504371k008855k422762
38879B8393085k747157k972561l066174k990438k737209k347334j898523j471779
38871H161910j122988q76971p37756o96205p26934p84835q14422p70293o33669
$$ y = [73132836, 71926175, 70448200, 68718207, 66802666, 64789686, 62758463, 60762002, 58827436, 56965794, 55183082, 53491084, 51919176, 50526336, 49409470, 48701474, 48550883, 49079122, 50324776, 52200617, 54492568, 56910763, 59170755, 61063046, 62479086, 63392308, 63816870, 63768898, 63244114, 62216776, 60659066, 58571510, 56006792, 53072231, 49911268, 46679192, 43530701, 40624512, 38131195, 36219996, 35012435, 34521034, 34613515, 35031834, 35459558, 35603816, 35258141, 34329073, 32824702, 30815847, 28393085, 25645928, 22673367, 19607193, 16616755, 13879546, 11532212, 9633689, 8161910, 7038922, 6161951, 5424195, 4727990, 4001056, 3216221, 2401799, 1631506, 997837]
38862I97837m13355j33224J82086N14471Q52601J190168J523736J847034K141531
38853H702885K371456K491600K464860K277975J949329J530798J102775P55631
38845B3647309N60065N44629O96561R79537J348065J750428K130789K440044K649273
38836C6746700K752920K758177K668956K475674K157511J696660J096693L94936
38828E2748227l36336r99637j492390j736920j711761j466414j106286p53804
38820D3144679n06584m10578m52997n71657o76710o79791n21780j89336K84081
38811C9419327Q29292J358061J781052K025208K047333J837969J412744P98657
38803E1509643L0103q38304j713764k464203k945155l043809k718396k016853
$$ y = [997837, 584482, 451258, 633344, 1147815, 2000416, 3190584, 4714320, 6561354, 8702885, 11074341, 13565941, 16030801, 18308776, 20258105, 21788903, 22891678, 23647309, 24207374, 24752003, 25448564, 26428101, 27776166, 29526594, 31657383, 34097427, 36746700, 39499620, 42257797, 44926753, 47402427, 49559938, 51256598, 52353291, 52748227, 52411891, 51412254, 49919864, 48182944, 46471183, 45004769, 43898483, 43144679, 42638095, 42227517, 41774520, 41202863, 40526153, 39846362, 39324582, 39135246, 39419327, 40248619, 41606680, 43387732, 45412940, 47460273, 49298242, 50710986, 51509643, 51539746, 50701442, 48987678, 46523475, 43578320, 40534511, 37816115, 35799262]
38795C5799262j069670n7893Q36428J480445J820177J880204J742135J517021
38787D3948109J318343J234964J307589J518643J802068K069062K238942K263429
38779E7701149K134782J874959J515725J087473O25802J84925j62304l46025l30781
38770F4285705j35842J69101M91332P50998R05770R51225R00049P58089N16184
38761F9592611J62894k93593q12617j327050j762916k057892k167475k060403
38753E9273559j714550j122816l08166O62945J680795K611512L330390L756667
38745F8170336L873718L722863L372324K879725K273293J563092P68316o6027
38737H6557640q76802j604047k204814k650315k915407k975896k820244k467430
$$ y = [35799262, 34729592, 34671699, 35508127, 36988572, 38808749, 40688953, 42431088, 43948109, 45266452, 46501416, 47809005, 49327648, 51129716, 53198778, 55437720, 57701149, 59835931, 61710890, 63226615, 64314088, 64939890, 65124815, 64962511, 64616486, 64285705, 64149863, 64318964, 64810296, 65561294, 66467064, 67418289, 68318338, 69076427, 69592611, 69755505, 69461912, 68649295, 67322245, 65559329, 63501437, 61333962, 59273559, 57559009, 56436193, 56128027, 56790972, 58471767, 61083279, 64413669, 68170336, 72044054, 75766917, 79139241, 82018966, 84292259, 85855351, 86623667, 86557640, 85680838, 84076791, 81871977, 79221662, 76306255, 73330359, 70510115, 68042685]
38729F8042685j974748j424730q95869m34624m5274K97302O19060R16793J144005
38720F6244600J224941J092487P26469J66796n04600j196375j833337k364879
38712F3556102k759274k993064l045566k904005k574807k088752j492982q36898
38704D4860754j64672M83931J075298J593136K048939K474955K898437L316872
38696E8587650L695248L985396M148289M162499M019927L721151L277564K716034
38688H8313758K077728J408624P47204J17152m71647j016778j515716j957974
38680H7702351k318150k556263k631953k527381k261533j883327j449150j001954
38672G1072640n63667j41414K58800O21268R24595J162413J363900J590639J906087
$$ y = [68042685, 66067937, 64643207, 63747338, 63312714, 63267440, 63564742, 64183802, 65100595, 66244600, 67469541, 68562028, 69288497, 69455293, 68950693, 67754318, 65920981, 63556102, 60796828, 57803764, 54758198, 51854193, 49279386, 47190634, 45697652, 44860754, 44696082, 45180013, 46255311, 47848447, 49897386, 52372341, 55270778, 58587650, 62282898, 66268294, 70416583, 74579082, 78599009, 82320160, 85597724, 88313758, 90391486, 91800110, 92547314, 92664466, 92192819, 91176041, 89660325, 87702351, 85384201, 82827938, 80195985, 77668604, 75407071, 73523744, 72074594, 71072640, 70508973, 70367559, 70626359, 71247627, 72172222, 73334635, 74698535, 76289174, 78195261]
38663G8195261K339715K870750L437152L958774M362950M605111M678213M608697
38655A09056623M444770M245497M071388L971711L969978M057209M199126M351407
38647A42367709M472189M527210M490441M344062M078665L693770L199259K617902
38639A73791207J986760J353501P64653K48115k00790o18359j053249j539180
38631A74732658k076521k632488l155366l591908l901427m066123m095660m021378
38623A47191787l881265l705942l515158l322103l135735k958203k783400k600016
38615A21289965k395172k157548j886806j610873j395499j326728j468812j824814
38607A07223713k325589k849223l255088l418433l259233k760102j967913r80604
$$ y = [78195261, 80534976, 83405726, 86842878, 90801652, 95164602, 99769713, 104447926, 109056623, 113501393, 117746890, 121818278, 125789989, 129759967, 133817176, 138016302, 142367709, 146839898, 151367108, 155857549, 160201611, 164280276, 167974046, 171173305, 173791207, 175777967, 177131468, 177896121, 178144236, 177943446, 177325087, 176271838, 174732658, 172656137, 170023649, 166868283, 163276375, 159374948, 155308825, 151213165, 147191787, 143310522, 139604580, 136089422, 132767319, 129631584, 126673381, 123889981, 121289965, 118894793, 116737245, 114850439, 113239566, 111844067, 110517339, 109048527, 107223713, 104898124, 102048901, 98793813, 95375380, 92116147, 89356045, 87388132, 86407528]
38599H6407528P2129J048756J819724K297306K461186K362537K099195J774026
38591A00342387J459280J184555R49207P43064N54767L62305J24497k03058o30104
38582A04886900j105187j530162j807764j885125j766618j501064j163377q40415
38574I3287188o16748n55575o78242r52833j302767j637349j889394k036054k091623
38565H1526603k085441k046420j999826j965300j948989j938440j911656j857200
38557F5773331j788136j735800j726245j757035j791815j775840j660251j419608
38549E2118601j055896n91690n8694N11964J092133J650687K145209K519195K707967
38540F1039476K652144K317825J718651R26157N4489p77535j485809k041772k470279
$$ y = [86407528, 86479657, 87528413, 89348137, 91645443, 94106629, 96469166, 98568361, 100342387, 101801667, 102986222, 103935429, 104678493, 105233260, 105595565, 105720062, 105517004, 104886900, 103781713, 102251551, 100443787, 98558662, 96792044, 95290980, 94127603, 93287188, 92670440, 92114865, 91436623, 90483790, 89181023, 87543674, 85654280, 83618226, 81526603, 79441162, 77394742, 75394916, 73429616, 71480627, 69542187, 67630531, 65773331, 63985195, 62249395, 60523150, 58766115, 56974300, 55198460, 53538209, 52118601, 51062705, 50471015, 50412321, 50924285, 52016418, 53667105, 55812314, 58331509, 61039476, 63691620, 66009445, 67728096, 68654253, 68708742, 67931207, 66445398, 64403626, 61933347]
38531F1933347k829758l179592l544193l892981m152673m245888m130205l815134
38523C2142923l353501k817336k270377j748075j253600p70339k80713K21388
38515A9870370P29645J232334J720156K187526K623071K994945L246587L314974
38507C7919608L163529K805246K298305J720331J142713O18994J84762j39854
38499D9713634l48442m46638m52665m02690l55499l83496n44526q47861j238729
38490D4693088j615662j872941j945784j837084j614832j380934j223347j173212
38482C2029292j189921j183828j064471p87114l72990J04222N54008R05185J125514
38473C0119897J220858J221312J162885J068367R31215P13498L68904j15965o90584
$$ y = [61933347, 59103589, 55923997, 52379804, 48486823, 44334150, 40088262, 35958057, 32142923, 28789422, 25972086, 23701709, 21953634, 20700034, 19929695, 19648982, 19870370, 20600015, 21832349, 23552505, 25740031, 28363102, 31358047, 34604634, 37919608, 41083137, 43888383, 46186688, 47907019, 49049732, 49668726, 49853488, 49713634, 49365192, 48918554, 48465889, 48063199, 47707700, 47324204, 46779678, 45931817, 44693088, 43077426, 41204485, 39258701, 37421617, 35806785, 34425851, 33202504, 32029292, 30839371, 29655543, 28591072, 27803958, 27430968, 27535190, 28089198, 28994383, 30119897, 31340755, 32562067, 33724952, 34793319, 35724534, 36438032, 36806936, 36690971, 36000387]
38464C6000387j247529j666970j869012j842449j639939j349617j058191q18468
38456B4508212o33682m66530k68072q868L05410O39697R49377J201604J386891
38447B7614039J515897J604975J660265J669585J605060J434578J138568P26608
38439C8969575K45479k28504o11580q39023q84786p68773n51052l13019j27264
38430C4891053k5330J9219P6767K18655M69679P87974J085899J275979J311162
38421D0111057J199576R94007P66227N75609M42958L44317K32457P3701j26178
38412D4613731l24372m65550n07679m33034k43150N2219M40567R02136J402089
38403D5436957J890432K313204K626224K800583K819619K676603K379079J955214
$$ y = [36000387, 34752858, 33085888, 31216876, 29374427, 27734488, 26384871, 25326680, 24508212, 23874530, 23408000, 23139928, 23131060, 23436470, 24076167, 25025544, 26227148, 27614039, 29129936, 30734911, 32395176, 34064761, 35669821, 37104399, 38242967, 38969575, 39215054, 38986550, 38374970, 37535947, 36651161, 35882388, 35331336, 35018317, 34891053, 34865723, 34884942, 34961709, 35180364, 35650043, 36438017, 37523916, 38799895, 40111057, 41310633, 42304640, 43070867, 43646476, 44089434, 44433751, 44666208, 44739909, 44613731, 44289359, 43823809, 43316130, 42883096, 42639946, 42692165, 43132732, 44034868, 45436957, 47327389, 49640593, 52266817, 55067400, 57887019, 60563622, 62942701, 64897915]
38395F4897915J453639R34777M60167Q6759j33787j57856L9357M48017J013907
38386F9042895J644235K228637K667263K896511K904490K729540K440761K110205
38378H8664537J791706J513631J280611J077344Q74318O38286L44353j7183m40867
38369I5726736r07873j384732j820799k150430k305603k238812j946072j472280
38361H1500135q88778k55248M05557J100813J836332K587378L292744L874853
38353I3453786M273988M478931M537120M535673M560017M650915M783873M884600
38345A30158903M875241M726269M479895M225465M042285L953461L926838L919289
38337A64307646L924974L988594M176693M532664N048980N673208O339317P001263
$$ y = [64897915, 66351554, 67286331, 67746498, 67833257, 67699470, 67541614, 67580971, 68028988, 69042895, 70687130, 72915767, 75583030, 78479541, 81384031, 84113571, 86554332, 88664537, 90456243, 91969874, 93250485, 94327829, 95202147, 95840433, 96184786, 96167603, 95726736, 94818863, 93434131, 91613332, 89462902, 87157299, 84918487, 82972415, 81500135, 80611357, 80356109, 80761666, 81862479, 83698811, 86286189, 89578933, 93453786, 97727774, 102206705, 106743825, 111279498, 115839515, 120490430, 125274303, 130158903, 135034144, 139760413, 144240308, 148465773, 152508058, 156461519, 160388357, 164307646, 168232620, 172221214, 176397907, 180930571, 185979551, 191652759, 197992076, 204993339]
38329B04993339P648888Q301032Q984527R712763J0475184J1243174J1988756
38322B73347663J2702932J3398651J4094588J4790793J5451201J5999019J6320911
38315C76105758J6274609J5699557J4434860J2349585R385563N601131J193705
38308D51044768l517501q147736j2321415j5740292j8228223j9744536k0365331
38301C52979734k0242262j9557317j8488869j7190984j5780509j4332214j2887916
38294B34499663j1477587j0136615q903481p800461o817343n916047n054050m208033
38286A74186046l381017k592385j862733j204305o18826r9515L64894P85348J169376
38277A66746883J521241J842803K131819K379904K576809K723074K843936K994121
$$ y = [204993339, 212642227, 220943259, 229927786, 239640549, 250115733, 261358907, 273347663, 286050595, 299449246, 313543834, 328334627, 343785828, 359784847, 376105758, 392380367, 408079924, 422514784, 434864369, 444249932, 449851063, 451044768, 447527267, 439379531, 427058116, 411317824, 393089601, 373345065, 352979734, 332737472, 313180155, 294691286, 277500302, 261719793, 247387579, 234499663, 223022076, 212885461, 203981980, 196181519, 189364176, 183448129, 178394079, 174186046, 170805029, 168212644, 166349911, 165145606, 164526780, 164427265, 164792159, 165577507, 166746883, 168268124, 170110927, 172242746, 174622650, 177199459, 179922533, 182766469, 185760590]
38269A85760590L248947L684988M357811N284963O441444P770388R203531J0679231
38261B36431893J2147526J3562612J4874540J6032688J7000916J7769276J8345578
38254C46165029J8724939J8853907J8611773J7822669J6296942J3888286J0547725
38247D60911270O356908J530664l612103q702625j3388852j7395610k0559029
38240D05140623k2826881k4233735k4868863k4848578k4293914k3312723k1990458
38233B38765471k0394757j8590579j6654388j4677058j2754079j0969574r382194
38226A35342842q017979o871397n913182n102348m399588l779348l237367k789374
38218I5232259k458650k256749k169110k157019k176147k198450k221446k259557
$$ y = [185760590, 189009537, 192694525, 197052336, 202337299, 208778743, 216549131, 225752662, 236431893, 248579419, 262142031, 277016571, 293049259, 310050175, 327819451, 346165029, 364889968, 383743875, 402355648, 420178317, 436475259, 450363545, 460911270, 467268178, 468798842, 465186739, 456484114, 443095262, 425699652, 405140623, 382313742, 358080007, 333211144, 308362566, 284068652, 260755929, 238765471, 218370714, 199780135, 183125747, 168448689, 155694610, 144725036, 135342842, 127324863, 120453466, 114540284, 109437936, 105038348, 101259000, 98021633, 95232259, 92773609, 90516860, 88347750, 86190731, 84014584, 81816134, 79594688, 77335131]
38210G7335131k325970k418110k514646k583138k592023k519784k358076k111002
38202E7912382j795121j441563j096979q19758o71163p02654r40357j370194j932492
38193D7142101k534420l077836l488095l728615l797423l713701l505860l207918
38185B0088233k862996k525427k251886k081092k014638k014095k017549j964554
38177B355996j816866j569821j254249r28621o62828n19377n37575p21961j036515
38168f691817j411184j764464k031807k181350k209540k127037j948769j690512
38160b2056480j367607r95640n95214j96544J64765M61416O87969Q64922J032400
38151b2000013J237234J516962J885415K326351K797668L241580L594958L800242
$$ y = [77335131, 75009161, 72591051, 70076405, 67493267, 64901244, 62381460, 60023384, 57912382, 56117261, 54675698, 53578719, 52758961, 52087798, 51385144, 50444787, 49074593, 47142101, 44607681, 41529845, 38041750, 34313135, 30515712, 26802011, 23296151, 20088233, 17225237, 14699810, 12447924, 10366832, 8352194, 6338099, 4320550, 2355996, 539130, -1030691, -2284940, -3213561, -3876389, -4395766, -4933341, -5655302, -6691817, -8103001, -9867465, -11899272, -14080622, -16290162, -18417199, -20365968, -22056480, -23424087, -24419727, -25014941, -25211485, -25046720, -24585304, -23897335, -23032413, -22000013, -20762779, -19245817, -17360402, -15034051, -12236383, -8994803, -5399845, -1599603]
38143a599603L820317L655890L357628L024660K783870K749958K977773L431958
38135B4202451L997514M529670M911507N084393N042820M813048M436949L965201
38127F0983553L452073K946949K484358K075922J707221J343984R49173N03819
38119G6447052J9196m65223q91964j196106j316558j212719q83598l76337K27059
38110G0350802Q40293J400647J874391K239166K464336K512028K359996K024295
38102H6065954J560083J039615N23340L9171m23779r05237j448661k069984k735992
38093H1644510l364156l844211m073054l990847l603897k981807k229308j449891
38085E6107339p23068j03580L66927O51981P25519N87075K73715j44634n88469
$$ y = [-1599603, 2220714, 5876604, 9234232, 12258892, 15042762, 17792720, 20770493, 24202451, 28199965, 32729635, 37641142, 42725535, 47768355, 52581403, 57018352, 60983553, 64435626, 67382575, 69866933, 71942855, 73650076, 74994060, 75943233, 76447052, 76466248, 76001025, 75109061, 73912955, 72596397, 71383678, 70500080, 70123743, 70350802, 71191095, 72591742, 74466133, 76705299, 79169635, 81681663, 84041659, 86065954, 87626037, 88665652, 89188992, 89228163, 88804384, 87899147, 86450486, 84380502, 81644510, 78280354, 74436143, 70363089, 66372242, 62768345, 59786538, 57557230, 56107339, 55384271, 55280691, 55647618, 56299599, 57025118, 57612193, 57885908, 57741274, 57152805]
38076E7152805r97050j342967j624599j845448j998554k068780k049998j960428
38068D3264981j839573j726571j637291j557673j454686j292620j044552o98627
38060C2013388k61865K39027P61091J251614J656277J929366K044619K001468
38052D1634985J823245J550247J232949R25428O75618N13580M45183M57310N32258
38043D9790803O62293Q55391J128414J490906J928075K393507K818761L138863
38035F4207013L322050L385511L383832L374472L382089L383626L318559L112351
38027I0869503K701556K057570J205610K27428p61528j651465k370675k894985
38019H9383014l238272l437246l535766l566549l534161l412446l164672k776014
$$ y = [57152805, 56155755, 54812788, 53188189, 51342741, 49344187, 47275407, 45225409, 43264981, 41425408, 39698837, 38061546, 36503873, 35049187, 33756567, 32712015, 32013388, 31751523, 31990550, 32751641, 34003255, 35659532, 37588898, 39633517, 41634985, 43458230, 45008477, 46241426, 47166854, 47842472, 48356052, 48801235, 49258545, 49790803, 50453096, 51308487, 52436901, 53927807, 55855882, 58249389, 61068150, 64207013, 67529063, 70914574, 74298406, 77672878, 81054967, 84438593, 87757152, 90869503, 93571059, 95628629, 96834239, 97061667, 96300139, 94648674, 92277999, 89383014, 86144742, 82707496, 79171730, 75605181, 72071020, 68658574, 65493902, 62717888]
38011F2717888k275580j732963j233985q52129o27477n54974n82171o21981n83769
38002E3652859m12023j10383K63532O25145Q90795R92861Q86069N56476L6236
37993E7381567n86219j175676j585722j709766j523393j094513n54177m2798L40501
37984D9449804N61605O42469O33701N90366N61740N88102O92584Q68499J075754
37975E5664624J255925J359406J367900J300369J201824J122147J094734J123839
37967F5490768J184392J231978J218517J110484R05746O40996L82395K00942J44182
37958G2510400K18525L90685O07296Q21774J012550J182587J345057J509968J681102
37949H1279944J858723K038070K202467K321301K362464K314479K199469K061110
$$ y = [62717888, 60442308, 58709345, 57475360, 56623231, 55995754, 55440780, 54858609, 54236628, 53652859, 53240836, 53130453, 53393985, 54019130, 54909925, 55902786, 56788855, 57345331, 57381567, 56795348, 55619672, 54033950, 52324184, 50800791, 49706278, 49152101, 49109303, 49449804, 50011409, 50653878, 51287579, 51877945, 52439685, 53027787, 53720371, 54588870, 55664624, 56920549, 58279955, 59647855, 60948224, 62150048, 63272195, 64366929, 65490768, 66675160, 67907138, 69125655, 70236139, 71141885, 71782881, 72165276, 72366218, 72510400, 72728925, 73119610, 73726906, 74548680, 75561230, 76743817, 78088874, 79598842, 81279944, 83138667, 85176737, 87379204, 89700505, 92062969, 94377448, 96576917, 98638027]
37941I8638027J933463J816866J682762J502529J274524J030659Q25500P20296
37933A09424626P65711R80698J333520J739998K086615K266805K209259J886034
37925A22693266J304958M99098m77573j548926k617920l578481m338042m840548
37917A07095832n076936n078887m903262m617450m288194l969881l691372l447800
37909G2022050l204436k912569k530483k041437j462743q43421k52918K32913
37901E9006956N45659O41822N25095K60526l9672k62823l50230l23098k62721
37892E9741514k59924l66906n78048q44497j106415j319794j464489j537792j547235
37883E0716414j510735j459298j431877j458517j539911j638221j689681j635633
$$ y = [98638027, 100571490, 102388356, 104071118, 105573647, 106848171, 107878830, 108704330, 109424626, 110190337, 111171035, 112504555, 114244553, 116331168, 118597973, 120807232, 122693266, 123998224, 124497322, 124019749, 122470823, 119852903, 116274422, 111936380, 107095832, 102018896, 96940009, 92036747, 87419297, 83131103, 79161222, 75469850, 72022050, 68817614, 65905045, 63374562, 61333125, 59870382, 59026961, 58774043, 59006956, 59552615, 60194437, 60719532, 60980058, 60940386, 60677563, 60327333, 60004235, 59741514, 59481590, 59114684, 58536636, 57692139, 56585724, 55265930, 53801441, 52263649, 50716414, 49205679, 47746381, 46314504, 44855987, 43316076, 41677855, 39988174, 38352541]
37875C8352541j454955j177634q70731o05872m29027l50493l58025m39224n92432
37866C2074148q15114j080096j325496j476210j485763j363766j163679r42125
37858B2421899p26507n13771k88063l1372K78316O64815J137541J674339K221912
37849B6839109K714208L093335L321170L382447L283877L050149K716204K317581
37841E0718080J881883J424817R54310M82965M0823l24101n62729o50873o09291
37832E3355884n07186m46023n27221q14521j308305j945862k627173l251350l746571
37823C8181672m084361m276693m358179m360540m292620m138315l873085l486619
37815E311260k997300k453651j926525j495647j229468j157819j245479j384256
$$ y = [38352541, 36897586, 35719952, 34849221, 34243349, 33814322, 33463829, 33105804, 32666580, 32074148, 31259034, 30178938, 28853442, 27377232, 25891469, 24527703, 23364024, 22421899, 21695392, 21181621, 20893558, 20862186, 21140502, 21805317, 22942858, 24617197, 26839109, 29553317, 32646652, 35967822, 39350269, 42634146, 45684295, 48400499, 50718080, 52599963, 54024780, 54979090, 55462055, 55502878, 55178777, 54616048, 53965175, 53355884, 52848698, 52402675, 51875454, 51060933, 49752628, 47806766, 45179593, 41928243, 38181672, 34097311, 29820618, 25462439, 21101899, 16809279, 12670964, 8797879, 5311260, 2313960, -139691, -2066216, -3561863, -4791331, -5949150, -7194629, -8578885]
37807h578885j419912j212057o99782O5119R37357J736100K307092K560652K478104
37798a826212K095799J483056P28721o0822p66228j278948j539585j562727j424653
37789d151599j221247j025749q69030p42766o14715m47495k15870Q2769M28743
37780h776959P90212J137468J454560J743755K022825K318539K657665L053136
37772F401201L487463L906113M234286M412323M425182M304158M102939L868692
37764C9142357L625951L375537L101303K778885K385392J910048J363692P82073
37756E8465238K18326k74781o64602r49172j152496j308472j443891j570101j686157
37747D9633892j789161j883293j980134k088348k198909k277503k272965k139535
$$ y = [-8578885, -9998797, -11210854, -11910636, -11845517, -10908160, -9172060, -6864968, -4304316, -1826212, 269587, 1752643, 2481364, 2420542, 1654314, 375366, -1164219, -2726946, -4151599, -5372846, -6398595, -7267625, -8010391, -8625106, -9072601, -9288471, -9205702, -8776959, -7986747, -6849279, -5394719, -3650964, -1628139, 690400, 3348065, 6401201, 9888664, 13794777, 18029063, 22441386, 26866568, 31170726, 35273665, 39142357, 42768308, 46143845, 49245148, 52024033, 54409425, 56319473, 57683165, 58465238, 58683564, 58408783, 57744181, 56795009, 55642513, 54334041, 52890150, 51320049, 49633892, 47844731, 45961438, 43981304, 41892956, 39694047, 37416544, 35143579, 33004044]
37739C3004044j859970j456065r82516n09510j03232J87404L33611L22923J58944
37730B9095633j30400m86459q31646j099788j263009j332400j333506j279246
37722B1339179j160174r53481o40187k21110K73970P89211J260055J637424J903177
37713B4228064K066274K144946K150735K085646J950497J754896J522066J286901
37705C9190025J087901R54171Q92522Q82994Q87576Q67298P96236O64799M75436
37696D6698958K39722k0137k72718m89338o60572p99655r22920j020291j042502
37687D1710547r20438o06811j13832M76753J038891J450897J642220J613107J418101
37678D7709435J126118P81806L88778p9765o52705j332874k084009k836834l507775
$$ y = [33004044, 31144074, 29688009, 28705493, 28195983, 28092751, 28280155, 28613766, 28936689, 29095633, 28965233, 28478774, 27647128, 26547340, 25284331, 23951931, 22618425, 21339179, 20179005, 19225524, 18585337, 18364227, 18638197, 19427408, 20687463, 22324887, 24228064, 26294338, 28439284, 30590019, 32675665, 34626162, 36381058, 37903124, 39190025, 40277926, 41232097, 42124619, 43007613, 43895189, 44762487, 45558723, 46223522, 46698958, 46938680, 46918543, 46645825, 46156487, 45495915, 44696260, 43773340, 42753049, 41710547, 40790109, 40183298, 40069466, 40546219, 41585110, 43036007, 44678227, 46291334, 47709435, 48835553, 49617359, 50006137, 49926372, 49273667, 47940793, 45856784, 43019950, 39512175]
37669C9512175m020607m323922m400424m267283l970592l577766l167588k814562
37661H969431k568615k438911k391296k362774k290092k144019j952357j790712
37653h969345j735703j806144j934925j995340j865798j491559r09035k24353
37645b0932202M37628R85279J387425J666758J871296K044727K207267K345545
37637g986277K409649K325061K026425J501973Q19924J13821m68955q27387r45225
37628a030991q92447p92504p70365r02570j189476j559807j903246k115951k140556
37619a3297913j984604j708692j388991j073770p59808m03435M2545N92785J217727
37610a8764156J857451K442855K907937L194729L261801L097528K726061K197391
$$ y = [39512175, 35491568, 31167646, 26767222, 22499939, 18529347, 14951581, 11783993, 8969431, 6400816, 3961905, 1570609, -792165, -3082257, -5226276, -7178633, -8969345, -10705048, -12511192, -14446117, -16441457, -18307255, -19798814, -20707849, -20932202, -20494574, -19509295, -18121870, -16455112, -14583816, -12539089, -10331822, -7986277, -5576628, -3251567, -1225142, 276831, 1096755, 1210576, 741621, -85766, -1030991, -1923438, -2715942, -3486307, -4388877, -5578353, -7138160, -9041406, -11157357, -13297913, -15282517, -16991209, -18380200, -19453970, -20213778, -20617213, -20574668, -19981883, -18764156, -16906705, -14463850, -11555913, -8361184, -5099383, -2001855, 724206, 2921597]
37602B921597J569239Q96780K35125l57102q27314j150132j341289j447054j513983
37593a014133j563522j590652j581191j527607j432474j304168j151091r75540
37585a2140378p71457n35013k85741p7698J7861m8547k70659n77979q54871r78016
37575a6522498q58286m69742J46972R02421J680653K357537K822454L008633K918554
37566d013302K622022K220872J799936J395036R96863N84855J64808k17715m96450
37557E056925o19127n71708l78452q3716K68808O47935J036500J427337J817579
37548H602081K200917K557884K849976L026031L041890K882514K571490K161504
37540B9894287J713068J276309Q85915N66002L32182J84075R7978L4945l6729
$$ y = [2921597, 4490836, 5387616, 5622741, 5265639, 4438325, 3288193, 1946904, 499850, -1014133, -2577655, -4168307, -5749498, -7277105, -8709579, -10013747, -11164838, -12140378, -12911835, -13446848, -13732589, -13810287, -13792426, -13840973, -14111632, -14689611, -15544482, -16522498, -17380784, -17850526, -17703554, -16801133, -15120480, -12762943, -9940489, -6931856, -4013302, -1391280, 829592, 2629528, 4024564, 5021427, 5606282, 5771090, 5553375, 5056925, 4437798, 3866090, 3487638, 3403922, 3672730, 4320665, 5357165, 6784502, 8602081, 10802998, 13360882, 16210858, 19236889, 22278779, 25161293, 27732783, 29894287, 31607355, 32883664, 33769579, 34335581, 34667763, 34851838, 34949816, 34984761, 34948032]
37531C4948032j24864k18870l08691l93943m74405n37199n59721n27912m51859
37522C1350568l64702l07991l16696m11047n91772q34876j091250j300844j420281
37513B4711109j445907j411671j360842j314908j267367j207198j147594j128979
37505A4426643j189489j328469j496589j622014j650346j568310j400716j192475
37497B978235r91503q37598p54636p45171p90359q56846r08951r22418q94795
37488d724042q45768q04213p88780p96425q07162p98172p54772o74626n69580
37479a1563540m63718l78840l09537k10598j9217K96995P04937J114628J423722
37470i405168J562800J515263J312582J018475P08705M46990K64179J54582R2794
$$ y = [34948032, 34823168, 34604298, 34295607, 33901664, 33427259, 32890060, 32330339, 31802427, 31350568, 30985866, 30677875, 30361179, 29950132, 29358360, 28523484, 27432234, 26131390, 24711109, 23265202, 21853531, 20492689, 19177781, 17910414, 16703216, 15555622, 14426643, 13237154, 11908685, 10412096, 8790082, 7139736, 5571426, 4170710, 2978235, 1986732, 1149134, 394498, -350673, -1141032, -1997878, -2906829, -3829247, -4724042, -5569810, -6374023, -7162803, -7959228, -8766390, -9564562, -10319334, -10993960, -11563540, -12027258, -12406098, -12715635, -12926233, -12945450, -12648455, -11943518, -10828890, -9405168, -7842368, -6327105, -5014523, -3996048, -3287343, -2840353, -2576174, -2421592, -2328798]
37461b328798N4980K5145j2857p8389j81520l08564m25881n01013n19503m82287
37451d758687l91906k45842m3163K04700M69304P08889Q77840R40430Q86633P43178
37441f08624N70778M44935M28825N51824Q01677J129029J459816J712766J818892
37432H309918J737137J461254J018687M64732j27703o83465j141528j464936j641006
37423G933090j675421j585777j398397j148877q81527o39575m46239k92066j45211
37414b80000K0744K06589L91655N52666O77111P64540Q22301Q60507Q85801Q96248
37404E798162Q82761Q36696P56914O51790N37560M35297L67137L52462M03927
37395A1022706N21299O83890Q50338R74146J028353J018690R71102R02638Q01992
$$ y = [-2328798, -2273818, -2248673, -2261530, -2339919, -2521439, -2830003, -3255884, -3756897, -4276400, -4758687, -5150593, -5396435, -5439598, -5234898, -4765594, -4056705, -3178865, -2238435, -1351802, -608624, -37846, 407089, 835914, 1387738, 2189415, 3318444, 4778260, 6491026, 8309918, 10047055, 11508309, 12526996, 12991728, 12864025, 12180560, 11039032, 9574096, 7933090, 6257669, 4671892, 3273495, 2124618, 1243091, 603516, 157277, -134789, -280000, -259256, -52667, 338988, 891654, 1568765, 2333305, 3155606, 4016113, 4901914, 5798162, 6680923, 7517619, 8274533, 8926323, 9463883, 9899180, 10266317, 10618779, 11022706, 11544005, 12227895, 13078233, 14052379, 15080732, 16099422, 17070524, 17973162, 18775154]
37386A8775154O40334M08575J51869l2201l9852J76939N75512J035444J406226
37377B3098000J561713J439719J055327M84533j72693q27770j417775j898377
37369B3322677k231741k383638k331311k075553j650079j122091n79741j08441
37361A0840082K33228M24758M77627M20322K87792J20611l3426j25306j18374
37352A2527314J156K25642N35992R08551J311824J698371K004523K165846K142502
37343B3521721J938685J604076J218490Q69213O26943N21699N25852N58946N21003
37334C1906628L38733l749m65980r75561j455767j843878k100577k213710k195133
37325B0991006k068955j856760j570172j214584p97029l29290J72869O87762J183375
$$ y = [18775154, 19415488, 19824063, 19975932, 19943731, 19903879, 20080818, 20656330, 21691774, 23098000, 24659713, 26099432, 27154759, 27639292, 27466599, 26638829, 25221054, 23322677, 21090936, 18707298, 16375987, 14300434, 12650355, 11528264, 10948523, 10840082, 11073310, 11498068, 11975695, 12396017, 12683809, 12804420, 12770994, 12645688, 12527314, 12528470, 12754112, 13290104, 14198655, 15510479, 17208850, 19213373, 21379219, 23521721, 25460406, 27064482, 28282972, 29152185, 29779128, 30300827, 30826679, 31385625, 31906628, 32245361, 32241612, 31775632, 30800071, 29344304, 27500426, 25399849, 23186139, 20991006, 18922051, 17065291, 15495119, 14280535, 13483506, 13154216, 13327085, 14014847, 15198222]
37316A5198222J619510J960517K188951K307060K325289K249449K077094J804560
37308C1730652J439697J013443N82682K19682q969o4915M5500K64399M89915O03284
37298C6315370N09585J71308l85146j088083j843967k551080l108865l434434
37290B4584688l483258l257949k796544k151282j376899n35630K92048J008840
37282A2284014J522159J775911J772029J567023J246289Q92513N63546K85968
37274B1909452O2620j11720k36804l05834l16818k83022k29679j79530j41277
37265B0167388j09420p1794j7748N5552J40551K24735L03991L93543N22682P11235
37255B2320715R42848J156686J267907J205912R45744N15180j8940n69616j045935
$$ y = [15198222, 16817732, 18778249, 20967200, 23274260, 25599549, 27848998, 29926092, 31730652, 33170349, 34183792, 34766474, 34986156, 34977187, 34912272, 34957772, 35222171, 35712086, 36315370, 36824955, 36996263, 36611117, 35523034, 33679067, 31127987, 28019122, 24584688, 21101430, 17843481, 15046937, 12895655, 11518756, 10983126, 11275174, 12284014, 13806173, 15582084, 17354113, 18921136, 20167425, 21059938, 21623484, 21909452, 21972072, 21860352, 21623548, 21317714, 21000896, 20717874, 20488195, 20308665, 20167388, 20057968, 19986174, 19968426, 20023978, 20164529, 20389264, 20693255, 21086798, 21609480, 22320715, 23263563, 24420249, 25688156, 26894068, 27839812, 28354992, 28336052, 27766436, 26720501]
37246B6720501j371374j505750j459112j284165j049773q13045o05342m34480
37238A8197460k95661j82415r2370k8320J675j5881r5008k36139m09306n49655
37228A6294380n74981m19697o8062M30471R71043J423072J666840J624712J280422
37219B2628200O83301o4119q31511j488846j928495k082267j937583j547101j018119
37210A2413460m77335k5555K95236N07854O78053Q74534J129899J423728J696916
37201A8516790J884923J947241J879270J708667J484456J263453J095403J009729
37193C0789932J008917J072307J168747J270610J359815J422694J440979J390450
37185D0924451J251758J025897P41481M46633J89411j726j27488k15105l06867
$$ y = [26720501, 25349127, 23843377, 22384265, 21100100, 20050327, 19237282, 18631940, 18197460, 17901799, 17719384, 17627014, 17598694, 17600369, 17584488, 17489480, 17253341, 16844035, 16294380, 15719399, 15299702, 15231640, 15662111, 16633154, 18056226, 19723066, 21347778, 22628200, 23311501, 23247382, 22415871, 20927025, 18998530, 16916263, 14978680, 13431579, 12413460, 11936125, 11910570, 12205806, 12713660, 13391713, 14266247, 15396146, 16819874, 18516790, 20401713, 22348954, 24228224, 25936891, 27421347, 28684800, 29780203, 30789932, 31798849, 32871156, 34039903, 35310513, 36670328, 38093022, 39534001, 40924451, 42176209, 43202106, 43943587, 44390220, 44579631, 44577905, 44450417, 44235312, 43928445]
37176D3928445m43271o44148q95513j152606j360658j480780j505141j456871
37168C4989457j379727j320932j308304j331302j342549j284747j124944q71284
37160B5025668n64276k55065J3983K20355L64091M61787N32070N77934N76104
37151B6952651M83658K64283p9156m91839q91961j220873j479400j719381j996754
37142A9821228k323007k649229k890190k970267k862629k599475k249583j880454
37134f03606j529896j199896q68017n05089r2909L61473Q20630J225748J517372
37125h74190J658760J652825J546726J421338J367815J459905J731912K166850
37117A2131941K695188L205799L571716L686825L501330L041250K402194J716159
$$ y = [43928445, 43485174, 42841026, 41945513, 40792907, 39432249, 37951469, 36446328, 34989457, 33609730, 32288798, 30980494, 29649192, 28306643, 27021896, 25896952, 25025668, 24461392, 24206327, 24220310, 24440665, 24804756, 25266543, 25798613, 26376547, 26952651, 27436309, 27700592, 27621436, 27129597, 26237636, 25016763, 23537363, 21817982, 19821228, 17498221, 14848992, 11958802, 8988535, 6125906, 3526431, 1276848, -603606, -2133502, -3333398, -4201415, -4706504, -4799413, -4437940, -3617310, -2391562, -874190, 784570, 2437395, 3984121, 5405459, 6773274, 8233179, 9965091, 12131941, 14827129, 18032928, 21604644, 25291469, 28792799, 31834049, 34236243, 35952402]
37109C5952402J102058O23252K75354Q194k38845n13694q47116j252963j720236
37100C3388406k200974k609884k845839k829155k536300k013248j359739o92196
37092A6301071j04667L51902O62688Q22574Q12267N97812J56738m87814j252049
37083A7860522k009528k632547l032304l178239l094327k842560k501717k141769
37075c572469j796000j444766j027528m82546K09801J008312J825677K562741
37067b716778L141090L519917L694737L685800L528812L274711K991529K755034
37059B3874852K625534K624247K725308K866929K973064K976069K835424K548971
37051D6050398K152756J709164J289540R59539P70026P49746Q96322J169185J492950
$$ y = [35952402, 37054460, 37677712, 37953066, 37961260, 37722415, 37208721, 36361605, 35108642, 33388406, 31187432, 28577548, 25731709, 22902554, 20366254, 18353006, 16993267, 16301071, 16196404, 16548306, 17210994, 18033568, 18845835, 19443647, 19600385, 19112571, 17860522, 15850994, 13218447, 10186143, 7007904, 3913577, 1071017, -1430700, -3572469, -5368469, -6813235, -7840763, -8323309, -8113508, -7105196, -5279519, -2716778, 424312, 3944229, 7638966, 11324766, 14853578, 18128289, 21119818, 23874852, 26500386, 29124633, 31849941, 34716870, 37689934, 40666003, 43501427, 46050398, 48203154, 49912318, 51201858, 52161397, 52931423, 53681169, 54577491, 55746676, 57239626]
37042E7239626J774922J930047J901874J672125J258743P06612P7582n53940j101412
37033F4906179j474362j603839j475221j142941p12224l00536m388J15862L8833
37024E8347363k19568o12424j073807j532530j923493k198317k337316k356928
37016D6092980k301540k216873k118687j979992j750855j400926r54967m94699
37008C2874441j25302P0447O3783j14448l90757o78856r10700j055672j119674
36999B8613262j128314j108664j081122j060567j058342j079908j120678j165619
36991A9810048j194957j193974j162094j115378j078624j069850j086588j102719
36983A0805864j076034r60542p20382l45835J33288O49348J119939J479822J699939
$$ y = [57239626, 59014548, 60944595, 62846469, 64518594, 65777337, 66483949, 66561531, 66007591, 64906179, 63431817, 61827978, 60352757, 59209816, 58497592, 58197056, 58192668, 58308530, 58347363, 58127795, 57515371, 56441564, 54909034, 52985541, 50787224, 48449908, 46092980, 43791440, 41574567, 39455880, 37475888, 35725033, 34324107, 33369140, 32874441, 32749139, 32819586, 32883369, 32768921, 32378164, 31699308, 30788608, 29732936, 28613262, 27484948, 26376284, 25295162, 24234595, 23176253, 22096345, 20975667, 19810048, 18615091, 17421117, 16259023, 15143645, 14065021, 12995171, 11908583, 10805864, 9729830, 8769288, 8048906, 7703071, 7836359, 8485707, 9605646, 11085468, 12785407]
36974A2785407J784908J759795J659860J524481J389185J275628J187153J115456
36966B4481873J054853J013767J013687J075207J203403J388028J619369J901233
36958C4751420K241812K625781K992665L243365L273674L014855K460553J670819
36950E6274944P55252j57294r53683j566122j985295k249913k417786k535696
36942D5164407k624097k678279k676337k587186k380481k041157j584613j065215
36934B7527042n72157k09420o1228j55559m48092q41856j233718j558173j801448
36925B0645391j982284k119246k210165k234976k173313k019152j782944j485315
36917D637996j150618q02743m60785j34218J79428M92472Q21045J175849J550665
$$ y = [12785407, 14570315, 16330110, 17989970, 19514451, 20903636, 22179264, 23366417, 24481873, 25536726, 26550493, 27564180, 28639387, 29842790, 31230818, 32850187, 34751420, 36993232, 39619013, 42611678, 45855043, 49128717, 52143572, 54604125, 56274944, 57030196, 56872902, 55919219, 54353097, 52367802, 50117889, 47700103, 45164407, 42540310, 39862031, 37185694, 34598508, 32218027, 30176870, 28592257, 27527042, 26954885, 26745465, 26684237, 26528678, 26080586, 25238730, 24005012, 22446839, 20645391, 18663107, 16543861, 14333696, 12098720, 9925407, 7906255, 6123311, 4637996, 3487378, 2684635, 2223850, 2089632, 2269060, 2761532, 3582577, 4758426, 6309091]
36908F309091J913155K206033K364410K345975K159631J874294J598709J441650
36900B2212948J474135J709693K103718K566612K989268L278060L384858L313887
36892D3033179L103007K796854K429698K021539J581673J116357O37772J67592
36884E6887671k69254o54319r78742j239245j435333j571340j657858j708264
36876D7373316j733305j737602j717534j660061j546157j360075j098428p72429
36868C5747725m04911k8281L15925N81170P26661P31268O04630L89671J51292
36859C8815150m8531j77599k44622k87220l46883m47013n81019p09127p64945
36850C5208191o76543l99426N5057O15559J176028J635270J926927K026615J942084
$$ y = [6309091, 8222246, 10428279, 12792689, 15138664, 17298295, 19172589, 20771298, 22212948, 23687083, 25396776, 27500494, 30067106, 33056374, 36334434, 39719292, 43033179, 46136186, 48933040, 51362738, 53384277, 54965950, 56082307, 56720079, 56887671, 56618417, 55964098, 54985356, 53746111, 52310778, 50739438, 49081580, 47373316, 45640011, 43902409, 42184875, 40524814, 38978657, 37618582, 36520154, 35747725, 35342814, 35314533, 35630458, 36211628, 36938289, 37669557, 38274187, 38663858, 38815150, 38766619, 38589020, 38344398, 38057178, 37710295, 37263282, 36682263, 35973136, 35208191, 34531648, 34132222, 34187279, 34802838, 35978866, 37614136, 39541063, 41567678, 43509762]
36841D3509762J702731J356989R70926O16782L51933K02167J61843K09058L22841
36832D9405032M91690P11689R78280J276257J573032J820712J968812J981151
36824F0206655J845512J570062J172016O70346Q8376n38919j163596j734729k215536
36815E9900187k597595k902948l170893l434331l696790l921350m036835l959110
36807C2180335l620583k998493k130717j109777n5261R22544J749586K394337
36799B7331971K854729L136891L239585L154289K880574K444018J900874J325109
36791D8268040P89236L52765N9080o8612l5965J18232L31655N37844O81686P23932
36781E1757893O41348M32425J28139k03971m73351n96168n26387k70640J19888
$$ y = [43509762, 45212493, 46569482, 47540408, 48157190, 48509123, 48711290, 48873133, 49082191, 49405032, 49896722, 50608411, 51586691, 52862948, 54435980, 56256692, 58225504, 60206655, 62052167, 63622229, 64794245, 65464591, 65552967, 65014048, 63850452, 62115723, 59900187, 57302592, 54399644, 51228751, 47794420, 44097630, 40176280, 36139445, 32180335, 28559752, 25561259, 23430542, 22320765, 22265504, 23188048, 24937634, 27331971, 30186700, 33323591, 36563176, 39717465, 42598039, 45042057, 46942931, 48268040, 49057276, 49410041, 49469121, 49400509, 49364544, 49482776, 49814431, 50352275, 51033961, 51757893, 52399241, 52831666, 52959805, 52755834, 52282483, 51686315, 51159928, 50889288, 51009176]
36772E1009176N71368J006989J356239J559250J575918J400810J073295O71274
36764F0224319K86955m255j66314k07181j66763r6885m2489l0161o5798j39728
36754E9591700k35192l37148m40951n59770p25667r79257j350823j843300k425105
36745E0694487l032789l581750l986744m190287m185439m016363l755202l472292
36737B0473621l217262l012873k852604k698582k487233k150172j645179r80488
36729A429228k16836N53783J238799J768387K104657K241115K199064K022611
36721A3340808J770380J503086J269653J096845R87230R27077R00250R00303R34078
36712B3629710J014862J149288J326848J520551J698531J836130J918313J935280
$$ y = [51009176, 51580544, 52587533, 53943772, 55503022, 57078940, 58479750, 59553045, 60224319, 60511274, 60507019, 60340705, 60133524, 59966761, 59869876, 59827387, 59797226, 59731428, 59591700, 59356508, 59019360, 58578409, 58018639, 57292972, 56313715, 54962892, 53119592, 50694487, 47661698, 44079948, 40093204, 35902917, 31717478, 27701115, 23945913, 20473621, 17256359, 14243486, 11390882, 8692300, 6205067, 4054895, 2409716, 1429228, 1212392, 1766175, 3004974, 4773361, 6878018, 9119133, 11318197, 13340808, 15111188, 16614274, 17883927, 18980772, 19968002, 20895079, 21795329, 22695632, 23629710, 24644572, 25793860, 27120708, 28641259, 30339790, 32175920, 34094233, 36029513]
36704C6029513J882462J767190J610374J433783J241668J016280P36284M05824
36696D6123378P1028j92365l16635k81908j30689N3514J88377K28833J78592P5192
36686D5997317m1073j55972k87986m66158o97177r51078j177084j332996j404154
36677C9483639j404341j366086j326926j313121j325879j340651j324148j259482
36669B8823005j161814j072979j038518j083241j202866j376847j589421j838512
36661A8458807k124176k428227k704757k890105k924912k775533k447553j988500
36653a824956j476295r92974n93698k89366n3915J50952L52301N56696P53911
36644c417344R24813J046781J095608J046938Q81284N94194K07196k28634o41740
$$ y = [36029513, 37911975, 39679165, 41289539, 42723322, 43964990, 44981270, 45717554, 46123378, 46194406, 46002041, 45685406, 45403498, 45272809, 45326323, 45514700, 45743533, 45922125, 45997317, 45956244, 45800272, 45512286, 45046128, 44348951, 43397873, 42220789, 40887793, 39483639, 38079298, 36713212, 35386286, 34073165, 32747286, 31406635, 30082487, 28823005, 27661191, 26588212, 25549694, 24466453, 23263587, 21886740, 20297319, 18458807, 16334631, 13906404, 11201647, 8311542, 5386630, 2611097, 163544, -1824956, -3301251, -4294225, -4887923, -5177289, -5231204, -5080252, -4727951, -4171255, -3417344, -2492531, -1445750, -350142, 696796, 1578080, 2172274, 2379470, 2150836, 1509096]
36635A509096r59415j129933j139158j014630q13254n96391m04686k46590j05451
36626d900412M1659K06283L82186N51693O96661Q02914Q55193Q32696P17314N12723
36616F98910K57768K0176j26970j31927J7775K92122O33053R83604J316759J643948
36606E605218J997235K400419K848969L305139L702896L960510M003825L795395
36598C1619606L351866K734229K015518J249672M64968l15191j045241j651782
36590C8423645k057997k219510k144099j884897j517507j114233p20548l39643
36582B6425211O2623N27900J068286J649348K203303K658063K961818L094376
36574D0650928L066599K911094K667594K368983K034311J671124J283860Q81358
$$ y = [1509096, 549681, -580252, -1719410, -2734040, -3547294, -4143685, -4548371, -4794961, -4900412, -4858753, -4652470, -4270284, -3718591, -3021930, -2219016, -1363823, -531127, 186187, 698910, 956678, 976854, 849884, 717957, 735732, 1027854, 1660907, 2644511, 3961270, 5605218, 7602453, 10002872, 12851841, 16156980, 19859876, 23820386, 27824211, 31619606, 34971472, 37705701, 39721219, 40970891, 41435859, 41120668, 40075427, 38423645, 36365648, 34146138, 32002039, 30117142, 28599635, 27485402, 26764854, 26425211, 26487834, 27015734, 28084020, 29733368, 31936671, 34594734, 37556552, 40650928, 43717527, 46628621, 49296215, 51665198, 53699509, 55370633, 56654493, 57535851]
36566E7535851M76945Q0997l05804o89845j073409j444789j778124k043709k223692
36557D8534421k324724k377576k419591k470423k520277k539151k496285k373711
36549B9012683k170129j901716j602475j318553j092822r45697q63202p98729
36541A8319360o86389m59428o9038M98269J209197J987614K738740L381971L870109
36532C0790405M184326M317596M267236M042802L678705L238134K801280K437493
36524E9757977K170386J957353J704499J314850P39419k025q36917j671165k411766
36515F2722611k976470l302107l359315l165654k782658k294290j781223j307578
36507D1753316r21867o59160n32781n18306n45020n09217l09853J10773P46083
$$ y = [57535851, 58012796, 58093793, 57787989, 57098144, 56024735, 54579946, 52801822, 50758113, 48534421, 46209697, 43832121, 41412530, 38942107, 36421830, 33882679, 31386394, 29012683, 26842554, 24940838, 23338363, 22019810, 20926988, 19981291, 19118089, 18319360, 17632971, 17173543, 17104505, 17602774, 18811971, 20799585, 23538325, 26920296, 30790405, 34974731, 39292327, 43559563, 47602365, 51281070, 54519204, 57320484, 59757977, 61928363, 63885716, 65590215, 66905065, 67644484, 67642459, 66805542, 65134377, 62722611, 59746141, 56444034, 53084719, 49919065, 47136407, 44842117, 43060894, 41753316, 40831449, 40172289, 39639508, 39121202, 38576182, 38066965, 37757112, 37867885, 38613968]
36498C8613968J536851K404359L280007M114714M871584N515695O009510O313017
36490G2659705O385258O187413N689058M877314L766229K403609Q73065p11297
36482A02130354k220321l534139m567188n281412n680977n794331n658009n313055
36474F4080922m812350m226692l637383l114783k696760k384227k157728k000366
36466C9050633j907501j877196j893007j915355j888844j760716j499210j102378
36458B5206426n95256k0963N68272J120258J595325J978439K279395K515266K687004
36449C7334166K772641K746581K608108K390222K138230J878067J603947J293097
36441E4765059R28162N05807L1019m88281j037932j591170k108288k544989k865592
$$ y = [38613968, 40150819, 42555178, 45835185, 49949899, 54821483, 60337178, 66346688, 72659705, 79044963, 85232376, 90921434, 95798748, 99564977, 101968586, 102841651, 102130354, 99910033, 96375894, 91808706, 86527294, 80846317, 75051986, 69393977, 64080922, 59268572, 55041880, 51404497, 48289714, 45592954, 43208727, 41050999, 39050633, 37143132, 35265936, 33372929, 31457574, 29568730, 27808014, 26308804, 25206426, 24611170, 24590207, 25158479, 26278737, 27874062, 29852501, 32131896, 34647162, 37334166, 40106807, 42853388, 45461496, 47851718, 49989948, 51868015, 53471962, 54765059, 55693221, 56199028, 56230047, 55741766, 54703834, 53112664, 51004376, 48459387, 45593795]
36432D5593795l054761l121562l093637l006229k892484k776360k666749k556477
36424B2425536k431583k286079k127638j967168j803485j619016j389049j094465
36416G707053p31090l17294R9757M46727O43376O34386M16847M5575l88357p93009
36406G763971j104366j295386j366639j328999j189558r48560o09595j96658K35082
36397d0708O05051Q28440Q42905O30246K25355k91772q18155j252425j510187
36388g81250j530442j283470p84653j03690O44680J329219J836142K094670K090034
36379C511240J864501J503839J107245P49975M58969K16387j3809k56096n07041
36370H635210p35505q93960r34948q27356n67703j85042K58648O74405R66079
$$ y = [45593795, 42539034, 39417472, 36323835, 33317606, 30425122, 27648762, 24982013, 22425536, 19993953, 17707874, 15580236, 13613068, 11809583, 10190567, 8801518, 7707053, 6975963, 6658669, 6758426, 7205153, 7848529, 8482915, 8899762, 8945337, 8556980, 7763971, 6659605, 5364219, 3997580, 2668581, 1479023, 530463, -79132, -275790, -40708, 564343, 1392783, 2235688, 2865934, 3091289, 2799517, 1981362, 728937, -781250, -2311692, -3595162, -4379815, -4483505, -3838825, -2509606, -673464, 1421206, 3511240, 5375741, 6879580, 7986825, 8736800, 9195769, 9412156, 9398347, 9142251, 8635210, 7899705, 7005745, 6070797, 5243441, 4675738, 4490696, 4749344, 5423749, 6389828]
36361F389828J066385R74098P66146N68990N00760O17537Q96512J264283J646356
36352A4690895J999296K306045K550985K707744K752740K685786K532780K327430
36344C4553701K090260J821628J510460J150496P55042L62073K3437k19483l58437
36335D1689177m21594m54333m94263n61520o69421q40586j108287j495582j983896
36326C3659695k495354k909313l111658l047877k742549k272457j718388j134391
36318A4227708n50609O070M98039Q79606J110489J170459J067353Q33245N09663
36309A9752023J31799k76538o95044j095484j437728j676775j777003j727537
36301A1197713j551903j305044j055092q57365p36480o88505o99084p59904q69010
$$ y = [6389828, 7456213, 8430311, 9196457, 9765447, 10266207, 10883744, 11780256, 13044539, 14690895, 16690191, 18996236, 21547221, 24254965, 27007705, 29693491, 32226271, 34553701, 36643961, 38465589, 39976049, 41126545, 41881587, 42243660, 42267097, 42047614, 41689177, 41267583, 40813250, 40318987, 39757467, 39088046, 38247460, 37139173, 35643591, 33659695, 31164341, 28255028, 25143370, 22095493, 19352944, 17080487, 15362099, 14227708, 13677099, 13683169, 14181208, 15060814, 16171303, 17341762, 18409115, 19242360, 19752023, 19883822, 19607284, 18912240, 17816756, 16379028, 14702253, 12925250, 11197713, 9645810, 8340766, 7285674, 6428309, 5691829, 5003324, 4304240, 3544336, 2675326]
36292B675326j017520j178547j310726j374545j349378j240969j077259q97421
36284f771039p39750o31029n77311n57779n27236m31171k28159R4052N19096J016424
36274h833902J556477K114864K664010L161079L544817L748533L724412L464187
36266A5144477L003635K411388J772663J175113O94437L76306K20492J79755J79553
36257B5157819J50237N4961j00471k79341m39606n57920o37198o94381p40181
36248B1913919p67407p54778o80492n36583l37656j18370Q4293K56613M21336
36239A9480875O23652Q98980J248429J637398K009804K303467K463305K456224
36231C3122134K283848J981843J603141J198031Q06966M68120K27014J34902K34495
$$ y = [2675326, 1657806, 479259, -831467, -2206012, -3555390, -4796359, -5873618, -6771039, -7510789, -8141818, -8719129, -9276908, -9804144, -10235315, -10463474, -10369422, -9850326, -8833902, -7277425, -5162561, -2498551, 662528, 4207345, 7955878, 11680290, 15144477, 18148112, 20559500, 22332163, 23507276, 24201713, 24578019, 24798511, 24978266, 25157819, 25308056, 25363017, 25262546, 24983205, 24543599, 23985679, 23348481, 22654100, 21913919, 21146512, 20391734, 19711242, 19174659, 18837003, 18718633, 18802926, 19059539, 19480875, 20104527, 21003507, 22251936, 23889334, 25899138, 28202605, 30665910, 33122134, 35405982, 37387825, 38990966, 40188997, 40995963, 41464083, 41691097, 41825999, 42060494]
36222D2060494N42509J038730J663720K323584K903147L290259L405847L224952
36214F0453242K777218K130001J366924N70446j90623q68337j435087j877575
36206F2926209k193448k394165k506632k564938k595938k611248k610559k587883
36198D2861398k532465k427893k257875k016758j712806j358530r58908n12901
36190B9083262k8945M61825R10102J268290J508840J627388J632807J537681J359786
36181C9361036J132608R12282P68753P59971R02193J155902J439146J662122J762360
36172D9856373J720988J555877J302219R93329O48491K71085j40451n72858r84520
36163E4650533j313001j500701j518459j371453j091584p29372l48610j6946K09123
$$ y = [42060494, 42603003, 43641733, 45305453, 47629037, 50532184, 53822443, 57228290, 60453242, 63230460, 65360461, 66727385, 67297831, 67107208, 66238871, 64803784, 62926209, 60732761, 58338596, 55831964, 53267026, 50671088, 48059840, 45449281, 42861398, 40328933, 37901040, 35643165, 33626407, 31913601, 30555071, 29596163, 29083262, 29054317, 29516142, 30426244, 31694534, 33203374, 34830762, 36463569, 38001250, 39361036, 40493644, 41405926, 42174679, 42934650, 43836843, 44992745, 46431891, 48094013, 49856373, 51577361, 53133238, 54435457, 55428786, 56077277, 56348362, 56207911, 55635053, 54650533, 53337532, 51836831, 50318372, 48946919, 47855335, 47125963, 46777353, 46760407, 46969530]
36154D6969530K96634K40160O1027j94983m66981p00303q70197r89351j092789
36145D3252747j213821j369025j556090j756435j938681k068295k124804k114352
36137B9111244k062219j986491j874128j681779j363838r08105l53379K23581
36129A9104886P42864J153880J443889J619522J678079J591576J316621Q26543
36121B9477860J47006o30973j376335j969356k343224k488280k426529k186309
36113A6203860j794323j277077o60243L1307P66240J497608K162728K692779L024634
36104B2647513L112315K941516K544308K002964J434639R59155O59435N49688
36096C6851533N70863O24747O31030N68397M70223L83559L28833K90170K35049
$$ y = [46969530, 47266164, 47506324, 47567351, 47372368, 46905387, 46205084, 45334887, 44345536, 43252747, 42038926, 40669901, 39113811, 37357376, 35418695, 33350400, 31225596, 29111244, 27049025, 25062534, 23188406, 21506627, 20142789, 19234684, 18881305, 19104886, 19847750, 21001630, 22445519, 24065041, 25743120, 27334696, 28651317, 29477860, 29624866, 28993893, 27617558, 25648202, 23304978, 20816698, 18390169, 16203860, 14409537, 13132460, 12472217, 12503524, 13269764, 14767372, 16930100, 19622879, 22647513, 25759828, 28701344, 31245652, 33248616, 34683255, 35642410, 36301845, 36851533, 37422396, 38047143, 38678173, 39246570, 39716793, 40100352, 40429185, 40719355, 40954404]
36087D0954404J39764R1j74121l67611n62435p39664q89672j027056j192088j428178
36077C4713434j749821k128461k507762k832434l064656l177644l139123k906489
36069A3207044k443382j745849q56024J47349J171802K130786K954659L598719
36061A8165104M050493M329143M471227M508379M449696M278474L965192L491409
36053E1709117K872051K160766J431598P47304J34736m19114r52243j504778k097858
36044E4081579k719911l324911l845522m217616m405394m416026m300283m142023
36036B2709893m038402m070078m266497m583144m909300n108511n071628m753763
36028a4091430m178019l409463k518459j554618n41608N12177J599044K699491
$$ y = [40954404, 41094168, 41094259, 40920138, 40552527, 39990092, 39250428, 38360756, 37333700, 36141612, 34713434, 32963613, 30835152, 28327390, 25494956, 22430300, 19252656, 16113533, 13207044, 10763662, 9017813, 8161789, 8309138, 9480940, 11611726, 14566385, 18165104, 22215597, 26544740, 31015967, 35524346, 39974042, 44252516, 48217708, 51709117, 54581168, 56741934, 58173532, 58920836, 59055572, 58636458, 57684215, 56179437, 54081579, 51361668, 48036757, 44191235, 39973619, 35568225, 31152199, 26851916, 22709893, 18671491, 14601413, 10334916, 5751772, 842472, -4266039, -9337667, -14091430, -18269449, -21678912, -24197371, -25751989, -26293597, -25781420, -24182376, -21482885]
36020b1482885L770649M737783N499716N956245O047955N784148N240289M527691
36012B0081591L755230L002593K311810J692683J136041O32214J91085j46522
36004C2656725l18449k73114p025M17022Q86073J281413J527011J613580J583641
35995C9366877J489331J354631J168809R10345N76220J92305j98218n53754q46447
35986D3460099j065341j216192j321228j415667j536355j704254j910633k117424
35978C1173005k273968k341695k312949k212823k081312j944608j792877j580334
35970A4632439j249984p68218j47048N59150J276440J934732K477539K860670
35962B1575720L052355L039283K830173K450392J935542J335353P22486J86471
$$ y = [-21482885, -17712236, -12974453, -7474737, -1518492, 4529463, 10313611, 15553900, 20081591, 23836821, 26839414, 29151224, 30843907, 31979948, 32612162, 32803247, 32656725, 32338276, 32065162, 32058137, 32475159, 33361232, 34642645, 36169656, 37783236, 39366877, 40856208, 42210839, 43379648, 44289993, 44866213, 45058518, 44860300, 44306546, 43460099, 42394758, 41178566, 39857338, 38441671, 36905316, 35201062, 33290429, 31173005, 28899037, 26557342, 24244393, 22031570, 19950258, 18005650, 16212773, 14632439, 13382455, 12614237, 12467189, 13026339, 14302779, 16237511, 18715050, 21575720, 24628075, 27667358, 30497531, 32947923, 34883465, 36218818, 36941304, 37127775]
35954C7127775j95177l89433m16468l29841j90222n4851J9190k2431k12091n37032
35944C4799419r35348j320044j617462j798039j885942j946289k054775k259876
35936B0981644k555295k879804l145842l278378l241410l043245k726289k349814
35928b238433j970568j625736j325244j057487q04292n54012l04580n7805J86234
35919i751923M28151O63684Q81163J065875J208168J309209J380388J435076J474490
35910I4281J475063J389278J166978P89108K92594k33138o79481r62241j049342
35901B283100r60187p46276m72504k08793k6180J2444j31762m58092r18820j424440
35891c051510j863172k131578k166460j964129j577233j090505n89265j38796
$$ y = [37127775, 36932598, 36543165, 36126697, 35796856, 35606634, 35551783, 35570973, 35548542, 35336451, 34799419, 33864071, 32544027, 30926565, 29128526, 27242584, 25296295, 23241520, 20981644, 18426349, 15546545, 12400703, 9122325, 5880915, 2837670, 111381, -2238433, -4209001, -5834737, -7159981, -8217468, -9021760, -9575772, -9880352, -9938157, -9751923, -9323772, -8660088, -7778925, -6713050, -5504882, -4195673, -2815285, -1380209, 94281, 1569344, 2958622, 4125600, 4914708, 5207302, 4974164, 4294683, 3332442, 2283100, 1322913, 576637, 104133, -104660, -130840, -118396, -250158, -708250, -1627070, -3051510, -4914682, -7046260, -9212720, -11176849, -12754082, -13844587, -14433852, -14572648]
35883a4572648K17440M50776N47882N21373M15202K92204K10841K08647K99160
35874a1409123M74720P08686R60440J187534J361109J475811J549439J613533
35866b077851J698592J818131J956036K062470K063948J890315J511233R62785
35858A1885659L45181k09708n82149o96872n32979j14865N04679J256871K059353
35849A3915170K815035L419449L779785L835395L568727L006002K211851J277762
35841C7829176L03236o24359j442485k117137k641336l027827l293436l442106
35833B1543726l461096l333906l055921k639018k108824j506687q96409l62239
35825D179626R999J60949Q0164j85857n42200q69822j061123j055881q63389n59757
$$ y = [-14572648, -14355208, -13904432, -13356550, -12835177, -12419975, -12127771, -11916930, -11708283, -11409123, -10934403, -10225717, -9265277, -8077743, -6716634, -5240823, -3691384, -2077851, -379259, 1438872, 3394908, 5457378, 7521326, 9411641, 10922874, 11885659, 12230840, 12021132, 11438983, 10742111, 10209132, 10094267, 10598946, 11855817, 13915170, 16730205, 20149654, 23929439, 27764834, 31333561, 34339563, 36551414, 37829176, 38132412, 37508053, 36065568, 33948431, 31307095, 28279268, 24985832, 21543726, 18082630, 14748724, 11692803, 9053785, 6944961, 5438274, 4541865, 4179626, 4189625, 4350574, 4430738, 4244881, 3702681, 2832859, 1771736, 715855, -147534, -707291]
35815g07291k57764n8696q932q7021k29451l74469m90808n75805o35992o73542
35805d099771o87817o83301o71454o63352o59901o48967o13611n46116m56280
35796i730570l66007k94218k44895k08368j74279j45066j39285j82683k93318
35787a1778689m68188o74921q50637r12838p85321m30526J30561Q24233J551347
35778a3394979K220057K770673L186643L488959L714950L890531M010082M033776
35770A3920692L904194L578391L064591K442502J846995J417062J239300J319770
35762C2733497J594636J963506K321887K580033K670439K553769K228237J735130
$$ y = [-707291, -965055, -1023751, -1032683, -1119704, -1349155, -1723624, -2214432, -2790237, -3426229, -4099771, -4787588, -5470889, -6142343, -6805695, -7465596, -8114563, -8728174, -9274290, -9730570, -10096577, -10390795, -10635690, -10844058, -11018337, -11163403, -11302688, -11485371, -11778689, -12246877, -12921798, -13772435, -14685273, -15470594, -15901120, -15770559, -14946326, -13394979, -11174922, -8404249, -5217606, -1728647, 1986303, 5876834, 9886916, 13920692, 17824886, 21403277, 24467868, 26910370, 28757365, 30174427, 31413727, 32733497, 34328133, 36291639, 38613526, 41193559, 43863998, 46417767, 48646004, 50381134]
$$ [...]
##END NTUPLES=NMR SPECTRUM
##END=
