##TITLE=31Pdec_DE-55DCM_K_b
 CDCl3, 64 sc
 27.6.2024
##JCAMPDX= 6.0         $$ Bruker NMR JCAMP-DX V2.0
##DATA TYPE= NMR SPECTRUM
##DATA CLASS= NTUPLES
##ORIGIN= UXNMR, Bruker Analytische Messtechnik GmbH
##OWNER= root
$$ XWIN-NMR		Version 3.5
$$ Thu Jun 27 16:09:22 2024 Russian Standard Time (UT+4h)  she@DPX200
##.OBSERVE FREQUENCY= 81.013821
##.OBSERVE NUCLEUS= ^31P
##.ACQUISITION MODE= SIMULTANEOUS
##.ACQUISITION SCHEME= undefined
##.AVERAGES= 64
##.DIGITISER RES= 17
##SPECTROMETER/DATA SYSTEM= spect
##.PULSE SEQUENCE= zgpg30
##.SOLVENT NAME= CDCl3
##.SHIFT REFERENCE= (INTERNAL, CDCl3, 0, 182.463)
##AUDIT TRAIL= $$ (NUMBER, WHEN, WHO, WHERE, WHAT)
$$ ##TITLE= Audit trail, XWIN-NMR		Version 3.5
$$ ##JCAMPDX= 5.01
$$ ##ORIGIN= Bruker BioSpin GmbH
$$ ##OWNER= she
$$ F:/spectra/data/she/nmr/P31/2/pdata/1/auditp.txt
$$ ##AUDIT TRAIL=  $$ (NUMBER, WHEN, WHO, WHERE, WHAT)
(   1,<2024-06-27 16:07:58.87 +0400>,<she>,<DPX200>,
      <created by zg, POWCHK disabled, PULCHK disabled
       configuration hash MD5:
       00 E9 B6 7A A2 85 ED C7 34 08 36 98 17 FE 4E 26
       data hash MD5: 32K
       B4 FD 61 8B 25 47 FA 59 DA ED 2F BE B0 D8 D7 FF>)
(   2,<2024-06-27 16:08:01.01 +0400>,<she>,<DPX200>,
      <Start of raw data processing
       efp BC_mod = 2 LB = 1.5 FT_mod = 6 PKNL = 1 PHC0 = 2821.601 PHC1 = 78.48631 SI = 64K 
       data hash MD5: 64K
       CB 4E 7B C4 AD 92 95 4B 05 6E 86 73 44 FC 2D F9>)
(   3,<2024-06-27 16:08:38.23 +0400>,<she>,<DPX200>,
      <pk PHC0 = -102.5047 PHC1 = 41 
       data hash MD5: 64K
       BD 0A C2 26 DE F2 6E 63 7A 9A E8 16 F9 23 BD CA>)
$$ ##END=
$$ 
$$ hash MD5
$$ 64 AE B7 FC 6B 56 0A ED 4E A3 8E 6A FD 46 62 70
##$RELAX= 
##$RELAX= 
##$RELAX= 
##$RELAX= 
##$RELAX= 
##$RELAX= 
##$RELAX= 
##$RELAX= 
$$ Bruker specific parameters
$$ --------------------------
##$DU= <F:/spectra>
##$EXPNO= 2
##$NAME= <P31>
##$PROCNO= 1
##$TYPE= <nmr>
##$USER= <she>
##$AMP= (0..31)
100 100 100 100 100 100 100 100 100 100 100 100 100 100 100 100 100 100 
100 100 100 100 100 100 100 100 100 100 100 100 100 100 
##$AQSEQ= 0
##$AQ_mod= 1
##$AUNM= <au_zg>
##$AUTOPOS= <>
##$BF1= 81.014009
##$BF2= 200.13
##$BF3= 200.13
##$BF4= 200.13
##$BF5= 200.13
##$BF6= 200.13
##$BF7= 200.13
##$BF8= 200.13
##$BYTORDA= 1
##$CFDGTYP= 0
##$CFRGTYP= 5
##$CHEMSTR= <none>
##$CNST= (0..31)
1 1 145 1 1 1 1 1 1 1 1 1 1 1 1 1 1 1 1 1 1 1 1 1 1 1 1 1 1 1 1 1 
##$CPDPRG= <waltz16>
##$CPDPRG1= <>
##$CPDPRG2= <waltz16>
##$CPDPRG3= <>
##$CPDPRG4= <mlev>
##$CPDPRG5= <mlev>
##$CPDPRG6= <mlev>
##$CPDPRG7= <mlev>
##$CPDPRG8= <mlev>
##$CPDPRGB= <>
##$CPDPRGT= <>
##$D= (0..31)
0 1 0 0 0 0 0 0 0 0 0 0.03 2e-05 3e-06 0 0 0 0 0 0 0 0 0 0 0 0 0 0 0 0 
0 0 
##$DATE= 1719490078
##$DBL= (0..7)
120 120 120 11 120 120 24 19 
##$DBP= (0..7)
150 150 150 150 150 150 150 150 
##$DBP07= 0
##$DBPNAM0= <>
##$DBPNAM1= <>
##$DBPNAM2= <>
##$DBPNAM3= <>
##$DBPNAM4= <>
##$DBPNAM5= <>
##$DBPNAM6= <>
##$DBPNAM7= <>
##$DBPOAL= (0..7)
0.5 0.5 0.5 0.5 0.5 0.5 0.5 0.5 
##$DBPOFFS= (0..7)
$$ [...]
##$SUBNAM2= <"">
##$SUBNAM3= <"">
##$SUBNAM4= <"">
##$SUBNAM5= <"">
##$SUBNAM6= <"">
##$SUBNAM7= <"">
##$SUBNAM8= <"">
##$SUBNAM9= <"">
##$SW= 369.568048894756
##$SWIBOX= (0..15)
0 1 3 0 0 0 0 0 0 0 0 0 0 0 0 0 
##$SW_h= 29940.119760479
##$TD= 32768
##$TD0= 1
##$TE= 0
##$TE2= 300
##$TE3= 300
##$TEG= 300
##$TL= (0..7)
0 120 53 12 22 120 120 120 
##$TP= (0..7)
150 150 150 150 150 150 150 150 
##$TP07= 0
##$TPNAME0= <>
##$TPNAME1= <>
##$TPNAME2= <>
##$TPNAME3= <>
##$TPNAME4= <>
##$TPNAME5= <>
##$TPNAME6= <>
##$TPNAME7= <>
##$TPOAL= (0..7)
0.5 0.5 0.5 0.5 0.5 0.5 0.5 0.5 
##$TPOFFS= (0..7)
0 0 0 0 0 0 0 0 
##$TUNHIN= 0
##$TUNHOUT= 0
##$TUNXOUT= 0
##$USERA1= <user>
##$USERA2= <user>
##$USERA3= <user>
##$USERA4= <user>
##$USERA5= <user>
##$V9= 5
##$VALIST= <valist>
##$VCLIST= <CCCCCCCCCCCCCCC>
##$VD= 0
##$VDLIST= <DDDDDDDDDDDDDDD>
##$VPLIST= <PPPPPPPPPPPPPPP>
##$VTLIST= <TTTTTTTTTTTTTTT>
##$WBST= 1024
##$WBSW= 4
##$XGAIN= (0..3)
0 0 0 0 
##$XL= 0
##$YL= 0
##$YMAX_a= 6524
##$YMIN_a= -3462
##$ZGOPTNS= <>
##$ZL1= 120
##$ZL2= 120
##$ZL3= 120
##$ZL4= 120
##$ABSF1= 0
##$ABSF2= 0
##$ABSG= 0
##$ABSL= 0
##$ALPHA= 0
##$AQORDER= 0
##$ASSFAC= 0
##$ASSFACI= 0
##$ASSFACX= 0
##$ASSWID= 0
##$AUNMP= <proc_1d>
##$AZFE= 0.1
##$AZFW= 0.5
##$BCFW= 0
##$BC_mod= 2
##$BYTORDP= 0
##$COROFFS= 0
##$CY= -3
##$DATMOD= 1
##$DC= 0
##$DFILT= <>
##$DTYPP= 0
##$F1P= 0
##$F2P= 0
##$FCOR= 1
##$FTSIZE= 65536
##$FT_mod= 6
##$GAMMA= 0
##$GB= 0
##$INTBC= 1
##$INTSCL= 9.790993e-09
##$ISEN= 30
##$LB= 1.5
##$LEV0= 0
##$LPBIN= 0
##$MAXI= 10000
##$MC2= 0
##$MEAN= 0
##$ME_mod= 0
##$MI= 50
##$NCOEF= 0
##$NC_proc= -10
##$NLEV= 6
##$NOISF1= 182.463
##$NOISF2= 159.3651
##$NSP= 0
##$NTH_PI= 0
##$NZP= 0
##$OFFSET= 182.463
##$PC= 4
##$PHC0= 2719.096
##$PHC1= 119.4863
##$PH_mod= 1
##$PKNL= yes
##$PPARMOD= 0
##$PSCAL= 0
##$PSIGN= 0
##$REVERSE= no
##$SF= 81.0140089999434
##$SI= 65536
##$SIGF1= 159.3651
##$SIGF2= -187.1042
##$SINO= 113.3802
##$SIOLD= 16384
##$SREGLST= <1H.CDCl3>
##$SSB= 0
##$STSI= 65536
##$STSR= 0
##$SW_p= 29940.119760479
##$SYMM= 0
##$S_DEV= 0
##$TDeff= 32768
##$TDoff= 0
##$TI= <>
##$TILT= no
##$TM1= 0
##$TM2= 0
##$TOPLEV= 0
##$USERP1= <user>
##$USERP2= <user>
##$USERP3= <user>
##$USERP4= <user>
##$USERP5= <user>
##$WDW= 1
##$XDIM= 65536
##$YMAX_p= 345265785
##$YMIN_p= -104890240
$$ End of Bruker specific parameters
$$ ---------------------------------
##NTUPLES= NMR SPECTRUM
##VAR_NAME=  FREQUENCY,     SPECTRUM/REAL,   SPECTRUM/IMAG
##SYMBOL=    X,             R,               I
##VAR_TYPE=  INDEPENDENT,   DEPENDENT,       DEPENDENT
##VAR_FORM=  AFFN,          ASDF,            ASDF
##VAR_DIM=   65536,         65536,           65536
##UNITS=     HZ,            ARBITRARY UNITS, ARBITRARY UNITS
##FACTOR=    0.456856943014862, 1,           1
##FIRST=     14782.0589164792, 0,            0
##LAST=      -15158.0608439998, 0,           0
##MIN=       -15158.0608439998, -104890240,  0
##MAX=       14782.0589164792, 345265785,    0
$$ Real data points
##PAGE= N=1
##DATA TABLE= (X++(R..R)), XYDATA
$$ [...]
##PAGE= N=2
##DATA TABLE= (X++(I..I)), XYDATA
4888I864525P517315J2647064R305184j598049j1738361j1693330k039952O161315
$$ 9864525 17381840 30028904 39334088 37736039 25997678 14304348 12264396 18425711
4880A8425711N396278R78081J416672N109218M378517p41817k194467K787187
$$ 18425711 23821989 24800070 26216742 31325960 35704477 34962660 32768193 35555380
4872C5555380O846749L375990m698810j0276409j0776502q093348m652368l140469
$$ 35555380 42402129 45778119 41079309 30802900 20026398 11933050 7280682 4140213
4864D140213n678857r167935o031452N024880J3324553Q749561k820754n893218
$$ 4140213 -1538644 -10706579 -16738031 -11713151 1611402 10360963 7540209 1646991
4856A646991L071823J0946581P730959J46449j493770k4462l766075r153249n736050
$$ 1646991 4718814 15665395 23396354 23542803 22049033 22024571 18258496 9105247 3369197
4847C369197L914571N535505l264799p116428K374635J1351566N122037p764440
$$ 3369197 7283768 12819273 9554474 2438046 4812681 16164247 21286284 13521844
4839A3521844q928632Q01222M636461j404533l515925L618381N801326o261670
$$ 13521844 4593212 5394434 10030895 8626362 5110437 8728818 14530144 8268474
4831H268474j8189844j1804050O890718J5582726O759427m310747k748749P847888
$$ 8268474 -9921370 -21725420 -14834702 748024 7507451 3196704 447955 8295843
4823H295843J4177402J0410769J076146p049111j0117333p525977k187640N39014
$$ 8295843 22473245 32884014 33960160 26911049 16793716 9267739 7080099 7619113
4815G619113k083692o190888n043840K801132J1078473J2560069O798247k54340
$$ 7619113 5535421 -655467 -5699307 -2898175 8180298 20740367 27538614 27284274
4807B7284274l347608k668263j808376l384984p134751j0113578q374983j373394
$$ 27284274 23936666 21268403 19460027 16075043 8940292 -1173286 -9548269 -10921663
4799a0921663M729367K485624o241098j0428660m401762L692426M157034P51187
$$ -10921663 -6192296 -3706672 -9947770 -20376430 -24778192 -21085766 -16928732 -16177545
4791a6177545L811193J1937514J2838687K972892o097195n096536L39157J147727
$$ -16177545 -12366352 -428838 12409849 15382741 9285546 4189010 4528167 5675894
4783E675894m89066K739394Q686211P739360k431659j2625675j3238559m255513
$$ 5675894 5186828 7926222 16612433 24351793 21920134 9294459 -3944100 -8199613
4775h199613O379246J0687617O786455m53652m880308n612264o166767p291183
$$ -8199613 -1820367 8867250 15653705 15200053 10319745 4707481 -1459286 -8750469
4767h750469n276114J054578O765187P203433L814336Q89525N79526L022114O351911
$$ -8750469 -14026583 -12972005 -6206818 996615 4810951 5700476 6280002 9302116 15654027
4758A5654027N111739m334956j4618295j2689299J366899J1136303O393598k114158
$$ 15654027 20765766 16430810 1812515 -10876784 -9509885 1626418 8020016 5905858
4750E905858o67771N187794J025471j1199423j5601054p425285J497506L172672
$$ 5905858 5238087 10425881 11451352 251929 -15349125 -22774410 -21276904 -18104232
4742a8104232L163007O417092Q172935M885680J809686K908561L661342O89551
$$ -18104232 -14941225 -8524133 -351198 4534482 6344168 9252729 12914071 13603622
4734A3603622j052409K004942L864975j305514q288074q002208m07568P119128
$$ 13603622 12551213 14556155 18421130 17115616 8827542 825334 417766 7536894
4726G536894R773743P183358O7196q062345j0076910l241525N063672N969240
$$ 7536894 17310637 24493995 24561191 16498846 6421936 3180411 8244083 14213323
4718A4213323M69057l698587k997702N32667N407772J0635679J1663140M295776
$$ 14213323 14682380 10983793 7986091 8518758 13926530 24562209 36225349 40521125
4710D0521125p539807j4610970j3455642r392045q398330j0924045j3875538j4146560
$$ 40521125 32981318 18370348 4914706 -4477339 -12875669 -23799714 -37675252 -51821812
4702e1821812r922115k404418L856998N780016N929594Q293555J1807681J2852619
$$ -51821812 -61743927 -64148345 -60291347 -54511331 -48581737 -40288182 -28480501 -15627882
4694a5627882J2107363J2586776J2097144N397127n346685j0292878n214093J821164
$$ -15627882 -3520519 9066257 21163401 26560528 21213843 10920965 5706872 7528036
4686G528036J531712m362903p388446m560858k19939J964656K546673K489938
$$ 7528036 9059748 4696845 -2691601 -7252459 -7472398 -5507742 -2961069 -471131
4678d71131J475504O05866J816314L290554L35092o650009r760564l737749M651252
$$ -471131 1004373 1610239 3426553 6717107 7052199 402190 -9358374 -13096123 -8444871
4669h444871L671130p429718j6040448j1878553M82068Q579203P156786J247927
$$ -8444871 -4773741 -12203459 -28243907 -40122460 -39640392 -31061189 -23904403 -22656476
4661b2656476k677455k599195N67365M301101M552326J09525l250352R47333R255732
$$ -22656476 -25333931 -27933126 -27365761 -23064660 -18512334 -18402809 -21653161 -20705828 -11450096
4652a1450096J1143287L901053l174840k785619J68724k153083q065717j0342138
$$ -11450096 -306809 3594244 419404 -2366215 -2197491 -4350574 -12416291 -22758429
4644b2758429p577825l948197j143780K082223M900002N808953O746592R316575
$$ -22758429 -30336254 -34284451 -35428231 -33346008 -28446006 -22637053 -15890461 -6573886
4636f573886R698890M394748j861182j996346K103238L068853O09325M36954K080816
$$ -6573886 3125004 7519752 5658570 3662224 5765462 8834315 9443640 9880594 11961410
4627A1961410m76175n682397m707022K788954O435288L018883K437190Q475940
$$ 11961410 11485235 5802838 1095816 3884770 10320058 13338941 15776131 24252071
4619B4252071Q239250p031390k2631172j7994894L364589J8130313J4318447K240047
$$ 24252071 32491321 25459931 2828759 -15166135 -11801546 6328767 20647214 22887261
4611B2887261n113532o736099n690725j049381N754992P281215O5863q990336
$$ 22887261 17773729 11037630 5346905 4297524 10052516 17333731 17399594 8409258
4603H409258j1775458q176195k048361M740337R649918Q492278K811859J074837
$$ 8409258 -3366200 -11542395 -13590756 -8850419 799499 9291777 12103636 13178473
4595A3178473O273213R624641L988988l823479l603607J779065K053789k504474
$$ 13178473 19451686 29076327 33065315 29241836 25638229 27417294 29471083 26966609
4587B6966609k015000N019987P869601J75890j0767068j5066057j1235060k903543
$$ 26966609 24951609 29971596 37841197 38017087 27250019 12183962 948902 -1954641
4579a954641N832421Q067776k078326j7327651j9731023l653869J3728646J5237825
$$ -1954641 3877780 11945556 9867230 -7460421 -27191444 -30845313 -17116667 -1878842
4571a878842P171885O161527J0896896N742991j0251929j8854201j1225169j820937
$$ -1878842 5293043 11454570 22351466 28094457 17842528 -1011673 -12236842 -14057779
4563a4057779m547073j1311711p458700L967701R156221O478975N653987Q269813
$$ -14057779 -18604852 -29916563 -37375263 -33407562 -24251341 -17772366 -12118379 -3848566
4555c848566O422643M56260J164098J0541519J5339268O602012o660227j1492088
$$ -3848566 2574077 3030337 4194435 14735954 30075222 36677234 30017007 18524919
4547A8524919q326017n043993k744895J353855L382562k187035j0162523r451147
$$ 18524919 10198902 5154909 2410014 3763869 7146431 4959396 -5203127 -14654274
4539a4654274L61633Q359765Q746085O852643O557460L193756n589185j1861357
$$ -14654274 -14292641 -5932876 2813209 9665852 16223312 19417068 13827883 1966526
4531A966526q429884q77517M18801m086057m866622J121586O025248L502091k108636
$$ 1966526 -6463358 -7340875 -6922074 -11008131 -15874753 -14753167 -8727919 -5225828 -7334464
4522g334464k458896L766611J0086928R978829K893188n733504q746424l126282
$$ -7334464 -9793360 -6026749 4060179 14039008 16932196 11198692 2452268 -674014
4514f74014O753298J2510718R270444p04671j1423733j8235159j9255570j4333841
$$ -674014 6079284 18590002 27860446 27155775 15732042 -2503117 -21758687 -36092528
4506c6092528m722901O603647J5520393J8490485J4993801Q932325N874040O776013
$$ -36092528 -40815429 -34211782 -18691389 -200904 14792897 23725222 29599262 36375275
4498C6375275N894032j871118j2460121j5983285r433631j487769j767496q570699
$$ 36375275 42269307 40398189 27938068 11954783 2521152 1033383 -734113 -9304812
4490i304812j1183732l265026R325512J4521679O816153n980057r549218J225176
$$ -9304812 -20488544 -23753570 -14428058 93621 6909774 929717 -8619501 -7394325
4482g394325J4416876J3636781j184251j2530754q224881K409097L279478m177080
$$ -7394325 7022551 20659332 19475081 6944327 -1280554 1128543 4408021 230941
4474B30941m300618O762098J3391037M131152r924179j0760086R54631Q430366
$$ 230941 -4069677 2692421 16083458 20214610 10290431 -469655 484976 8915342
4466H915342K974927p230447j2284066j1891473q332797K38081J2499708J8868847
$$ 8915342 11890269 4659822 -7624244 -19515717 -27848514 -27610433 -15110725 3758122
4458C758122J2955595K592102k42745L074670J221638p260066r974189j72488
$$ 3758122 16713717 19305819 19063074 22137744 23359382 16099316 6125127 5952639
4450E952639J0976627R599261j290715p637985n234443k907123n329361n180900
$$ 5952639 16929266 26528527 25237812 17599827 12365384 9458261 4128900 -1052000
4442a052000K702905R680903M983934o642143r733398K27352R902682O073630
$$ -1052000 1650905 11331808 16315742 9673599 -59799 167553 10070235 16143865
4434A6143865p067721j4365011q930461J899142Q364349R086049Q313788P919759
$$ 16143865 9076144 -5288867 -14219328 -12320186 -3955837 5130212 13444000 21363759
4426B1363759O465812L670747J100986j385936n880884j1857751j4496413j0005195
$$ 21363759 27829571 31500318 32601304 31215368 25334484 13476733 -1019680 -11024875
4418a1024875j102108N159890M665264p6951l042654m79262N535975Q325688K862621
$$ -11024875 -12126983 -6967093 -2301829 -2378780 -5421434 -5900696 -364721 7960967 10823588
4409A0823588p684127j3488879q594137J813360P843350O914860M750455N263508
$$ 10823588 3139461 -10349418 -18943555 -17130195 -9286845 -2371985 2378470 7641978
4401G641978N620228K915555k15402l06570J096277N24257j968488m724835q379577
$$ 7641978 13262206 16177761 15962359 15655789 16752066 17276323 15307835 10583000 2203423
4392B203423j2541845j1631808j136807J2743468J7142707Q032585m288319p967687
$$ 2203423 -10338422 -21970230 -23107037 -10363569 6779138 14811723 10523404 2555717
4384B555717k813562K895662M501366M505172N682903O045087K154378n168447
$$ 2555717 -257845 2637817 7139183 11644355 17327258 23372345 25526723 20358276
4376B0358276j0395252q450956j02780P914068Q935446L039465k979074k833552
$$ 20358276 9963024 1512068 1409288 9323356 18258802 21298267 18319193 15485641
4368A5485641K726963P220636N631042n42796n299129m567980k96482J980855
$$ 15485641 18212604 25433240 31064282 30521486 25222357 20654377 20357895 22338750
4360B2338750n78820m989366n984122k019955L220169N315743M326458M714575
$$ 22338750 21759930 16770564 10786442 8766487 11986656 17302399 21628857 26343432
4352B6343432R389878J4169160J0451731m548585k1992782k9506613k4561641
$$ 26343432 35733310 49902470 60354201 55805616 33812834 4306221 -20255420
4345b0255420j5293605p776410R37696J3584457K3050430J9660232N525396o477273
$$ -20255420 -35549025 -43325435 -42387739 -28803282 -5752852 13907380 19432776 12955503
4337A2955503q564261n808818n724162o546645j352849R168728J4628031P478153
$$ 12955503 4391242 -1417576 -7141738 -13688383 -15041232 -5872504 8755527 16233680
4329A6233680o045124j1634537l476460Q922130J2869625P751751L200876M584418
$$ 16233680 10188556 -1445981 -4922441 3999689 16869314 24621065 27821941 32406359
4321C2406359P731069P959746N872303K086071m912723j1826378j0848459k690048
$$ 32406359 40137428 48097174 53969477 56055548 51142825 39316447 28467988 25777940
4313B5777940M19585p307173j4232923q952184P34508N73461o334715n550687
$$ 25777940 26197525 18890352 4657429 -4294755 -3560247 -2986786 -9321501 -14872188
4305a4872188L755589Q560257M955378K085198K218831l312827j4366372j7604701
$$ -14872188 -11116599 -2556342 2399036 4484234 6703065 3390238 -10976134 -28580835
4297b8580835q468708N19308J112487J215664O571555Q967563L921760J782360
$$ -28580835 -37049543 -36530235 -35417748 -34202084 -27630529 -18662966 -14741206 -12958846
4289a2958846P461547P291764o978929j8383809r622439P048461Q586605j639577
$$ -12958846 -5497299 1794465 -5184464 -23568273 -33190712 -26142251 -17555646 -19195223
4281a9195223j828642R991931J3532528J100141j1200652j0575026l306176J685256
$$ -19195223 -21023865 -11031934 2500594 3600735 -7599917 -18174943 -21481119 -19795863
4273a9795863N264524Q267225O586833J425326j027471l252009j2851819k2931684
$$ -19795863 -14531339 -6264114 322719 1748045 720574 -2531435 -15383254 -38314938
4265c8314938j6167644O015431J9431687J1464047q10570J037175R391222P419974
$$ -38314938 -54482582 -48467151 -29035464 -17571417 -18381987 -17344812 -7953590 -533616
4257e33616k458794n526793K94923M525702L066474J530711L168881N642769O847029
$$ -533616 -2992410 -8519203 -8224280 -3698578 -632104 898607 4067488 9710257 16557286
4248A6557286N006379k261767j1325124j2059177k334067N395090J504773o055940
$$ 16557286 21563665 19301898 7976774 -4082403 -6416470 -1021380 483393 -5572547
4240e572547n805016j913362n121166j2403747j2019690l916262J330900J172150
$$ -5572547 -11377563 -13290925 -18412091 -30815838 -42835528 -46751790 -45420890 -44248740
4232d4248740K576389O096700M569015j344872j750220N396189R845912O020300
$$ -44248740 -41672351 -35575651 -31006636 -32351508 -34101728 -28705539 -18859627 -12839327
4224a2839327J612802L421809N715150K55930r995518j4776006r630578L06965
$$ -12839327 -11226525 -7804716 -2089566 -1833636 -11829154 -26605160 -36235738 -35928773
4216c5928773O805718N729150K47590j864750L302643J0562839J2175443P567079
$$ -35928773 -29123055 -23393905 -23146315 -25011065 -21708422 -11145583 1029860 8596939
4208H596939J634228l847103r993308j3911246j0610021j980071M002631L856189
$$ 8596939 10231167 6384064 -3609244 -17520490 -28130511 -30110582 -26107951 -22251762
4200b2251762J393038k00691j521880j834657J135806N265918N804690M024652
$$ -22251762 -20858724 -21059415 -22581295 -24415952 -23280146 -18014228 -12209538 -8184886
4192h184886N438187P966470K123926j2765551k2162643j3450354O549473J8676084
$$ -8184886 -2746699 5219771 7343697 -5421854 -27584497 -41034851 -34485378 -15809294
4184a5809294J3343444k92378o216288R28698J0870915J0225993n01456o742916
$$ -15809294 -2465850 -2758228 -8974516 -8045818 2825097 13051090 12549634 5806718
4176E806718L06709J0235881P999197l431475p612332j63212N020139j726905
$$ 5806718 6113427 16349308 24348505 20917030 13304698 13141486 18161625 16434720
4168A6434720j1246001j0905155l430161p02990n743214j0273537p019724K132501
$$ 16434720 5188719 -5716436 -9146597 -9849587 -15592801 -25866338 -32886062 -30753561
4160c0753561Q613685N158117n646899j0984261k261423J1155946J2903213M151807
$$ -30753561 -22139876 -16981759 -22628658 -33612919 -35874342 -24718396 -11815183 -7663376
4152g663376K518410J2831984J6901279K708613j3625553j1906367k56769j780836
$$ -7663376 -5144966 7687018 24588297 27296910 13671357 1764990 1508221 -272615
4144b72615j6609959k1427743o296220J1282478J4601727R880305J0220349J3479895
$$ -272615 -16882574 -38310317 -44606537 -33324059 -18722332 -8842027 1378322 14858217
4136A4858217R335862j886471j0672118j2882606j1557540p765420n5185Q388578
$$ 14858217 24194079 22307608 11635490 -1247116 -12804656 -20570076 -20625261 -12236683
4128a2236683J1282247Q531194O686228Q775967R860904M994432l501260j0045782
$$ -12236683 -954436 7576758 14262986 23038953 32899857 37894289 34393029 24347247
4120B4347247j3315289j5377486j5325945r212871K572449J2438694J3650991
$$ 24347247 11031958 -4345528 -19671473 -28884344 -26311895 -13873201 -222210
4113b22210Q823566O150833Q212320R315879M408927m257762j1105188j3388678
$$ -222210 8601356 14752189 22964509 32280388 36689315 32431553 21326365 7937687
4105G937687j1041651m938311J269268J820833m200899r826117q420778j725116
$$ 7937687 -3103964 -8042275 -6773007 -4952174 -9153073 -18979190 -27399968 -29125084
4097b9125084M680276R675364J4148711J4358699O575619l350199m795951K364157
$$ -29125084 -24444808 -14769444 -620733 13737966 20313585 16963386 12167435 14531592
4089A4531592O634532J737559m522136l186741K245627K736469j459174k235799
$$ 14531592 21166124 22903683 18381547 15194806 17440433 20176902 18717728 16481929
4081A6481929K111159L543064k770054r514173o388557N155874J2044010N068264
$$ 16481929 18593088 22136152 19366098 9851925 3463368 8619242 20663252 25731516
4073B5731516r685865j7762659j2947952k967445J913366J274146J838562N871109
$$ 25731516 16045651 -1717008 -14664960 -17632405 -15719039 -14444893 -12606331 -6735222
4065f735222Q674957P422084N721713O652984O847492K384777l064070k150526
$$ -6735222 1939735 9361819 15083532 21736516 28584008 30968785 27904715 25754189
4057B5754189N063064R847244N914461k831075p981489o504879j941394J423088
$$ 25754189 30817253 40664497 46578958 43747883 35766394 29261515 27320121 28743209
4049B8743209J567680k404047r521614j4883335j3093011n375661Q98959J908946
$$ 28743209 30310889 27906842 18385228 3501893 -9591118 -14966779 -14067820 -12158874
4041a2158874K024264N426748Q244583N059910p08909j118121L286904L830732
$$ -12158874 -10134610 -4707862 3536721 8596631 7887722 6769601 10056505 13887237
4033A3887237k446869q589845r555238q636724p944414k365507R980622J9853369
$$ 13887237 11440368 2850523 -6704715 -15341439 -23285853 -25651360 -15670738 4182631
4025D182631J8378681R646306K414273m086159j4367719k2178147j6520262p99126
$$ 4182631 22561312 32207618 34621891 30535732 16168013 -6010134 -22530396 -23329522
4017b3329522Q880926O256022J723994L220701M732231O08380k212432L355919
$$ -23329522 -14448596 -8192574 -6468580 -3247879 1484352 2092732 -119700 3236219
4009C236219J0357776Q124932n04244m671857l039810k924955m899496k016955
$$ 3236219 13593995 21718927 21214683 16542826 13503016 10578061 5678565 3661610
4001C661610N259079O743299r92403p279504l005849N222971N030561l124303
$$ 3661610 8920689 15663988 14671585 7392081 4386232 9609203 14639764 11515461
3993A1515461o755575N26909J0095555R894449m61389j0277191j1245081n909671
$$ 11515461 4759886 5286795 15382350 25276799 24815410 14538219 3293138 -2616533
3985b616533j958203j846381j814960K09551J074412j454501l797675j862429
$$ -2616533 -4574736 -6421117 -8236077 -8026526 -6952114 -8406615 -12204290 -14066719
3977a4066719K154068L395389K431192L526348N959258M474746m91091p35998
$$ -14066719 -11912651 -8517262 -6086070 -2559722 3399536 7874282 7383191 6647193
3969F647193P700848J6706288J5784638N401055n050081r568562r836813r077665
$$ 6647193 14348041 31054329 46838967 52240022 47189941 37621379 27784566 18706901
3961A8706901p905261o172169l899456l18203L836835M211002j574577p322374
$$ 18706901 10801640 4629471 730015 411812 4248647 8459649 6885072 -437302
3953d37302m512160M380232P158437q26157r275580p916670q21721J726722j050480
$$ -437302 -4949462 -569230 6589207 5763050 -3512530 -11429200 -12250921 -10524199 -11574679
3944a1574679k388176p62395M98351L747232J4342878K6631657K5781134Q567070
$$ -11574679 -13962855 -14725250 -14226899 -10479667 3863211 30494868 56276002 64843072
3936F4843072q800687j0928735k452654J478019l450280r197230j0427579r617101
$$ 64843072 56042385 45113650 42660996 44139015 40688735 31491505 21063926 11446825
3928A1446825q272637l774487L108447O038295J850172m410881o323253l466875
$$ 11446825 3174188 -600299 2508148 8546443 10396615 5985734 -337519 -3804394
3920c804394O24561L849733O061273P195747P363464O807943M557835m16488n881738
$$ -3804394 -3179833 669900 6731173 13926920 21290384 28098327 32656162 32239674 26357936
3911B6357936p491436m823998k918550n331812q518557o547354O7057M031121
$$ 26357936 18866500 14042502 11123952 5792140 -2726417 -9273771 -9206714 -5175593
3903e175593M08321o536708p800399m83183Q278061R938667N274309K687270N936319
$$ -5175593 -4767272 -11303980 -19104379 -19587562 -11309501 -1370834 3903475 6590745 12527064
3894A2527064Q688884L671667p589413j8028854k3371564k1989360j1443302O565273
$$ 12527064 21215948 24887615 17298202 -730652 -24102216 -46091576 -57534878 -50969605
3886e0969605K0737956J9727785P284310j643914j108914j04459n147279q373062
$$ -50969605 -30231649 -10503864 -3219554 -4863468 -5972382 -6076841 -11224120 -19597182
3878a9597182o37547J2446432J7634342J1869047L118784l050412p588751j0245611
$$ -19597182 -20234729 -7788297 9846045 21715092 24833876 21783464 14194713 3949102
3870C949102q084990k782685m16922j506336Q50814R278681J5567369J1124947
$$ 3949102 -4135888 -6918573 -7335495 -8841831 -7991017 1287664 16855033 27979980
3862B7979980q43330r464012r810555o683053n532969m907906J28031R700872
$$ 27979980 27136650 17672638 7862083 1179030 -4353939 -9261845 -9133814 567058
3854E67058J6933318J4574694L141364q818053j3388164j1041798q107556p966048
$$ 567058 17500376 32075070 35216434 26398381 13010217 1968419 -6139137 -14105185
3846a4105185q198617o218390l170805m30093L483352Q967964J1650674P445368
$$ -14105185 -22303802 -28522192 -31692997 -32123090 -28639738 -19671774 -8021100 -575732
3838e75732l53284m016997r24588M618516Q751153J1305270J0738222L159769
$$ -575732 -929016 -4946013 -5870601 -1252085 7499068 18804338 29542560 32702329
3830C2702329r267349j5292971p138501P338767J2773967N218882m768413p827785
$$ 32702329 23434980 8142009 1003508 8342275 21116242 26335124 21566711 13738926
3822A3738926o121305n644794o307256m776440j680135l46098j595350m038678
$$ 13738926 7617621 1972827 -4334429 -9110869 -10791004 -11137102 -12732452 -16771130
3814a6771130o505732o797192k102369N289443P316286O14094o508277m165001
$$ -16771130 -23276862 -30074054 -32176423 -26886980 -19570694 -18956600 -25464877 -29629878
3806b9629878N187347J0271994O678027J588810K986121J0375368J6591251J4178941
$$ -29629878 -24442531 -14170537 -7492510 -5903700 -2917579 7457789 24049040 38227981
3798C8227981J036391j5492863k2325962j4260965j414839L399270J091493J394411
$$ 38227981 39264372 23771509 1445547 -12815418 -14230257 -10830987 -9739494 -8345083
3790h345083N362181N040538l76401j946594K925230N146022k96415n362500k293840
$$ -8345083 -2982902 2057636 1681235 -265359 2659871 7805893 7509478 2146978 -146862
3781a46862M871623R142748J0642962J0280966L883810q127198j4986154j0033428
$$ -146862 4724761 13867509 24510471 34791437 38675247 30548049 15561895 5528467
3773E528467k203923k020108m843748r37967N875841M922425j868133l863686
$$ 5528467 3324544 1304436 -3539312 -4477279 1398562 6320987 4452854 589168
3765E89168j445661m043449r611001n134719R479317J6551165O479438p582198
$$ 589168 -856493 -4899942 -14510943 -19645662 -10166345 6384820 12864258 5282060
3757E282060r707399j863518N541634J0890880J6379405J6104844M255552j0519976
$$ 5282060 -4425339 -6288857 -747223 10143657 26523062 42627906 46883458 36363482
3749C6363482j3604184n019026J379494j537664o901438q097007p988980r986743
$$ 36363482 22759298 17740272 19119766 17582102 10680664 2583657 -5405323 -15392066
3741a5392066j0322793n294605J344576M382416M614252M532650K480539j844897
$$ -15392066 -25714859 -31009464 -29664888 -25282472 -20668220 -16135570 -13655031 -15499928
3733a5499928j573954Q117662J8258588J4934320m8427r297749m035922L815615
$$ -15499928 -17073882 -8956220 9302368 24236688 24188261 14890512 10854590 14670205
3725A4670205R10864p362080p692233j548042j503498p958687o542468Q281801
$$ 14670205 15581069 8218989 526756 -1021286 -2524784 -10483471 -17025939 -8744138
3717h744138K2003748J9432505M066872r538930j3658232j0003712k835361K109800
$$ -8744138 13259610 32692115 36758987 27220057 13561825 3558113 722752 2832552
3709B832552j111123j0018953j2827841m310179M708256L065025l280899j442787
$$ 2832552 1721429 -8297524 -21125365 -25435544 -20727288 -17662263 -20943162 -22385949
3701b2385949P264644J0607470N914278K150566K791625J707389k767624m109253
$$ -22385949 -15121305 -4513835 1400443 3551009 6342634 8050023 5282399 1173146
3693A173146j020118j329644q066551j3402974j1364501n814334r60239N248712
$$ 1173146 153028 -1176616 -9243167 -22646141 -34010642 -39824976 -40785215 -35536503
3685c5536503J2570228J3929626O493006j822196l869292k671313k411017N63319
$$ -35536503 -22966275 -9036649 -2543643 -4365839 -8235131 -10906444 -13317461 -12754142
3677a2754142Q707297J3503118N698954r711843j8933416j6528182q372355o60566
$$ -12754142 -4046845 9456273 15155227 5443384 -13490032 -30018214 -38390569 -39051135
3669c9051135N031894P657769O382461M123140M552327N831720L171812k982576
$$ -39051135 -34019241 -26361472 -19979011 -15855871 -11303544 -5471824 -2300012 -5282588
3661e282588p020631o167851l218133j041978J249617N937172J3242680K0269296
$$ -5282588 -12303219 -18471070 -21689203 -22731181 -21481564 -15544392 -2301712 17967584
3653A7967584K1884491J4381988M25830j1473757j4511795r067685j36509P055662
$$ 17967584 39852075 54234063 54659893 43186136 28674341 19606656 19470147 26525809
3645B6525809P860042N8038j1725725j7806600j3446408m023867K054839J601514
$$ 26525809 34385851 34443889 22718164 4911564 -8534844 -12558711 -10503872 -8902358
3637h902358l735164j0033758j0562196J87016J7356462K7328023K3688992J4845494
$$ -8902358 -12637522 -22671280 -33233476 -33046460 -15689998 11638025 35327017 50172511
3629E0172511J0047349N845326n102251j8700167k3586666j6778126n410941M195494
$$ 50172511 60219860 66065186 60962935 42262768 18676102 1897976 -3512965 682529
3621F82529J0037371R875116L010798m761693o769338m737584m492155m979037
$$ 682529 10719900 20595016 23605814 18844121 12074783 7337199 2845044 -2133993
3613b133993j060732M823868M701700j431588m856795j945839J493046J592711
$$ -2133993 -3194725 1629143 6330843 4899255 42460 -1903379 -410333 1182378
3605A182378K157980N819976Q457774O561785K779089L50445j358488k539579
$$ 1182378 3340358 9160334 17618108 24179893 26958982 27309427 25950939 23411360
3597B3411360r45570K172004P93324o581223j1912247p219559M219922J0977532
$$ 23411360 22465790 24637794 25431118 18849895 6937648 -281911 3938011 14915543
3589A4915543O403326m349140j0000278n539249J242123j206081j1310843j3374639
$$ 14915543 21318869 16969729 6969451 1430202 2672325 1466244 -9844599 -23219238
3581b3219238P18141J6505088J4743723j200875j0380761m640393K947181K132388
$$ -23219238 -22501097 -5996009 8747714 7546839 -2833922 -7474315 -4527134 -2394746
3573b394746j13189L350265N212764j522521p405639o91925J0885357R278963
$$ -2394746 -2507935 842330 6055094 4532573 -2873066 -3564991 7320366 16599329
3565A6599329o249120j6503213q720063P228703J3316372N270596n319385o114756
$$ 16599329 10350209 -6153004 -14873067 -7644364 5672008 10942604 5623219 -491537
3557d91537L287163J2560569J2354776L903855m011478o242701n026132k734636
$$ -491537 2795626 15356195 27710971 31614826 27603348 21360647 16334515 13599879
3549A3599879J927240P510337P378919k44152o317236k863248M344895L918749
$$ 13599879 15527119 23037456 30416375 30172223 23854987 20991739 25336634 29255383
3541B9255383m243230j0372480j0877950j1308758j2534466o344406R543293K1816377
$$ 29255383 25012153 14639673 3761723 -7547035 -20081501 -26425907 -16882614 4933763
3533D933763J6254926k226331j3557730o779584P149057J0293345M15675p906214
$$ 4933763 21188689 18962358 5404628 -1374956 5774101 16067446 16483121 8576907
3525H576907m104964M347038L670944o211787j2491716q710740k526093j591800
$$ 8576907 4471943 8818981 12489925 6278138 -6213578 -14924318 -17450411 -19042211
3517a9042211k151100J764937O417422M844868o10141k294826M6771Q22597K01459
$$ -19042211 -21193311 -19428374 -13010952 -8166084 -8776225 -11071051 -11024280 -10201683 -10000224
3508a0000224K982263O803381L609273n539068r333075l904698L92800l270734
$$ -10000224 -7017961 -214580 3394693 -2144375 -11477450 -15382148 -14989348 -18260082
3500a8260082n201039N136980J9056942J8655142L524499p517790l123807N989023
$$ -18260082 -23461121 -18324141 732801 19387943 22912442 15394652 12270845 18259868
3492A8259868N297020k219257l541744K588847M315746l808373j1867215r005731
$$ 18259868 23556888 21337631 17795887 20384734 24700480 20892107 9024892 19161
3484A9161J840810R492193R098585M810676J469490J19094K49936R27483J91059
$$ 19161 1859971 11352164 20450749 25261425 26730915 26850009 27099945 28027428 28218487
3475B8218487k525086m506009l996649l831615o065511o454981j359699L064579
$$ 28218487 25693401 21187392 17190743 13359128 7293617 838636 -521063 2543516
3467B543516j641707j0929509j1299356j193656N129228l96057o677655j381201
$$ 2543516 901809 -10027700 -21327056 -22520712 -17391484 -17787541 -24465196 -25846397
3459b5846397R320857J0966638K866992l528909l575321k845829l442563n31643
$$ -25846397 -16525540 -5558902 -2691910 -6220819 -9796140 -12641969 -16084532 -16616175
3451a6616175O218726R546522N706618r67515o880794j2909271j6647251j1411677
$$ -16616175 -10397449 -850927 4855691 3888176 -2992618 -15901889 -32549140 -43960817
3443d3960817J839480J0892030P653245K9926O29270Q814489J2638263O269075
$$ -43960817 -42121337 -31229307 -23576062 -23546136 -22916866 -14102377 -1464114 4804961
3435D804961k746298m385826J541550O604820M827930q7840J79086O650556R717717
$$ 4804961 2058663 -2327163 -785613 5819207 10647137 10559297 10738383 17388939 27106656
3426B7106656J459048j1510920j4450811l625120Q947904J2081762Q347686N708309
$$ 27106656 28565704 17054784 2603973 -1021147 7926757 20008519 28356205 34064514
3418C4064514M455794M56185m424477m817364j993403k085575n092201m788403
$$ 34064514 38520308 38976493 34552016 29734652 27741249 25655674 20563473 15775070
3410A5775070j23654K479128N77047N61604O431324J1410953P551810j694436
$$ 15775070 15651416 18130544 18707591 19269195 25700519 37111472 44663282 42968846
3402D2968846o256986l804857j455861l966852p623256p056707k143494L756388
$$ 42968846 36711860 32907003 31451142 27484290 19861034 12804327 10660833 14417221
3394A4417221P495645O338283m86732q148823r276040l651490N32025r72072j190600
$$ 14417221 21912866 28251149 27764417 19615594 10339554 6688064 7220089 6248017 5057417
3385E057417O263485J3885382R186590n328370j2991299n766159M924259N404157
$$ 5057417 11320902 25206284 34392874 29064504 16073205 10307046 15231305 20635462
3377B0635462j863584n199186j882548R04409r1485k22768K606173K857393l488818
$$ 20635462 18771878 13572692 11690144 12594553 12503068 12280300 14886473 17743866 14255048
3368A4255048j1000307j1130700l523250L665897M131672L96433r12582J662777
$$ 14255048 3254741 -7875959 -11399209 -7733312 -3601640 -3205207 -4117789 -2455012
3360b455012L311531J470006J046569O892914J3775443J0938429k578680j4538083
$$ -2455012 856519 2326525 3373094 10266008 24041451 34979880 32401200 17863117
3352A7863117j4941253q341724n202338o466891m628742K565541Q226371P021345
$$ 17863117 2921864 -5419860 -10622198 -17089089 -21717831 -19152290 -10925919 -3904574
3344c904574K784826K301109N577126O046776l76869q912738j0279972j909567
$$ -3904574 -1119748 1181361 6758487 12805263 12428394 3515656 -6764316 -8673883
3336h673883P503863P833073J90485n420371m154690o82581J028338K985113N224428
$$ -8673883 -1170020 6663053 6853538 1433167 -2721523 -3404104 -2375766 609347 5833775
3327E833775K804678l724723n245678Q44686L239586n132211j2267644m484860
$$ 5833775 8638453 4913730 -331948 512738 3752324 -1379887 -13647531 -18132391
3319a8132391J0288897J3685223N055886o21855O15132j640104q605653p573319
$$ -18132391 -7843494 5841729 10897615 10275760 10890892 9250788 645135 -6928184
3311f928184M193642J1516544N540278k755146l174981k420799p155625q083455
$$ -6928184 -2734542 8782002 14322280 11567134 8392153 5971354 -1184271 -9267726
3303i267726K863438J3312751P051469r567714j6424261q783546K56871K838006
$$ -9267726 -6404288 6908463 13959932 4392218 -12032043 -20815589 -20558718 -17720712
3295a7720712M199416P887435R131426N451017J300499o24771k730621n449300
$$ -17720712 -13521296 -5633861 3497565 8948582 10249081 9624310 6893689 1444389
3287A444389n806591m106858l630693l334889N43794N482711M471931k188390
$$ 1444389 -4362202 -8469060 -12099753 -15434642 -14890848 -9408137 -4936206 -7124596
3279g124596n738755j372417N895005R138611O171034k160242j2401389j6633782
$$ -7124596 -12863351 -14235768 -8340763 797848 6968882 4808640 -7592749 -24226531
3271b4226531q896540M849101J1574814Q039270M177113O899967R824427M542329
$$ -24226531 -33123071 -28273970 -16699156 -8659886 -4482773 2417194 12241621 16783950
3263A6783950n434515r149578k625640P164960J0960472N933658l176553r288644
$$ 16783950 11349435 2199857 -425783 6739177 17699649 23633307 20456754 11168110
3255A1168110r488566o208212j798483M367653J0506622R839485N15497o822269
$$ 11168110 1679544 -4528668 -6327151 -1959498 8547124 18386609 18902106 12079837
3247A2079837j925649P582243M967185r255371j5266639l289047J0458557P570446
$$ 12079837 10154188 17736431 22703616 13448245 -1818394 -5107441 5351116 12921562
3239A2921562n358354q016476K770418J0328823M962346k632732K83445Q843295
$$ 12921562 7563208 -453268 2317150 12645973 17608319 14975587 15259032 24102327
3231B4102327Q445951l549877j3740298j0372879K148871J0250547Q623611M593962
$$ 24102327 32548278 28998401 15258103 4885224 7034095 17284642 25908253 30502215
3223C0502215N354900P961273O333019K554892L334723P535149O384242k730043
$$ 30502215 35857115 43818388 50151407 52706299 56041022 63576171 69960413 67230370
3215F7230370j1058984j0527581m246150o29628k214795m774424l569474L169952
$$ 67230370 56171386 45643805 41397655 40768027 38553232 33778808 30209334 33379286
3207C3379286J2972356J8122043J0893933n908265j8417733j6984835q020230
$$ 33379286 46351642 64473685 75367618 69459353 51041620 34056785 26036555
3200B6036555m913100j0688551j6398233j4614446p292239j61644M329723O567192
$$ 26036555 21123455 10434904 -5963329 -20577775 -27870014 -28031658 -23701935 -17134743
3192a7134743O605005M178787L70065k258944j442828K192005M534691K102968
$$ -17134743 -10529738 -6350951 -5980886 -8239830 -9682658 -7490653 -2955962 -852994
3184h52994l016175n295988l342256j318427j654438j507690Q61591J845307q12560
$$ -852994 -3869169 -9165157 -12507413 -13825840 -15480278 -16987968 -16126377 -14281070 -15093630
3175a5093630k110120L236678J1392268J3695813Q398028J646592k129617m273135
$$ -15093630 -17203750 -13967072 -2574804 11121009 19519037 21165629 19036012 14762877
3167A4762877o174579n677665j173705M755292P895164O765535L808118L141006
$$ 14762877 8588298 2910633 1736928 6492220 14387384 21152919 24961037 28102043
3159B8102043O081692Q187080L743634n262559r460649m944699k52974m351253
$$ 28102043 34183735 42370815 46114449 40851890 31391241 26446542 26193568 21842315
3151B1842315j2643460j3531688n642597J618113L561851N175440R076633R659868
$$ 21842315 9198855 -4332833 -9975430 -8357317 -4795466 379974 9456607 19116475
3143A9116475L853147j805310j331738R12981k110533q431893j0901224q555618
$$ 19116475 22969622 21164312 19832574 20745555 18635022 10203129 -698095 -9253713
3135i253713n931812l561310K190602J0040245J2728844P165283p63716m593005
$$ -9253713 -15185525 -18746835 -16556233 -6515988 6212856 13378139 12614423 8021418
3127H021418n352218p241239r212075o437467J019556O548154N511305J327961
$$ 8021418 2669200 -4572039 -13784114 -20221581 -19202025 -12653871 -7142566 -5814605
3119e814605L2868J539820P38517l600201o299541l704255P38407K262307K097431
$$ -5814605 -5781737 -4241917 -3503400 -7103601 -13403142 -17107397 -16368990 -14106683 -12009252
3110a2009252M022498O612923N464990J937080K171187O387580O825917l15268
$$ -12009252 -7986754 -1373831 4091159 6028239 8199426 14587006 21412923 21097655
3102B1097655p952262q517747n279739n735672p867179k759429R483767J6520837
$$ 21097655 13145393 4627646 -652093 -6387765 -14254944 -17014373 -7530606 8990231
3094H990231J0281293j095629m139427K032674O178445J392984o651982r173220
$$ 8990231 19271524 18175895 14036468 16069142 22247587 23640571 16988589 7815369
3086G815369n430078q88784J163907J490939J051979K65947R61899M133606N986914
$$ 7815369 2385291 1496507 2660414 4151353 5203332 5469279 6431178 10564784 16551698
3077A6551698J557769o684644r576109l617582K686232j0902q213565r933223
$$ 16551698 18109467 11424823 1848714 -1768868 917364 906462 -7307103 -17240326
3069a7240326j473422P401359O647838j776201q194242p451447k568106J424821
$$ -17240326 -18713748 -11312389 -4664551 -6440752 -14634994 -22086441 -24654547 -23229726
3061b3229726K743908K171749O26736j265056k564996k163143J96247K905226
$$ -23229726 -20485818 -18314069 -17687333 -18952389 -21517385 -23680528 -23484281 -20579055
3053b0579055L207954L30604k331155l13952N987102J0753299R456158M107791
$$ -20579055 -17371101 -17040497 -19371652 -19685604 -13698502 -2945203 6510955 10618746
3045A0618746N7724m68316P51008J772614J997962P43213k051577l597923n58192
$$ 10618746 10676470 10208154 10959162 12731776 14729738 15472951 13421374 9823451 9265259
3036I265259N203126O784462O55354p807984j0350540n680506k676J101762k222262
$$ 9265259 14468385 21252847 21908201 14100217 3749677 -1930829 -1933505 -831743 -3054005
3027c054005o349188p391820k286467Q363891J7186153J5062434K517022q388343
$$ -3054005 -9403193 -16795013 -19081480 -10717589 6468564 21530998 24048020 15659677
3019A5659677p879784l13092L267857R37664M66190M963936O688521j718458j5951842
$$ 15659677 7779893 7466801 10734658 11672322 12138512 17102448 23790969 22072511 6120669
3010F120669k4227311j9501011n068221Q730205J1744405K325994r149057r398905
$$ 6120669 -18106642 -37607653 -42675874 -33945669 -22201264 -19875270 -29024327 -38423232
3002c8423232K358594J2717434J1006354K383597j217348J916529L294071r56667
$$ -38423232 -36064638 -23347204 -12340850 -9957253 -11174601 -9258072 -5964001 -6920668
2994f920668m038512Q06266R709713J2346192M614683n902211q070945l02352
$$ -6920668 -10959180 -10152914 -443201 11902991 16517674 10615463 2544518 2242166
2986B242166O806563L490793o008871r308428l903998j08055l632330o269504
$$ 2242166 9048729 12539522 6530651 -2777777 -6681775 -6789830 -10422160 -16691664
2978a6691664r57057M248116j482019j3005680j6381926j0207684n194601m596416
$$ -16691664 -17648721 -13400605 -14882624 -27888304 -44270230 -54477914 -59672515 -64268931
2970f4268931q70740P052207R316872K882615p45086O915447J8001490K1087469
$$ -64268931 -65139671 -58087464 -48770592 -45887977 -46633063 -39717616 -21716126 -628657
2962f28657J6969958J2406261P316162r35964p519073o149298j057960j867426
$$ -628657 16341301 28747562 36063724 35127760 27608687 21459389 20401429 18534003
2954A8534003q349252j0220219k122281R359891J4676136J1228169L254936l656805
$$ 18534003 10184751 -35468 -2157749 7202142 21878278 33106447 36361383 32704578
2946C2704578o738511p053866o681311n036017p86554K893470P68061n476798
$$ 32704578 25966067 18912201 12230890 7194873 6408319 9301789 10069850 4593052
2938D593052p906492m707489l417721p401289q849757k419552M094823K788755
$$ 4593052 -3313440 -8020929 -11438650 -18839939 -27689696 -30109248 -26014425 -23225670
2930b3225670J51537N477217J2069589N940268j0177349j8077365r767543L089487
$$ -23225670 -23074133 -17596916 -5527327 412941 -9764408 -27841773 -37609316 -34519829
2922c4519829P813545N256901K172684J327735L602645R086569J1935874M642412
$$ -34519829 -26706284 -21449383 -19276699 -17948964 -14346319 -5259750 6676124 11318536
2914A1318536q580076j3572405n874491K768017K862217j04862J235193K750481
$$ 11318536 2738460 -10833945 -16708436 -13940419 -11078202 -11183064 -9947871 -7197390
2906g197390j059248m332929K9857N682649K221728o052720n219252O478184J5536524
$$ -7197390 -8256638 -12589567 -12559710 -6877061 -4655333 -10708053 -15927305 -9449121 6087403
2897F087403J2661943L754634r37023P09446M126161M955230J863118k600086
$$ 6087403 18749346 22503980 21566957 22276403 26402564 31357794 33220912 30620826
2889C0620826l191908J381052M308492o15952p974551o901739K285631P658638
$$ 30620826 27428918 28809970 33118462 32502510 24527959 17626220 19911851 27570489
2881B7570489L565581j615212m5761L259001J22766o559837p700620k625699P56625
$$ 27570489 31136070 29520858 29475097 32734098 32856864 26297027 18596407 15970708 16727333
2872A6727333j417992n012888o564334p685865q971304o781771K01962O672330
$$ 16727333 15309341 10296453 3732119 -3953746 -12925050 -19706821 -19504859 -12832529
2864a2832529P413113M576484L728027N425455N639167K870041k51590j883444
$$ -12832529 -5419416 -842932 2885095 8310550 13949717 16819758 16568168 14684724
2856A4684724k578928k038401O06013K782582N81216l644175k356450N383520
$$ 14684724 12105796 10067395 10673408 13455990 14037206 10393031 8036581 13420101
2848A3420101J0318813O483245J247788L820549R435876N631338q642247k1444839
$$ 13420101 23738914 30222159 31469947 35290496 44726372 50357710 41715463 20270624
2840B0270624k4419557j9558313r603171N046069J7409814J6342955M187933j296052
$$ 20270624 -4148933 -23707246 -33310417 -28264348 -10854534 5488421 9676354 8380302
2832H380302Q510290J8836714J2949852l332260j2356483j0627011p782645o122695
$$ 8380302 16890592 35727306 48677158 45344898 32988415 22361404 14578759 8456064
2824H456064K60549Q222185O494407m137573r048689k649390L093293n88547n426053
$$ 8456064 8716613 16938798 23433205 19295632 10246943 7597553 10690846 10102299 4676246
2815D676246k208291K960753L12823o240757o390611o76742K361366J226767J270142
$$ 4676246 2467955 5428708 5741531 -499226 -6889837 -7566579 -5205213 -3978446 -2708304
2806b708304K717326R54355k638607j530473M077852O618876L715732J586646
$$ -2708304 9022 963377 -1675230 -3205703 872149 7491025 11206757 12793403
2798A2793403L172920J960396p258034j7873464j7875335m348515J2409486J8591747
$$ 12793403 15966323 17926719 10668685 -7204779 -25080114 -29428629 -17019143 1572604
2790A572604R731736m513663q559612L400228J9959702K3769949R946415j0083380
$$ 1572604 11304340 6790677 -1768935 1631293 21590995 45360944 55307359 45223979
2782D5223979k2139945k1713095j2875066j317865Q219456J1965207R060201K515146
$$ 45223979 23084034 1370939 -11504127 -12821992 -4602536 7362671 16422872 18938018
2774A8938018l590707o700101n489037j82677N726468P530964N020701L065719
$$ 18938018 15347311 8647210 3158173 2975496 8701964 16232928 21253629 24319348
2766B4319348M426347N398446J739551m093272o003727l132071j132900m247662
$$ 24319348 28745695 34144141 35883692 31790420 25786693 22654622 21521722 17274060
2758A7274060r710482j1481010p366741q73129K967162K310796o49733k515886
$$ 17274060 7563578 -3917432 -11284173 -12157302 -9190140 -6879344 -7529077 -10044963
2750a0044963j686096J326113N322902Q817254R602422O145501P6409m511825
$$ -10044963 -11731059 -10404946 -5082044 3735210 13337632 19483133 19559542 15047717
2742A5047717n264350l602157j758317J86879K780722M782529M706733L334609
$$ 15047717 9783367 6181210 4422893 4609772 7390494 12173023 16879756 20214365
2734B0214365J945387p58319o431938j2159016j1943181m462899M204636P742052
$$ 20214365 22159752 21401433 14969495 2810479 -9132702 -13595601 -9390965 -1648913
2726a648913O467838M426696K642502n40746m130199m622079j741346N33648j9177
$$ -1648913 4818925 9245621 11888123 11347377 7217178 2595099 853753 1387401 1368224
2717A368224r07241J41578J277678M44118k77199K067919O296278R144986R913435
$$ 1368224 460983 602561 1880239 2324357 2047158 4115077 10411355 19556341 29469776
2708B9469776Q861967L664212o743556j6351987j7009191r421249k541889r03869
$$ 29469776 38331743 41995955 35252399 18900412 1891221 -7530028 -10071917 -10975786
2700a0975786K32371M534497P001875J934216p156357j1673440q365270n45919
$$ -10975786 -10743415 -6208918 792957 2727173 -4429184 -16102624 -24467894 -25013813
2692b5013813P450596J1919077R807800L004281r61564J319655K776470l087090
$$ -25013813 -17563217 -5644140 4163660 7167941 6206377 7526032 10302502 7215412
2684G215412r134208l375320J1107284J7569515Q623545m335074q954338p479369
$$ 7215412 -1918796 -5294116 5813168 23382683 32006228 27671154 18716816 11237447
2676A1237447p551344q112976m517962J28686K69288m72550N008479J2743317
$$ 11237447 3686103 -4426873 -8944835 -8816149 -8546861 -9019411 -4010932 8732385
2668H732385J1628880J937854l264910J334115L938445n676209j8313825j7242086
$$ 8732385 20361265 22299119 19034209 20368324 24306769 18630560 316735 -16925351
2660a6925351k258595J0244956R998176M029259K721948N114302M372560O09039
$$ -16925351 -19183946 -8938990 1059186 5088445 7810393 12924695 17297255 17906294
2652A7906294l44046K316175L354921R45869m20756J893600M059715K256392j576701
$$ 17906294 17562248 19878423 23233344 24179213 23758457 25652057 29711772 31968164 30391463
2643C0391463l992610n268417o213623m374881J054151M390296M26308o155371
$$ 30391463 26398853 21130436 14916813 10541932 11596083 15986379 16412687 10257316
2635A0257316o098241L60564K942822l701867j2196842j2921948n939547J729716
$$ 10257316 4159075 4519639 7462461 3760594 -8436248 -21358196 -27297743 -25568027
2627b5568027N552988N485867K637190q48527j107912L394645Q359993P964791
$$ -25568027 -20015039 -14529172 -11891982 -12740509 -13848421 -10453776 -2093783 5871008
2619E871008K027479l638598l236409L902723J2289561J3519738L998572q859076
$$ 5871008 7898487 4259889 1023480 4926203 17215764 30735502 34734074 25874998
2611B5874998j2205955k232639J0846719J5050262R183878k59050q570630j3062316
$$ 25874998 13669043 11436404 22283123 37333385 46517263 46258213 37687583 24625267
2603B4625267r646964J541453J0092115N149108q791368j5647548q894813P20533
$$ 24625267 14978303 16519756 26611871 31760979 22969611 7322063 -1572750 -852217
2595h52217K178402q12446J123243O532106N947391j687979o043658q19844O169658
$$ -852217 1326185 513739 1636982 8169088 14116479 12428500 6384842 5564998 11734656
2586A1734656L483921q169482j6857664j4423122m412735N487437J2473483J6458194
$$ 11734656 15218577 7049095 -9808569 -24231691 -28644426 -23156989 -10683506 5774688
2578E774688J4469864M431158p338916j0273395k703812N372315M964570k054910
$$ 5774688 20244552 24675710 17336794 7063399 4359587 9731902 14696472 12641562
2570A2641562q355221j0407390q434259k833916M035829P028945M707123K769144
$$ 12641562 4286341 -6121049 -14555308 -17389224 -13353395 -6324450 -1617327 1151817
2562A151817N586184Q560915N265992j793821m977929l106289j524919k592152
$$ 1151817 6738001 15298916 20564908 18771087 13793158 10686869 9161950 6569798
2554F569798l608898k765062k97925M216926Q875322P147808k897748j0808733
$$ 6569798 2960900 195838 -102087 4114839 12990161 20137969 17240221 6431488
2546F431488n991028N055735O506938k934110q366798k255220N446628M974354
$$ 6431488 440460 5496195 12003133 9069023 702225 -1552995 3893633 8867987
2538H867987L0076l064467o049997j0595080j1652094p604983n645162q142664
$$ 8867987 8898063 5833596 -216401 -10811481 -22463575 -30068558 -35713720 -43856384
2530d3856384n662432N959575J3913313O989967n151863o456445J227827M982201
$$ -43856384 -49518816 -43559241 -29645928 -22655961 -27807824 -34264269 -33036442 -28054241
2522b8054241L669757M934155N671006k371940r584366M576626L6815197N4442010
$$ -28054241 -24384484 -19450329 -13779323 -16151263 -25735629 -21159003 15656194 70098204
2514G0098204L5300738l303903k7284559k4503643r220538J109182J00254r649689
$$ 70098204 105398942 102095039 74810480 50306837 41086299 42195481 42295735 32646046
2506C2646046k0087626k1562090j1985154l16986M568720M332168M983549O009230
$$ 32646046 12558420 -9003670 -20988824 -21305810 -16737090 -12404922 -7421373 -1412143
2498a412143L416658o87574j26277N663391J1003370J1720730P981574J493266
$$ -1412143 2004515 1316941 1190664 6854055 17857425 29578155 37559729 39052995
2490C9052995m537227m942805J834137R155493Q616734j17083j0166829j5517648
$$ 39052995 34515768 29572963 31407100 40562593 49179327 49062244 38895415 23377767
2482B3377767j3535323l545470R841591J5276532N822444r375906j4009252n718135
$$ 23377767 9842444 6296974 16138565 31415097 37237541 27861635 13852383 8134248
2474H134248J527838j631100p204523l735261O110182J0453280N181247k998209
$$ 8134248 9662086 8030986 826463 -2908798 3201384 13654664 18835911 15837702
2466A5837702p614513p953357m539783K600343J0016537J2014560P944432L121903
$$ 15837702 8223189 269832 -4269951 -1669608 8346929 20361489 28305921 31427824
2458C1427824R05803o55890k441158j069950M015395O460591J874086m034041
$$ 31427824 32333627 31677737 29236579 28166629 32182024 38642615 40516701 36482660
2450C6482660l297963J868169K786744j545236l601638r42066m94898n913668
$$ 36482660 33184697 35052866 37839610 36294374 32692736 31750670 31255772 25342104
2442B5342104j0124643o509620M9305Q19084l685150o484336o108014o862462
$$ 25342104 15217461 8707841 8757146 9576230 5891080 -593256 -6701270 -13563732
2434a3563732q824510o309515K933210J3749116J9914262J9203628J1987242N37784
$$ -13563732 -22388242 -28697757 -25764547 -12015431 7898831 27102459 39089701 39627485
2426C9627485r460631j2212266q211676l373678j439568j518218k699611n406518
$$ 39627485 30166854 17954588 9742912 6369234 4929666 3411448 711837 -4694681
2418d694681p690488o138125j805483K56884j169541j599631J632592N536607
$$ -4694681 -12385169 -18523294 -20328777 -20071893 -21241434 -22841065 -21208473 -15671866
2410a5671866O905876N939029K687339l673409r448716p345135K850974J0669187
$$ -15671866 -8765990 -2826961 -139622 -3813031 -13261747 -20606882 -17755908 -7086721
2402g086721P427372k462851q024095n469524M7299L094748K745083P69436j92053
$$ -7086721 340651 -2122200 -10146295 -15615819 -15568520 -12473772 -9728689 -8959253 -9151306
2393i151306J888268N405263N729499J665731j889308j023743J248511L85508
$$ -9151306 -7263038 -1857775 3871724 5537455 3648147 2624404 3872915 4258423
2385D258423j951751q17262L818724O986019N471634M79738n101869q561411q103095
$$ 4258423 2306672 1489410 5308134 12294153 17765787 18245525 13143656 4582245 -3520850
2376c520850m839779k257282j463902J2511K554515K277894j961151m586540j311983
$$ -3520850 -8360629 -10617911 -12081813 -12069302 -9514787 -7236893 -9198044 -13784584 -15096567
2367a5096567L699733M470610K427023K405766L629885K086810j382759k864023
$$ -15096567 -11396834 -6926224 -4499201 -2093435 1536450 3623260 2240501 -623522
2359f23522k349512j675348R87216O334493P557127q42186j0543231p820805N775270
$$ -623522 -2973034 -4648382 -3661166 2673327 10230454 9388268 -1154963 -8975768 -3200498
2350c200498J3530873O472748n446635q805628k791735M982907R177057P522233
$$ -3200498 10330375 16803123 11356488 2550860 -240875 4742032 13919089 21441322
2342B1441322p15298j0806929j3892455p923972j119722K35365K18104L976641
$$ 21441322 20726024 9919095 -3973360 -11897332 -13017054 -12781689 -12563585 -8586944
2334h586944P846931O308089K194943J340398K131675n87567n052178n338758
$$ -8586944 -740013 5568076 7763019 9103417 11235092 10647525 5595347 256589
2326B56589k185973j796610m813592n374846j475763K064339K554368L825270
$$ 256589 -1929384 -3725994 -8539586 -13914432 -15390195 -13325856 -10771488 -6946218
2318f946218Q804343J3732912J3407940Q051532J769644k671043m616713l599779
$$ -6946218 1858125 15591037 28998977 37050509 38820153 36149110 31532397 27932618
2310B7932618J23397L918176M032947q91309p986192j2170851j0667523n617326
$$ 27932618 28056015 31974191 36007138 35115829 27129637 14958786 4291263 -1326063
2302a326063j124159J989118N702711Q587823M752676p372961j8875893j8656378
$$ -1326063 -2450222 -461104 5241607 13829430 18582106 11209145 -7666748 -26323126
2294b6323126o721187N970235J0531424P882899L387523k23430k279428j562034
$$ -26323126 -33044313 -27074078 -16542654 -8659755 -5272232 -5495662 -7775090 -9337124
2286i337124J883983N119081N699277M635750L424365P46132m384329q467210
$$ -9337124 -7453141 -2334060 3365217 8000967 11425332 12171464 7787135 -680075
2278f80075p248358k680793q13965k154645j29993P816460J3347437P633312m707423
$$ -680075 -7928433 -10609226 -11423191 -13577836 -13707829 -5891369 7456068 15089380 10381957
2269A0381957j0006806l596536M740507N544609J618228J77970O42195j637648
$$ 10381957 375151 -3221385 1519122 7063731 8681959 8859929 9502124 7864476
2261G864476m754478l425082k37772k720606r036991q150535K393472R915191
$$ 7864476 3109998 -315084 -552856 -3273462 -12310453 -20460988 -18067516 -8152325
2253h152325M602506m873618l262460Q971383J5620641O202735j0842979j8412921
$$ -8152325 -3549819 -8423437 -11685897 -2714514 12906127 19108862 8265883 -10147038
2245a0147038r594301N784535J2050136M715199m390787j932381Q683867J1417255
$$ -10147038 -19741339 -13956804 -1906668 2808531 -1582256 -3514637 5169230 16586485
2237A6586485R71209q746225n743538J423333k278480j3802676j6953183q284709
$$ 16586485 17557694 8811469 3067931 4491264 2212784 -11589892 -28543075 -36827784
2229c6827784j163666k828289m131811K174964P893119L581659n128871o589230
$$ -36827784 -37991450 -40819739 -44951550 -42776586 -34883467 -31301808 -36430679 -43019909
2221d3019909n19148M791543O739144Q480212Q747447L382109m271593n466509
$$ -43019909 -43539057 -38747514 -32008370 -23528158 -14780711 -11398602 -15670195 -21136704
2213b1136704O36782N099269K436427k306180k091377L282373R394867J2517382
$$ -21136704 -20499922 -15400653 -12964226 -15270406 -17361783 -14079410 -4684543 7832839
2205G832839J0687674M878917O17251K685284O936863M240031n400233j0666485
$$ 7832839 18520513 23399430 24016681 26701965 33638828 37878859 32478626 21812141
2197B1812141m897899L740067M213944k186389o398862n866367n224763o140618
$$ 21812141 16914242 20654309 24868253 22681864 16283002 10416635 5191872 -948746
2189i48746n787869l901152k561544K36193P864762J5825987J4634160L803749
$$ -948746 -6736615 -10637767 -13199311 -12963118 -5098356 10727631 25361791 29165540
2181B9165540n785946o369652j991756N85872J201355J652617k76153n537619
$$ 29165540 23379594 17009942 15018186 15604058 16805413 18458030 18181877 12644258
2173A2644258q810591n797624q24269o40325m815514q369798r547642q700799
$$ 12644258 3833667 -1963957 -2788226 -3428551 -8244065 -16613863 -26161505 -34862304
2165c4862304m241854L056132O343357J537037l978069k91924J0512885J7647093
$$ -34862304 -39104158 -36048026 -29704669 -28167632 -32145701 -32437625 -21924740 -4277647
2157d277647J6288942R646543J22847j0155975j3050515k515173J1492908J1756398
$$ -4277647 12011295 21657838 21780685 11624710 -1425805 -3940978 7551930 19308328
2149A9308328j887379j1609416p910693j013897m41158j52273N939098R093555
$$ 19308328 17420949 5811533 -2099160 -3113057 -3554215 -3706488 2232610 11326165
2141A1326165M48870j1023292j0756518p98666N295644L686465J229838k73001
$$ 11326165 11775035 751743 -10004775 -10803441 -5507797 -1821332 -591494 -864495
2133h64495n078640j0652596q924333o56038M926543N517471P553472J1503807
$$ -864495 -5943135 -16595731 -25520064 -26176102 -21249559 -15732088 -8178616 3325191
2125C325191R370294L58599m506137O39086O727546M504551q99316Q25847Q399607
$$ 3325191 12695485 13054084 8547947 9187033 15914579 20419130 19519814 20345661 28745268
2116B8745268J0768435K244176j1455128k0460109j9159756r300356J627758O794714
$$ 28745268 39513703 41757879 30302751 9842642 -9317114 -18617470 -16989712 -10194998
2108a0194998O671415O542817O981644K470740q111955j5990441j2472671l53007
$$ -10194998 -3523583 3019234 10000878 12471618 4359663 -11630778 -24103449 -24456456
2100b4456456R506899J0275286L950300l342067o986027o290017l925237k178265
$$ -24456456 -14949557 -4674271 -723971 -4066038 -11052065 -17342082 -21267319 -23445584
2092b3445584K02202M574249O924070J940071o738665q089896J172573J0634130
$$ -23445584 -23243382 -18669133 -11745063 -9804992 -16543657 -24633553 -23460980 -12826850
2084a2826850J0432529M180087P17538j03354l604158p038927k500547P389192
$$ -12826850 -2394321 1785766 2503304 2399950 -1204208 -8243135 -10743682 -3354490
2076c354490R216877j521505j0638212l058974J5570296K4332647J2707440p462322
$$ -3354490 5862387 4340882 -6297330 -9356304 6213992 30546639 43254079 35791757
2068C5791757j7524350j2837414l462453J415053K512683M205592O409598O276028
$$ 35791757 18267407 5429993 1967540 3382593 5895276 10100868 16510466 22786494
2060B2786494L535068k46837m944663j0062956j1913474p471456J79110M768807
$$ 22786494 26321562 26074725 21130062 11067106 -846368 -8317824 -8138714 -3369907
2052c369907M181075P26460l949870q786131r895913m116244M413993Q128504
$$ -3369907 811168 1537628 -2412242 -11198373 -21094286 -25210530 -20796537 -12668033
2044a2668033O569845N809581P162139N247123p96140l602347N70689M685164
$$ -12668033 -6098188 -288607 6873532 12120655 11324515 7722168 8292857 12978021
2036A2978021J444285n847091r127515o633132k051584K270076N079954L707448
$$ 12978021 14422306 8575215 -552300 -7185432 -9237016 -6966940 -1886986 1820462
2028A820462j776294n355612j958409N172664Q829573O673027J764721k087499
$$ 1820462 44168 -5311444 -7269853 -2097189 6732384 13405411 15170132 13082633
2020A3082633j969172K499521N669925J00082j1416675j5485023n901186N911206
$$ 13082633 11113461 13612982 19282907 19382989 7966314 -7518709 -13419895 -7508689
2012g508689O209128k695067q799168q161928n032082j45575Q033851J4034412
$$ -7508689 -1299561 -3994628 -12793796 -20955724 -25987806 -26133381 -18099530 -4065118
2004d065118J0809714K723468J96785K617584J16743p830869j0216461l086365
$$ -4065118 6744596 9468064 9664849 12282433 12399176 4568307 -5648154 -8734519
1996h734519L930197L822744J602192K035389O84078n506243r831202o636715
$$ -8734519 -4804322 -981578 620614 2656003 3340081 -2166162 -11997364 -18634079
1988a8634079j501176j865788m772397k542688M865819J0833901J1073388N843239
$$ -18634079 -20135255 -22001043 -26773440 -29316128 -24450309 -13616408 -2543020 3300219
1980C300219j984155o227804q69776J0455844J5068957P316188k821492l862817
$$ 3300219 1316064 -4911740 -5781516 4674328 19743285 27059473 24237981 20375164
1972B0375164J687357M167933K285501J842825L726929L456594R0905l320430
$$ 20375164 22062521 26230454 28515955 30358780 34085709 37542303 37633208 34312778
1964C4312778n931036p895066o027761J074855O814856M491642j474453j786730
$$ 34312778 28381742 20486676 14458915 15533770 22348626 26840268 25365815 23579085
1956B3579085K935647M302974J340705J645515P034181R814096N579701q88269
$$ 23579085 26514732 30817706 32158411 33803926 40838107 50652203 56231904 55343635
1948E5343635n164731q423772j0285312p095201j308061j685872q702432j0591367
$$ 55343635 50178904 41755132 31469820 24374619 23066558 21380686 12678254 2086887
1940B086887j133022R054383Q214766J048800o57695K750182K322252j816568
$$ 2086887 953865 10008248 18223014 19271814 18614119 21364301 23686553 21869985
1932B1869985j179775M069992L722162m575143r594796l997058L921244L224726
$$ 21869985 20690210 24760202 28482364 23907221 14312425 10315367 14236611 17461337
1924A7461337l984271q289371p318158n089174k205734K883877N592605n96113
$$ 17461337 13477066 5187695 -2130463 -7219637 -9425371 -6541494 -948889 -1545002
1916a545002j1168888j2729743j746460Q365572N231237m921564o385382L863436
$$ -1545002 -12713890 -25443633 -27190093 -18824521 -13593284 -18514848 -24900230 -21036794
1908b1036794J3250946J2051027M819230Q23849J575614L047364L938199M973114
$$ -21036794 -7785848 4265179 9084409 9908258 11483872 14531236 18469435 23442549
1900B3442549L912040j476624p301630p496950l457250k649279o652115p871972
$$ 23442549 27354589 25877965 18576335 11079385 7622135 4972856 -1679259 -9551231
1892i551231j273214P109411Q406331K945034j796910k066840k27971K067355
$$ -9551231 -10824445 -3715034 4691297 7636331 5839421 3772581 3544610 5611965
1884E611965O098059J0780707J1342136N754403j901439p063040r902638j2036625
$$ 5611965 11710024 22490731 33832867 39587270 37685831 30622791 20720153 8683528
1876H683528j1679650o446262J034091N177444N011524N308518Q923163J1862866
$$ 8683528 -2996122 -9442384 -8408293 -3230849 1780675 7089193 16012356 27875222
1868B7875222Q879394J501275l585974l762758l640264p069349r946992n687923
$$ 27875222 36754616 38255891 34669917 30907159 27266895 20197546 10250554 4562631
1860D562631L757742Q505693L907170k590444j815244M339067O502492J702285
$$ 4562631 8320373 16826066 20733236 18142792 16327548 20666615 27169107 28871392
1852B8871392l618160m525740m226697p054628j0703608r833923l972914K213722
$$ 28871392 25253232 20727492 16500795 9446167 -1257441 -11091364 -15064278 -12850556
1844a2850556M597299K784155m61089j038959K864293P373101O195203j028112
$$ -12850556 -8253257 -5469102 -5930191 -6969150 -4104857 3268244 9463447 8435335
1836H435335p283257o840398r41178O814728J4363625J7272745R127729p514019
$$ 8435335 1152078 -5688320 -6629498 185230 14548855 31821600 40949329 33435310
1828C3435310j8055271j3024247k383134j849243r795200j0965199p64696R002835
$$ 33435310 15380039 2355792 -27342 -1876585 -11671785 -22636984 -23401680 -14398845
1820a4398845R630929N983130L703835J26382n533997n594838L745132J3503329
$$ -14398845 -4767916 1215214 4919049 5045431 -488566 -6083404 -2338272 11165057
1812A1165057J4157884Q127583J824733n205765j3161956j3481130q53714J2650514
$$ 11165057 25322941 33450524 35275257 30069492 16907536 3426406 2572692 15223206
1804A5223206J0313167m881537j2792272l525267J0411507J2420206J956064q524818
$$ 15223206 25536373 20654836 7862564 4337297 14748804 27169010 29125074 20600256
1796B0600256r836152m061654O57705j18494k711862j132348L520264M155615
$$ 20600256 10764104 6702450 7360155 7241661 4529799 3397451 6917715 11073330
1788A1073330p71687m200382k682096k830987q658479j1567466l315383Q639102
$$ 11073330 10301643 6101261 3419165 588178 -8070301 -19637767 -22953150 -14314048
1780a4314048J1192985N212130J526364J841592j261113p648110q707158k994399
$$ -14314048 -3121063 2091067 3617431 5459023 4197910 -3450200 -12157358 -15151757
1772a5151757K241037N580846J1726065J6031847O713429j2403420j9096949k236808
$$ -15151757 -12910720 -7329874 4396191 20428038 27141467 14738047 -4358902 -6595710
1764f595710K0291792K4447453R965002m089124n783642q64830o37619q077954
$$ -6595710 13696082 38143535 48108537 44019413 38235771 37370941 36733322 28655368
1756B8655368j5419284j2519014N93589J1006025Q384509k29629r15067N418847
$$ 28655368 13236084 717070 1310659 12316684 20701193 20471564 19556497 24975344
1748B4975344O027293p10740k909460K777428N716108K141929J944278Q360463
$$ 24975344 31002637 30291897 27382437 30159865 35875973 38017902 39962180 48322643
1740D8322643J0921770O488441O234047J2129771R325857n659270j3363249l624294
$$ 48322643 59244413 65732854 71966901 84096672 93422529 87763259 74400010 70775716
1732G0775716N814972K013782J221752J6258075K7441169J7275573O245650J3595976
$$ 70775716 76590688 78604470 79826222 96084297 123525466 140801039 147046689 160642665
1724A60642665Q088413m8183721j20547669j28588826n6895327J9530665L6887185
$$ 160642665 168731078 120547357 -312 -128589138 -185484465 -165953800 -129066615
1717a29066615J5761714P098963J5099528J3478725K172626J859834J1022102
$$ -129066615 -113304901 -106205938 -91106410 -77627685 -75455059 -73595225 -62573123
1710f2573123R567416l439396r130958j433040O956148Q237567O530471L972275
$$ -62573123 -53005707 -56445103 -65576061 -67009101 -60052953 -51815386 -45284915 -41312640
1702d1312640r37965m214049j930140j11353m310033o582820J523206J1516070
$$ -41312640 -42250605 -46464654 -48394794 -48506147 -52816180 -59399000 -57875794 -46359724
1694d6359724J0790209M514804N952838J2573473J1905466M881086K334158L029898
$$ -46359724 -35569515 -31054711 -25101873 -12528400 -622934 4258152 6592310 9622208
1686I622208l136293j2981335j2852210k588855M108999K936850K315393L813675
$$ 9622208 6485915 -6495420 -19347630 -21936485 -17827486 -14890636 -12575243 -8761568
1678h761568L29914n611356l530751L447902J374230p494214m964373J0306939
$$ -8761568 -8431654 -14043010 -17573761 -14125859 -12751629 -20245843 -25210216 -14903277
1670a4903277J6184940K988222r324607l882655O804070N154276j737528J749517
$$ -14903277 1281663 4269885 -5054722 -8937377 -2133307 3020969 1283441 3032958
1662C032958J0159067P185181n142352j0481258n200508o29424j918788l278353
$$ 3032958 13192025 20377206 15234854 4753596 -446912 -1076336 -2995124 -6273477
1654f273477k331836k725074l700236j513114P94147j296261k252722M683455
$$ -6273477 -8605313 -11330387 -15030623 -16543737 -15749590 -17045851 -19298573 -14615118
1646a4615118J1155270M012845j0227279j1559702J505104P673981l319041j3752748
$$ -14615118 -3459848 552997 -9674282 -21233984 -19728880 -12054899 -15373940 -29126688
1638b9126688o190493R399741J2521498L001538k795887J188451N480617L910929
$$ -29126688 -35317181 -25917440 -13395942 -10394404 -13190291 -12001840 -6521223 -2610294
1630b610294J513631K317113K356097j521536n572885n924301m254312l200562
$$ -2610294 -1096663 1220450 3576547 2055011 -3517874 -9442175 -13696487 -16897049
1622a6897049k045957l01635l13677k653723l328279L22562M182533K209828m848747
$$ -16897049 -18943006 -19244641 -19558318 -22212041 -25540320 -25217758 -21035225 -18825397 -23674144
1613b3674144r480787o069236K928908R755580R005777K390081l541818m305400
$$ -23674144 -33154931 -39224167 -36295259 -26539679 -17533902 -15143821 -18685639 -22991039
1605b2991039j548617N25807J315860L522401P167424Q152044M493713J69339
$$ -22991039 -24539656 -24013849 -22697989 -19175588 -12008164 -3856120 637593 806932
1597H06932n22014K75014l025187j0771868j6301423j3119845j535404J1446654
$$ 806932 284918 559932 -2465255 -13237123 -29538546 -42658391 -44193795 -32747141
1589c2747141J6825998R848011m853802j5154231j2412205m68872R704831J3148856
$$ -32747141 -15921143 -6073132 -10926934 -26081165 -38493370 -38962242 -29257411 -16108555
1581a6108555J3566732J3715023J0809628L704347l037741o905261j2384224k1498459
$$ -16108555 -2541823 11173200 21982828 25687175 22649434 15744173 3359949 -18138510
1573a8138510k5379392j4686244M426973J4981865J0187878N23282k280975P33060
$$ -18138510 -43517902 -58204146 -53777173 -38795308 -28607430 -28084148 -30365123 -29632063
1565b9632063K430091K405797N350622J0691079J2154079P369661J476184k75990
$$ -29632063 -27201972 -24796175 -19445553 -8754474 3399605 10769266 12245450 11969460
1557A1969460J139595J687622K46099j498137k941545m762239n726169l121791
$$ 11969460 13109055 14796677 15042776 13544639 10603094 5840855 114686 -3007105
1549c007105K163460M408632L32292m572130k004858P094774J2350727P664160
$$ -3007105 -843645 3564987 3897279 -674851 -2679709 4415065 16765792 24429952
1541B4429952r65801n296189o382927r392527j1679914o026770N275003J0293252
$$ 24429952 23464151 18167962 11785035 2392508 -9287406 -15314176 -10039173 254079
1533B54079M305120k413897R74965J0826391J5362369J1162667N378060L641449
$$ 254079 4559199 2145302 3120267 13946658 29309027 40471694 45849754 49491203
1525D9491203L623226J335144k527392n321360p515270j1229622j4884282j2832172
$$ 49491203 53114429 54449573 51922181 46600821 39085551 27855929 12971647 139475
1517A39475k218146J1079909J6671310J1222756K650691m11046N6968l479299
$$ 139475 -2078671 9001238 25672548 36895304 39545995 39134949 39191917 35712618
1509C5712618j0223502j1392405n355844j887355o172957q462241J242955J5463379
$$ 35712618 25489116 14096711 8740867 6853512 680555 -7781686 -6538731 8924648
1501H924648J7823314N718627p546320j2192059j1374383r895557o103185j432
$$ 8924648 26747962 32466589 24920269 12728210 1353827 -8541730 -14644915 -14646347
1493a4646347J578625m253193q667614k973356P621949J1443725P309710L838968
$$ -14646347 -13067722 -17320915 -25988529 -28961885 -21339936 -9896211 -2586501 1252467
1485A252467M047527K053423l606126m649349L539191J1846317Q987053j760363
$$ 1252467 5299994 7353417 3747291 -902058 2637133 14483450 23470503 21710140
1477B1710140o464142L2906P330994M411905n603785j0615169n466371L244570
$$ 21710140 15245998 15278904 22609898 27021803 21418018 10802849 5336478 8581048
1469H581048P211511N585709K705637J130887Q2227j514716l670022o183179q422849
$$ 8581048 15792559 21378268 24083905 25214792 25297019 23782303 20112281 13929102 5506253
1460E506253q753685o154674j899219J985275M835345O044900L564859k825867
$$ 5506253 -3247432 -9402106 -11301325 -9316050 -4480705 1564195 5129054 2303187
1452B303187q054697o184682J545363P566003P433436L699978m19270n068567
$$ 2303187 -5751510 -11936192 -10390829 -2824826 4608610 8308588 7889318 2820751
1444B820751q826834o437551L208802J1880238J1168629L357439k992532m690923
$$ 2820751 -6006083 -12443634 -9234832 2645406 13814035 17171474 14178942 9488019
1436I488019m060256j100294N213972R776616O066834j840185k950938L285580
$$ 9488019 5427763 4327469 9541441 19318057 25384891 23544706 20593768 23879348
1428B3879348N151954k020119p598333m003988o47741p958837j7727472j4366208
$$ 23879348 29031302 27011183 19412850 15408862 14761121 6802284 -10925188 -25291396
1420b5291396K77204R452319O542748J565409J932824K635089j66307n11593M777406
$$ -25291396 -25014192 -15561873 -9019125 -7453716 -5520892 -2885803 -3052110 -3563703 1213703
1411A213703P001875j176104j2225832j3796532o287212l96428r70048k782885
$$ 1213703 8215578 7039474 -5186358 -18982890 -25270102 -25666530 -26636578 -29419463
1403b9419463p24908M045939Q092515R759881R018727P365341P249244Q588071
$$ -29419463 -30144371 -26098432 -18005917 -8246036 772691 8138032 15387276 23975347
1395B3975347P811846L231581j891029n046035q849983j4770560j7038125r751121
$$ 23975347 31787193 35018774 33127745 28081710 19231727 4461167 -12576958 -22328079
1387b2328079K904933J0783817J0333766O243613K441052q14541j661899L108049
$$ -22328079 -19423146 -8639329 1694437 7938050 10379102 9564561 7902662 11010711
1379A1010711J1010928J4025326Q255535j432020p911518q630548n438149k291517
$$ 11010711 22021639 36046965 44302500 42870480 34958962 26328414 20890265 18598748
1371A8598748l456706r057310j2277732o474997M571919R527764L733253n217247
$$ 18598748 15142042 6084732 -6193000 -12667997 -8096078 1431686 5164939 -52308
1363e2308p518854j141001R477584J8371440J9564013J0214071m101077j2417257
$$ -52308 -7571162 -8712163 765421 19136861 38700874 48914945 44813868 32396611
1355C2396611j0278669m350677k608467n117779p773919r567696j1315408j1494493
$$ 32396611 22117942 17767265 15158798 10041019 2267100 -7300596 -18616004 -30110497
1347c0110497q531818m360220j404611J227742M641126O284692L673008m04849
$$ -30110497 -38642315 -43002535 -44407146 -43179404 -38538278 -32253586 -28580578 -28985427
1339b8985427r48031K543284O399822Q347481Q774429P600282M052596n37593
$$ -28985427 -29933458 -27390174 -20990352 -12642871 -3868442 3731840 7784436 7246843
1331G246843l219723l275175l103702m598119o456202o097765l392665j174770
$$ 7246843 4027120 751945 -2351757 -6949876 -13406078 -19503843 -22896508 -24071278
1323b4071278j310816j136312L628932J1662440J5318305J0125201J774407r95910
$$ -24071278 -25382094 -26518406 -22889474 -11227034 4091271 14216472 15990879 14994969
1315A4994969J955732L316736n16275n830784q465160p697832l642388K238530
$$ 14994969 16950701 20267437 19751162 13920378 5455218 -2242614 -5885002 -3646472
1307c646472M377892r69395o884495k580913R322864J3352042L158123q262799
$$ -3646472 731420 -237975 -7122470 -9703383 -380519 12971523 16129646 7866847
1299G866847p325718J279366L910797j728052o595147n854990l596747l790093
$$ 7866847 541129 1820495 5731292 4003240 -2591907 -8446897 -12043644 -15833737
1291a5833737n424382o404391n906284l308506P44697L748110N055525O921234
$$ -15833737 -21258119 -27662510 -33568794 -36877300 -36132603 -32384493 -27328968 -20407734
1283b0407734Q786187N751516k976273j0057775r753599n543797k332424J649269
$$ -20407734 -11621547 -5870031 -8846304 -18904079 -28657678 -34201475 -36533899 -34884630
1275c4884630P911816J0718805O739597M328902J1253184J8936465J2699977n239200
$$ -34884630 -26972814 -16254009 -9514412 -5185510 6067674 25004139 37704116 32464916
1267C2464916j6884361j2300639q136P219078N812255p28696p599591j0574857
$$ 32464916 15580555 3279916 3271780 10490858 16303113 15574417 7974826 -2600031
1259b600031r639606j0297652j4186786j2213301K537712J9180941K0324818P249520
$$ -2600031 -12239637 -22537289 -36724075 -48937376 -46399664 -27218723 -6893905 355615
1251C55615j633515K036477P354761N251339J998673M835600Q845439P072758
$$ 355615 -1277900 758577 8113338 13364677 15363350 20198950 29044389 36117147
1243C6117147J933463k113313o872734j3121478j4891934r520513m245101m372975
$$ 36117147 38050610 35937297 29064563 15943085 1051151 -8469362 -12714463 -17087438
1235a7087438l941945K784973R315026O831987r60233l614033N50432M565344
$$ -17087438 -21029383 -18244410 -8929384 -2097397 -3057630 -6671663 -6121231 -1555887
1227a555887M475611K029110j071963l972741m604504k891257k465257m318594
$$ -1555887 2919724 4948834 3876871 -95870 -4700374 -7591631 -10056888 -14375482
1219a4375482l907166N22279L337359R44584j747975r71400j742792p554713j1238413
$$ -14375482 -18282648 -17760369 -14423010 -13478426 -15226401 -16197801 -17940593 -25495306 -36733719
1210c6733719o562743p36118k999910p858527l817395O498020J0560241P358545
$$ -36733719 -43296462 -44032580 -47032490 -54891017 -58708412 -52210392 -41650151 -34291606
1202c4291606Q115731J5327085J7314648P595393m251056p124339k898133J47226
$$ -34291606 -26175875 -10848790 6465858 14061251 9810195 2685856 -212277 -65051
1194f5051k42183j265143k399808n234871q851594r514848m048650O672519J5700402
$$ -65051 -307234 -1572377 -3972185 -9207056 -18058650 -27573498 -31622148 -24949629 -9249227
1185i249227J4206497K418240o996168l692855N166855M124442p552412j3682104
$$ -9249227 4957270 7375510 379342 -3313513 1853342 5977784 -1574628 -15256732
1177a5256732m075838J1462066J6987126R526560j542461p659234p628122n216131
$$ -15256732 -19332570 -7870504 9116622 18643182 17100721 9441487 1813365 -3402766
1169c402766m892398p394169p700960j116027Q203663J0618233M028135l265374
$$ -3402766 -8295164 -15689333 -23390293 -24506320 -16302657 -5684424 -1656289 -4921663
1161d921663m743531l332750l671890m290544k416020r2469K09408Q64177M254694
$$ -4921663 -9665194 -12997944 -16669834 -20960378 -23376398 -23468867 -23259459 -22395282 -18140588
1152a8140588P099384N285797O21109k611665m150326n162096k834266N392377
$$ -18140588 -11041204 -5755407 -5134298 -7745963 -11896289 -17058385 -19892651 -14500274
1144a4500274J4019154J3264933J509056j1258686j3968057n303575O566514J2182198
$$ -14500274 -481120 12783813 14292869 3034183 -10933874 -16237449 -9670935 2511263
1136B511263Q113634j237803p797924o914928j100517L420962L355307Q67266
$$ 2511263 10624897 9387094 1589170 -5325758 -6426275 -3005313 349994 1217260
1128A217260M9741J947286L592995K006022j761867m312371n288178p454846r942910
$$ 1217260 1267001 3214287 6807282 8813304 7051437 2739066 -2549112 -10003958 -19946868
1119a9946868o362164N689452J7345134J7826327R082620K938925L787827L204273
$$ -19946868 -26309032 -20619580 -3274446 14551881 23634501 26573426 30361253 33565526
1111C3565526n539277j6069182j7356201p824350M355155J1024744R530310K170328
$$ 33565526 28026249 11957067 -5399134 -13223484 -8868329 2156415 11686725 13857053
1103A3857053n292315p468923n377517n465582r469956r904215n17353J3072643
$$ 13857053 8564738 1095815 -4281702 -9747284 -19217240 -29121455 -29638808 -16566165
1095a6566165J9537203J5645483P161959j652246j0962282j7654111j4055511
$$ -16566165 2971038 18616521 25778480 24126234 13163952 -4490159 -18545670
1088a8545670P98754J4650832J3642807j134387j4260551j3617641k961581M964937
$$ -18545670 -17746916 -3096084 10546723 9412336 -4848215 -18465856 -21427437 -16462500
1080a6462500L983750r50156k828668o92878K421249M531263M470782M82161o583485
$$ -16462500 -12478750 -13428906 -16257574 -16950452 -14529203 -9997940 -5527158 -5044997 -11628482
1071a1628482j1235995r151952l185382J022369L418409P753316J2696924J1853128
$$ -11628482 -22864477 -32016429 -35201811 -34179442 -30761033 -23007717 -10310793 1542335
1063A542335L826648l959586m230456J560461O050508M559100o35647k817290
$$ 1542335 5368983 1409397 -2821059 -1260598 4789910 9349010 8713363 5896073
1055E896073K166224R928978J1251155M460446r07388J666073M198126l297726
$$ 5896073 8062297 17991275 29242430 33702876 32795488 34461561 38659687 35361961
1047C5361961j4402426j4405663m406762n66283p544548j0558229l11807J1233695
$$ 35361961 20959535 6553872 2147110 1580827 -5963721 -16521950 -16833757 -5600062
1039e600062J0369794K120269j558645j508147m721366q150698n033633N3668
$$ -5600062 4769732 6890001 5331356 3823209 -898157 -9048855 -14082488 -14028820
1031a4028820j587765o192558m124590J593511L23085n422739k297283J0484926
$$ -14028820 -15616585 -21809143 -25933733 -24340222 -24017137 -29439876 -31737159 -21252233
1023b1252233J7678738J1222714J221353j047226K815529O546931Q574624P285006
$$ -21252233 -3573495 7649219 8870572 7823346 10638875 17185806 25760430 33045436
1015C3045436q81533j1930910j4122580m516612M562086L065503k750738k180546
$$ 33045436 32163903 20232993 6110413 1593801 6155887 9221390 6470652 4290106
1007D290106L427379N607144K458536k327485p386021j1038882p512639L465342
$$ 4290106 7717485 13324629 15783165 13455680 6069659 -4969223 -12481862 -9016520
999i016520R526067P50540j2506602j1141304M897745J5460540Q917741k917637
$$ -9016520 509547 1260087 -11246515 -22387819 -17490074 -2029534 6888207 3970570
991C970570m753536P20964J839991j441207Q2814O122635N378809n352625j3313818
$$ 3970570 -782966 -62002 1777989 336782 419596 6542231 11921040 6568415 -6745403
982f745403p226102O764724J4760811J3686207J0158351N996151k027992r252252
$$ -6745403 -13971505 -7206781 7554030 21240237 31398588 37394739 35366747 26114495
974B6114495n103471P792486J0994016m306074k1518118k0654021o104697K864347
$$ 26114495 21011024 28803510 39797526 35491452 13973334 -6680687 -12785384 -9921037
966i921037J883913K786267Q003280N227409q012302j4522755k764004J3279203
$$ -9921037 -8037124 -5250857 2752423 7979832 -32470 -14555225 -17319229 -4040026
958d040026J2915653k818506j5141456j3449790m259712K541158M832236N795167
$$ -4040026 8875627 6057121 -9084335 -22534125 -26793837 -24252679 -19420443 -13625276
950a3625276Q268581J1997287J2548900N372687o107820j1873920q866162n801908
$$ -13625276 -5356695 6640592 19189492 24562179 18454359 6580439 -2285723 -8087631
942h087631q513838r478184j386991P606588N493855k955253k944259N655585
$$ -8087631 -16601469 -26079653 -27466644 -19860056 -14366201 -17321454 -20265713 -14610128
934a4610128P456634k890787j0833739l859102J0080575J4810475P197954k710122
$$ -14610128 -7153494 -10044281 -20878020 -24737122 -14656547 153928 7351882 4641760
926D641760o493752m170611P1484K596645K653710L034969N619586N720499k917116
$$ 4641760 -1851992 -6022603 -5951119 -3354474 -700764 2334205 7953791 13674290 10757174
917A0757174j5941095j9696048r072820M284359Q053172N664861P821052J3873014
$$ 10757174 -5183921 -24879969 -33952789 -29668430 -21615258 -15950397 -8129345 5743669
909E743669J3171761K869566o898442p284831j436826K384950K091299K006366
$$ 5743669 18915430 21784996 14886554 7601723 6164897 8549847 10641146 12647512
901A2647512N329252J0016286J1275216O733949o22203n271110n624783n578876
$$ 12647512 17976764 27993050 39268266 46002215 45380012 40108902 34484119 28905243
893B8905243p808996q847873m939847P9382r51290p080934q992328j946464P101143
$$ 28905243 21096247 12248374 7308527 7387909 6436619 -644315 -9636643 -11583107 -4481964
884d481964Q901535L875454q6088P16885J619947k541219r302545j0880030l821010
$$ -4481964 4419571 8295025 8208937 8925822 10545769 8004550 -1297995 -12178025 -15999035
875a5999035N920320R163418M080614k104062k934996q29535k128358o948633
$$ -15999035 -10078715 -915297 3165317 1061255 -1873741 -2703276 -4831634 -11780267
867a1780267r494552p579423n233702m292484J2505J0863817K2121841K4240237
$$ -11780267 -21274819 -28854242 -34087944 -38380428 -38367923 -27504106 -5382265 18857972
859A8857972J5294695J387195j1340110j9552533j9792164j0315391L045391R544394
$$ 18857972 34152667 35539862 24199752 4647219 -15144945 -25460336 -22414945 -12870551
851a2870551N345317j712675k272385L432272Q039061P122117K368481k968734
$$ -12870551 -7525234 -9237909 -11510294 -8078022 -38961 7083156 9451637 6482903
843F482903o803995p151366l021303K944046O156453N086297J834605k199001
$$ 6482903 -321092 -7472458 -10493761 -7549715 -1393262 3693035 5527640 3328639
835C328639p395010j1953517j1422996m847707K264737M816153N255710R214777
$$ 3328639 -4066371 -16019888 -27442884 -32290591 -30025854 -25209701 -19953991 -10739214
827a0739214J5459904J5904262O837273m751385r255359n807542j618329j353421
$$ -10739214 4720690 20624952 27462225 22710840 13455481 7647939 6029610 4676189
819D676189j633600K809434J0839061J5551572J2259170L497222m295362p563067
$$ 4676189 3042589 5852023 16691084 32242656 44501826 47999048 43703686 36140619
811C6140619q064867r135957j0977397j0688241o676009j387930J688890K678727
$$ 36140619 28075752 18939795 7962398 -2725843 -9401852 -10789782 -9100892 -6422165
803f422165M369103O523650M898402j582016o285840k818885M173346L459686
$$ -6422165 -2053062 4470588 9368990 7786974 1501134 -1317751 2855595 6315281
795F315281o123468j1627367l948946P366218O712028m182336p755098L456167
$$ 6315281 191813 -11435554 -15384500 -8018282 -1306254 -5488590 -13243688 -9787521
787i787521J5074862J1494447k008683p995334j358285O884499P873858M488479
$$ -9787521 5287341 16781788 14773105 6777771 5419486 12303985 20177843 24666322
779B4666322J125356m279584j2562974j6890529j1806372k818491J160489J074740
$$ 24666322 25791678 21512094 8949120 -7941409 -19747781 -22566272 -21405783 -20331043
771b0331043M864166J3093340J6402197Q801769l570218j0115029p621151j697587
$$ -20331043 -15466877 -2373537 14028660 22830429 19260211 9145182 1524031 -173556
763a73556L11793m184882j0735631j0891337j085305J0600122J1425729j01031
$$ -173556 138237 -4046645 -14782276 -25673613 -26758918 -16158796 -4733067 -4834098
755d834098j0818724r236176K92691N611891M022613K869978N275960N567331
$$ -4834098 -15652822 -24888998 -24596307 -18984416 -14961803 -12091825 -6815865 -1248534
747a248534M63136m628518m862148l827289o138976q226316m172359L052722M854013
$$ -1248534 -785398 -5413916 -10276064 -14103353 -20242329 -28468645 -32641004 -29588282 -24734269
738b4734269N59445p75397N974702J3551987J1656174M77627r575551r826856
$$ -24734269 -24174824 -24950221 -18975519 -5423532 6232642 6710269 -2865282 -12692138
730a2692138j583523O754388Q281262L394564j441299n98699M732434Q059484
$$ -12692138 -14275661 -7521273 759989 4154553 2713254 2114555 6846989 14906473
722A4906473M932909k748146r816532j2780961j0645877l606782O132164J3340989
$$ 14906473 19839382 17091236 7274704 -5506257 -16152134 -19758916 -13626752 -285763
714b85763J2785814M279197o442359j2377957j0573789l702144K326633K883528
$$ -285763 12500051 16779248 10336889 -2041068 -12614857 -16317001 -13990368 -11106840
706a1106840j411179m920654k577472M337149R328296Q192545L763553J660314
$$ -11106840 -12518019 -17438673 -20016145 -15678996 -6350700 1841845 5605398 7265712
698G265712K652493K053300l102205r385887j1506875r227036o422751m256765
$$ 7265712 9918205 11971505 8869300 -516587 -12023462 -21250498 -27673249 -31930014
690c1930014L82305Q492834J4957462J3956213O314568j476925m395558k624025
$$ -31930014 -31547709 -23054875 -8097413 5858800 12173368 10696443 6300885 3676860
682C676860M83821J376892j686951o575411p999893l486662K123297J991064l190046
$$ 3676860 4160681 5537573 3850622 -2724789 -10724682 -14211344 -12088047 -10096983 -13287029
673a3287029n597036j044888N583046P932416O462275N191983L887296q64653
$$ -13287029 -18884065 -19928953 -14345907 -6413491 48784 5240767 9128063 8263410
665H263410p933160j0659716n159985M039853R086964P733162M859090N512569
$$ 8263410 330250 -10329466 -15489451 -11449598 -2362634 5370528 10229618 15742187
657A5742187Q489282P980083Q93838r072585j5204723j4263663q243243j386632
$$ 15742187 24231469 32211552 33105390 24032805 8828082 -5435581 -13678824 -15065456
649a5065456K403499Q21986m404747o632881l46570J0522927J4704705O956929
$$ -15065456 -12661957 -11839971 -16244718 -22877599 -23224169 -12701242 2003463 8960392
641H960392m262199o572033J298663Q975781P734505q40602r732712j4539099
$$ 8960392 4698193 -1873840 -575177 8400604 16135109 15294507 5561795 -8977304
633h977304j4170187q202900J536089Q718408P454703M30993k539540L208778
$$ -8977304 -23147491 -31350391 -29814302 -21095894 -13641191 -13210198 -15749738 -12540960
625a2540960J0116181Q001352j748808p862657m916557j1902p18566l495905n36295
$$ -12540960 -2424779 5576573 3827765 -4034892 -8951449 -8963351 -9681917 -13177822 -13714117
616a3714117O899166J0425110P495691L516264J300731k255671p092963p062260
$$ -13714117 -6814951 3610159 11105850 14622114 15922845 13667174 6574211 -488049
608d88049q42785K425673m308997j3402604j0961938M193007J7593597J5738020
$$ -488049 -1330834 1094839 -3214158 -16616762 -27578700 -23385693 -5792096 9945924
600I945924O13245j3530531j4922245m875479N004688N759477K45771k540361
$$ 9945924 10559169 -2971362 -17893607 -22769086 -17764398 -12004921 -11759150 -14299511
592a4299511j66575J955188J505762K895942O981783O467982j667003p307906
$$ -14299511 -14466086 -12510898 -11005136 -8109194 -1127411 5340571 3673568 -3634338
584c634338n71721J1529718J3294769K752212n916981k954063M911147O208421
$$ -3634338 -4206059 7323659 20618428 23370640 17453659 14499596 19410743 25619164
576B5619164k61645o918404p916739l590038J987341M667712L720199K729923
$$ 25619164 25357519 18439115 10522376 6932338 8919679 13587391 17307590 20037513
568B0037513M513849N835033J463659o903554j0982031n837657M857043J3589110
$$ 20037513 24551362 30386395 31850054 24946500 13964469 8126812 12983855 26572965
560B6572965J4764110O795507n763780j2844449q282355J292520L750971k398946
$$ 26572965 41337075 48132582 42368802 29524353 21241998 22534518 26285489 23886543
552B3886543p023057m051708J032203J803779k99879j937867m011855o519616
$$ 23886543 16863486 12811778 13843981 15647760 15347881 13410014 9398159 2878543
544B878543n025489J504759O022973L137581k228317k554703J130839K752367
$$ 2878543 -2146946 -642187 5380786 8518367 6290050 3735347 4866186 7618553
536G618553J288184J77458J10422p39230j926335k074958k237015k690856q4363
$$ 7618553 8906737 9084195 9194617 8455387 6529052 4454094 2217079 -473777 -558140
527e58140O450931J0398385N846684l115096q024184p692549o661769n374715
$$ -558140 5892791 16291176 22137860 19022764 10998580 3306031 -3355738 -8730453
519h730453r40338M086710L204259l518081q639091p696749l040566K686459Q839629
$$ -8730453 -9670791 -5584081 -2379822 -5897903 -14536994 -22233743 -25274309 -22587850 -13748221
510a3748221J1968845P467894j729824o058519j880687M029461N436725M417541
$$ -13748221 -1779376 5688518 3958694 -2099825 -3980512 48949 5485674 9903215
502I903215M156264J793411n142920j1088349q847393n16038M848182K882348
$$ 9903215 14059479 15852890 10709970 -378379 -9225772 -9741810 -4893628 -2011280
494b011280k587647o593071p711116n584474N85228Q857984J3662680J1177749
$$ -2011280 -4598927 -11191998 -18903114 -24487588 -23902360 -15044376 -1381696 9796053
486I796053M088822j427466k818799k998484m914414o860151n229566l81064L394922
$$ 9796053 13884875 12457409 9638610 6640126 1725712 -5134439 -10364005 -10745069 -7350147
477g350147L525814J334709j821441o196133r608180o788525L020995J1758455
$$ -7350147 -3824333 -2489624 -4311065 -10507198 -20115378 -26903903 -23882908 -12124453
469a2124453J1379228M601755J127519M767902J0268132J1881398Q732146J999151
$$ -12124453 -745225 3856530 4984049 9751951 20020083 31901481 40633627 42632778
461D2632778o380974j1488457q893220k214799n83242o026658r998187n877900
$$ 42632778 36251804 24763347 15870127 13655328 13072086 7045428 -2952759 -8830659
453h830659J766546N250474M817987M995146M867917L84494n914611o320015q540
$$ -8830659 -7064113 -1813639 3004348 7999494 12867411 13251905 7337294 1017279 1008739
444A008739L867518j552688j0638700j1793768j869293R946662J2495915M307726
$$ 1008739 4876257 3323569 -7315131 -19108899 -20978192 -11031530 1464385 5772111
436E772111n863520q723189l334697L550921N707778L495771J571039K152773
$$ 5772111 -91409 -8814598 -12149295 -8598374 -2890596 605175 2176214 4328987
428D328987K545392j54345l572191j905268N931838J2658660J0374729R22445
$$ 4328987 6874379 6720034 3147843 1242575 7174413 19833073 30207802 31130247
420C1130247n793966m346897L15551J602639L31371M31388N19055l079669p470729
$$ 31130247 25336281 20989384 21304935 22907574 23238945 23670333 24189388 21109719 13638990
411A3638990n537967K756457Q919392P393837J893896j985530m094547o122947
$$ 13638990 8101023 10857480 19776872 27170709 29064605 27079075 22984528 16861581
403A6861581o296578k686829J645259J718329k613893o307055m592276K921247
$$ 16861581 10565003 7878174 9523433 11241762 8627869 2320814 -2271462 649785
395F49785J1831130J5290331R356689k049948r727319q592446k776776j79804
$$ 649785 12480915 27771246 37127935 35077987 25350668 16758222 13981446 13801642
387A3801642l854585r554809r940166j444584J0468703J4218785M698139q242990
$$ 13801642 9947057 392248 -9547918 -10992502 -523799 13694986 18393125 10150135
379A0150135j0096279j18647Q241465O250996J3j680438L34152J235814J743579
$$ 10150135 53856 -64791 8176674 14427670 14427683 12747245 13081397 14317211 16060790
370A6060790L530796K352654m624407r968415m870393O455358J1503816O586724
$$ 16060790 19591586 21944240 17319833 7351418 2481025 8936383 20440199 27026923
362B7026923p03761m712675o980305q332941o282098k141461j253102l590315
$$ 27026923 26323162 21610487 14630182 6297241 15143 -2126318 -3379420 -6969735
354f969735k957171J598134K572946l677428r866685q334946j376495M664526
$$ -6969735 -9926906 -8328772 -5755826 -9433254 -19299939 -27634885 -29011380 -24346854
346b4346854Q721755J1830451J0939343M021628l026433l052101J520100K690596
$$ -24346854 -15625099 -3794648 7144695 11166323 8139890 5087789 6607889 9298485
338I298485k58977p69756K535288K970784k155727n405867n32751O458872M786422
$$ 9298485 9039508 8269752 10805040 13775824 11620097 6214230 5681479 12140351 16926773
329A6926773n682203j3686315j0920938j038878O908603Q795384O499797K791613
$$ 16926773 11244570 -2441745 -13362683 -14401561 -7492958 1302426 7802223 10593836
321A0593836p28890k594908k403466k169940l553352m363726j298596M172370
$$ 10593836 9864946 7270038 4866572 2696632 -856720 -5220446 -6519042 -2346672
313b346672O658295M106260K45564j223892p91277n3216J050214J686979n74738
$$ -2346672 4311623 8417883 8663447 7439555 6648278 6595062 7645276 9332255 8757517
304H757517m896388o189447k661590N48292j39745n5871N399993J0784100P665134
$$ 8757517 3861129 -2328318 -4989908 -4441616 -4581361 -4637232 762761 11546861 19211995
295A9211995j670649p394593p275544p881849j0655138q635513k7485O393098
$$ 19211995 17541346 10146753 2871209 -5010640 -15665778 -24301291 -24328776 -17935678
287a7935678M966487K294246N621571J0675138R542325L759110K69877l88473
$$ -17935678 -12969191 -10674945 -5053374 5621764 15164089 18923199 19193076 18804603
279A8804603k282425m566343l872509l388803q706511j5540265j2820979L82756
$$ 18804603 16522178 11955835 8083326 4694523 -4011988 -19552253 -32373232 -31990476
271c1990476J1414314J0884985L745902j098030l521001p542419j0636377o684522
$$ -31990476 -20576162 -9691177 -5945275 -7043305 -10564306 -18106725 -28743102 -35427624
263c5427624L059511J0084246R693913N748181L418987K510027L00662k718983
$$ -35427624 -32368113 -22283867 -12589954 -6841773 -3422786 -912759 -612097 -3331080
255c331080l397933r41320J620763J614956N26096J787393N225208O332332K599627
$$ -3331080 -6729013 -7670333 -6049570 -4434614 -3908518 -2121125 3104083 9436415 12036042
246A2036042j728974n38075N350494Q226077L186437n671769j0405601p741842
$$ 12036042 10307068 9768993 15119487 23345564 26532001 20860232 10454631 2712789
238B712789o24735O002767Q531812N927013K75939n015203q893702j2390526j3670721
$$ 2712789 2088054 8090821 16622633 22549646 22825585 17810382 8916680 -3473846 -17144567
229a7144567p724706N347308J5817121J4180347L678541l451054j771599K022471
$$ -17144567 -24869273 -19521965 -3704844 10475503 14154044 10702990 8931391 10953862
221A0953862N13216m596614p004091m462797R12565O404853Q836533N294894j836777
$$ 10953862 11467078 6870464 -133627 -4596424 -3683859 2720994 11557527 16852421 15015644
212A5015644m709665j20483M155456j58371q095883o813357N640411J5925987
$$ 15015644 10305979 10185496 14340952 14182581 6086698 -726659 4913752 20839739
204B0839739J2646021N55769p338065o615503m161792o307527j0436201r806079
$$ 20839739 33485760 34041529 26703464 20087961 15926169 9618642 -817559 -10623638
196a0623638l368723K183446O59481n052558n740038J891318R709812Q646798
$$ -10623638 -13992361 -11808915 -11149434 -16201992 -21942030 -20050712 -10340900 -1694102
188a694102J314504j985448J799238N067469J772968m515660p331248n450023
$$ -1694102 -379598 -2365046 -565808 4501661 6274629 1758969 -5572279 -11022302
180a1022302j035384M249914P619505N660341N82959q0193N350804Q374566L018456
$$ -11022302 -12057686 -7807772 -188267 5472074 6055033 5974840 11325644 19700210 22718666
171B2718666l828462k528932M594575P692732M115129r29852m956526r016034
$$ 22718666 18890204 16361272 20955847 28648579 32763708 31833856 26877330 17861296
163A7861296j0252856m852797K207308J601158n442928p767014j553235M242777
$$ 17861296 7608440 2755643 4962951 6564109 1121181 -6645833 -8199068 -3956291
155c956291K846337r81311j129675P42730K057030N512557J1395849J2365619
$$ -3956291 -1109954 -2091265 -3220940 -2478210 -421180 5091377 16487226 28852845
147B8852845L937294o855498j0975365r035947o034765j715220M762400P272909
$$ 28852845 32790139 25934641 14959276 5923329 -111436 -1826656 2935744 10208653
139A0208653Q40191p318891o265236K030583N852945J797444k119826j459009
$$ 10208653 11048844 3729953 -2535283 -504700 5348245 7145689 5025863 3566854
131C566854j511456n767058q757889n113592K086856O672561P093121N037189
$$ 3566854 2055398 -3711660 -12469549 -17583141 -15496285 -8823724 -1730603 3306586
123C306586J797962o30285R1670K159487M70013n193330q087449m017185K173137
$$ 3306586 5104548 4474263 4565933 6725420 7195433 2002103 -6085346 -10102531 -7929394
114g929394L717135J197649K21385L078835O977686Q395018N963021J014287k628191
$$ -7929394 -4212259 -3014610 -2793225 285610 7263296 15658314 21621335 22635622 20007431
105B0007431k054664P7990j790270p194444q822407l595937J744453J160063q81784
$$ 20007431 17952767 18030757 16240487 9046043 223636 -3372301 -1627848 -467785 -1349569
96a349569K473721P752601O306122n01089k245929L886807Q118862L169181n084515
$$ -1349569 1124152 8876753 15182875 14681786 12435857 16322664 24441526 27610707 22526192
87B2526192p566845m934804l505479m035801k675357M44046J916721K592797O059136
$$ 22526192 14959347 10024543 6519064 2483263 -192094 251952 2168673 4761470 10820606
78A0820606R902433P192506j507303o122275j272776M853287K109902o661193
$$ 10820606 20723039 27915545 26408242 20285967 19013191 23866478 25976380 19315187
70A9315187j0126786m809178J518832K266910k54008j292119q35479q64007o42972
$$ 19315187 9188401 4379223 5898055 8164965 7910957 6618838 5783359 4919352 4276380
61D276380J072970K523119J378198j607758m173362n403871m704231j026287L976468
$$ 4276380 5349350 7872469 9250667 7642909 3469547 -1934324 -6638555 -7664842 -3688374
52c688374N337836J127951l447702k560655K145639M631952L267766J170741k17538
$$ -3688374 1649462 2777413 -670289 -3230944 -1085305 3546647 6814413 7985154 7767616
43G767616j487404n35114M741527Q691884J773956j4411678k4119265j5748521
$$ 7767616 6280212 5745098 10486625 19178509 20952465 6540787 -17578478 -33326999
35c3326999K578300J3001548R735554K847072J887417M666681M395976O72916
$$ -33326999 -30748699 -17747151 -8011597 -5164525 -3277108 1389573 5785549 6458465
27F458465j565648k13094J902511J945129L97723o02794O1597J641903J873105
$$ 6458465 4892817 4679723 6582234 8527363 8925086 8322292 8383889 10025792 11898897
18A1898897j393487p097741r980486n398903M125821R845570O263575k195694
$$ 11898897 10505410 3407669 -6572817 -11971720 -7845899 1999671 8263246 6067552
10F067552o612314m401509j186958j805003l573016r86539N553334R407728N818102
$$ 6067552 -544762 -4946271 -6133229 -7938232 -11511248 -12497787 -6944453 2463275 8281377
1H281377k454246
$$ 8281377 5827131
0E827131
$$ 5827131
##END NTUPLES=NMR SPECTRUM
##END=
