##TITLE=31Pdec_DE-54rm1d
 
 64 sc
 27.4.2024
##JCAMPDX= 6.0         $$ Bruker NMR JCAMP-DX V2.0
##DATA TYPE= NMR SPECTRUM
##DATA CLASS= NTUPLES
##ORIGIN= UXNMR, Bruker Analytische Messtechnik GmbH
##OWNER= root
$$ XWIN-NMR		Version 3.5
$$ Sat Apr 27 13:44:00 2024 Russian Standard Time (UT+4h)  she@DPX200
##.OBSERVE FREQUENCY= 81.013821
##.OBSERVE NUCLEUS= ^31P
##.ACQUISITION MODE= SIMULTANEOUS
##.ACQUISITION SCHEME= undefined
##.AVERAGES= 64
##.DIGITISER RES= 16
##SPECTROMETER/DATA SYSTEM= spect
##.PULSE SEQUENCE= zgpg30
##.SOLVENT NAME= CDCl3
##.SHIFT REFERENCE= (INTERNAL, CDCl3, 0, 248.564)
##AUDIT TRAIL= $$ (NUMBER, WHEN, WHO, WHERE, WHAT)
$$ ##TITLE= Audit trail, XWIN-NMR		Version 3.5
$$ ##JCAMPDX= 5.01
$$ ##ORIGIN= Bruker BioSpin GmbH
$$ ##OWNER= she
$$ F:/spectra/data/she/nmr/P31/1/pdata/1/auditp.txt
$$ ##AUDIT TRAIL=  $$ (NUMBER, WHEN, WHO, WHERE, WHAT)
(   1,<2024-04-27 13:42:35.15 +0400>,<she>,<DPX200>,
      <continue with go, POWCHK disabled, PULCHK disabled
       configuration hash MD5:
       00 E9 B6 7A A2 85 ED C7 34 08 36 98 17 FE 4E 26
       data hash MD5: 32K
       AC E3 09 26 84 B0 D8 3D C3 21 B4 36 63 3C 8B 33>)
(   2,<2024-04-27 13:42:38.21 +0400>,<she>,<DPX200>,
      <Start of raw data processing
       efp BC_mod = 2 LB = 10 FT_mod = 6 PKNL = 1 PHC0 = -13403.47 PHC1 = 492.8828 SI = 64K 
       data hash MD5: 64K
       36 60 69 B2 D6 1B D4 33 DE 28 19 9A FD 81 0D 49>)
(   3,<2024-04-27 13:43:03.73 +0400>,<she>,<DPX200>,
      <pk PHC0 = 219.4981 PHC1 = -555.9996 
       data hash MD5: 64K
       A1 BB 3A 29 78 E9 7F 5A 9F 8F 17 40 45 47 D5 59>)
(   4,<2024-04-27 13:43:28.40 +0400>,<she>,<DPX200>,
      <pk PHC0 = -7.000183 PHC1 = 0 
       data hash MD5: 64K
       62 E3 74 7C 16 B8 8F 6D BC 61 DB B1 7E 82 1B 79>)
(   5,<2024-04-27 13:43:33.21 +0400>,<she>,<DPX200>,
      <abs ABSG = 5 
       data hash MD5: 64K
       77 D6 AC AC 60 38 23 18 0D 5C 45 B8 20 1A 44 F8>)
$$ ##END=
$$ 
$$ hash MD5
$$ C4 4D D8 4D 56 C3 D3 2E 2A 35 B1 CC 8D B1 95 D6
##$RELAX= 
##$RELAX= 
##$RELAX= 
##$RELAX= 
##$RELAX= 
##$RELAX= 
##$RELAX= 
##$RELAX= 
##$RELAX= 
$$ Bruker specific parameters
$$ --------------------------
##$DU= <F:/spectra>
##$EXPNO= 1
##$NAME= <P31>
##$PROCNO= 1
##$TYPE= <nmr>
##$USER= <she>
##$AMP= (0..31)
100 100 100 100 100 100 100 100 100 100 100 100 100 100 100 100 100 100 
100 100 100 100 100 100 100 100 100 100 100 100 100 100 
##$AQSEQ= 0
##$AQ_mod= 1
##$AUNM= <au_zg>
##$AUTOPOS= <>
##$BF1= 81.014009
##$BF2= 200.13
##$BF3= 200.13
##$BF4= 200.13
##$BF5= 200.13
##$BF6= 200.13
##$BF7= 200.13
##$BF8= 200.13
##$BYTORDA= 1
##$CFDGTYP= 0
##$CFRGTYP= 5
##$CHEMSTR= <none>
##$CNST= (0..31)
1 1 145 1 1 1 1 1 1 1 1 1 1 1 1 1 1 1 1 1 1 1 1 1 1 1 1 1 1 1 1 1 
##$CPDPRG= <waltz16>
##$CPDPRG1= <>
##$CPDPRG2= <waltz16>
##$CPDPRG3= <>
##$CPDPRG4= <mlev>
##$CPDPRG5= <mlev>
##$CPDPRG6= <mlev>
##$CPDPRG7= <mlev>
##$CPDPRG8= <mlev>
##$CPDPRGB= <>
##$CPDPRGT= <>
##$D= (0..31)
$$ [...]
##$SUBNAM3= <"">
##$SUBNAM4= <"">
##$SUBNAM5= <"">
##$SUBNAM6= <"">
##$SUBNAM7= <"">
##$SUBNAM8= <"">
##$SUBNAM9= <"">
##$SW= 501.771253377433
##$SWIBOX= (0..15)
0 1 3 0 0 0 0 0 0 0 0 0 0 0 0 0 
##$SW_h= 40650.406504065
##$TD= 32768
##$TD0= 1
##$TE= 0
##$TE2= 300
##$TE3= 300
##$TEG= 300
##$TL= (0..7)
0 120 53 12 22 120 120 120 
##$TP= (0..7)
150 150 150 150 150 150 150 150 
##$TP07= 0
##$TPNAME0= <>
##$TPNAME1= <>
##$TPNAME2= <>
##$TPNAME3= <>
##$TPNAME4= <>
##$TPNAME5= <>
##$TPNAME6= <>
##$TPNAME7= <>
##$TPOAL= (0..7)
0.5 0.5 0.5 0.5 0.5 0.5 0.5 0.5 
##$TPOFFS= (0..7)
0 0 0 0 0 0 0 0 
##$TUNHIN= 0
##$TUNHOUT= 0
##$TUNXOUT= 0
##$USERA1= <user>
##$USERA2= <user>
##$USERA3= <user>
##$USERA4= <user>
##$USERA5= <user>
##$V9= 5
##$VALIST= <valist>
##$VCLIST= <CCCCCCCCCCCCCCC>
##$VD= 0
##$VDLIST= <DDDDDDDDDDDDDDD>
##$VPLIST= <PPPPPPPPPPPPPPP>
##$VTLIST= <TTTTTTTTTTTTTTT>
##$WBST= 1024
##$WBSW= 4
##$XGAIN= (0..3)
0 0 0 0 
##$XL= 0
##$YL= 0
##$YMAX_a= 11810
##$YMIN_a= -9002
##$ZGOPTNS= <>
##$ZL1= 120
##$ZL2= 120
##$ZL3= 120
##$ZL4= 120
##$ABSF1= 248.5645
##$ABSF2= -253.2056
##$ABSG= 5
##$ABSL= 3
##$ALPHA= 0
##$AQORDER= 0
##$ASSFAC= 0
##$ASSFACI= 0
##$ASSFACX= 0
##$ASSWID= 0
##$AUNMP= <proc_1d>
##$AZFE= 0.1
##$AZFW= 0.5
##$BCFW= 0
##$BC_mod= 2
##$BYTORDP= 0
##$COROFFS= 0
##$CY= -3
##$DATMOD= 1
##$DC= 0
##$DFILT= <>
##$DTYPP= 0
##$F1P= 0
##$F2P= 0
##$FCOR= 1
##$FTSIZE= 65536
##$FT_mod= 6
##$GAMMA= 0
##$GB= 0
##$INTBC= 1
##$INTSCL= 6.047779e-11
##$ISEN= 30
##$LB= 10
##$LEV0= 0
##$LPBIN= 0
##$MAXI= 10000
##$MC2= 0
##$MEAN= 0
##$ME_mod= 0
##$MI= 50
##$NCOEF= 0
##$NC_proc= -9
##$NLEV= 6
##$NOISF1= 182.463
##$NOISF2= 159.3651
##$NSP= 0
##$NTH_PI= 0
##$NZP= 0
##$OFFSET= 248.5645
##$PC= 4
##$PHC0= -13190.97
##$PHC1= -63.11676
##$PH_mod= 1
##$PKNL= yes
##$PPARMOD= 0
##$PSCAL= 0
##$PSIGN= 0
##$REVERSE= no
##$SF= 81.0140089999694
##$SI= 65536
##$SIGF1= 159.3651
##$SIGF2= -187.1042
##$SINO= 113.3802
##$SIOLD= 16384
##$SREGLST= <1H.CDCl3>
##$SSB= 0
##$STSI= 65536
##$STSR= 0
##$SW_p= 40650.406504065
##$SYMM= 0
##$S_DEV= 0
##$TDeff= 32768
##$TDoff= 0
##$TI= <>
##$TILT= no
##$TM1= 0
##$TM2= 0
##$TOPLEV= 0
##$USERP1= <user>
##$USERP2= <user>
##$USERP3= <user>
##$USERP4= <user>
##$USERP5= <user>
##$WDW= 1
##$XDIM= 65536
##$YMAX_p= 362107293
##$YMIN_p= -39728311
$$ End of Bruker specific parameters
$$ ---------------------------------
##NTUPLES= NMR SPECTRUM
##VAR_NAME=  FREQUENCY,     SPECTRUM/REAL,   SPECTRUM/IMAG
##SYMBOL=    X,             R,               I
##VAR_TYPE=  INDEPENDENT,   DEPENDENT,       DEPENDENT
##VAR_FORM=  AFFN,          ASDF,            ASDF
##VAR_DIM=   65536,         65536,           65536
##UNITS=     HZ,            ARBITRARY UNITS, ARBITRARY UNITS
##FACTOR=    0.620285442955139, 1,           1
##FIRST=     20137.2065510682, 0,            0
##LAST=      -20513.1999529968, 0,           0
##MIN=       -20513.1999529968, -39728311,   0
##MAX=       20137.2065510682, 362107293,    0
$$ Real data points
##PAGE= N=1
##DATA TABLE= (X++(R..R)), XYDATA
$$ [...]
45306 1848571 2997090 4038237 4970980 5797623 6513363 7105139 7560362 7876803 8064160
45297 8064160 8136517 8103650 7969633 7740054 7431219 7072899 6701485 6348672 6034813 5771954
45287 5771954 5573245 5460548 5464371 5615848 5934509 6416913 7031534 7724012 8432464 9106636
45277 9106636 9721450 10278305 10794508 11287880 11765260 12219480 12633186 12984878 13254147
45268 13254147 13425679 13491480 13449704 13299721 13036354 12647602 12117849 11435246 10600049 9630372
45258 9630372 8562420 7444696 6329285 5265200 4296600 3464059 2804624 2348295 2112883
45249 2112883 2101250 2302498 2694079 3240523 3888918 4566928 5189331 5673032 5954256 6001098
45239 6001098 5818592 5446876 4953429 4419755 3924213 3525303 3251013 3097554 3036363 3025503
45229 3025503 3022499 2997476 2943868 2880975 2844435 2868987 2974841 3166221 3440225 3796353 4238714
45218 4238714 4770180 5383899 6058607 6760838 7452248 8097333 8668316 9147993 9532819
45209 9532819 9835522 10083541 10310951 10546388 10802321 11070466 11325750 11538648 11691821
45200 11691821 11793042 11876631 11991966 12185316 12483695 12885900 13361703 13858666 14315316
45191 14315316 14676983 14908166 14997013 14952492 14798372 14566889 14291916 14001135 13709634 13418985
45181 13418985 13123209 12817607 12503556 12184819 11857510 11501142 11078020 10542375 9854068
45172 9854068 8989678 7947694 6749735 5440732 4087526 2772332 1579617 580528
45164 580528 -178536 -679855 -932832 -970371 -843720 -614175 -341662 -73171 165540 373729
45154 373729 575048 811885 1133263 1576740 2149292 2815744 3502422 4117676 4582343 4857279
45144 4857279 4955071 4929798 4849406 4764357 4688123 4597939 4452759 4217478 3881792 3466595
45134 3466595 3016683 2584058 2210107 1914984 1697870 1545900 1446391 1397089 1409884 1505114
45124 1505114 1697763 1982618 2327440 2678579 2975611 3166648 3217580 3114166 2860906 2480894
45114 2480894 2016472 1526312 1075389 719829 493310 401221 424335 529208 680162 847943
45104 847943 1012444 1160479 1281991 1367646 1408676 1398382 1334271 1219514 1062303 873502
45094 873502 665290 453340 260893 119043 59017 98973 233311 431206 644279 818196
45084 818196 903168 861506 671606 327691 -164000 -788695 -1522190 -2326237 -3146003 -3914543
45074 -3914543 -4563477 -5034152 -5284526 -5291419 -5050925 -4579741 -3917548 -3127956 -2294399 -1508872
45064 -1508872 -854782 -388432 -125064 -35161 -54416 -106021 -126970 -86075 14895 154829
45054 154829 310467 466349 614781 750341 863943 938342 946058 852222 624175 244656
45044 244656 -278810 -913991 -1612347 -2319855 -2984989 -3563085 -4019582 -4334626 -4508759 -4566059
45034 -4566059 -4549918 -4510255 -4487646 -4503436 -4560636 -4651664 -4765041 -4887702 -5006311 -5111069
45024 -5111069 -5199591 -5275154 -5338191 -5377214 -5366979 -5275819 -5077049 -4757098 -4316655 -3766732
45014 -3766732 -3125076 -2417424 -1683092 -978633 -371676 77426 338754 427003 396558 319467
45004 319467 259246 254048 313588 424826 559393 679982 746883 725664 594838 351087 10063
44993 10063 -397800 -835275 -1267471 -1668375 -2021631 -2315446 -2536336 -2668805 -2703916 -2650917
44983 -2650917 -2541148 -2418535 -2321515 -2267270 -2246292 -2228104 -2173653 -2048244 -1829964 -1511645
44973 -1511645 -1098367 -604073 -49431 538971 1128524 1680250 2150185 2495483 2686074
44964 2686074 2717543 2617542 2439501 2244189 2077327 1954634 1861220 1763335 1624420 1418169
44954 1418169 1136141 790837 414694 54073 -242565 -440340 -531727 -541410 -518564 -519232 -585975
44943 -585975 -732167 -936378 -1149970 -1316900 -1398030 -1387869 -1315066 -1227481 -1170553 -1169228 -1220192
44932 -1220192 -1296268 -1360035 -1380213 -1343773 -1259360 -1151688 -1050151 -977075 -940830 -935796 -947051
44921 -947051 -955577 -940891 -880686 -749922 -523383 -183836 267644 807204 1394669 1987215
44911 1987215 2550791 3063440 3512672 3892887 4205944 4463011 4683464 4888044 5087474
44902 5087474 5271830 5407172 5442720 5326407 5022944 4527846 3872562 3118838 2344359 1624835
44892 1624835 1018274 555141 235847 35334 -86526 -171142 -247058 -319009 -364250 -339557
44882 -339557 -198822 84991 504180 1015828 1556886 2065717 2498184 2832347 3064992 3206836
44872 3206836 3279696 3313834 3342845 3396221 3491902 3631450 3799693 3969236 4108040 4187104
44862 4187104 4186782 4101420 3940319 3721323 3457580 3146162 2768552 2302977 1737144 1070807
44852 1070807 309391 -541264 -1472613 -2466585 -3490971 -4499519 -5434497 -6229691 -6814716
44843 -6814716 -7122575 -7100577 -6722219 -5995925 -4966617 -3708022 -2307376 -847852 604693
44834 604693 2005865 3327252 4545813 5635574 6567089 7313539 7856670 8186970 8299635
44825 8299635 8192995 7873366 7362918 6703591 5953222 5175945 4431725 3768979 3221730
44816 3221730 2810380 2543380 2417263 2415100 2506424 2651328 2808082 2940547 3021972 3034338
44806 3034338 2964711 2801826 2536885 2170340 1720742 1227020 738925 300770 -59467 -328328
44796 -328328 -497199 -556025 -496028 -316850 -29753 346175 790344 1282931 1800769 2310641
44786 2310641 2766879 3117897 3320484 3354902 3232455 2991033 2680986 2349176 2029345 1742056
44776 1742056 1501050 1319542 1211413 1186367 1242038 1358097 1496810 1611108 1656549 1601457
44766 1601457 1432080 1154126 793156 393247 10581 -299024 -493553 -551399 -467656 -244850
44756 -244850 112843 596637 1184314 1833725 2485105 3072545 3539142 3848775 3989584 3969110
44746 3969110 3805436 3520136 3135748 2675509 2160961 1606325 1013992 376830 -311927
44737 -311927 -1047118 -1806077 -2552267 -3245324 -3852178 -4354692 -4750801 -5048475 -5255809 -5373905
44727 -5373905 -5397157 -5318513 -5132671 -4833763 -4412047 -3856968 -3168595 -2371694 -1523598 -709742
44717 -709742 -26336 444282 655404 604695 326146 -129126 -712204 -1387258 -2132088 -2932009
44707 -2932009 -3772091 -4631782 -5484366 -6301455 -7059539 -7743358 -8342228 -8840599 -9209466
44698 -9209466 -9406531 -9388169 -9128168 -8632064 -7937609 -7101736 -6184486 -5241168 -4323947 -3484270
44688 -3484270 -2768317 -2207439 -1811877 -1572061 -1464164 -1454634 -1503300 -1568579 -1616471 -1630051
44678 -1630051 -1613501 -1586622 -1570944 -1574044 -1580553 -1554814 -1453075 -1238270 -890822 -412528 176055
44667 176055 842563 1550674 2265061 2951367 3572806 4087834 4452753 4629246 4592902 4338057
44657 4338057 3877531 3239716 2465965 1608563 727442 -115186 -861416 -1464439 -1895208
44648 -1895208 -2147225 -2236411 -2195313 -2065535 -1893246 -1728066 -1620700 -1615436 -1738695 -1988824
44638 -1988824 -2332504 -2710327 -3049992 -3281968 -3352062 -3228890 -2907784 -2412251 -1791002 -1108462
44628 -1108462 -430485 189733 720879 1155986 1508542 1804591 2074546 2347557 2647631
44619 2647631 2988521 3366812 3757140 4114649 4385954 4524793 4506070 4333119 4035977 3661603
44609 3661603 3259216 2865304 2493638 2134967 1767042 1369666 936174 476166 11468
44600 11468 -428890 -811831 -1104175 -1280927 -1336140 -1288999 -1179283 -1054814 -960162 -933126
44590 -933126 -1005849 -1202279 -1528447 -1961147 -2444002 -2895599 -3227751 -3367675 -3276263 -2955588
44580 -2955588 -2443001 -1795447 -1071511 -317784 437421 1182807 1916351 2633525 3316060
44571 3316060 3927361 4419205 4748436 4895082 4870608 4711200 4461478 4160053 3834740 3506444
44561 3506444 3194722 2918657 2691657 2514032 2369149 2227109 2055356 1831626 1553130
44552 1553130 1237547 915821 621381 381757 215215 130259 124785 184608 283645 387479
44542 387479 459996 471734 407721 271643 84075 -124020 -318778 -469435 -553052 -557990 -484382
44531 -484382 -340891 -140384 102034 368924 641453 902234 1136841 1331012 1465156 1511250
44521 1511250 1435708 1207744 809889 246737 -451570 -1233024 -2033367 -2787732 -3440580 -3953388
44511 -3953388 -4310944 -4524581 -4628217 -4666076 -4677874 -4689837 -4714315 -4752952 -4797585 -4828964 -4818068
44500 -4818068 -4732765 -4547520 -4252078 -3856880 -3394672 -2917713 -2490218 -2177604 -2035340 -2098994
44490 -2098994 -2375597 -2837725 -3424691 -4054820 -4647125 -5143716 -5522441 -5794271 -5988281
44481 -5988281 -6132917 -6243113 -6318269 -6349605 -6330999 -6267245 -6176416 -6085674 -6021950 -6001426 -6023631
44470 -6023631 -6074219 -6135151 -6196165 -6261328 -6348365 -6482320 -6687106 -6978025 -7356618 -7807496
44460 -7807496 -8297438 -8779321 -9203056 -9530217 -9743722 -9845971 -9847880 -9758164 -9579859 -9313468
44450 -9313468 -8961615 -8531838 -8037627 -7498791 -6941270 -6395719 -5894375 -5465584 -5126017
44441 -5126017 -4872835 -4680468 -4505688 -4299916 -4023229 -3654767 -3197708 -2678929 -2142842
44432 -2142842 -1639419 -1210289 -879639 -653710 -526183 -483640 -508038 -577516 -668146 -757500
44422 -757500 -829072 -875938 -902391 -923387 -962711 -1050312 -1217973 -1492356 -1886334 -2391066 -2971390
44411 -2971390 -3567100 -4103249 -4509874 -4743970 -4800889 -4707223 -4500866 -4213157 -3863657 -3465745
44401 -3465745 -3033739 -2584783 -2135893 -1700856 -1291017 -920166 -609594 -388248 -286213
44392 -286213 -324758 -508198 -820320 -1225298 -1672740 -2106856 -2477461 -2747340 -2891224 -2887668
44382 -2887668 -2711175 -2332431 -1728512 -897452 131751 1299356 2524540 3719264 4801114
44373 4801114 5702343 6374348 6788071 6932521 6814340 6459600 5915954 5251983 4551811
44364 4551811 3904263 3386827 3047231 2889469 2872170 2922319 2959704 2922092 2780748 2539926
44354 2539926 2221679 1845881 1418238 932822 384755 -217357 -847107 -1465169 -2029586
44345 -2029586 -2505942 -2872758 -3120496 -3246900 -3253737 -3147751 -2944059 -2667936 -2353037 -2037833
44335 -2037833 -1763433 -1573197 -1510976 -1614309 -1903156 -2369772 -2975927 -3659478 -4347272 -4969421
44325 -4969421 -5471102 -5820019 -6009210 -6055906 -5996763 -5879297 -5750433 -5645681 -5583759 -5568534
44315 -5568534 -5595440 -5657427 -5747784 -5860757 -5992546 -6143761 -6321536 -6537714 -6801474 -7109964
44305 -7109964 -7444091 -7773679 -8068331 -8305349 -8469686 -8549111 -8531971 -8411217 -8191539 -7893196
44295 -7893196 -7548521 -7191940 -6847982 -6522732 -6202727 -5862333 -5477299 -5039439 -4566269
44286 -4566269 -4100562 -3698791 -3412865 -3273329 -3281347 -3411379 -3620816 -3860584 -4083266 -4248920
44276 -4248920 -4330152 -4316130 -4213303 -4041507 -3827711 -3601281 -3392066 -3228394 -3131653 -3108518
44266 -3108518 -3146229 -3215557 -3280330 -3307184 -3269397 -3144414 -2910575 -2548934 -2050181 -1420816
44256 -1420816 -683041 131143 987129 1852814 2701928 3516316 4286280 5008069 5680006
44247 5680006 6300314 6868213 7387154 7866749 8320140 8756336 9171624 9546301 9849831
44238 9849831 10051578 10131126 10084060 9922206 9669066 9351962 8993547 8605788 8188312 7731475
44228 7731475 7223203 6657443 6041069 5397207 4765459 4199681 3761174 3504347 3457256 3606485
44218 3606485 3896218 4244023 4566914 4807022 4946947 5009048 5039913 5088544 5189211 5355137
44208 5355137 5581385 5851079 6140438 6421488 6663517 6835204 6909611 6872857 6733775 6528752
44198 6528752 6317047 6167566 6143215 6288682 6622902 7134308 7778813 8483845 9160938 9723733
44188 9723733 10103773 10258169 10169794 9845202 9313745 8626241 7849369 7054971 6307815 5656610
44178 5656610 5131127 4745626 4506719 4421346 4499623 4750415 5172783 5748690 6439367 7184719
44168 7184719 7906311 8516754 8935665 9105737 8999973 8616754 7968459 7072904 5952689
44159 5952689 4640251 3182192 1637804 71298 -1458577 -2906531 -4242890 -5449383
44151 -5449383 -6511337 -7410675 -8123317 -8621729 -8881433 -8889861 -8655223 -8211193 -7613239 -6926755
44141 -6926755 -6212951 -5519817 -4880968 -4319577 -3852190 -3488546 -3227068 -3049371 -2918500
44132 -2918500 -2783096 -2585644 -2271951 -1801154 -1156192 -351818 564674 1521540 2435872
44123 2435872 3227064 3828118 4194252 4307283 4174079 3819632 3278204 2586208 1779061
44114 1779061 892360 -34320 -954866 -1819138 -2580682 -3204975 -3672518 -3975220 -4109897
44105 -4109897 -4074658 -3871079 -3510126 -3016673 -2428260 -1787658 -1132959 -490095 129545 727140
44095 727140 1312234 1897421 2492039 3095794 3694641 4260658 4755341 5134644 5355672 5386298
44085 5386298 5216783 4868000 4389212 3843061 3283552 2737929 2201328 1645531 1035584
44076 1035584 345482 -432747 -1286965 -2187020 -3088323 -3935562 -4666494 -5217045 -5530079
44067 -5530079 -5569278 -5334681 -4871438 -4263937 -3615841 -3025640 -2568851 -2291529 -2212296 -2328163
44057 -2328163 -2621567 -3067519 -3639312 -4311142 -5057534 -5851458 -6663505 -7463616 -8225341
44048 -8225341 -8930828 -9573410 -10154797 -10676415 -11128660 -11485062 -11707220 -11760176 -11630416 -11336588
44038 -11336588 -10927892 -10471919 -10036812 -9672666 -9397471 -9193350 -9015764 -8811484 -8536475
44029 -8536475 -8166241 -7696643 -7137967 -6507220 -5823336 -5106993 -4382745 -3679704 -3029055
44020 -3029055 -2459386 -1991477 -1634265 -1384712 -1233344 -1172467 -1199983 -1314242 -1502856 -1733066
44010 -1733066 -1950021 -2085321 -2074411 -1876766 -1489003 -943201 -292110 408576 1111502 1780831
44000 1780831 2391449 2927332 3379110 3740473 4005087 4166110 4218019 4157790 3982550 3684097
43990 3684097 3244492 2637620 1838180 834855 -358336 -1697476 -3112573 -4517916 -5825283
43981 -5825283 -6956796 -7855361 -8490695 -8858768 -8974592 -8862510 -8550226 -8069096 -7456880
43972 -7456880 -6757010 -6012952 -5262287 -4535695 -3860722 -3264929 -2773637 -2403534 -2157998
43963 -2157998 -2028086 -1996956 -2042423 -2135843 -2241152 -2318739 -2334416 -2269005 -2123240 -1915170
43953 -1915170 -1671016 -1414182 -1158780 -911512 -679724 -478839 -333464 -271950 -318951 -490852
43943 -490852 -795141 -1230422 -1782731 -2418193 -3078426 -3686998 -4168680 -4472987 -4588947 -4543373
43933 -4543373 -4385701 -4169595 -3940529 -3731888 -3566069 -3455791 -3404124 -3404826 -3444355 -3504053
43923 -3504053 -3560186 -3582170 -3532425 -3370525 -3060486 -2577680 -1913565 -1079402 -109839 936299
43913 936299 1983276 2956180 3804105 4517238 5127361 5690214 6259398 6865695 7509914
43904 7509914 8167346 8796492 9346866 9765424 10002579 10017497 9781849 9282649 8525322 7536179
43894 7536179 6361727 5063484 3709862 2367918 1096214 -61666 -1082639 -1966560
43886 -1966560 -2732903 -3411378 -4029622 -4602938 -5130024 -5595628 -5978382 -6260571 -6436357
43877 -6436357 -6515901 -6524678 -6499285 -6481868 -6514478 -6633636 -6865180 -7220100 -7692352 -8259599
43867 -8259599 -8887400 -9536608 -10172064 -10769586 -11318700 -11820695 -12283336 -12713947 -13112548
43858 -13112548 -13466976 -13752199 -13934948 -13982280 -13870966 -13594513 -13166338 -12618759 -11997546
43849 -11997546 -11351803 -10720918 -10123419 -9553231 -8984778 -8382419 -7708019 -6925010 -6003014
43840 -6003014 -4926875 -3707318 -2384686 -1019530 326874 1611089 2814800 3938767
43832 3938767 4989805 5969850 6872560 7686983 8403635 9017811 9527826 9929833 10213208
43823 10213208 10359956 10349262 10165500 9806020 9284281 8626022 7860669 7013746 6104943
43814 6104943 5151309 4170806 3182134 2200929 1236003 289185 -640341 -1549462 -2425796
43805 -2425796 -3246300 -3980385 -4596026 -5066094 -5372472 -5507404 -5473566 -5284223 -4962675 -4538943
43795 -4538943 -4044277 -3507275 -2954465 -2413082 -1911348 -1474971 -1123389 -868958 -718015
43786 -718015 -670910 -720881 -854410 -1054620 -1305587 -1593614 -1902802 -2206300 -2459184 -2600759
43776 -2600759 -2569553 -2325136 -1864825 -1226692 -479855 290781 999763 1574897 1968901 2165501
43766 2165501 2176689 2032556 1769553 1422476 1021095 589321 145148 -298427 -730570 -1137507
43756 -1137507 -1496324 -1770580 -1911816 -1869193 -1604559 -1105927 -393215 484296 1454809 2432427
43746 2432427 3328825 4070441 4617729 4976696 5194134 5337337 5468451 5625077 5812686
43737 5812686 6007669 6166915 6240004 6181082 5958619 5562280 5006094 4326825 3577953 2822134
43727 2822134 2124626 1546484 1134740 911053 865603 961557 1147786 1372105 1589221 1762997
43717 1762997 1865646 1876567 1782312 1577790 1267162 862744 382314 -153046 -719576 -1291164
43707 -1291164 -1841471 -2348022 -2796742 -3184894 -3521074 -3821882 -4106240 -4389325 -4678509
43698 -4678509 -4972803 -5265018 -5543409 -5789823 -5975819 -6063053 -6013194 -5804710 -5446613 -4980091
43688 -4980091 -4466941 -3971344 -3543533 -3210912 -2977453 -2828522 -2737683 -2673833 -2608564 -2522740
43678 -2522740 -2409882 -2274786 -2128444 -1981726 -1840643 -1706016 -1578869 -1467956 -1391788 -1370755
43668 -1370755 -1414381 -1514303 -1648652 -1793856 -1935284 -2071020 -2208322 -2355695 -2514765 -2675632
43658 -2675632 -2816590 -2906519 -2908510 -2785611 -2509695 -2071243 -1485417 -791111 -43323 698306
43648 698306 1381319 1969646 2448377 2824038 3121170 3375285 3622313 3886842 4174311 4471447
43638 4471447 4754408 4999444 5190340 5320281 5389828 5404061 5370608 5297670 5190292 5045253
43628 5045253 4847690 4572742 4192314 3684085 3039772 2270714 1408898 501720 -398324
43619 -398324 -1243963 -1998381 -2635309 -3138086 -3500451 -3727274 -3832014 -3831230 -3740134 -3572820
43609 -3572820 -3346792 -3087618 -2828809 -2605151 -2442588 -2350494 -2320281 -2329835 -2351087 -2359242 -2343107
43598 -2343107 -2313690 -2305790 -2369342 -2553427 -2890197 -3385469 -4019038 -4754178 -5552412 -6386528
43588 -6386528 -7244625 -8123178 -9014502 -9897155 -10733934 -11476648 -12074649 -12484937 -12680880
43579 -12680880 -12655132 -12414389 -11970304 -11335106 -10526189 -9574619 -8527863 -7442160 -6369111
43570 -6369111 -5345701 -4393531 -3525598 -2753636 -2089598 -1540362 -1100391 -748408 -450773
43561 -450773 -169843 126501 457836 829254 1235076 1665892 2114405 2576282 3045738 3509016
43551 3509016 3939992 4300669 4546661 4635758 4536928 4237576 3747294 3096940 2333168 1510649
43541 1510649 684806 -93569 -782400 -1351828 -1786563 -2086242 -2263430 -2339518 -2339131 -2284395
43531 -2284395 -2190909 -2065847 -1907634 -1707603 -1455530 -1148354 -796274 -419835 -38629 340529
43521 340529 728558 1150981 1639299 2219017 2896922 3653721 4448482 5234966 5981249 6681571
43511 6681571 7354225 8027232 8719624 9428144 10125773 10771168 11322074 11745825 12024568
43502 12024568 12156252 12152679 12035550 11832214 11572615 11287024 11003262 10744028 10526370 10363123
43492 10363123 10262544 10223035 10225174 10227681 10172513 9998801 9660523 9141494 8462570 7678569
43482 7678569 6866057 6106726 5472226 5013927 4757523 4701179 4817206 5057774 5363358 5671458
43472 5671458 5924812 6080214 6117130 6041653 5882492 5681680 5486162 5342244 5289154 5349153
43462 5349153 5518744 5768641 6054649 6333503 6575192 6766989 6909594 7009053 7069051 7087308
43452 7087308 7057254 6973357 6836547 6656136 6446236 6218037 5972941 5702028 5393499 5043811
43442 5043811 4665361 4285501 3937188 3646637 3424743 3265737 3151637 3059046 2966705 2863706
43432 2863706 2756391 2669562 2640112 2706893 2902484 3247811 3745968 4374381 5081807 5798282
43422 5798282 6457180 7016856 7467006 7815557 8066450 8204854 8199330 8017621 7644520 7091629
43412 7091629 6396071 5611410 4795839 4001494 3267109 2615055 2052500 1575408 1173865
43403 1173865 838050 564085 357603 231506 196432 248030 359540 486684 584068 624535
43393 624535 610957 574679 561562 611300 737884 919245 1101564 1217471 1210061 1051542 749428
43382 749428 340658 -121026 -579206 -987453 -1318768 -1569886 -1759073 -1917954 -2080343 -2272345
43372 -2272345 -2507072 -2784243 -3091870 -3406918 -3695037 -3912740 -4015098 -3967697 -3757495 -3396646
43362 -3396646 -2917114 -2359407 -1762231 -1158273 -575492 -38467 434183 834128 1163701
43353 1163701 1430225 1638710 1789226 1880601 1916785 1910601 1881850 1849837 1823559 1795396 1743462
43342 1743462 1642672 1478261 1254233 993889 735149 524496 410789 438069 637075 1017128
43332 1017128 1561659 2230831 2972397 3737206 4491755 5221639 5926153 6610247 7279701
43323 7279701 7940057 8595516 9244633 9873899 10453843 10942116 11294161 11477440 11482825 11328169
43313 11328169 11053054 10707374 10338388 9980803 9652462 9355934 9084675 8831923 8599566
43304 8599566 8402464 8264244 8205084 8228125 8312804 8419170 8500991 8521645 8465994 8342607
43294 8342607 8174640 7984371 7781192 7560829 7315295 7045438 6767173 6507859 6295997
43285 6295997 6150966 6078608 6074514 6132193 6250760 6437778 6706605 7071067 7540879 8118532
43275 8118532 8795640 9547434 10328202 11073075 11708716 12169107 12409002 12410060 12179859 11746757
43265 11746757 11153077 10447760 9679494 8891499 8118975 7389763 6727916 6157830 5704563
43256 5704563 5387154 5207455 5142385 5146714 5165933 5151705 5072191 4914994 4685283 4402284
43246 4402284 4095514 3800746 3555040 3389988 3323757 3355045 3462892 3612921 3765884 3883685
43236 3883685 3931975 3882199 3715573 3427881 3031369 2550929 2015347 1448594 867520 288794
43226 288794 -259020 -727151 -1049044 -1153768 -984784 -516991 233299 1208480 2319953
43217 2319953 3465466 4547840 5489868 6242834 6788901 7138519 7323608 7387170 7371088
43208 7371088 7305493 7203274 7061444 6868204 6612699 6294308 5928462 5546281 5186847 4884570
43198 4884570 4657493 4502010 4395346 4303141 4189063 4025123 3801370 3531249 3248520 2996064
43188 2996064 2812850 2726500 2753717 2904769 3186493 3600873 4139677 4778111 5472087 6163563
43178 6163563 6794784 7326425 7751122 8095562 8410198 8751910 9168191 9689557 10330863
43169 10330863 11096155 11981208 12973102 14050804 15189498 16365668 17557203 18736195
43161 18736195 19858718 20859392 21656106 22164477 22316414 22076014 21448283 20479253 19248268
43152 19248268 17854782 16403804 14994306 13712258 12626431 11784019 11205817 10883828
43144 10883828 10784601 10858927 11054789 11328092 11646289 11983954 12314137 12601419 12800705 12862204
43134 12862204 12740685 12406107 11852687 11103751 10211091 9248849 8302624 7455206 6772742
43125 6772742 6297044 6047768 6031835 6252274 6710164 7399897 8302690 9382215 10583042
43116 10583042 11832373 13047046 14146142 15064699 15762242 16224347 16460787 16503003 16398763
43107 16398763 16201034 15954059 15684583 15402945 15110305 14804277 14479502 14126438 13733138
43098 13733138 13290033 12793018 12241043 11630528 10953630 10205208 9395610 8560176 7757514
43089 7757514 7055955 6515111 6171929 6037093 6101052 6343939 6743292 7277256 7924886 8665827
43079 8665827 9479432 10341932 11221635 12075219 12849567 13491162 13959376 14235952 14324757 14243780
43069 14243780 14017442 13675462 13256433 12808933 12385982 12035322 11791327 11672169 11682416
43060 11682416 11818849 12075433 12442615 12899320 13402885 13886527 14270018 14479707 14467689
43051 14467689 14221588 13762845 13136561 12398447 11604973 10810373 10068537 9432496 8945802
43042 8945802 8628493 8467364 8418338 8420043 8411238 8345293 8198650 7971880 7682359 7351128
43032 7351128 6991828 6609805 6211105 5812068 5440644 5130050 4912294 4815879 4864390 5071221
43022 5071221 5431347 5915559 6470604 7024620 7496121 7805803 7889930 7711676 7266072 6576891
43012 6576891 5687723 4652035 3526312 2367068 1229602 166670 -772451 -1541885 -2100044
43003 -2100044 -2414553 -2470138 -2273710 -1851744 -1241091 -479000 402635 1377304 2419414
42994 2419414 3498165 4573470 5597373 6522120 7312864 7960254 8486622 8940915 9382661
42985 9382661 9861739 10403010 11001122 11624943 12228021 12761368 13185108 13475451 13625070
42976 13625070 13638435 13526348 13303172 12987057 12600708 12170116 11720356 11269163 10820350
42967 10820350 10360606 9863749 9303252 8667374 7968088 7239721 6531743 5902375 5413745
42958 5413745 5123448 5069693 5254987 5637627 6137532 6656467 7106100 7432925 7629339 7726883
42948 7726883 7777321 7832176 7928394 8081833 8286942 8520835 8749936 8936833 9045904 9048383
42938 9048383 8927963 8685694 8340706 7924616 7471943 7011952 6565980 6149685 5776701
42929 5776701 5460704 5215197 5050919 4970246 4959336 4982290 4983590 4901535 4687869 4323809
42919 4323809 3824725 3233055 2605090 1997679 1458070 1018214 694884 495260 423109 478698
42909 478698 650249 903220 1176899 1393045 1474155 1365447 1054293 580374 30921 -479101
42899 -479101 -834492 -945149 -763177 -290496 423024 1291282 2211844 3089458 3857347 4491352
42889 4491352 5012935 5479232 5963343 6533241 7237160 8097322 9108832 10241685 11447463
42880 11447463 12671954 13869958 15014764 16097313 17117009 18071652 18953443 19752043
42872 19752043 20459967 21074742 21596428 22023178 22348329 22560767 22648987 22608085 22447121 22192760
42862 22192760 21886152 21573602 21294951 21074383 20916843 20810462 20732532 20654975 20546552 20372192
42852 20372192 20092642 19667737 19064007 18263587 17269550 16105307 14810235 13435097 12036988
42843 12036988 10670388 9374732 8166259 7042698 5999741 5047971 4218458 3554403
42835 3554403 3095364 2862727 2851963 3033128 3358190 3771883 4222083 4667147 5080386 5453840
42825 5453840 5802107 6163437 6593813 7153121 7888191 8819272 9933123 11182297 12490598
42816 12490598 13766241 14921707 15893822 16655467 17214711 17603895 17864785 18035131 18139937
42807 18139937 18188933 18180082 18106773 17964864 17756409 17489511 17176366 16831849 16473319 16120944
42797 16120944 15798141 15532245 15354235 15294721 15374561 15593154 15922156 16311247 16705217 17063191
42787 17063191 17369254 17630588 17868349 18109403 18382350 18715538 19133643 19652096 20271093
42778 20271093 20971865 21717854 22462454 23161569 23785848 24327558 24801111 25239658 25689648
42769 25689648 26202218 26819858 27560590 28406338 29302257 30168103 30916061 31467522 31764627
42760 31764627 31776421 31500407 30959435 30194062 29252066 28178115 27007096 25763823 24469110
42751 24469110 23147856 21833110 20563340 19375091 18294671 17331012 16470868 15678128
42743 15678128 14898435 14068172 13126346 12028675 10761931 9352983 7866501 6390597
42735 6390597 5016360 3819098 2846435 2115210 1616741 1327266 1218314 1262655 1435018
42726 1435018 1710068 2061037 2460828 2884800 3312305 3725170 4105064 4433749 4697383
42717 4697383 4891284 5020878 5098248 5137154 5148999 5140346 5112254 5062312 4989444 4899580 4809593
42706 4809593 4748223 4754265 4872423 5146564 5610459 6278200 7138308 8155046 9277314 10451818
42696 10451818 11635164 12799830 13931622 15020621 16051488 16999365 17833589 18525978
42688 18525978 19057977 19422677 19621837 19660815 19544174 19272754 18841841 18241211 17458727
42679 17458727 16486949 15328645 13997266 12513352 10901907 9193605 7427384 5650272
42671 5650272 3913787 2269903 769378 -537945 -1603862 -2386119 -2855498 -3000714 -2826373
42662 -2826373 -2345432 -1573977 -534481 735326 2177455 3718744 5284106 6811311
42654 6811311 8262162 9627372 10924149 12187481 13459279 14780089 16185059 17702213
42646 17702213 19350736 21138806 23061442 25097806 27206774 29321173 31344230 33153539
42638 33153539 34616251 35614081 36070951 35973324 35375032 34384174 33136399 31764300 30373836
42629 30373836 29034653 27783675 26635497 25592532 24651610 23807321 23053046 22380027 21775322
42620 21775322 21221084 20697470 20188716 19689018 19204284 18748498 18336572 17977461 17670675
42611 17670675 17406693 17168889 16933650 16668272 16330621 15876299 15274856 14529061 13686122
42602 13686122 12832173 12070205 11491085 11150646 11061240 11197285 11508196 11931513 12402366
42593 12402366 12858294 13240110 13491179 13559088 13402819 13004116 12377635 11574335 10676663
42584 10676663 9787112 9011985 8441987 8133454 8096901 8298163 8671476 9138091 9623253
42575 9623253 10067902 10434408 10706328 10882341 10967193 10965293 10881245 10725496 10518116 10285204
42565 10285204 10049310 9820252 9591583 9343591 9051351 8695986 8275875 7812204 7343866
42556 7343866 6912612 6545802 6245748 5990071 5741137 5458756 5110455 4676553 4150721
42547 4150721 3538530 2856016 2128265 1386928 665956 -3530 -597527 -1101438 -1510106
42538 -1510106 -1825156 -2048997 -2176898 -2192265 -2070707 -1792352 -1353913 -771116 -70084 724774
42528 724774 1597729 2540867 3548473 4610858 5710030 6817856 7896240 8898344 9770553
42519 9770553 10456522 10905023 11081078 10976401 10613580 10040409 9315771 8493338 7611182
42510 7611182 6692659 5757658 4836791 3978381 3241851 2680494 2324773 2176976 2218954 2425424
42500 2425424 2774065 3249138 3840113 4537031 5323779 6171749 7037450 7865889 8598242
42491 8598242 9180873 9573473 9754802 9724781 9502274 9118786 8609288 8002624 7315485 6553504
42481 6553504 5719332 4822921 3888031 2952286 2062075 1264912 601473 99347 -228827
42472 -228827 -381340 -359266 -158808 231643 828612 1646581 2689627 3944207 5375655
42463 5375655 6930554 8544721 10153602 11700834 13142725 14449119 15602331 16595443
42455 16595443 17430219 18114602 18660282 19081978 19400225 19646956 19869165 20124632 20467663
42446 20467663 20929508 21502262 22133740 22735940 23204354 23441996 23380908 22995446 22304975
42437 22304975 21367305 20266569 19099225 17960553 16933014 16077950 15432081 15008799 14802124
42428 14802124 14790776 14941266 15210525 15549147 15906607 16239522 16521557 16750010 16943432
42419 16943432 17129835 17331664 17555599 17791476 18019594 18222230 18393453 18541504 18682423
42410 18682423 18830301 18992009 19169433 19365430 19588042 19851103 20171948 20566322 21039927
42401 21039927 21578929 22145340 22682533 23130719 23445985 23614516 23656597 23619941 23565642 23551708
42391 23551708 23619734 23789784 24064779 24439649 24907139 25456039 26065323 26701060 27319202
42382 27319202 27872201 28316324 28618061 28757944 28729695 28535580 28182959 27686296 27073042
42373 27073042 26387977 25692278 25056871 24550407 24223259 24093329 24142116 24323957 24581447
42364 24581447 24857010 25097322 25255345 25294773 25196328 24961664 24611343 24175987 23683131 23145678
42354 23145678 22558336 21903893 21164887 20334630 19424720 18468734 17521040 16649250 15921834
42345 15921834 15396133 15111695 15089750 15335963 15843183 16592837 17555692 18693618 19963006
42336 19963006 21318988 22719366 24128272 25519686 26879262 28202405 29489684 30743900
42328 30743900 31971283 33183695 34396341 35620023 36852676 38075168 39252344 40337731
42320 40337731 41280991 42037263 42575246 42880085 42950787 42796762 42438381 41911204 41268157
42311 41268157 40573994 39891603 39265624 38710975 38212038 37734103 37243807 36730391 36217152
42302 36217152 35756278 35410231 35231586 35252581 35485941 35929618 36568343 37371749 38294071
42293 38294071 39279582 40273601 41234945 42144376 43005411 43838436 44673143 45543443 46483953
42284 46483953 47523857 48677071 49933675 51259552 52606565 53928628 55195776 56400316
42276 56400316 57554096 58679969 59801747 60935355 62081844 63222464 64317250 65309549
42268 65309549 66137070 66745881 67100903 67188481 67012372 66588183 65939575 65094989 64083055
42259 64083055 62928417 61652421 60279908 58847576 57407087 56019678 54745338 53633264
42251 53633264 52718855 52026944 51575819 51376957 51430933 51724597 52233520 52928197 53779450
42242 53779450 54760100 55843079 56997726 58186387 59363915 60482295 61499974 62391721
42234 62391721 63152931 63794071 64326141 64743707 65014354 65079877 64867888 64308128 63348172
42225 63348172 61965759 60176335 58034702 55630494 53078381 50504327 48029771 45757093
42217 45757093 43760446 42083229 40739030 39712082 38957307 38404098 37966583 37557928 37103012
42208 37103012 36545592 35850463 35003499 34011658 32902647 31721859 30524523 29363876 28279719
42199 28279719 27292609 26405560 25610350 24893852 24242378 23645109 23097977 22607166 22189702
42190 22189702 21868988 21665029 21581757 21596705 21659716 21704489 21669404 21517109 21241956 20862312
42180 20862312 20405024 19893417 19344877 18775189 18202564 17647526 17130396 16670046 16285140
42171 16285140 15996019 15824179 15787274 15890297 16117408 16431001 16781657 17125472 17439535
42162 17439535 17727125 18010909 18319281 18673669 19081681 19536070 20016670 20494299 20937941
42153 20937941 21325062 21650276 21926352 22176578 22423655 22681041 22948966 23214799 23457547
42144 23457547 23655377 23792761 23863816 23872173 23830036 23756912 23675182 23600948 23533483 23449570 23306763
42133 23306763 23055079 22652773 22080039 21344881 20478543 19522856 18515850 17482938 16438273
42124 16438273 15395385 14380268 13437679 12625422 11999324 11597126 11428821 11476351 11701463
42115 11701463 12057999 12503377 13004344 13535673 14075436 14602060 15095491 15540655 15929836
42106 15929836 16261982 16538588 16757681 16909214 16975602 16938106 16785138 16517279 16147884 15702462
42096 15702462 15218902 14745394 14331414 14013319 13803432 13690731 13652220 13665909 13717333 13798821
42086 13798821 13906209 14036951 14190149 14367231 14572737 14815396 15109242 15473607 15930763
42077 15930763 16501031 17196700 18016995 18945932 19953686 21000951 22045185 23047244 23976792
42068 23976792 24815311 25556901 26207983 26786935 27323234 27854175 28417413 29040513 29732295
42059 29732295 30480874 31258480 32027974 32746594 33368207 33848605 34154928 34275000 34221638
42050 34221638 34030675 33753920 33448420 33164164 32934756 32775221 32686514 32661540 32687492 32743872
42040 32743872 32800232 32819068 32766254 32624809 32402678 32127608 31831853 31537342 31249936 30962190
42030 30962190 30658127 30316233 29912264 29424424 28839710 28157825 27390895 26560667 25695545
42021 25695545 24827774 23989571 23208222 22501917 21877849 21332289 20852141 20418355 20011032
42012 20011032 19613242 19210568 18787973 18329706 17825480 17279075 16712135 16159407 15657823
42003 15657823 15235134 14903809 14663059 14506824 14431014 14434231 14512740 14655725 14845424 15061525
41993 15061525 15286519 15509892 15730446 15956219 16201791 16483971 16817272 17209829 17659963
41984 17659963 18154541 18671082 19184873 19679725 20157420 20639487 21158300 21741208 22395856
41975 22395856 23103254 23820510 24491886 25064520 25501889 25787011 25913190 25870110 25637015
41966 25637015 25188831 24511458 23617424 22553941 21399391 20249469 19198970 18326062 17682332
41957 17682332 17288298 17133900 17184280 17389441 17694173 18045282 18395938 18707956 18952074
41948 18952074 19106719 19156797 19093324 18912884 18616925 18213456 17722866 17184522 16657637 16213091
41938 16213091 15918904 15825023 15952223 16288134 16791727 17404923 18067170 18727931 19353239
41929 19353239 19924868 20433634 20871788 21230226 21502153 21688678 21800056 21851378 21857556 21832729
41919 21832729 21793975 21765109 21777233 21866006 22066805 22407811 22901281 23535572 24272198 25051126
41909 25051126 25804044 26471696 27018665 27439029 27750781 27983937 28170504 28340417 28520479
41900 28520479 28731602 28984275 29276517 29597251 29933380 30276749 30628845 31003004 31424054
41891 31424054 31924582 32537744 33288484 34186330 35222758 36374097 37608933 38896944 40215619
41882 40215619 41552181 42900942 44258684 45621083 46981266 48330223 49658539 50958473
41874 50958473 52224053 53447762 54616431 55712131 56721031 57646395 58518210 59394159
41866 59394159 60351775 61475340 62842796 64517662 66548011 68970920 71819600 75131698
41858 75131698 78957452 83364780 88438663 94275884 100979240 108653653 117402180 127317894
41850 127317894 138469852 150885503 164534359 179314951 195040551 211415351 227998059
41843 227998059 244161216 259065430 271676320 280857151 285556683 285063351 279232509 268570821
41835 268570821 254120899 237196072 219087566 200855317 183245370 166711234 151488327
41828 151488327 137674976 125293030 114321460 104709324 96377656 89218572 83098757
41821 83098757 77871085 73390560 69525403 66158039 63180187 60490422 57998376 55633196
41813 55633196 53350797 51135009 48991027 46934438 44982086 43148361 41445075 39881623
41805 39881623 38465352 37203905 36108328 35192331 34464984 33920218 33530693 33251800 33034982
41796 33034982 32843364 32661694 32497292 32374173 32324703 32381734 32572506 32914499 33412530 34056450
41786 34056450 34820131 35662870 36532071 37364572 38087107 38621156 38896522 38870565 38543738
41777 38543738 37963081 37211195 36384127 35565676 34807914 34125059 33500479 32899838 32283529
41768 32283529 31616608 30877439 30064435 29197757 28314086 27456731 26666472 25977625 25419641
41759 25419641 25020063 24803459 24784174 24956031 25285731 25716031 26179977 26620906 27008430
41750 27008430 27341651 27637836 27913332 28167919 28380914 28519669 28553638 28464818 28249429 27912606
41740 27912606 27462499 26909206 26269296 25572049 24862069 24194867 23626023 23197977 22929749
41731 22929749 22813458 22818906 22904866 23033192 23180416 23342185 23529514 23759847 24047796 24398887
41721 24398887 24807014 25254820 25716837 26165873 26581655 26957883 27303355 27636850 27980326
41712 27980326 28355333 28783040 29284401 29877903 30575841 31381514 32288502 33281688 34339096
41703 34339096 35433483 36532817 37600788 38600475 39503396 40301555 41016103 41696990 42412968
41694 42412968 43235679 44222672 45403071 46768957 48274999 49846351 51390973 52810922
41686 52810922 54010036 54899945 55407529 55484329 55115123 54321971 53160968 51710937 50056643
41677 50056643 48272831 46416355 44529342 42649127 40816190 39073320 37456765 35987380
41669 35987380 34669894 33500702 32476264 31594309 30848402 30223480 29698039 29251632 28872475
41660 28872475 28561456 28331307 28200979 28187056 28296251 28522119 28844663 29228921 29621748
41651 29621748 29951688 30138015 30109669 29827197 29296839 28568926 27721381 26837991 25993440
41642 25993440 25250119 24661326 24270667 24102650 24149165 24361949 24657914 24936558 25103402
41633 25103402 25092678 24883599 24505105 24026135 23534133 23110420 22811685 22661630 22651443 22746468
41623 22746468 22897257 23052704 23171859 23231637 23229431 23180366 23108849 23035990 22967463 22887009 22757838
41612 22757838 22530950 22158404 21609204 20883718 20020961 19094992 18201339 17438151 16887308
41603 16887308 16599517 16586056 16818862 17239143 17772647 18347623 18909970 19430595 19903400
41594 19903400 20336577 20741839 21125002 21479796 21786751 22018714 22151553 22175054 22098630 21950156
41584 21950156 21769863 21602001 21485972 21448717 21501106 21640461 21858495 22150397 22519562 22974757
41574 22974757 23521518 24153632 24850480 25581505 26314036 27019178 27672873 28253223 28737737
41565 28737737 29104435 29338180 29439452 29429895 29349966 29248410 29167881 29132822 29144189 29182265
41555 29182265 29215378 29210337 29140581 28990124 28753279 28431357 28028092 27546276 26988036 26359007
41545 26359007 25673075 24952586 24221793 23497521 22784944 22083680 21401445 20766183 20228139
41536 20228139 19849298 19683953 19757583 20051862 20501991 21008250 21457455 21745583 21793457 21553047
41526 21553047 21007874 20172607 19092923 17841517 16505649 15168051 13890750 12711974
41518 12711974 11657300 10754763 10040558 9550478 9304352 9295884 9494471 9855804 10333302
41509 10333302 10885165 11477358 12084888 12692415 13293438 13887725 14477738 15065088 15647182
41500 15647182 16213768 16744041 17206402 17563364 17781568 17843205 17753274 17539638 17247357 16930932
41490 16930932 16646523 16443471 16354969 16390788 16536880 16763991 17041185 17346101 17666202 17992545
41480 17992545 18313184 18611796 18871146 19076681 19216545 19278370 19246015 19099148 18815921 18376686
41470 18376686 17767248 16982898 16035474 14961710 13825941 12711474 11703197 10871187 10263346
41461 10263346 9907237 9815981 9993365 10435675 11129266 12045426 13137640 14346477 15611589
41452 15611589 16883854 18130903 19335621 20492033 21601191 22665457 23679592 24622325
41444 24622325 25455691 26135899 26630775 26932895 27060307 27046021 26924987 26726732 26475054
41435 26475054 26190456 25891200 25592842 25308048 25046827 24815263 24612001 24424881 24231574
41426 24231574 24006255 23730460 23403457 23047067 22702323 22419381 22244738 22209792 22322798
41417 22322798 22564917 22891066 23235991 23524726 23685035 23659088 23412387 22939063 22263095
41408 22263095 21434662 20520536 19589065 18694330 17866745 17114510 16432971 15814069 15250781
41399 15250781 14738202 14275903 13872571 13548531 13331196 13243592 13292341 13462715 13723816 14040097
41389 14040097 14382351 14733588 15089439 15454876 15838831 16247898 16680801 17125412 17559387
41380 17559387 17954780 18286104 18539521 18718809 18844214 18944232 19044667 19160254 19290798
41371 19290798 19420320 19517315 19537301 19431016 19159783 18713795 18124272 17461584 16818596 16286851
41361 16286851 15936617 15808000 15912620 16239880 16762309 17439546 18223969 19069094 19936747
41352 19936747 20797370 21622803 22378456 23023548 23521436 23852521 24019493 24041552 23943850 23751112
41342 23751112 23488693 23186960 22882818 22615178 22414943 22293033 22232293 22189713 22111416 21955507
41332 21955507 21712537 21414523 21129663 20945880 20949142 21202369 21730082 22513099 23495933 24605348
41322 24605348 25773396 26955562 28137116 29326742 30541910 31792813 33071881 34353689
41314 34353689 35605165 36799721 37926865 38993126 40017189 41024963 42046961 43115696
41306 43115696 44259846 45495374 46817859 48200874 49601762 50971168 52261060 53429189
41298 53429189 54442878 55285682 55966251 56524130 57027491 57561869 58212654 59045486 60090117
41289 60090117 61334819 62735877 64238158 65794723 67374588 68958150 70528598 72067332
41281 72067332 73554669 74973004 76310253 77563070 78738970 79856096 80940726 82024267
41273 82024267 83141676 84332137 85641457 87124375 88844723 90873235 93284982 96157928
41265 96157928 99570789 103596732 108292426 113686520 119772997 126512384 133840368 141680326
41257 141680326 149954427 158587953 167505001 176618643 185821043 194976971 203920276 212450841
41249 212450841 220331540 227288934 233024638 237242382 239688623 240196622 238720601 235349704
41241 235349704 230298258 223875736 216445245 208381646 200038452 191726920 183705468 176175829
41233 176175829 169284099 163126103 157755707 153193081 149430684 146437521 144164175 142549675
41225 142549675 141528564 141035528 141006486 141377031 142080358 143047270 144210145 145509348 146896493
41216 146896493 148328703 149754114 151096072 152245245 153063920 153400211 153106698 152058754
41208 152058754 150169897 147402837 143774943 139357264 134268090 128663847 122728404 116657561
41200 116657561 110635476 104807616 99263379 94039617 89142902 84575951 80352943 76498630
41192 76498630 73036743 69977280 67309326 65000190 62997151 61228912 59608420 58041672
41184 58041672 56443695 54756209 52958358 51065717 49119970 47176120 45293284 43530216
41176 43530216 41941949 40573309 39449420 38567991 37898311 37387227 36968296 36570881 36129244
41167 36129244 35592832 34936492 34166660 33320155 32455540 31639857 30934194 30381144 29997480
41158 29997480 29775090 29690257 29716579 29834320 30031906 30301590 30635236 31024607 31465334 31959683
41148 31959683 32513622 33127595 33785374 34447961 35058014 35554740 35892632 36054722 36054791 35930578
41138 35930578 35734333 35524901 35360905 35293325 35358708 35575682 35944788 36448521 37050059 37693745
41128 37693745 38311991 38838742 39223496 39438495 39476485 39343305 39052570 38626792 38103030
41119 38103030 37536634 36997557 36559053 36283614 36211581 36354655 36693707 37180502 37744622
41110 37744622 38306127 38791366 39147464 39352411 39419949 39398717 39363999 39401990 39590756 39985388
41100 39985388 40613492 41481595 42586826 43925351 45491654 47269984 49225729 51304152
41092 51304152 53437390 55554109 57585481 59465058 61124563 62490505 63487165 64048841
41084 64048841 64137892 63759375 62963933 61838091 60488643 59029016 57570237 56213456 55040033
41075 55040033 54099516 53401090 52914502 52581307 52331127 52096352 51822108 51471906 51029589
41066 51029589 50497442 49891002 49233350 48552202 47880715 47258941 46730815 46334008 46086752
41057 46086752 45981180 45990765 46089259 46268796 46544449 46942662 47482556 48162921 48962133 49848882
41047 49848882 50795525 51786174 52816941 53891463 55017137 56204932 57471327 58838483
41039 58838483 60330174 61964063 63743059 65648715 67638846 69650720 71609967 73443468
41031 73443468 75092284 76519885 77712545 78672554 79408504 79927467 80230614 80310233 80146371
41022 80146371 79705495 78946159 77832597 76349887 74511727 72357469 69943119 67332857
41014 67332857 64593149 61787355 58969975 56183199 53458497 50822294 48301925 45928735
41006 45928735 43737295 41760991 40024901 38538150 37288843 36244011 35355349 34569702
40998 34569702 33840795 33136678 32438751 31734720 31013508 30267856 29501338 28730795 27979379
40989 27979379 27264323 26587946 25936888 25288437 24619314 23912894 23163859 22382151 21597961
40980 21597961 20865643 20260542 19864004 19739384 19909911 20350547 20998360 21774778 22607217
40971 22607217 23441158 24242298 24993588 25690851 26337630 26939941 27503225 28033103 28538445
40962 28538445 29033593 29537420 30068224 30634592 31224710 31799725 32296971 32644194 32779413
40953 32779413 32667386 32305343 31716679 30938477 30012068 28981925 27899454 26822921 25808452
40944 25808452 24896173 24101489 23418447 22833227 22338658 21940914 21656174 21501844 21488532
40935 21488532 21615258 21866920 22213310 22611726 23015448 23386377 23705094 23971587 24195947
40926 24195947 24385778 24539053 24646154 24698384 24697665 24663045 24631187 24649332 24762222 24998312
40916 24998312 25362196 25837483 26398866 27026506 27713733 28463134 29275190 30139807 31037711
40907 31037711 31948921 32859816 33763216 34652361 35513138 36319585 37036865 37632522 38091077
40898 38091077 38423697 38667855 38878315 39114488 39429089 39861459 40436529 41167014 42054489
40889 42054489 43087026 44235335 45451079 46669165 47812967 48799645 49543258 49956544
40881 49956544 49956623 49478927 48496161 47031732 45159678 42992665 40665291 38317289 36077290
40872 36077290 34048802 32302289 30874920 29774684 28984415 28464581 28157162 27993026 27902656
40863 27902656 27827193 27725985 27579194 27387390 27169816 26959327 26790815 26685659 26641451 26634613
40853 26634613 26633155 26608913 26541390 26414434 26212186 25918182 25517414 25000573 24370738 23650712
40843 23650712 22885493 22135072 21459481 20904006 20491522 20222631 20080283 20036375 20060099 20127400
40833 20127400 20229075 20373950 20584939 20888832 21304659 21837516 22481477 23228335 24074637
40824 24074637 25021840 26070500 27213309 28431365 29695661 30973199 32235313 33464404
40816 33464404 34655560 35811469 36932499 38007368 39010817 39910896 40681660 41313340
40808 41313340 41814828 42209340 42527582 42801623 43059788 43321290 43589794 43847403 44053095
40799 44053095 44149667 44079114 43801051 43306265 42619871 41793181 40888445 39963737 39064580 38223904
40789 38223904 37466265 36810817 36271048 35853130 35555713 35372178 35294151 35314083 35425304 35620267
40779 35620267 35889311 36221155 36603975 37026070 37477486 37954312 38464228 39029282 39683613
40770 39683613 40467432 41419352 42567755 43921793 45464433 47150892 48914373 50678882
40762 50678882 52376936 53967063 55443739 56834646 58187225 59553134 60978730 62502886
40754 62502886 64156831 65960745 67917825 70011979 72214168 74495478 76838936 79243388
40746 79243388 81719323 84282003 86947485 89733897 92666638 95783213 99132359 102765206
40738 102765206 106722711 111027577 115686161 120699229 126076298 131848325 138074269 144837465
40730 144837465 152230416 160332472 169189783 178806281 189148184 200156610 211758769
40723 211758769 223870761 236393213 249207177 262176072 275152143 287981867 300507317
40716 300507317 312563991 323974463 334534008 343984816 351981351 358060468 361643976
40709 361643976 362107293 358926442 351864451 341111738 327300650 311379914 294411089
40702 294411089 277377632 261065888 246025043 232581258 220878366 210927390 202655141
40695 202655141 195946019 190673134 186716211 183964744 182307812 181616525 181728317 182440743
40687 182440743 183517412 184704331 185754277 186456596 186666965 186327179 185465282 184173622
40679 184173622 182572248 180770620 178839951 176803817 174647863 172341986 169863548 167211330
40671 167211330 164406495 161483894 158480778 155429166 152354390 149277834 146220149 143203279
40663 143203279 140252350 137397509 134672518 132106744 129712364 127473618 125344129 123253055
40655 123253055 121116657 118851779 116389411 113686985 110737206 107570665 104250617 100860905
40647 100860905 97490446 94218270 91101709 88169034 85417710 82819926 80335381 77927275
40639 77927275 75573831 73268652 71010143 68788467 66580912 64359740 62106349 59821031
40631 59821031 57522296 55238110 52995600 50813958 48701240 46653752 44657385 42691607
40623 42691607 40736434 38780852 36829382 34904373 33043838 31295813 29709640 28324408
40615 28324408 27157034 26194600 25394839 24695169 24027295 23332676 22573767 21737295 20829616
40606 20829616 19868378 18875473 17873254 16882911 15923863 15014304 14172556 13417656 12768144
40597 12768144 12240532 11849659 11610768 11540246 11651956 11949460 12417951 13021033 13705047
40588 13705047 14409026 15074972 15654199 16110022 16419744 16576951 16591955 16488846 16301221
40579 16301221 16069751 15841117 15664738 15585295 15633358 15818271 16126204 16524312 16970655 17427293
40569 17427293 17871627 18301178 18730339 19181302 19672584 20208377 20771833 21325373 21819636
40560 21819636 22209347 22470321 22609493 22662323 22678647 22704906 22771456 22888733 23050723 23242174
40550 23242174 23446088 23647896 23834297 23989144 24092005 24122284 24065411 23915437 23672747 23341034
40540 23341034 22927499 22445692 21917309 21370391 20834753 20337912 19904564 19560091 19335300
40531 19335300 19268239 19400917 19772197 20409557 21321632 22493067 23884691 25442356 27113644
40522 27113644 28864571 30686048 32585822 34571683 36636254 38749526 40858295 42889345
40514 42889345 44755723 46366974 47641601 48516953 48952693 48928563 48440269 47496658 46118355
40505 46118355 44336415 42190312 39726683 37000577 34078868 31042239 27981512 24987402
40497 24987402 22137711 19488634 17074769 14917672 13037749 11461665 10219340 9330722
40489 9330722 8789570 8553767 8547574 8674651 8836674 8951452 8964831 8852534 8612753 8255995
40479 8255995 7799501 7268332 6699054 6140518 5649794 5285132 5098715 5130809 5405393 5927156
40469 5927156 6680759 7633540 8740509 9947410 11189139 12387615 13457631 14323557 14938783
40460 14938783 15296061 15424560 15379183 15229182 15047993 14903277 14847440 14910313 15094696 15375378
40450 15375378 15703878 16020730 16272341 16424638 16467181 16408358 16267584 16069463 15840214 15604190
40440 15604190 15380023 15178071 15000453 14842848 14696460 14549781 14390602 14208136 13994547
40431 13994547 13745793 13462608 13152016 12828556 12513691 12232342 12006622 11848634 11755776
40422 11755776 11711655 11692712 11676944 11650452 11610022 11563291 11528521 11533779 11613019 11797435 12104853
40411 12104853 12533249 13062121 13659006 14285187 14898921 15460200 15939832 16328295 16636442
40402 16636442 16886236 17098573 17287106 17460702 17630486 17816190 18048954 18369784 18823319
40393 18823319 19447195 20259048 21245261 22356230 23511420 24613810 25569184 26304172 26778793
40384 26778793 26992613 26984915 26828368 26615747 26441725 26384565 26492391 26776670 27214302 27758882
40374 27758882 28357984 28968127 29558637 30103436 30569165 30909700 31069984 30994801 30637530
40365 30637530 29967932 28980342 27701283 26191886 24539993 22841709 21179548 19608257
40357 19608257 18155291 16832889 15650961 14621188 13750979 13034013 12445750 11948421 11503823
40348 11503823 11088004 10700403 10362210 10104091 9949624 9903504 9949472 10055463 10179712 10274805
40338 10274805 10291782 10186842 9929461 9508932 8938023 8253498 7511288 6773915 6092598
40329 6092598 5492206 4966978 4488693 4022474 3542837 3043486 2537565 2050332 1610484
40320 1610484 1245893 984151 853776 882318 1091486 1491960 2080238 2837912 3732306 4717264
40310 4717264 5734460 6717701 7602327 8338229 8901009 9295981 9554012 9722162 9852506
40301 9852506 9990730 10165833 10383988 10630038 10876985 11098971 11280942 11420661 11523884
40292 11523884 11597231 11642962 11656953 11629055 11545530 11394424 11173523 10897303 10598012 10319359
40282 10319359 10106338 9996230 10013256 10166222 10448302 10839403 11311701 11837412 12396072
40273 12396072 12977869 13580667 14201690 14828703 15436127 15987985 16445268 16774665 16957030
40264 16957030 16994040 16909571 16743123 16537089 16323918 16118429 15916465 15698276 15435496 15101640
40254 15101640 14684669 14196917 13676304 13176224 12748152 12425319 12213800 12091983 12016341
40245 12016341 11932585 11791436 11564490 11252351 10880247 10484746 10100335 9751980 9453545
40236 9453545 9209167 9016606 8873464 8785213 8770343 8857544 9074382 9433048 9920955 10500510
40226 10500510 11116462 11706158 12209285 12576586 12777929 12808269 12688144 12456625 12159326
40217 12159326 11838103 11528079 11261268 11070218 10985706 11028566 11201060 11482697 11831657 12190620
40207 12190620 12495987 12689172 12727049 12588131 12273681 11806316 11228772 10602490 10002825
40198 10002825 9508516 9186848 9079515 9194709 9508193 9971743 10524563 11103566 11651184
40189 11651184 12121275 12483371 12723899 12843271 12850443 12759168 12588858 12368673 12139991 11953387
40179 11953387 11860401 11903714 12109760 12486161 13024252 13704976 14504679 15397419 16352691 17331119
40169 17331119 18282799 19152152 19889390 20463910 20872317 21135979 21289235 21365190 21386440 21363311
40159 21363311 21296738 21181223 21006024 20756848 20421577 20000123 19512951 19000820 18513362
40150 18513362 18092532 17760842 17520087 17358010 17256087 17193319 17146305 17089291 16997303 16851749
40140 16851749 16644678 16378498 16061685 15704508 15318180 14917198 14521276 14153483 13834088
40131 13834088 13573051 13365133 13190007 13017144 12813894 12554947 12230777 11851321 11441754
40122 11441754 11031375 10641309 10277553 9931904 9588860 9235032 8868249 8503644 8173579
40113 8173579 7919908 7781316 7782357 7929980 8217687 8631647 9152642 9752899 10392784 11023205
40103 11023205 11595112 12071939 12438835 12705022 12899998 13066721 13254312 13510292 13871348
40094 13871348 14353209 14943003 15598102 16253273 16834297 17273947 17526006 17573785 17430310
40085 17430310 17128837 16706492 16189087 15586303 14899701 14136372 13317708 12478758 11661547
40076 11661547 10907376 10249882 9709629 9292844 8996358 8815902 8751377 8805918 8981596 9276291
40066 9276291 9682678 10187122 10767581 11392715 12024301 12622162 13148577 13570606 13861380
40057 13861380 14001837 13982583 13804880 13481483 13038866 12519997 11983767 11498075 11128138
40048 11128138 10924771 10916143 11103811 11462756 11945881 12492799 13040921 13534936 13931249 14196970
40038 14196970 14307172 14245850 14012653 13631571 13154789 12657286 12222237 11920761 11792630
40029 11792630 11836778 12018105 12287986 12606503 12953496 13324057 13714360 14108688 14476844
40020 14476844 14784670 15012069 15167223 15288033 15430221 15648907 15981406 16436398 16992419
40011 16992419 17606392 18228227 18813453 19327754 19744360 20040052 20193689 20186420 20001814 19627287
40001 19627287 19059873 18315512 17435075 16479673 15515124 14594760 13752201 13007990 12383054
39992 12383054 11907157 11615523 11535896 11674395 12008316 12490017 13060676 13667554 14275479
39983 14275479 14865434 15421750 15919064 16322156 16602338 16759488 16831799 16882712 16970778 17120763
39973 17120763 17313156 17496064 17609131 17604434 17456176 17161026 16735248 16211726 15635745 15058038
39963 15058038 14526231 14077341 13733258 13500167 13372636 13342138 13406837 13576850 13870577 14303079
39953 14303079 14872900 15554505 16299428 17044483 17723656 18280867 18680827 18914414 18996056
39944 18996056 18954542 18822217 18627102 18389113 18119727 17825057 17512174 17195427 16897197
39935 16897197 16640835 16440942 16299657 16212570 16178662 16204955 16301947 16474551 16716747 17013821
39925 17013821 17348953 17707865 18078274 18446418 18795513 19108260 19370862 19574360 19712712
39916 19712712 19781505 19781484 19725980 19645897 19585476 19587791 19676127 19840663 20036872 20195631 20240202
39905 20240202 20104234 19746324 19158012 18363640 17413582 16375457 15327296 14352310 13531429
39896 13531429 12931853 12595018 12530067 12716431 13114266 13678138 14368176 15153986 16010031
39887 16010031 16906144 17800248 18639099 19367516 19941256 20337086 20556236 20621307 20568905 20439577
39877 20439577 20266087 20062609 19820048 19511564 19106809 18588055 17961073 17257604 16530026
39868 16530026 15840670 15249388 14803389 14531418 14441534 14521195 14740266 15057646 15429390 15814644
39858 15814644 16178426 16493683 16744497 16929195 17060949 17164794 17270905 17404341 17573634
39849 17573634 17763845 17939328 18056294 18079376 17994149 17809609 17549757 17239871 16896610 16527926
39839 16527926 16140299 15745274 15359322 14997808 14668315 14368479 14089906 13825279 13573273
39830 13573273 13338239 13127380 12950549 12823701 12771206 12821832 12998240 13304522 13717591 14187075
39820 14187075 14645360 15024566 15273509 15368638 15317024 15151923 14921850 14676110 14453244 14278164
39810 14278164 14166896 14131425 14178315 14302044 14479414 14670450 14825818 14896318 14839662 14623326
39800 14623326 14226008 13640533 12877661 11967447 10955390 9893815 8831802 7807858 6847969
39791 6847969 5968070 5177201 4478513 3869213 3343021 2896776 2539605 2301262 2235853 2416330
39781 2416330 2916384 3782536 5007509 6518904 8190737 9873903 11432567 12771999
39773 12771999 13848859 14663909 15244381 15625919 15841739 15921287 15895081 15799206 15674321 15558934
39763 15558934 15481203 15453599 15471578 15514941 15551547 15545027 15467177 15310763 15094452 14854291 14625327
39752 14625327 14424757 14246654 14069148 13867222 13623762 13335455 13013086 12676975 12349872
39743 12349872 12051155 11795182 11593436 11457764 11402309 11443336 11597443 11879216 12298944 12859870
39733 12859870 13554447 14360966 15244077 16161730 17076574 17965650 18822109 19647690 20441106
39724 20441106 21190389 21873743 22467072 22953229 23329774 23613788 23841203 24057855 24304171
39715 24304171 24601306 24946174 25316313 25679904 26006164 26273844 26476745 26625562 26746270
39706 26746270 26876369 27059928 27341584 27758906 28332907 29058418 29899352 30794254 31671705
39697 31671705 32467496 33135154 33649164 34006549 34229408 34363694 34468831 34600318 34794824
39688 34794824 35066129 35412243 35825992 36300270 36824957 37380172 37932725 38439155 38854354
39679 38854354 39143889 39297850 39341183 39332974 39350674 39464829 39717136 40113225 40631988 41243213
39669 41243213 41921828 42652745 43429354 44252548 45132460 46088585 47144033 48316006 49608890
39660 49608890 51014103 52515482 54096413 55745674 57460158 59243204 61098154 63018931
39652 63018931 64982241 66946631 68860659 70676654 72362554 73905709 75307194 76569426
39644 76569426 77682129 78613363 79311994 79722443 79804325 79546542 78970672 78125916 77079646
39635 77079646 75905402 74669819 73422371 72191988 70990456 69818779 68672647 67545163
39627 67545163 66426287 65299808 64141102 62920146 61610959 60203046 58708315 57160408
39619 57160408 55608378 54107865 52711047 51455850 50357012 49403696 48566693 47813270
39611 47813270 47123291 46499434 45966953 45562852 45318675 45244032 45317714 45490038 45695397 45870535
39601 45870535 45972265 45988202 45935928 45850956 45769795 45717215 45703351 45728722 45789878 45879557 45981452
39590 45981452 46065444 46089422 46008979 45790568 45421684 44913945 44298793 43618158 42913257 42214861
39580 42214861 41538068 40883160 40241535 39603889 38967694 38342268 37750748 37229331 36825203
39571 36825203 36594809 36601932 36911859 37577916 38621981 40017944 41689212 43524966 45408954
39562 45408954 47247371 48984130 50600505 52104539 53517831 54863984 56159296 57406529
39554 57406529 58595320 59712102 60756181 61751766 62746090 63793161 64932988 66178536
39546 66178536 67515858 68914595 70342463 71778262 73219547 74682711 76196084 77789529
39538 77789529 79484263 81284691 83173292 85110687 87042419 88910090 90660855 92250370
39530 92250370 93639085 94785662 95642140 96154039 96266292 95933145 95128328 93852196 92134861
39521 92134861 90035797 87640167 85050867 82375272 79707702 77112640 74616728 72215399
39513 72215399 69891893 67638144 65466111 63404861 61486572 59728208 58116259 56601397
39505 56601397 55107342 53552096 51873173 50046995 48096332 46084459 44098289 42225975
39497 42225975 40537365 39075025 37856999 36884911 36148590 35623600 35265602 35009147 34776087
39488 34776087 34492806 34109697 33613944 33029014 32401076 31779816 31203471 30693427 30256055
39479 30256055 29885880 29567351 29277685 28993918 28702218 28403026 28107706 27829735 27578125
39470 27578125 27357266 27169451 27013503 26878663 26740714 26567401 26332050 26026653 25666491
39461 25666491 25285690 24928869 24643795 24476012 24463623 24630815 24981323 25494988 26130153
39452 26130153 26831772 27542251 28211599 28804702 29304053 29706388 30014268 30228454 30348607
39443 30348607 30383833 30365033 30347276 30397065 30570700 30896681 31372377 31976160 32687028 33500290
39433 33500290 34431759 35510529 36766089 38216032 39858079 41668027 43604326 45618708
39425 45618708 47669817 49734426 51810615 53910732 56047731 58223275 60424897 62633078
39417 62633078 64832665 67022270 69219008 71459277 73796587 76296554 79029306 82060482
39409 82060482 85442815 89210184 93374277 97921033 102802844 107925508 113133596 118200843
39401 118200843 122833633 126697818 129476857 130954127 131088781 130044127 128147004 125795491
39393 125795491 123359523 121114828 119224109 117753872 116706145 116048948 115738380 115731218 115988894
39384 115988894 116474056 117141880 117930101 118752422 119498510 120040969 120247468 119995364 119186788
39375 119186788 117763133 115717559 113102834 110030768 106660587 103176573 99758932 96555267
39367 96555267 93661827 91120745 88931858 87070775 85503993 84196864 83115061 82222044
39359 82222044 81475815 80829405 80238231 79672028 79123800 78609093 78156181 77794680 77550386
39350 77550386 77447515 77512740 77774733 78258550 78979900 79943859 81147281 82580626 84226616
39341 84226616 86057226 88032200 90100392 92201864 94266925 96210389 97924992 99282482
39333 99282482 100148346 100407277 99988579 98880948 97132585 94839298 92126243 89128396
39325 89128396 85972972 82765031 79577260 76445856 73374439 70345502 67336387 64335695
39317 64335695 61355707 58435919 55634782 53012638 50614760 48463096 46558609 44889426
39309 44889426 43438136 42184176 41101068 40152200 39290710 38467088 37642366 36799669 35946940
39300 35946940 35109119 34314908 33586107 32933978 32360350 31857804 31407008 30975213 30520589
39291 30520589 30001723 29387410 28663434 27836771 26937364 26014837 25127975 24330119 23657853
39282 23657853 23128509 22745471 22505132 22399634 22414452 22525021 22697597 22895082 23082992
39273 23082992 23230051 23303726 23267298 23084506 22730488 22201291 21515121 20705193 19809533 18863313
39263 18863313 17895735 16929996 15983804 15069030 14191421 13352584 12555031 11808051 11130103
39254 11130103 10544999 10073556 9726772 9506874 9416804 9470343 9692073 10103960 10707635 11475921
39244 11475921 12358886 13297619 14235616 15123937 15923170 16605862 17159491 17587716 17907818
39235 17907818 18143660 18315901 18434179 18496797 18499172 18445187 18352525 18248355 18160612 18113579
39225 18113579 18131471 18245901 18500464 18948543 19644473 20630477 21923761 23509305 25341850
39216 25341850 27355158 29473179 31619336 33723444 35725863 37576665 39228628 40627675
39208 40627675 41707959 42397658 42635945 42394951 41696288 40613432 39258946 37763961 36259568
39199 36259568 34865172 33682899 32794794 32260762 32117219 32377285 33033100 34059522 35417567
39190 35417567 37056571 38915887 40928251 43026803 45155425 47278555 49383958 51474232
39182 51474232 53550203 55596325 57577906 59452739 61191310 62795466 64306145 65795774
39174 65795774 67348991 69041471 70926612 73033720 75374902 77954870 80778160 83850905
39166 83850905 87178686 90765010 94612991 98727295 103110730 107752616 112610419 117587877
39158 117587877 122512991 127121302 131054335 133886844 135193068 134645683 132115319 127723762
39150 127723762 121819889 114888836 107439048 99912859 92640795 85834737 79605347 73989666
39142 73989666 68977539 64529966 60589163 57084694 53939962 51080668 48444212 45986698
39134 45986698 43683669 41524330 39504434 37623390 35885376 34299527 32876189 31621866
39126 31621866 30537263 29619536 28865352 28270032 27820678 27486606 27214698 26935666 26579370
39117 26579370 26090116 25433491 24594578 23574867 22394425 21097985 19756291 18455221
39109 18455221 17273950 16262376 15429248 14745808 14161716 13625217 13099401 12569218 12038610
39100 12038610 11521214 11029355 10564708 10112834 9643466 9117279 8497071 7759552 6904727
39091 6904727 5961211 4985542 4053447 3243508 2618095 2208253 2007497 1976058 2053883 2178465
39081 2178465 2301875 2401641 2482571 2569792 2695809 2885836 3146257 3460456 3793745 4104735
39071 4104735 4356841 4523701 4587677 4537150 4369571 4100676 3771536 3443649 3180848 3027842
39061 3027842 2998448 3078970 3241342 3455606 3694520 3930390 4130014 4254986 4270856 4161610
39051 4161610 3940433 3648971 3344875 3085036 2913373 2857429 2932164 3146031 3504798 4011305
39041 4011305 4662401 5445279 6334608 7291609 8267233 9210713 10080595 10851922 11515439
39032 11515439 12070663 12518090 12854439 13072132 13162793 13123177 12960488 12694562 12357423 11992388
39022 11992388 11653060 11399725 11291013 11371684 11660482 12143173 12774419 13488248 14212786
39013 14212786 14884256 15458091 15916662 16271199 16554122 16802128 17037405 17256778 17433381
39004 17433381 17528138 17504648 17342136 17043460 16636981 16172247 15710727 15313948 15031949 14894631
38994 14894631 14908327 15058824 15319719 15662092 16060684 16495206 16949380 17410567 17869790
38985 17869790 18320188 18753855 19158981 19518443 19809677 20006336 20082811 20020592 19812698 19463753
38975 19463753 18987595 18406355 17752253 17069310 16411126 15833218 15382225 15086994 14956073
38966 14956073 14982241 15150088 15440999 15832919 16297176 16797961 17298686 17773758 18218560
38957 18218560 18650623 19101400 19604262 20183943 20848513 21583688 22351830 23098508 23765596
38948 23765596 24306040 24695717 24939751 25071164 25140982 25203277 25302923 25471514 25729176 26085062
38938 26085062 26533020 27046804 27581872 28085236 28507522 28810473 28969314 28975087 28840506 28605439
38928 28605439 28333820 28098188 27958009 27943810 28055470 28272936 28570024 28922401 29307396
38919 29307396 29699509 30067166 30373671 30581485 30656605 30570337 30299476 29828941 29159425 28316466
38909 28316466 27353366 26343475 25365291 24488265 23765209 23231460 22907067 22797776 22893296
38900 22893296 23165174 23568531 24049978 24558928 25056481 25517043 25922342 26252692 26483066
38891 26483066 26589290 26562125 26419650 26208712 25994135 25842404 25807574 25922594 26194898 26603957
38881 26603957 27100198 27607506 28033295 28287854 28308076 28075313 27618269 26999660 26293487
38872 26293487 25563468 24851432 24178734 23556708 22997687 22519313 22140839 21875833 21726875
38863 21726875 21684646 21729922 21836193 21972880 22110656 22228180 22315986 22374003 22404810 22408510
38853 22408510 22382075 22320349 22215534 22056805 21833994 21545257 21203527 20837223 20485391 20190320
38843 20190320 19989554 19908235 19953928 20117001 20376819 20709684 21093605 21508794 21936678 22360072
38833 22360072 22763856 23134423 23458245 23721775 23913731 24028163 24066113 24035167 23947691 23818846
38823 23818846 23665356 23505272 23357600 23239804 23162762 23125573 23113686 23102076 23062490 22972662
38813 22972662 22825125 22632953 22429372 22259507 22166347 22177640 22301120 22530008 22852589 23257184
38803 23257184 23730000 24251472 24797799 25347551 25887122 26409745 26909307 27375418 27795647
38794 27795647 28164889 28495355 28819222 29181498 29627451 30190491 30883025 31690862 32573435
38785 32573435 33472168 34324566 35076622 35687438 36126154 36365689 36377797 36131652 35596091
38776 35596091 34744281 33559933 32046219 30238630 28217783 26111870 24080131 22280508
38768 22280508 20836555 19819153 19247476 19101352 19333743 19877331 20646486 21539102 22442083
38759 22442083 23242597 23845388 24192619 24277914 24145604 23873153 23544581 23226733 22955949
38750 22955949 22736033 22545104 22348295 22112006 21814183 21446924 21012159 20514374 19954000
38741 19954000 19323189 18604884 17776254 16816784 15718948 14496876 13188474 11849262 10540104
38732 10540104 9313012 8199359 7204718 6313921 5506451 4775826 4142188 3650318 3354382
38723 3354382 3297989 3498278 3937987 4565649 5303489 6062558 6762255 7347639 7797037 8117182
38713 8117182 8331072 8468069 8561807 8652682 8786971 9008518 9346574 9806195 10364784 10975065
38703 10975065 11574933 12104056 12522877 12825207 13037320 13204491 13372313 13570580 13804224
38694 13804224 14053539 14284320 14464933 14582694 14651334 14706396 14792097 14946447 15190481 15524706
38684 15524706 15932784 16388782 16862331 17318205 17712831 17994694 18112652 18028182 17722650
38675 17722650 17194959 16454224 15516308 14407387 13168822 11854922 10521633 9212599
38667 9212599 7951934 6748436 5608212 4547169 3594899 2787172 2151801 1696761 1406986
38658 1406986 1250188 1187463 1184190 1218511 1285545 1395522 1565703 1809928 2132139 2527599
38648 2527599 2989397 3514030 4102049 4754919 5471891 6249218 7081844 7966264 8902293
38639 8902293 9890263 10921972 11969175 12977940 13875212 14586156 15054373 15256850 15209444
38630 15209444 14962692 14589894 14171063 13777841 13464471 13266994 13208422 13303784 13559328 13964954
38620 13964954 14485633 15060489 15614033 16075622 16397312 16561676 16578204 16473609 16282449
38611 16282449 16040487 15779101 15519272 15267432 15017031 14756121 14475409 14169903 13832256
38602 13832256 13442975 12965459 12350867 11551989 10540708 9321835 7938001 6464387 4996196
38593 4996196 3633277 2465037 1557555 945257 629748 586261 774186 1147051 1660107
38584 1660107 2277061 2976833 3757601 4634102 5627829 6754551 8014247 9385713 10826133
38575 10826133 12276430 13672574 14958754 16095469 17059234 17838495 18432620 18854432 19129934
38566 19129934 19291175 19366978 19379409 19346945 19287314 19214273 19131235 19029324 18893076 18709774
38556 18709774 18476099 18199090 17892249 17569380 17239091 16902199 16552324 16178003 15764950
38547 15764950 15299209 14772627 14189704 13571998 12956512 12387946 11908529 11550655 11335995
38538 11335995 11279819 11394476 11685943 12144179 12735496 13404644 14085697 14713585 15230190
38529 15230190 15586408 15745203 15687214 15415637 14956365 14352247 13653460 12907855 12154887
38520 12154887 11424463 10738904 10115720 9570653 9121101 8787822 8591472 8543677 8637533 8843367
38510 8843367 9111862 9382479 9594692 9700459 9675798 9527369 9289855 9013697 8748400 8529636
38500 8529636 8375421 8289584 8266310 8292094 8346974 8408346 8456498 8477954 8464972 8413383 8321021
38489 8321021 8186448 8007242 7779734 7502773 7184649 6848233 6529544 6268953 6098852
38480 6098852 6033452 6065434 6171125 6321785 6495540 6684077 6891312 7125640 7390681 7679827
38470 7679827 7977783 8268492 8544478 8810408 9076411 9344556 9598611 9805780 9929742
38461 9929742 9945937 9850459 9660843 9411544 9145739 8903206 8706792 8554309 8421858 8277530
38451 8277530 8097604 7876861 7629514 7382276 7163217 6990689 6867252 6782402 6723544 6688890
38441 6688890 6694211 6769666 6949590 7261315 7717036 8308965 9006718 9757752 10493365 11141331
38431 11141331 11641550 11957725 12080022 12020082 11804321 11469535 11059322 10617912 10181849
38422 10181849 9774190 9404718 9074484 8780112 8515138 8269146 8026845 7768513 7472694
38413 7472694 7121586 6708336 6243308 5755642 5288371 4889028 4600165 4453276 4466174 4641676
38403 4641676 4966854 5415377 5955116 6558236 7206735 7889206 8592212 9294143 9966108
38394 9966108 10578118 11105755 11534194 11858852 12083514 12217743 12275642 12276383 12244577 12208460
38384 12208460 12195855 12229369 12322099 12475420 12680958 12927356 13208368 13527127 13895052 14328512
38374 14328512 14846082 15464928 16193404 17021216 17913462 18814705 19663611 20412154 21040233
38365 21040233 21558381 21997629 22392235 22763922 23113481 23420729 23650439 23760948 23712602
38356 23712602 23474679 23031210 22386122 21565431 20612419 19575206 18492970 17389593 16277588
38347 16277588 15166628 14068722 12997559 11965450 10981763 10053101 9183463 8373546 7619735
38338 7619735 6913446 6241252 5586572 4933338 4270474 3594934 2912256 2235608 1584555
38329 1584555 982812 452902 7285 -360904 -681920 -1003856 -1377699 -1838388 -2389899
38320 -2389899 -3000971 -3613600 -4160806 -4586488 -4859791 -4979882 -4971522 -4874386 -4729445 -4566073
38310 -4566073 -4394742 -4209054 -3995666 -3744839 -3454109 -3123904 -2751102 -2327782 -1847447
38301 -1847447 -1314356 -748797 -183459 348082 824615 1244611 1623043 1978984 2320553
38292 2320553 2636018 2897093 3073493 3150149 3135809 3057168 2942949 2809270 2655178 2468178
38282 2468178 2232805 1936675 1574255 1150576 684016 204754 -251878 -653720 -978276
38273 -978276 -1216805 -1376251 -1477355 -1547254 -1608996 -1674098 -1742796 -1810822 -1876707 -1943579 -2013849
38262 -2013849 -2080600 -2121986 -2102299 -1978174 -1705638 -1246135 -573477 316166 1393988 2595469
38252 2595469 3830967 5008349 6057140 6941977 7661010 8235209 8698010 9089458 9452133
38243 9452133 9824637 10232369 10679665 11148420 11605389 12015440 12354274 12614697 12804956
38234 12804956 12941943 13043154 13120404 13177749 13215224 13236996 13258485 13306024 13406708 13572973
38224 13572973 13791243 14022515 14215046 14321033 14307961 14162241 13889745 13516920 13089721
38215 13089721 12665284 12296722 12017948 11835409 11728160 11653648 11556975 11383190 11091567 10667906
38205 10667906 10129328 9518252 8887658 8284066 7734769 7242259 6785783 6329644 5837747
38196 5837747 5291020 4700304 4107469 3573544 3160113 2912886 2853329 2979062 3269876 3694920
38186 3694920 4217495 4796785 5388980 5950655 6444514 6845164 7143066 7346625 7482028
38177 7482028 7588870 7710679 7883308 8125993 8437709 8798408 9174548 9528632 9830138
38168 9830138 10062127 10218898 10296205 10281550 10152993 9889743 9489349 8980003 8417917 7869493
38158 7869493 7388641 7001613 6704707 6471987 6267502 6058196 5824974 5569481 5314540
38149 5314540 5097802 4959955 4930969 5019603 5210871 5472064 5763409 6048070 6298858 6501889
38139 6501889 6657841 6780200 6889934 7008110 7149660 7320986 7521227 7745061 7985342
38130 7985342 8235136 8488684 8740010 8978905 9186983 9338237 9406360 9376649 9256632 9079178
38120 9079178 8894946 8756491 8701444 8743001 8871616 9065378 9302496 9569386 9860939 10173855
38110 10173855 10497743 10809872 11077169 11264940 11348370 11321651 11200443 11016381 10806365 10601535
38100 10601535 10419180 10257773 10094580 9887615 9584815 9140159 8531230 7770395 6904533
38091 6904533 6003822 5144487 4391846 3788365 3348687 3061281 2895524 2813325 2783769 2796688
38081 2796688 2868512 3035278 3334455 3784602 4373295 5057895 5776411 6462385 7058960 7529075
38071 7529075 7859608 8058507 8146419 8146774 8078379 7952909 7777396 7559801 7314612 7065517
38061 7065517 6844121 6686103 6627025 6698429 6922789 7306255 7830796 8450038 9092630 9673868
38051 9673868 10112809 10350095 10361165 10160582 9795422 9329036 8819940 8303687 7786532 7255527
38041 7255527 6700013 6130912 5585331 5115382 4770976 4587150 4579043 4741695 5051925 5471565
38031 5471565 5951125 6432462 6851136 7141642 7247474 7133338 6793632 6253183 5560937
38022 5560937 4780624 3981497 3229351 2576722 2053203 1659636 1370272 1143635 938474
38013 938474 728408 508930 293734 103143 -47237 -149983 -200627 -190444 -104734 71757
38003 71757 346386 712150 1146003 1613058 2076852 2513123 2920759 3323107 3757748 4259939
37993 4259939 4848388 5519308 6248698 6998411 7721851 8368524 8889351 9243897 9407874
37984 9407874 9377773 9170708 8819731 8365980 7849286 7299647 6732837 6152393 5556795 4947239
37974 4947239 4331101 3719916 3125293 2557670 2029496 1559532 1173457 898691 755529
37965 755529 748462 861785 1062605 1311624 1577000 1843486 2112107 2392588 2694280 3018993
37955 3018993 3355944 3679581 3953035 4138237 4209119 4161545 4015274 3807141 3578559 3362653
37945 3362653 3176106 3017616 2871206 2711686 2511291 2247502 1910940 1511029 1077676
37936 1077676 658940 314993 108089 88417 278400 661987 1186473 1779200 2371825 2918972
37926 2918972 3402144 3820503 4177948 4475169 4709232 4878394 4988124 5054658 5103349 5161333
37916 5161333 5246980 5360664 5481307 5570621 5583530 5480599 5238306 4854964 4351878 3769901
37906 3769901 3162139 2584389 2085273 1697136 1428930 1263695 1163486 1080898 971979 805243
37896 805243 566046 258813 -92281 -447314 -761463 -999463 -1146176 -1208101 -1206622 -1167818
37886 -1167818 -1112972 -1051582 -978010 -873437 -713628 -479908 -168193 208452 625135 1055928
37876 1055928 1485394 1916115 2369480 2879793 3483780 4208606 5062222 6029473 7075224
37867 7075224 8152377 9210899 10204640 11094430 11847257 12432965 12822197 12989588 12922628
37858 12922628 12631633 12154781 11555037 10909657 10294806 9768816 9359122 9058635 8834321
37849 8834321 8644701 8457749 8260588 8057574 7860020 7674681 7496857 7309913 7089577
37840 7089577 6810606 6453948 6012448 5492857 4913094 4296523 3666609 3044185 2446678
37831 2446678 1887424 1374731 912270 502053 148361 -141084 -359212 -507168 -600037 -666157
37821 -666157 -740319 -855662 -1038833 -1308887 -1677601 -2149896 -2725232 -3400078 -4169386 -5025659
37811 -5025659 -5957458 -6950444 -7990716 -9066624 -10166035 -11270212 -12348304 -13355755
37803 -13355755 -14237623 -14935977 -15399153 -15589857 -15489410 -15097276 -14427411 -13504471 -12362473
37794 -12362473 -11046044 -9611378 -8123982 -6653530 -5269185 -4037137 -3017846 -2259302
37786 -2259302 -1787245 -1598471 -1662967 -1934754 -2365445 -2913165 -3542699 -4218334 -4895863 -5521666
37776 -5521666 -6042310 -6419568 -6640274 -6713621 -6658140 -6488110 -6207694 -5813658 -5301930 -4673398
37766 -4673398 -3937264 -3112268 -2226642 -1317670 -430205 388752 1101682 1694579 2183683
37757 2183683 2607119 3003880 3391734 3756126 4055072 4236856 4262006 4119692 3832093 3446917
37747 3446917 3023441 2617739 2270287 1998665 1798748 1655295 1556728 1505290 1516801 1611136
37737 1611136 1799319 2073712 2405544 2750115 3055807 3271354 3349005 3245911 2927278 2371552
37727 2371552 1575407 557581 -637459 -1937115 -3244355 -4451705 -5462389 -6208789
37719 -6208789 -6659667 -6816197 -6704086 -6368089 -5868592 -5275663 -4658512 -4073842 -3558768
37710 -3558768 -3130611 -2791163 -2531511 -2335678 -2183619 -2054178 -1927287 -1784730 -1610495
37701 -1610495 -1392853 -1128598 -826707 -507895 -199616 70208 277449 404253 442227 396395
37691 396395 286182 139883 -15918 -165922 -309151 -455150 -617684 -810601 -1046884 -1338323
37681 -1338323 -1693521 -2115492 -2601992 -3148648 -3750281 -4396062 -5060956 -5701802 -6264312
37672 -6264312 -6698598 -6974152 -7086100 -7051151 -6897582 -6655405 -6350169 -6000254 -5615884 -5199336
37662 -5199336 -4747433 -4256611 -3728464 -3172505 -2604399 -2040605 -1492339 -962280 -446398
37653 -446398 59497 551665 1012793 1411255 1706005 1856519 1835573 1640726 1300219 871161
37643 871161 430206 58295 -177493 -239591 -127667 123114 450090 773000 1004124 1059032
37633 1059032 868078 387899 -388183 -1422967 -2635108 -3909099 -5114722 -6130433 -6863613
37624 -6863613 -7263028 -7322430 -7076336 -6589558 -5942240 -5212997 -4464079 -3732603 -3030153 -2350139
37614 -2350139 -1679900 -1013406 -360002 254608 796098 1234415 1555056 1762116 1871197
37605 1871197 1896668 1842200 1701914 1472153 1166072 821436 496877 258870 165742 255017
37595 255017 537670 999278 1605579 2310456 3066272 3836231 4605352 5384362 6202709 7091658
37585 7091658 8063149 9093495 10121297 11063126 11839540 12396910 12714888 12801417 12684146
37576 12684146 12404136 12011059 11557469 11092097 10653691 10266440 9938055 9661905 9423188
37567 9423188 9206486 9001580 8806462 8627888 8478925 8372094 8308935 8270778 8217200 8095470
37557 8095470 7857712 7477308 6956587 6323708 5622873 4903170 4208682 3570747 3004627
37548 3004627 2513309 2097141 1762414 1521928 1387078 1358083 1419509 1542983 1694062 1839487
37538 1839487 1952889 2018196 2030095 1991788 1911678 1800480 1668349 1520661 1353355 1151805
37528 1151805 897093 578810 208316 -174725 -506231 -711204 -723190 -504275 -58656 566456
37518 566456 1293826 2037129 2720510 3290254 3717275 3992133 4115532 4089193 3912918 3589939
37508 3589939 3135637 2581731 1972586 1357218 782530 289886 -86476 -320892 -397752 -312274
37498 -312274 -69975 315270 824584 1438872 2144789 2939957 3833392 4837791 5955016
37489 5955016 7161669 8402364 9593926 10638935 11444947 11944777 12111395 11960607 11539159
37480 11539159 10904050 10104216 9173715 8137870 7026257 5883719 4772679 3764311
37472 3764311 2920900 2276304 1823897 1518559 1291594 1070860 798060 439797 -7901
37463 -7901 -522213 -1063879 -1592453 -2079752 -2515413 -2903510 -3254394 -3577415 -3877782 -4156612
37453 -4156612 -4411010 -4632614 -4806507 -4912897 -4930892 -4841368 -4627996 -4278861 -3790715 -3174341
37443 -3174341 -2457977 -1687063 -919690 -216900 371078 816661 1116897 1283721 1329885 1260810
37433 1260810 1076061 775786 365748 -140744 -721720 -1345310 -1971048 -2556155 -3064656
37424 -3064656 -3473492 -3772092 -3957957 -4034164 -4011680 -3913365 -3773757 -3631890 -3520085 -3454806
37414 -3454806 -3433822 -3439263 -3443162 -3412639 -3314143 -3117230 -2797652 -2339375 -1735756 -990707 -119862
37403 -119862 848881 1875908 2911648 3900224 4785840 5521041 6073592 6428601 6585675
37394 6585675 6554341 6351197 5999062 5525469 4958522 4321865 3632928 2906706 2162689 1430031
37384 1430031 747738 160111 -290642 -572939 -673976 -605163 -402091 -117487 191498 477167
37374 477167 710544 882371 997119 1065117 1097328 1103337 1090915 1066936 1041150 1032096 1069812
37363 1069812 1189707 1418225 1758928 2188678 2666318 3147194 3594076 3980267 4287805
37354 4287805 4506306 4634345 4680521 4660486 4590706 4484150 4352008 4208965 4074970 3969632
37344 3969632 3903388 3873189 3865943 3866302 3863900 3858117 3859873 3888648 3963463 4091065 4258359 4433716
37332 4433716 4575834 4645166 4614007 4473611 4237171 3936996 3615429 3311741 3049773 2831485
37322 2831485 2639105 2444457 2220504 1950101 1630080 1272026 901550 555948 279179
37313 279179 114525 97325 250309 582080 1087294 1747114 2529854 3392588 4284158 5149229
37303 5149229 5932827 6584904 7064384 7342406 7405245 7257926 6928474 6470093 5957056 5471809
37293 5471809 5086113 4844159 4756262 4806000 4965312 5207693 5512600 5861532 6232036 6596457
37283 6596457 6928254 7212386 7451667 7662200 7859131 8042590 8194073 8284874 8289340 8194766
37273 8194766 8004831 7737249 7416511 7063475 6686597 6280965 5837002 5353593 4846813
37264 4846813 4348836 3898818 3532611 3277096 3149483 3157655 3298630 3556206 3900990 4294115
37254 4294115 4693301 5059457 5363052 5589776 5744066 5848290 5936218 6041782 6186906 6373241
37244 6373241 6580600 6771399 6898409 6913709 6777725 6467354 5981704 5344193 4600110 3809237
37234 3809237 3034672 2331282 1737471 1271428 930236 690063 507382 322402 66485
37225 66485 -324797 -893422 -1641013 -2520461 -3443447 -4302048 -4995787 -5454558 -5651002 -5599993
37215 -5599993 -5346882 -4950003 -4465086 -3937553 -3404001 -2898812 -2458967 -2121808 -1916220
37206 -1916220 -1853265 -1922856 -2097825 -2341187 -2611364 -2863885 -3052444 -3133186 -3072950 -2857743
37196 -2857743 -2496302 -2017103 -1461908 -879839 -322723 159686 525045 742975 798335 693874
37186 693874 451600 110332 -281907 -677977 -1039538 -1340161 -1564283 -1704043 -1755777 -1717329
37176 -1717329 -1587192 -1365869 -1058950 -680278 -253105 192206 623250 1010805 1331473
37167 1331473 1566832 1700137 1712684 1582129 1284748 802038 129779 -714397 -1688784 -2732287
37157 -2732287 -3774481 -4747387 -5595132 -6278913 -6776460 -7077045 -7175146 -7066652 -6749481
37148 -6749481 -6227041 -5511648 -4626992 -3610422 -2514331 -1403622 -347935 587949 1350250
37139 1350250 1897674 2202428 2255451 2075334 1714431 1254631 790339 404422 148011 33146
37129 33146 39527 129052 259765 394164 502045 561196 558949 494811 381533 241775 100216
37118 100216 -25989 -134156 -237291 -358610 -520865 -734438 -989605 -1257214 -1498465 -1679852
37108 -1679852 -1786768 -1829953 -1842436 -1868678 -1950353 -2114157 -2366108 -2693587 -3072032 -3471221
37098 -3471221 -3858999 -4204965 -4487006 -4698517 -4849968 -4961281 -5049126 -5117692 -5158752 -5159958
37088 -5159958 -5115256 -5031110 -4925826 -4823760 -4748856 -4720938 -4755029 -4861693 -5046613 -5309344
37078 -5309344 -5642055 -6028082 -6439222 -6831552 -7143021 -7298784 -7227864 -6886494 -6275599 -5440907
37068 -5440907 -4455373 -3395560 -2325738 -1294895 -341645 500778 1203388 1743416 2107480
37059 2107480 2294704 2318830 2208490 2004970 1757217 1514018 1314739 1182270 1122586 1131617
37049 1131617 1204847 1342992 1550478 1829018 2171861 2563251 2983304 3413948 3840669 4249269
37039 4249269 4622067 4938107 5176615 5319318 5349913 5253787 5021368 4654353 4171022 3607668
37029 3607668 3014916 2448902 1958966 1575923 1305332 1127946 1006973 900392 774406
37020 774406 611905 411501 179613 -76670 -350798 -634335 -916580 -1187773 -1442395 -1679171
37010 -1679171 -1898673 -2102281 -2294894 -2490158 -2714042 -3002773 -3394139 -3915014 -4569839
37001 -4569839 -5334006 -6153653 -6951566 -7638016 -8125069 -8342447 -8252013 -7856982 -7202485 -6366521
36991 -6366521 -5443384 -4523638 -3675748 -2934618 -2300805 -1750048 -1248413 -766995 -291670
36982 -291670 174369 615523 1012639 1349339 1610950 1778470 1825351 1722592 1450125 1007325
36972 1007325 416753 -280504 -1035662 -1804618 -2556862 -3277545 -3962747 -4610822 -5214164
36963 -5214164 -5755502 -6211094 -6559537 -6791671 -6916624 -6961542 -6965445 -6969620 -7008067 -7101617 -7257310
36952 -7257310 -7471217 -7731312 -8018489 -8306518 -8562969 -8752577 -8842660 -8808440 -8635665 -8319920
36942 -8319920 -7864354 -7277466 -6570653 -5754909 -4838175 -3825938 -2725399 -1551081 -329551
36933 -329551 898372 2080006 3159523 4090814 4847935 5427330 5842063 6113355 6264622
36924 6264622 6319893 6305476 6252052 6194127 6165506 6192606 6288907 6452432 6666068 6900532 7120854
36913 7120854 7296422 7411714 7472787 7505907 7548803 7638704 7802086 8048841 8370794 8743668
36903 8743668 9132208 9497861 9806413 10031889 10155209 10160100 10030609 9752354 9316179 8721652
36893 8721652 7979609 7114366 6164920 5182103 4219549 3321324 2513039 1801320 1180016
36884 1180016 637522 161644 -257294 -623668 -935537 -1188067 -1380866 -1524050 -1637496
36875 -1637496 -1742747 -1853457 -1972457 -2098860 -2240141 -2418563 -2664090 -2996439 -3408659
36866 -3408659 -3864586 -4311958 -4701217 -4997539 -5181218 -5241217 -5170288 -4966925 -4643290 -4233157
36856 -4233157 -3792544 -3389671 -3087625 -2927419 -2917317 -3030131 -3208386 -3377459 -3465171 -3422647
36846 -3422647 -3239623 -2949278 -2620375 -2337090 -2171625 -2160603 -2296673 -2538383 -2829952 -3118441
36836 -3118441 -3361533 -3528325 -3599888 -3573510 -3467848 -3322277 -3186546 -3104446 -3100096 -3173053
36826 -3173053 -3302120 -3454014 -3593509 -3692677 -3736833 -3725415 -3668442 -3581060 -3478018 -3368517
36816 -3368517 -3252074 -3117081 -2943542 -2709485 -2398440 -2005101 -1537586 -1016653 -473007
36807 -473007 56904 536919 938727 1248599 1469785 1618182 1712259 1761729 1760918 1690382 1525585
36796 1525585 1247663 851653 350308 -226658 -838619 -1445777 -2023700 -2573654 -3121760
36787 -3121760 -3705897 -4357054 -5085088 -5874526 -6688433 -7474886 -8173918 -8727287 -9092710
36778 -9092710 -9258311 -9249436 -9122964 -8951203 -8802508 -8725718 -8741763 -8841460 -8987023 -9117199
36768 -9117199 -9158459 -9042622 -8725114 -8195027 -7473014 -6601251 -5632463 -4620904 -3614382
36759 -3614382 -2647770 -1741400 -906206 -151838 508989 1063198 1504177 1836814 2076535
36750 2076535 2241993 2344117 2376334 2311664 2110359 1736340 1174688 441038 -421373 -1353560
36740 -1353560 -2294099 -3189021 -3998674 -4703757 -5309116 -5840493 -6331957 -6809104 -7277218
36731 -7277218 -7719902 -8106486 -8402874 -8581488 -8627903 -8542727 -8338827 -8036178 -7657012 -7222267
36721 -7222267 -6749317 -6251567 -5740273 -5227131 -4725469 -4249695 -3813858 -3428640 -3095915
36712 -3095915 -2803518 -2526001 -2233421 -1902582 -1522898 -1094775 -624577 -120250 411656
36703 411656 967856 1548159 2152661 2777821 3413374 4040674 4632603 5156065 5577874 5872303
36693 5872303 6026403 6040109 5920771 5674474 5298480 4779919 4103260 3263025 2273105 1165979
36683 1165979 -16768 -1234125 -2447726 -3616098 -4688621 -5607787 -6322056 -6802895 -7055771
36674 -7055771 -7119022 -7052832 -6924972 -6797991 -6718422 -6708026 -6759375 -6838668 -6896019 -6880493 -6755881
36663 -6755881 -6512566 -6170843 -5773892 -5374236 -5020604 -4749349 -4579526 -4509862 -4518704 -4568823
36653 -4568823 -4615958 -4617601 -4540014 -4363157 -4082168 -3702982 -3233279 -2675314 -2027110 -1291511
36643 -1291511 -486028 352944 1172456 1909322 2498838 2885863 3037001 2950423 2659624 2229514
36633 2229514 1745507 1297878 965185 801351 829797 1044889 1418292 1907413 2463928 3040930
36623 3040930 3597782 4102942 4535986 4889251 5168008 5388055 5571361 5741647 5920911
36614 5920911 6126597 6369417 6653108 6977152 7340897 7745317 8189836 8666501 9157210
36605 9157210 9637697 10085028 10481149 10808844 11044941 11159386 11123572 10923359 10569630 10102354
36595 10102354 9587200 9104347 8730710 8520840 8494361 8634791 8898203 9226112 9557423
36586 9557423 9836458 10016331 10059481 9939562 9647561 9199339 8636814 8017428 7395334 6804506
36576 6804506 6252298 5724406 5196419 4646481 4065035 3458329 2843714 2238882 1651844
36567 1651844 1078547 509747 -57931 -614422 -1137053 -1598875 -1978523 -2265339 -2458055
36558 -2458055 -2561047 -2582781 -2536326 -2437517 -2299101 -2125868 -1918071 -1683515 -1448927 -1258854
36548 -1258854 -1158769 -1171331 -1280651 -1434849 -1565959 -1616221 -1556942 -1391301 -1142302 -835369
36538 -835369 -486523 -101276 318799 768793 1237302 1707697 2161411 2580845 2950207 3253584
36528 3253584 3471740 3581613 3562322 3406582 3130169 2770426 2371438 1964377 1556974 1139939
36518 1139939 704188 254186 -192107 -612630 -988072 -1299613 -1521916 -1620414 -1556653 -1297940
36508 -1297940 -825311 -137399 748371 1795555 2949927 4144366 5308669 6382972 7330349
36499 7330349 8142442 8833282 9422148 9913932 10289031 10509327 10535915 10347342 9949720 9377679
36489 9377679 8689447 7958285 7260129 6658019 6186974 5845534 5599549 5398628 5197709
36480 5197709 4971525 4713832 4424135 4092974 3695673 3196710 2560604 1764017 805816
36471 805816 -286635 -1456603 -2624071 -3699064 -4598917 -5263035 -5659785 -5786026 -5664423
36462 -5664423 -5341060 -4879219 -4344607 -3785921 -3223240 -2653516 -2069200 -1476012 -898436
36453 -898436 -372247 68736 404198 632945 771255 845188 880891 897634 905175 903306 881440
36442 881440 819623 694092 487836 202186 -136595 -480258 -771200 -959230 -1013420 -923409
36432 -923409 -693517 -339051 110283 605642 1083398 1481840 1761658 1916953 1970031 1954656
36422 1954656 1899627 1822556 1734814 1650112 1587888 1568935 1608223 1711546 1878093 2105507 2392429
36411 2392429 2736617 3131208 3563612 4019125 4486844 4963153 5450433 5952928 6473247
36402 6473247 7010841 7561520 8117398 8668130 9203503 9714897 10192606 10619494 10965585
36393 10965585 11188462 11240469 11079607 10680171 10040162 9183462 8155325 7011683 5805530
36384 5805530 4575397 3340206 2102479 858665 -388026 -1618323 -2794966 -3867581
36376 -3867581 -4781531 -5488952 -5960655 -6194998 -6218072 -6073498 -5807640 -5458864 -5054457 -4612501
36366 -4612501 -4145128 -3663021 -3181871 -2727742 -2335898 -2041326 -1866190 -1812059 -1860467 -1978908
36356 -1978908 -2127170 -2261617 -2338383 -2317270 -2166516 -1867141 -1415065 -819868 -100348 721532
36346 721532 1626185 2599921 3635223 4726334 5859930 7004756 8107742 9101883 9923140
36337 9923140 10526923 10896020 11039399 10986830 10782965 10479881 10126331 9756067 9381377 8995551
36327 8995551 8581720 8122054 7604355 7027414 6406300 5774433 5177868 4661853 4255880
36318 4255880 3964692 3767977 3626122 3487408 3294291 2990270 2530169 1893411 1094550
36309 1094550 183735 -765129 -1672956 -2471833 -3113459 -3569622 -3828666 -3892567 -3777269 -3515249
36299 -3515249 -3156448 -2764045 -2404596 -2134522 -1985588 -1953060 -1992206 -2027843 -1975352 -1764149
36289 -1764149 -1353602 -737761 58187 985679 1983513 2990806 3958417 4853347 5654678
36280 5654678 6346212 6913221 7345665 7643231 7816080 7880320 7852798 7750258 7593451 7411902
36270 7411902 7243559 7126283 7083584 7111487 7173658 7207325 7137662 6896099 6438138 5755991
36260 5755991 4881614 3878926 2828902 1813851 905226 156147 -401799 -758016 -919773
36251 -919773 -907900 -751835 -483743 -132817 277329 726104 1190145 1639162 2037471 2351212
36241 2351212 2557162 2647213 2624794 2495432 2259563 1915532 1472134 960402 433080 -50223
36231 -50223 -443170 -726003 -905906 -1006690 -1055014 -1070721 -1065297 -1046639 -1024096 -1008896 -1010778
36220 -1010778 -1035063 -1082654 -1151733 -1239561 -1344440 -1467712 -1613594 -1784881 -1976183 -2169311
36210 -2169311 -2334098 -2434157 -2434636 -2309318 -2046300 -1652576 -1156812 -607506 -63648 420589
36200 420589 810508 1098217 1301415 1456719 1610083 1804939 2070487 2415931 2834963 3317746
36190 3317746 3861743 4473726 5162142 5925654 6745447 7585634 8400805 9146496 9788227
36181 9788227 10306307 10695072 10956788 11093081 11098881 10963151 10676870 10244411 9691738 9065273
36171 9065273 8419696 7800080 7228493 6702984 6208631 5733080 5277680 4859021 4500693
36162 4500693 4219167 4010648 3846198 3678800 3459555 3154830 2755948 2278126 1752189
36153 1752189 1215711 707851 266982 -72604 -286860 -368950 -332864 -211152 -48506 104707
36143 104707 196611 177731 7966 -333797 -842318 -1485264 -2209050 -2948588 -3639047 -4227908
36133 -4227908 -4683358 -4994698 -5165332 -5204894 -5127069 -4953091 -4714653 -4450101 -4193648 -3963915
36123 -3963915 -3759880 -3567667 -3373760 -3175817 -2984981 -2820246 -2699612 -2632408 -2615188 -2632409
36113 -2632409 -2662084 -2684384 -2689646 -2683113 -2685576 -2729772 -2851766 -3077532 -3408362 -3812091 -4226845
36102 -4226845 -4578619 -4806265 -4882355 -4819834 -4662225 -4464515 -4275893 -4131455 -4051907 -4045453
36092 -4045453 -4108050 -4223079 -4363480 -4497128 -4594153 -4635090 -4619415 -4572055 -4543102 -4597299 -4795527
36081 -4795527 -5175694 -5740879 -6458360 -7267848 -8093967 -8858157 -9487865 -9924104 -10129481
$$ [...]
##END NTUPLES=NMR SPECTRUM
##END=
