##TITLE=31Pdec_DE-54_d6_TFA
 DMSO-d6
 64 sc
 24.6.2024
##JCAMPDX= 6.0         $$ Bruker NMR JCAMP-DX V2.0
##DATA TYPE= NMR SPECTRUM
##DATA CLASS= NTUPLES
##ORIGIN= UXNMR, Bruker Analytische Messtechnik GmbH
##OWNER= root
$$ XWIN-NMR		Version 3.5
$$ Mon Jun 24 16:21:57 2024 Russian Standard Time (UT+4h)  she@DPX200
##.OBSERVE FREQUENCY= 81.013821
##.OBSERVE NUCLEUS= ^31P
##.ACQUISITION MODE= SIMULTANEOUS
##.ACQUISITION SCHEME= undefined
##.AVERAGES= 64
##.DIGITISER RES= 16
##SPECTROMETER/DATA SYSTEM= spect
##.PULSE SEQUENCE= zgpg30
##.SOLVENT NAME= CDCl3
##.SHIFT REFERENCE= (INTERNAL, CDCl3, 0, 248.564)
##AUDIT TRAIL= $$ (NUMBER, WHEN, WHO, WHERE, WHAT)
$$ ##TITLE= Audit trail, XWIN-NMR		Version 3.5
$$ ##JCAMPDX= 5.01
$$ ##ORIGIN= Bruker BioSpin GmbH
$$ ##OWNER= she
$$ F:/spectra/data/she/nmr/P31/1/pdata/1/auditp.txt
$$ ##AUDIT TRAIL=  $$ (NUMBER, WHEN, WHO, WHERE, WHAT)
(   1,<2024-06-24 16:20:35.70 +0400>,<she>,<DPX200>,
      <created by zg, POWCHK disabled, PULCHK disabled
       configuration hash MD5:
       00 E9 B6 7A A2 85 ED C7 34 08 36 98 17 FE 4E 26
       data hash MD5: 32K
       01 CE C4 1C 9B 18 1F 8D A0 46 8C B3 42 F4 15 A9>)
(   2,<2024-06-24 16:20:38.20 +0400>,<she>,<DPX200>,
      <Start of raw data processing
       efp BC_mod = 2 LB = 10 FT_mod = 6 PKNL = 1 PHC0 = 2200.462 PHC1 = -5115.798 SI = 64K 
       data hash MD5: 64K
       4E 70 3C 8A 8D C2 29 BD 1F 2C 7D E7 AF C2 38 01>)
(   3,<2024-06-24 16:21:30.96 +0400>,<she>,<DPX200>,
      <pk PHC0 = 1421.614 PHC1 = -3466.361 
       data hash MD5: 64K
       D0 CE 01 04 1F AD BF 8A B2 DE 8B EC 69 FE FA B0>)
$$ ##END=
$$ 
$$ hash MD5
$$ 0E 79 39 3E C3 9F BA AE 1E C2 5C DF B7 A0 67 E9
##$RELAX= 
##$RELAX= 
##$RELAX= 
##$RELAX= 
##$RELAX= 
##$RELAX= 
##$RELAX= 
##$RELAX= 
##$RELAX= 
$$ Bruker specific parameters
$$ --------------------------
##$DU= <F:/spectra>
##$EXPNO= 1
##$NAME= <P31>
##$PROCNO= 1
##$TYPE= <nmr>
##$USER= <she>
##$AMP= (0..31)
100 100 100 100 100 100 100 100 100 100 100 100 100 100 100 100 100 100 
100 100 100 100 100 100 100 100 100 100 100 100 100 100 
##$AQSEQ= 0
##$AQ_mod= 1
##$AUNM= <au_zg>
##$AUTOPOS= <>
##$BF1= 81.014009
##$BF2= 200.13
##$BF3= 200.13
##$BF4= 200.13
##$BF5= 200.13
##$BF6= 200.13
##$BF7= 200.13
##$BF8= 200.13
##$BYTORDA= 1
##$CFDGTYP= 0
##$CFRGTYP= 5
##$CHEMSTR= <none>
##$CNST= (0..31)
1 1 145 1 1 1 1 1 1 1 1 1 1 1 1 1 1 1 1 1 1 1 1 1 1 1 1 1 1 1 1 1 
##$CPDPRG= <waltz16>
##$CPDPRG1= <>
##$CPDPRG2= <waltz16>
##$CPDPRG3= <>
##$CPDPRG4= <mlev>
##$CPDPRG5= <mlev>
##$CPDPRG6= <mlev>
##$CPDPRG7= <mlev>
##$CPDPRG8= <mlev>
##$CPDPRGB= <>
##$CPDPRGT= <>
##$D= (0..31)
0 1 0 0 0 0 0 0 0 0 0 0.03 2e-05 3e-06 0 0 0 0 0 0 0 0 0 0 0 0 0 0 0 0 
0 0 
##$DATE= 1719231635
##$DBL= (0..7)
120 120 120 11 120 120 24 19 
##$DBP= (0..7)
150 150 150 150 150 150 150 150 
##$DBP07= 0
##$DBPNAM0= <>
##$DBPNAM1= <>
##$DBPNAM2= <>
##$DBPNAM3= <>
##$DBPNAM4= <>
##$DBPNAM5= <>
##$DBPNAM6= <>
##$DBPNAM7= <>
##$DBPOAL= (0..7)
0.5 0.5 0.5 0.5 0.5 0.5 0.5 0.5 
$$ [...]
##$SUBNAM2= <"">
##$SUBNAM3= <"">
##$SUBNAM4= <"">
##$SUBNAM5= <"">
##$SUBNAM6= <"">
##$SUBNAM7= <"">
##$SUBNAM8= <"">
##$SUBNAM9= <"">
##$SW= 501.771253377433
##$SWIBOX= (0..15)
0 1 3 0 0 0 0 0 0 0 0 0 0 0 0 0 
##$SW_h= 40650.406504065
##$TD= 32768
##$TD0= 1
##$TE= 0
##$TE2= 300
##$TE3= 300
##$TEG= 300
##$TL= (0..7)
0 120 53 12 22 120 120 120 
##$TP= (0..7)
150 150 150 150 150 150 150 150 
##$TP07= 0
##$TPNAME0= <>
##$TPNAME1= <>
##$TPNAME2= <>
##$TPNAME3= <>
##$TPNAME4= <>
##$TPNAME5= <>
##$TPNAME6= <>
##$TPNAME7= <>
##$TPOAL= (0..7)
0.5 0.5 0.5 0.5 0.5 0.5 0.5 0.5 
##$TPOFFS= (0..7)
0 0 0 0 0 0 0 0 
##$TUNHIN= 0
##$TUNHOUT= 0
##$TUNXOUT= 0
##$USERA1= <user>
##$USERA2= <user>
##$USERA3= <user>
##$USERA4= <user>
##$USERA5= <user>
##$V9= 5
##$VALIST= <valist>
##$VCLIST= <CCCCCCCCCCCCCCC>
##$VD= 0
##$VDLIST= <DDDDDDDDDDDDDDD>
##$VPLIST= <PPPPPPPPPPPPPPP>
##$VTLIST= <TTTTTTTTTTTTTTT>
##$WBST= 1024
##$WBSW= 4
##$XGAIN= (0..3)
0 0 0 0 
##$XL= 0
##$YL= 0
##$YMAX_a= 5970
##$YMIN_a= -2064
##$ZGOPTNS= <>
##$ZL1= 120
##$ZL2= 120
##$ZL3= 120
##$ZL4= 120
##$ABSF1= 0
##$ABSF2= 0
##$ABSG= 0
##$ABSL= 0
##$ALPHA= 0
##$AQORDER= 0
##$ASSFAC= 0
##$ASSFACI= 0
##$ASSFACX= 0
##$ASSWID= 0
##$AUNMP= <proc_1d>
##$AZFE= 0.1
##$AZFW= 0.5
##$BCFW= 0
##$BC_mod= 2
##$BYTORDP= 0
##$COROFFS= 0
##$CY= -3
##$DATMOD= 1
##$DC= 0
##$DFILT= <>
##$DTYPP= 0
##$F1P= 0
##$F2P= 0
##$FCOR= 1
##$FTSIZE= 65536
##$FT_mod= 6
##$GAMMA= 0
##$GB= 0
##$INTBC= 1
##$INTSCL= 6.047779e-11
##$ISEN= 30
##$LB= 10
##$LEV0= 0
##$LPBIN= 0
##$MAXI= 10000
##$MC2= 0
##$MEAN= 0
##$ME_mod= 0
##$MI= 50
##$NCOEF= 0
##$NC_proc= -11
##$NLEV= 6
##$NOISF1= 182.463
##$NOISF2= 159.3651
##$NSP= 0
##$NTH_PI= 0
##$NZP= 0
##$OFFSET= 248.5645
##$PC= 4
##$PHC0= 3622.076
##$PHC1= -8582.159
##$PH_mod= 1
##$PKNL= yes
##$PPARMOD= 0
##$PSCAL= 0
##$PSIGN= 0
##$REVERSE= no
##$SF= 81.0140089999694
##$SI= 65536
##$SIGF1= 159.3651
##$SIGF2= -187.1042
##$SINO= 113.3802
##$SIOLD= 16384
##$SREGLST= <1H.CDCl3>
##$SSB= 0
##$STSI= 65536
##$STSR= 0
##$SW_p= 40650.406504065
##$SYMM= 0
##$S_DEV= 0
##$TDeff= 32768
##$TDoff= 0
##$TI= <>
##$TILT= no
##$TM1= 0
##$TM2= 0
##$TOPLEV= 0
##$USERP1= <user>
##$USERP2= <user>
##$USERP3= <user>
##$USERP4= <user>
##$USERP5= <user>
##$WDW= 1
##$XDIM= 65536
##$YMAX_p= 419232593
##$YMIN_p= -135067138
$$ End of Bruker specific parameters
$$ ---------------------------------
##NTUPLES= NMR SPECTRUM
##VAR_NAME=  FREQUENCY,     SPECTRUM/REAL,   SPECTRUM/IMAG
##SYMBOL=    X,             R,               I
##VAR_TYPE=  INDEPENDENT,   DEPENDENT,       DEPENDENT
##VAR_FORM=  AFFN,          ASDF,            ASDF
##VAR_DIM=   65536,         65536,           65536
##UNITS=     HZ,            ARBITRARY UNITS, ARBITRARY UNITS
##FACTOR=    0.620285442955139, 1,           1
##FIRST=     20137.2065510682, 0,            0
##LAST=      -20513.1999529968, 0,           0
##MIN=       -20513.1999529968, -135067138,  0
##MAX=       20137.2065510682, 419232593,    0
$$ Real data points
##PAGE= N=1
##DATA TABLE= (X++(R..R)), XYDATA
$$ [...]
43201 -27773964 -27576340 -26914114 -25813711 -24309894 -22442455 -20251859 -17778878 -15077178
43193 -15077178 -12239195 -9418913 -6828668 -4701345 -3232134 -2525066 -2563548 -3212351 -4250715
43184 -4250715 -5430586 -6545283 -7485235 -8257516 -8959420 -9717397 -10619119 -11668411 -12778817
43175 -12778817 -13799645 -14552063 -14853814 -14529509 -13422824 -11426988 -8528566 -4838440
43167 -4838440 -585857 3926166 8384741 12525716 16168639 19218962 21640505 23416063
43159 23416063 24522072 24934019 24656061 23748839 22331461 20557134 18586107 16579386
43151 16579386 14711023 13174527 12166281 11855879 12365939 13768428 16083085 19262049
43143 19262049 23162783 27529912 32010995 36216818 39808993 42576060 44465826 45572691
43135 45572691 46101200 46320231 46505898 46876172 47540998 48495140 49655321 50914285 52179331
43126 52179331 53379814 54448838 55297325 55801406 55815918 55210963 53915077 51945675 49413617
43117 49413617 46498676 43403741 40305255 37319920 34499497 31851069 29368533 27057406
43109 27057406 24939903 23038410 21348620 19821386 18367918 16887706 15303312 13583621
43101 13583621 11748458 9860147 8009288 6295918 4806374 3592925 2666067 2001134
43093 2001134 1551574 1262781 1087716 1005164 1032266 1217604 1609143 2208496 2937106 3638627
43083 3638627 4120282 4206694 3769463 2719257 984009 -1490625 -4706597 -8567015 -12852681
43074 -12852681 -17241325 -21365008 -24884505 -27554742 -29260820 -30017389 -29939892 -29206791 -28030008
43065 -28030008 -26636900 -25251081 -24057248 -23153348 -22517243 -22019025 -21483987 -20774161 -19840655
43056 -19840655 -18719276 -17481664 -16181085 -14827312 -13397518 -11865694 -10228037 -8511637
43048 -8511637 -6765676 -5042334 -3379582 -1797714 -311780 1052370 2257082 3275108
43040 3275108 4122284 4873309 5639807 6516660 7529957 8623791 9697766 10672307 11540585
43031 11540585 12374161 13277860 14322531 15501144 16736555 17926603 18983553 19840324
43023 19840324 20436016 20710051 20613042 20117155 19211613 17889714 16142645 13966037 11373828
43014 11373828 8410472 5154196 1709047 -1807313 -5267965 -8529821 -11427967 -13788240
43006 -13788240 -15461564 -16366481 -16521001 -16051236 -15173228 -14151683 -13245453 -12654578 -12484560
42997 -12484560 -12738516 -13336859 -14151553 -15036464 -15843499 -16430246 -16672783 -16488513 -15857829
42988 -15857829 -14829186 -13505605 -12027037 -10562977 -9311664 -8486516 -8277006 -8795541
42980 -8795541 -10038829 -11883790 -14114436 -16461958 -18646248 -20419615 -21614386 -22183821
42972 -22183821 -22215923 -21906445 -21498364 -21213510 -21202821 -21525790 -22152450 -22976695 -23836667 -24544118
42962 -24544118 -24921979 -24841346 -24245308 -23152024 -21640374 -19830770 -17873842 -15949322 -14264364
42953 -14264364 -13037118 -12461850 -12666012 -13674261 -15389042 -17593283 -19982612 -22231508
42945 -22231508 -24079408 -25400193 -26217343 -26657531 -26875377 -26996637 -27104436 -27254831 -27488437
42936 -27488437 -27818070 -28203069 -28539486 -28686135 -28520037 -27994882 -27175546 -26234377 -25409406
42927 -25409406 -24936679 -24978672 -25574232 -26628000 -27941846 -29275699 -30414668 -31215752 -31615915
42918 -31615915 -31606034 -31198529 -30417387 -29312839 -27974541 -26517699 -25046482 -23626367 -22292196
42909 -22292196 -21086995 -20099614 -19470693 -19360155 -19892641 -21106257 -22926935 -25180591 -27640166
42900 -27640166 -30089098 -32376821 -34448274 -36340628 -38150939 -39990550 -41952426 -44110475
42892 -44110475 -46541214 -49334270 -52569161 -56271768 -60383673 -64761300 -69194597 -73428476
42884 -73428476 -77183505 -80182928 -82190145 -83050018 -82717044 -81251526 -78780229 -75444757
42876 -75444757 -71373083 -66688740 -61536938 -56095171 -50557132 -45105274 -39892394 -35039405
42868 -35039405 -30643181 -26783484 -23519593 -20874399 -18814709 -17243786 -16018426 -14990216
42860 -14990216 -14057042 -13203104 -12507001 -12109795 -12153693 -12716575 -13769273 -15171973 -16709819
42851 -16709819 -18151235 -19302467 -20035630 -20285211 -20026241 -19251821 -17958453 -16138736 -13782169
42842 -13782169 -10889998 -7506538 -3755647 140146 3875724 7114081 9552422 10977042
42834 10977042 11285796 10472133 8585998 5702461 1922814 -2596304 -7617097 -12827054
42826 -12827054 -17878770 -22441558 -26244175 -29101469 -30925824 -31726014 -31597394 -30706602
42818 -30706602 -29268480 -27512132 -25643973 -23825330 -22172912 -20769285 -19664569 -18868997
42810 -18868997 -18354492 -18076800 -18005309 -18135416 -18472789 -19005124 -19688474 -20462154 -21280469
42801 -21280469 -22133090 -23032450 -23971488 -24880018 -25613977 -25993641 -25876455 -25228548 -24160685
42792 -24160685 -22916054 -21820591 -21216070 -21391602 -22522072 -24621155 -27520521 -30888201
42784 -30888201 -34290484 -37283076 -39499093 -40700631 -40782674 -39746878 -37674181 -34713200
42776 -34713200 -31081741 -27068082 -23017645 -19293373 -16207278 -13940436 -12489444 -11676039
42768 -11676039 -11223965 -10864820 -10418737 -9819412 -9091162 -8303725 -7523606 -6773520 -6017035
42759 -6017035 -5184633 -4230522 -3177055 -2106755 -1105883 -203754 651169 1572337 2693432
42750 2693432 4124821 5920794 8067715 10499064 13128300 15875226 18665356 21406691
42742 21406691 23972142 26214221 28010459 29308566 30137044 30572349 30685218 30502271 30007834
42733 30007834 29184016 28060263 26734896 25350841 24042387 22888395 21894399 21000935
42725 21000935 20105759 19093740 17870412 16388753 14658658 12740266 10731114 8752988
42717 8752988 6936865 5405223 4255647 3549328 3304651 3495838 4057256 4891564 5878465
42708 5878465 6883979 7771924 8414027 8692001 8493932 7720170 6310839 4285939 1770853
42699 1770853 -1015618 -3811023 -6375795 -8549592 -10279707 -11617833 -12689677 -13643207
42691 -13643207 -14584682 -15523682 -16358385 -16920302 -17062573 -16744402 -16066749 -15249257 -14573958
42682 -14573958 -14329510 -14772651 -16103877 -18447740 -21833222 -26177664 -31283421 -36856898
42674 -36856898 -42551759 -48025054 -52986820 -57228710 -60630385 -63153264 -64833558 -65781619
42666 -65781619 -66183331 -66286287 -66351827 -66574999 -67006065 -67519310 -67851830 -67695905 -66805675
42657 -66805675 -65081892 -62612875 -59661305 -56597729 -53798313 -51541664 -49943369 -48950009
42649 -48950009 -48384427 -48011045 -47591047 -46918903 -45850775 -44331943 -42411603 -40225882 -37947364
42640 -37947364 -35725856 -33653284 -31767715 -30084592 -28629321 -27451693 -26619602 -26201426
42632 -26201426 -26245663 -26759333 -27686167 -28895355 -30198838 -31404712 -32389376 -33152362 -33822569
42623 -33822569 -34608832 -35714108 -37248382 -39176832 -41325723 -43441275 -45270680 -46628575
42615 -46628575 -47429888 -47691825 -47514646 -47045636 -46430191 -45763717 -45065702 -44290629 -43371426
42606 -43371426 -42272063 -41019083 -39693203 -38387449 -37160888 -36018592 -34926418 -33841338
42598 -33841338 -32726846 -31537940 -30190621 -28552300 -26479479 -23890153 -20823703 -17445428
42590 -17445428 -13993574 -10704717 -7757404 -5251306 -3216504 -1637913 -479308 302857
42582 302857 753893 912328 792034 364305 -442150 -1714287 -3510164 -5818055 -8539140
42573 -8539140 -11502157 -14503889 -17358993 -19939994 -22193079 -24125744 -25775648 -27179329
42565 -27179329 -28355643 -29303577 -30002983 -30411718 -30464908 -30084910 -29202922 -27787133 -25871332
42556 -25871332 -23573489 -21088188 -18644478 -16443924 -14609898 -13169736 -12068071 -11197239
42548 -11197239 -10433231 -9668568 -8831816 -7888542 -6832674 -5683097 -4486695 -3311784 -2219483
42539 -2219483 -1224144 -270871 750431 1959543 3431943 5161527 7056512 8970357
42531 8970357 10751333 12282235 13489149 14322911 14735536 14668722 14053166 12810877 10862585
42522 10862585 8148166 4656101 443394 -4367680 -9607720 -15071836 -20514944 -25644508
42514 -25644508 -30135366 -33678955 -36054053 -37187576 -37175042 -36250957 -34725440 -32916739
42506 -32916739 -31102240 -29493271 -28227363 -27371022 -26929402 -26860687 -27094397 -27555637 -28195594
42497 -28195594 -29018406 -30084908 -31479009 -33244368 -35321246 -37517982 -39534133 -41024589
42489 -41024589 -41674034 -41251998 -39637627 -36822559 -32903573 -28067783 -22569084 -16701171
42481 -16701171 -10776212 -5108758 6370 4327822 7700349 10066313 11451044 11937880
42473 11937880 11651039 10746477 9395193 7750328 5913395 3928426 1816270 -372973
42465 -372973 -2529339 -4496716 -6118135 -7281007 -7941809 -8131785 -7953075 -7564948 -7150946
42456 -7150946 -6865644 -6778922 -6845792 -6919223 -6801111 -6310733 -5347119 -3925418 -2174903 -301946
42446 -301946 1459863 2887246 3787952 4022660 3541136 2417023 848353 -891544 -2532634
42437 -2532634 -3878163 -4841252 -5449745 -5833983 -6204214 -6811831 -7891834 -9602088 -11985427
42428 -11985427 -14967063 -18376020 -21972288 -25474975 -28598178 -31095356 -32801987 -33666501
42420 -33666501 -33765131 -33293457 -32522279 -31718096 -31058314 -30588533 -30249434 -29956072 -29680190
42411 -29680190 -29490070 -29533050 -29976606 -30937667 -32427031 -34325334 -36395854 -38330187 -39816174
42402 -39816174 -40612126 -40606742 -39844116 -38503703 -36844118 -35134382 -33596508 -32372744 -31519936
42393 -31519936 -31024951 -30826903 -30829665 -30901073 -30876406 -30589565 -29933793 -28922840 -27713503 -26570260
42383 -26570260 -25785099 -25587378 -26080122 -27224179 -28870304 -30821501 -32900102 -34995845
42375 -34995845 -37079702 -39181202 -41342072 -43569616 -45812195 -47965334 -49899089 -51488211
42367 -51488211 -52632709 -53269934 -53384414 -53013073 -52235220 -51144983 -49822165 -48321954 -46686111
42358 -46686111 -44958699 -43190347 -41431732 -39727501 -38117302 -36641320 -35344336 -34274664
42350 -34274664 -33478390 -32992775 -32842375 -33036463 -33563316 -34382529 -35424520 -36603409 -37835791
42341 -37835791 -39050235 -40181402 -41158636 -41904323 -42347700 -42444397 -42183769 -41573005 -40607715
42332 -40607715 -39257196 -37487905 -35318347 -32867503 -30356465 -28052616 -26182637 -24858132
42324 -24858132 -24047606 -23602245 -23318846 -23013330 -22581143 -22027279 -21455951 -21023517 -20876933
42315 -20876933 -21107528 -21736021 -22722686 -23988661 -25440719 -26994369 -28584298 -30153663
42307 -30153663 -31631685 -32922980 -33922951 -34551605 -34787294 -34686823 -34385214 -34071501 -33944105
42298 -33944105 -34161551 -34808639 -35888182 -37334171 -39035813 -40862559 -42682678 -44372701
42290 -44372701 -45823090 -46948729 -47704170 -48089942 -48134997 -47858311 -47235299 -46198287 -44676207
42281 -44676207 -42646509 -40162883 -37345064 -34347365 -31330696 -28448006 -25838465 -23623651
42273 -23623651 -21900726 -20727167 -20098242 -19933165 -20089115 -20401071 -20720320 -20925990 -20911387
42264 -20911387 -20569209 -19795116 -18506901 -16659120 -14235413 -11221684 -7586059 -3291799
42256 -3291799 1658383 7176932 13073813 19069205 24822280 29968345 34165577 37145619
42248 37145619 38752303 38957623 37856815 35647991 32598004 28998519 25123810 21202518
42240 21202518 17408015 13865319 10668829 7899820 5629725 3904221 2718923 2003025
42232 2003025 1619173 1381207 1094211 619497 -52598 -762497 -1211819 -1066214 -86985
42223 -86985 1771348 4340329 7294307 10250567 12869866 14927302 16341251 17159543 17509212
42214 17509212 17526135 17292202 16809066 16020550 14868043 13345152 11523450 9542796 7577869
42205 7577869 5796807 4324931 3224406 2496935 2105484 1998684 2119619 2393107 2702695
42196 2702695 2878478 2713705 2012772 653174 -1368316 -3929940 -6824149 -9823020 -12737754
42187 -12737754 -15443730 -17863580 -19928793 -21555233 -22655037 -23176224 -23139573 -22647235 -21859141
42178 -21859141 -20949995 -20063361 -19277806 -18598293 -17978134 -17358716 -16699296 -15976546 -15162167
42169 -15162167 -14208585 -13062450 -11693711 -10110647 -8346459 -6430558 -4367596 -2136704
42161 -2136704 289512 2912951 5678255 8462428 11102661 13456212 15460271 17154707
42153 17154707 18653174 20082104 21528018 23025253 24583631 26224137 27986845 29902239
42145 29902239 31949621 34036532 36015120 37723511 39026144 39836195 40123632 39921461
42137 39921461 39331588 38516780 37668423 36958610 36496730 36304521 36313516 36386431 36360398 36096369
42127 36096369 35509114 34563779 33250310 31560654 29485516 27029823 24232637 21173090
42119 21173090 17952814 14666143 11384380 8169414 5102412 2297416 -116180 -2033313
42111 -2033313 -3415435 -4318558 -4893553 -5349402 -5885863 -6623405 -7564594 -8603653 -9573767
42102 -9573767 -10305260 -10669586 -10598400 -10082344 -9160321 -7905542 -6408506 -4758088 -3027226
42093 -3027226 -1269446 474530 2166319 3760323 5196498 6397249 7273320 7743700
42085 7743700 7768696 7385498 6727685 6011925 5488970 5373890 5780864 6686987 7940807
42076 7940807 9316485 10593786 11627258 12371729 12859283 13153833 13316512 13394661 13423148
42067 13423148 13422861 13396732 13336119 13242828 13152752 13139078 13286777 13650744 14218026 14889367 15489923
42056 15489923 15814723 15699486 15084310 14032879 12700646 11287020 10013548 9131794 8922383
42047 8922383 9646854 11457195 14311215 17946775 21934014 25781523 29048682 31421177
42039 31421177 32731958 32939226 32090740 30300645 27745309 24664117 21345818 18092997
42031 18092997 15173768 12777930 10992446 9804212 9129353 8857693 8892710 9170073 9652600
42022 9652600 10314444 11129006 12064397 13081061 14128370 15145661 16075541 16887280 17594088
42013 17594088 18244551 18883573 19503302 20018624 20289297 20178757 19615007 18622849 17322095
42004 17322095 15906497 14616536 13705347 13391742 13804442 14936208 16630925 18616440
41996 18616440 20576288 22234193 23416363 24065251 24202622 23867269 23066670 21772304 19960701
41987 19960701 17674649 15068615 12412272 10047212 8313500 7476749 7684418 8959448
41979 8959448 11215289 14272724 17878285 21738472 25570751 29148514 32316998 34982181
41971 34982181 37091938 38619990 39549567 39858219 39517093 38513380 36885671 34751594
41963 34751594 32312963 29832720 27583691 25780054 24518524 23759888 23361235 23140340
41955 23140340 22941190 22678912 22356836 22054118 21883081 21923031 22153152 22417405 22444906 21922415
41945 21922415 20589826 18321824 15168898 11346905 7178930 3006979 -896499 -4384040
41937 -4384040 -7434969 -10108031 -12472724 -14554878 -16319839 -17693232 -18600185 -18998422
41929 -18998422 -18888718 -18302198 -17280862 -15874472 -14163083 -12286234 -10444148 -8854978
41921 -8854978 -7691665 -7042470 -6919054 -7296848 -8152983 -9479973 -11277089 -13532087 -16203316
41912 -16203316 -19209480 -22433627 -25739333 -28981978 -31997171 -34573728 -36446966 -37342291
41904 -37342291 -37056731 -35528702 -32851787 -29228232 -24894048 -20056378 -14869326 -9449873
41896 -9449873 -3912465 1607676 6958628 11995350 16603274 20709441 24280761 27313407
41888 27313407 29817839 31806140 33289426 34288876 34856068 35090755 35140229 35170430 35317369
41879 35317369 35644207 36125412 36658151 37087927 37242686 36979027 36235541 35071820 33670792
41870 33670792 32299892 31245106 30738913 30902369 31717872 33040632 34643635 36278691
41862 36278691 37731000 38849547 39550438 39806578 39639679 39114670 38321585 37337978 36189799
41853 36189799 34839592 33211747 31234720 28870074 26115176 22991222 19538015 15824710
41845 15824710 11963687 8104998 4403772 980939 -2090589 -4761647 -6965499 -8595039
41837 -8595039 -9516804 -9610585 -8809785 -7126053 -4655254 -1565821 1931419 5627800 9358949
41828 9358949 13021011 16547760 19857715 22800638 25138664 26583510 26880554 25899449
41820 25899449 23683515 20436625 16465920 12117449 7728156 3593962 -52553 -3050639
41812 -3050639 -5297930 -6722790 -7267819 -6902573 -5653228 -3616151 -936299 2235390
41804 2235390 5775686 9598304 13644528 17866052 22204917 26575071 30854357 34892035
41796 34892035 38526339 41603775 43998632 45633065 46489170 46599394 46014272 44766878
41788 44766878 42859525 40283022 37055766 33256943 29032357 24568950 20054089 15644980
41780 15644980 11464213 7614855 4190379 1258354 -1177449 -3204525 -4984281 -6685625
41772 -6685625 -8405076 -10123362 -11723724 -13053488 -13984348 -14437462 -14374788 -13786259 -12699326
41763 -12699326 -11207678 -9489065 -7784877 -6343953 -5361771 -4948068 -5132400 -5890198 -7162907
41754 -7162907 -8858566 -10841181 -12929683 -14920443 -16627407 -17917939 -18723254 -19018920
41746 -19018920 -18790963 -18012296 -16645415 -14666167 -12087519 -8965514 -5387713 -1458007
41738 -1458007 2711612 7003778 11300557 15493805 19497767 23256786 26741756 29934993
41730 29934993 32813037 35341368 37485514 39226812 40566995 41520244 42106838 42358895
41722 42358895 42330132 42091846 41709373 41213516 40586999 39772056 38688683 37252214 35391890
41713 35391890 33079694 30366596 27402316 24412062 21630966 19230393 17275274 15723749
41705 15723749 14452447 13290666 12062932 10640450 8982712 7139725 5205509 3249294
41697 3249294 1268017 -812757 -3096286 -5661555 -8530604 -11666541 -14989828 -18394678
41689 -18394678 -21759937 -24961645 -27890567 -30463513 -32613679 -34261803 -35291185 -35553289
41681 -35553289 -34910675 -33296060 -30753752 -27443168 -23610996 -19552508 -15572779 -11942839
41673 -11942839 -8848972 -6351800 -4378187 -2750819 -1238073 395686 2346808 4737563
41665 4737563 7596071 10857849 14386599 18004379 21523569 24776715 27637578 30025397
41657 30025397 31893697 33217196 33989629 34231023 33991537 33342236 32355822 31089726 29583279
41648 29583279 27870869 26000469 24041601 22075223 20173830 18387017 16739172 15233377
41640 15233377 13854199 12571312 11352333 10188476 9124638 8275905 7812691 7911187 8688547
41631 8688547 10155781 12209873 14658426 17252928 19715908 21767168 23158671 23712592
41623 23712592 23342902 22045766 19865457 16862713 13114260 8750107 4002388 -777289
41615 -777289 -5157022 -8705502 -11073620 -12045047 -11553297 -9679772 -6640706 -2758483 1585353
41606 1585353 6004477 10152437 13750848 16609273 18645497 19900050 20527804 20758726
41598 20758726 20841966 20998553 21396824 22145039 23288102 24802723 26595333 28510634 30357532
41589 30357532 31954321 33183242 34030322 34585557 34999261 35417381 35927576 36534509 37164931
41580 37164931 37695074 37991072 37950361 37531647 36767662 35761383 34664562 33635163 32780946
41571 32780946 32114819 31550575 30945108 30163336 29130431 27848043 26373281 24777087 23105747
41562 23105747 21364305 19526784 17564073 15473929 13298767 11121821 9040914 7131469
41554 7131469 5419835 3884716 2488315 1220269 128171 -686070 -1106294 -1058091 -548026
41545 -548026 337212 1468678 2722443 4004354 5239595 6343880 7210394 7736325 7880894
41536 7880894 7718637 7449595 7352286 7698215 8669721 10323790 12617997 15472843 18819241
41527 18819241 22596161 26708582 30987607 35187353 39022492 42226782 44608490 46085483
41519 46085483 46692659 46563552 45893272 44891837 43740497 42567345 41452043 40450802
41511 40450802 39619022 39015828 38693018 38680163 38974405 39540182 40322519 41268604 42340206
41502 42340206 43502798 44699135 45831470 46768396 47371421 47526685 47171182 46306717 44994431
41493 44994431 43328433 41400848 39279013 37008255 34636708 32245992 29969491 27986232
41485 27986232 26489138 25638326 25518622 26120200 27348983 29054831 31055011 33140862
41477 33140862 35079834 36636899 37621382 37934875 37587677 36675899 35341343 33741027 32033878
41468 32033878 30374315 28902109 27727394 26915480 26475224 26353263 26438018 26578590 26619915
41459 26619915 26445359 26007910 25330829 24473539 23481149 22349992 21033692 19486386 17710843
41450 17710843 15773703 13776222 11805684 9905258 8077229 6302682 4554580 2801757
41442 2801757 1018581 -792028 -2573278 -4204872 -5517558 -6327051 -6474343 -5857521 -4445544
41433 -4445544 -2276634 547474 3866142 7471599 11136973 14652068 17843417 20564982
41425 20564982 22674247 24026103 24504418 24078846 22850414 21053767 19011705 17065820
41417 17065820 15514432 14574884 14367931 14913102 16127959 17834471 19783925 21709611
41409 21709611 23399540 24759238 25829297 26745392 27662907 28684851 29821011 30985109
41401 30985109 32022476 32754740 33025503 32734030 31852833 30431465 28586502 26475292 24258817
41392 24258817 22069590 19996981 18085249 16330082 14671137 12995839 11169772 9088752
41384 9088752 6728202 4165129 1564420 -861527 -2903406 -4401511 -5279815 -5563960
41376 -5563960 -5381028 -4938623 -4483335 -4247021 -4398905 -5021777 -6116983 -7625868 -9450290
41367 -9450290 -11465822 -13534994 -15529873 -17362481 -19008924 -20509753 -21938800 -23351762
41359 -23351762 -24742123 -26031157 -27097437 -27825479 -28144110 -28037638 -27533385 -26681716 -25544876
41350 -25544876 -24201085 -22756038 -21344687 -20111214 -19171792 -18578078 -18298537 -18224417 -18197815
41341 -18197815 -18053953 -17665726 -16976489 -16010139 -14855593 -13632488 -12453340 -11399947 -10523046
41332 -10523046 -9857897 -9438745 -9301566 -9477847 -9986443 -10824919 -11959019 -13313942 -14774483
41323 -14774483 -16195760 -17418728 -18285138 -18654044 -18426304 -17577475 -16185975 -14433967 -12565906
41314 -12565906 -10814655 -9329758 -8144523 -7194503 -6369683 -5568332 -4726853 -3817629 -2824703
41305 -2824703 -1717814 -443072 1065155 2861075 4966736 7360228 9970863 12678046
41297 12678046 15315564 17688062 19605310 20930505 21626235 21775578 21563141 21218645 20943739
41288 20943739 20851401 20942658 21129046 21287913 21322471 21198979 20949146 20644703 20360218 20137939
41278 20137939 19963456 19759604 19403799 18764580 17741279 16289350 14425706 12220880 9786114
41269 9786114 7257735 4779557 2487380 499864 -1084996 -2191979 -2771958 -2806937 -2317043
41260 -2317043 -1368414 -77674 1392097 2845601 4078661 4909423 5214103 4958111 4209959
41251 4209959 3130410 1939758 874348 145403 -91200 246918 1160262 2572229 4356260
41242 4356260 6385339 8581632 10934277 13472894 16216132 19127081 22094203 24938350
41234 24938350 27439686 29377404 30571893 30917978 30404699 29123964 27266847 25098471
41226 25098471 22906892 20941011 19367479 18267536 17666920 17571138 17981853 18889203 20249567
41217 20249567 21961377 23851071 25681452 27189056 28142648 28401936 27954711 26919318
41209 26919318 25509065 23966210 22488717 21183788 20072266 19137344 18382824 17863677
41201 17863677 17675260 17915317 18643238 19850741 21443701 23233728 24948412 26271671
41193 26271671 26909354 26654752 25427404 23278289 20374631 16980474 13436891 10131418
41185 10131418 7442591 5659888 4906102 5104687 6016923 7332453 8769050 10144876
41177 10144876 11411029 12645776 14013668 15699732 17842212 20490111 23598037 27054142
41169 27054142 30727646 34516594 38372235 42283953 46233353 50150180 53903119 57332697
41161 57332697 60303704 62743005 64641206 66022087 66904678 67285289 67149647 66502661 65392281
41152 65392281 63910036 62166679 60256438 58230826 56098203 53849200 51491291 49072282
41144 49072282 46684061 44450676 42507213 40972754 39923714 39381216 39324025 39721356 40560829
41135 40560829 41845048 43550124 45567979 47672418 49542898 50848465 51353769 50988711
41127 50988711 49843571 48101049 45955919 43569500 41067613 38556397 36129192 33860300
41119 33860300 31797711 29962895 28354803 26953448 25724365 24627592 23630003 22714573
41111 22714573 21879403 21123800 20427143 19734451 18961535 18018597 16835820 15374266 13620392
41102 13620392 11575697 9252238 6675447 3889428 959319 -2032272 -4994273 -7838038
41094 -7838038 -10487631 -12890685 -15030368 -16932549 -18659468 -20288768 -21887130 -23489973
41086 -23489973 -25093411 -26660163 -28138818 -29491322 -30717389 -31863240 -33007558 -34226533
41078 -34226533 -35550318 -36932069 -38249607 -39342951 -40068837 -40345120 -40168941 -39609955 -38789855
41069 -38789855 -37860762 -36991515 -36362989 -36163828 -36574928 -37739010 -39723443 -42489458 -45878817
41060 -45878817 -49625718 -53398227 -56863547 -59755634 -61914900 -63282103 -63858130 -63664524
41052 -63664524 -62734302 -61133594 -58989329 -56497483 -53903637 -51462475 -49386894 -47797334
41044 -47797334 -46683571 -45892435 -45152264 -44136323 -42551535 -40221436 -37129764 -33412727
41036 -33412727 -29316004 -25139318 -21177728 -17662643 -14718787 -12360585 -10530236 -9148617
41028 -9148617 -8145404 -7459762 -7027219 -6770081 -6596814 -6407342 -6099480 -5572964 -4731165
41019 -4731165 -3485320 -1766337 456956 3160430 6255718 9593730 12981274 16209016
41011 16209016 19087207 21484546 23362602 24792068 25935801 26997561 28158372 29532472
41003 29532472 31159491 33024353 35084200 37286214 39568897 41846579 43987577 45808052
40995 45808052 47100927 47695564 47517015 46610009 45117687 43235245 41167835 39107108
40987 39107108 37221162 35646321 34476250 33751970 33457934 33526014 33845373 34274656 34655832
40978 34655832 34834873 34694397 34191445 33379190 32393279 31405182 30566456 29970423 29643459
40969 29643459 29562193 29682680 29963171 30366576 30843888 31314582 31660640 31739528 31412674 30583225
40959 30583225 29231351 27427310 25307497 23022595 20689785 18379427 16140878 14044203
40951 14044203 12203718 10759973 9821960 9397230 9348636 9404996 9227130 8505707 7054316
40942 7054316 4864836 2110533 -895068 -3763647 -6105043 -7597203 -8041532 -7389726
40934 -7389726 -5735837 -3282423 -298252 2919019 6072037 8889657 11155617 12739331
40926 12739331 13618185 13877926 13686044 13243541 12724832 12219231 11695740 11013419 9979137
40917 9979137 8425849 6276418 3574692 482830 -2753398 -5868269 -8652944 -11017358
40909 -11017358 -13013503 -14812970 -16645991 -18720335 -21150083 -23925641 -26934392 -30008741
40901 -30008741 -32966556 -35630067 -37838370 -39474154 -40503155 -41001163 -41143548 -41156082 -41250078
40892 -41250078 -41568762 -42157321 -42954689 -43801827 -44464481 -44670669 -44162976 -42761608 -40422148
40883 -40422148 -37259047 -33510766 -29453248 -25304238 -21170704 -17065261 -12974328 -8930050
40875 -8930050 -5039810 -1460370 1657113 4211966 6170688 7565244 8488578 9089290
40867 9089290 9557825 10099701 10897159 12064670 13612210 15439191 17374525 19250260 20970357
40858 20970357 22537984 24032834 25560856 27210040 29034080 31062430 33318149 35824308
40850 35824308 38592610 41601987 44780766 48002860 51100407 53888002 56191366 57875021
40842 57875021 58863619 59149566 58782563 57847791 56447075 54690970 52696735 50584189 48468718
40833 48468718 46454053 44622436 43018410 41631027 40386557 39158612 37790984 36123792
40825 36123792 34018713 31385775 28213902 24599164 20755838 16996817 13684746 11170889
40817 11170889 9740406 9572626 10717920 13093209 16496015 20629590 25131346 29608340
40809 29608340 33690265 37096652 39691689 41493742 42628166 43245949 43451993 43279700
40801 43279700 42716945 41755542 40428303 38818354 37049814 35273267 33647389 32312345
40793 32312345 31359721 30814096 30637972 30757229 31092340 31579635 32175022 32842396 33535104
40784 33535104 34180887 34679966 34921942 34818783 34341338 33542790 32557067 31569899 30769612
40775 30769612 30292286 30180418 30372524 30731158 31101109 31373811 31526309 31612569 31711845 31866446
40765 31866446 32046183 32154380 32061516 31641433 30794831 29461249 27629318 25351626 22759741
40756 22759741 20066411 17543220 15471277 14073219 13445410 13518739 14073843 14810063 15431705
40747 15431705 15706198 15479947 14675390 13296368 11441039 9300265 7125844 5173695
40739 5173695 3641302 2621613 2089862 1925763 1957212 2005828 1922984 1615277 1059346 301869
40729 301869 -558248 -1400434 -2113146 -2612221 -2843722 -2780822 -2427402 -1827900 -1067241 -249139
40719 -249139 534319 1214822 1734338 2032486 2066709 1862608 1553544 1368242 1562568 2330136
40709 2330136 3735479 5695757 8012686 10438214 12746536 14783145 16474014 17801250
40701 17801250 18769913 19390030 19681019 19688011 19493470 19214207 18986384 18949959 19241539 19991658
40691 19991658 21311149 23255908 25780467 28710539 31762287 34609151 36967264 38663145
40683 38663145 39665272 40081616 40128404 40069512 40133926 40441521 40976654 41623915 42239617 42714004
40673 42714004 42995634 43078942 42972678 42668014 42121357 41262632 40029721 38413458 36486469
40664 36486469 34396310 32327105 30454357 28915727 27800374 27144210 26922943 27048051
40656 27048051 27374833 27725251 27922171 27827697 27371321 26549741 25392935 23917154 22099700
40647 22099700 19895090 17280510 14297975 11064944 7746611 4505532 1455136 -1361129
40639 -1361129 -3957818 -6369417 -8602496 -10600954 -12246450 -13399028 -13955671 -13892033 -13269297
40630 -13269297 -12216579 -10909348 -9551581 -8355767 -7516390 -7181607 -7431276 -8266150 -9609408
40621 -9609408 -11319283 -13210058 -15079487 -16742990 -18072247 -19026154 -19655835 -20074040 -20399758
40612 -20399758 -20705232 -20992003 -21206030 -21279728 -21173994 -20895682 -20484537 -19984388 -19420115
40603 -19420115 -18792287 -18087927 -17299438 -16442781 -15565339 -14735985 -14019520 -13450050 -13020638
40594 -13020638 -12695736 -12438697 -12240182 -12134902 -12198147 -12519865 -13165561 -14144853 -15408066
40585 -15408066 -16874261 -18472725 -20171622 -21977787 -23911074 -25971141 -28116277 -30263573
40577 -30263573 -32305580 -34131562 -35645890 -36784071 -37526358 -37900778 -37966296 -37780440 -37371132
40568 -37371132 -36730812 -35833398 -34660143 -33220993 -31565005 -29776205 -27953378 -26181073
40560 -26181073 -24508033 -22944739 -21475681 -20072512 -18701824 -17333426 -15954025 -14577423
40552 -14577423 -13234902 -11941895 -10661139 -9294760 -7723486 -5878582 -3806306 -1684667
40544 -1684667 223539 1665529 2502083 2774748 2705977 2632596 2905459 3801444 5479428
40535 5479428 7982025 11262007 15209166 19665619 24432131 29274967 33941006 38183349
40527 38183349 41793849 44633788 46650950 47875209 48395603 48331407 47809379 46951721 45873133
40518 45873133 44682991 43486901 42381676 41443776 40718687 40216768 39910264 39723001 39516547
40509 39516547 39090705 38213463 36677585 34364173 31288205 27606707 23584007 19526987
40501 19526987 15715253 12347788 9514386 7192577 5271694 3603233 2063554 602662
40493 602662 -743739 -1882450 -2714010 -3180412 -3288168 -3100569 -2708652 -2197582 -1621318
40484 -1621318 -989780 -267457 617699 1756006 3232258 5103774 7387191 10056215 13048022
40475 13048022 16273476 19625096 22977188 26179463 29057140 31434704 33185877 34287397
40467 34287397 34842390 35053106 35151403 35318243 35630213 36060268 36532494 36996820 37472794
40458 37472794 38029999 38715546 39473488 40103424 40280457 39626193 37798856 34569286 29866346
40449 29866346 23794657 16632491 8807756 844359 -6717117 -13402510 -18866098 -22922024
40441 -22922024 -25550589 -26885078 -27178005 -26749146 -25930973 -25030590 -24310885 -23974758 -24139511
40432 -24139511 -24811084 -25880955 -27155471 -28404914 -29413671 -30023769 -30171199 -29908508 -29400501
40423 -29400501 -28887159 -28625598 -28835066 -29664038 -31180079 -33368267 -36127549 -39270840 -42541185
40414 -42541185 -45642820 -48272373 -50144216 -51023426 -50776587 -49420802 -47131868 -44194134
40406 -44194134 -40917957 -37571184 -34351571 -31392120 -28773935 -26530163 -24644137 -23054425
40398 -23054425 -21672253 -20404111 -19170330 -17920187 -16650467 -15426344 -14390341 -13743154
40390 -13743154 -13693403 -14391400 -15874066 -18047728 -20719774 -23663715 -26682524 -29639064
40382 -29639064 -32447494 -35044305 -37363461 -39328413 -40858543 -41880335 -42334715 -42176980
40374 -42176980 -41371233 -39886932 -37707877 -34857103 -31424674 -27574210 -23514759 -19451783
40366 -19451783 -15547477 -11908791 -8596508 -5637679 -3033212 -765385 1188081 2834157
40358 2834157 4148077 5073489 5547334 5542857 5109502 4387487 3589125 2954342 2694121 2936054
40348 2936054 3686609 4822656 6116657 7290152 8084226 8330747 8001269 7210118 6165964
40339 6165964 5096304 4186956 3564862 3316959 3511010 4188841 5332114 6827738 8461794
40330 8461794 9949566 10986775 11301345 10695328 9077239 6484255 3085170 -846201
40322 -846201 -4983205 -9001885 -12616719 -15594476 -17764469 -19038932 -19433554 -19065696 -18122382
40313 -18122382 -16813758 -15333892 -13837007 -12422795 -11122870 -9889087 -8594686 -7063670
40305 -7063670 -5134840 -2742866 24424 2930170 5656680 7901310 9454221 10235988
40297 10235988 10300710 9816689 9026530 8185789 7493078 7038621 6793428 6639944 6426627
40288 6426627 6024976 5372072 4486117 3449052 2364006 1309472 314775 -630488 -1538270
40279 -1538270 -2376099 -3042386 -3385489 -3264119 -2616196 -1492512 -33530 1593171 3251468
40270 3251468 4853905 6332426 7592311 8490752 8860973 8566782 7552054 5859584 3619506
40261 3619506 1023248 -1705001 -4339723 -6693332 -8658605 -10233701 -11505253 -12585484
40253 -12585484 -13533122 -14304096 -14758964 -14717199 -14026554 -12619118 -10539476 -7941518 -5059758
40244 -5059758 -2167933 464892 2619535 4170968 5113895 5544528 5596122 5363458 4864201
40235 4864201 4056762 2891781 1356844 -509771 -2633574 -4930348 -7329622 -9784320
40227 -9784320 -12259390 -14702821 -17020199 -19081655 -20771541 -22056151 -23024298 -23869057
40219 -23869057 -24815816 -26033583 -27574278 -29366884 -31261358 -33090005 -34709582 -36008672
40211 -36008672 -36893745 -37280242 -37104275 -36349267 -35068359 -33386107 -31476071 -29522234 -27675751
40202 -27675751 -26019296 -24554006 -23220531 -21946160 -20686797 -19434754 -18196365 -16971536
40194 -16971536 -15756523 -14557454 -13391657 -12278132 -11239277 -10321685 -9614017 -9235284
40186 -9235284 -9292406 -9829672 -10792131 -12011633 -13218494 -14082960 -14283821 -13584376 -11886081
40177 -11886081 -9241808 -5835227 -1946640 2082280 5887436 9129521 11542608 12969985
40169 12969985 13379502 12859811 11598776 9842169 7838390 5789769 3833071 2051970
40161 2051970 500044 -790555 -1818278 -2619936 -3257574 -3787013 -4231261 -4579634 -4810806
40152 -4810806 -4918235 -4917894 -4836823 -4696872 -4507686 -4270923 -3987828 -3662433 -3299252 -2899611
40142 -2899611 -2461057 -1981309 -1464623 -926161 -391079 110078 543413 867155 1026109
40133 1026109 957108 611318 -16221 -869748 -1843709 -2820120 -3713646 -4497859 -5195035 -5836613
40123 -5836613 -6425907 -6934908 -7337647 -7649962 -7942341 -8319953 -8890103 -9736519 -10901810
40114 -10901810 -12371832 -14066624 -15853079 -17585768 -19159520 -20542958 -21771595 -22906000
40106 -22906000 -23983385 -24991632 -25874460 -26555200 -26962741 -27054254 -26836412 -26380481 -25819193
40097 -25819193 -25321110 -25056577 -25176863 -25813523 -27082903 -29074243 -31816222 -35240582 -39170889
40088 -39170889 -43349937 -47492090 -51330639 -54639612 -57234213 -58969016 -59746259 -59531937
40080 -59531937 -58372572 -56408498 -53876387 -51086017 -48362196 -45968233 -44049237 -42625247
40072 -42625247 -41629901 -40962231 -40520522 -40209757 -39933757 -39587017 -39055611 -38230816 -37035214
40063 -37035214 -35455651 -33570558 -31555585 -29656992 -28137744 -27218646 -27041297 -27662804
40055 -27662804 -29065313 -31152749 -33727327 -36472165 -38978267 -40827836 -41702959 -41467404
40047 -41467404 -40185949 -38081798 -35459429 -32625851 -29836100 -27276573 -25082224 -23363909
40039 -23363909 -22216583 -21698798 -21804073 -22453677 -23518361 -24850171 -26304414 -27752791
40031 -27752791 -29102017 -30322577 -31473565 -32703698 -34220209 -36235373 -38912515 -42331609
40023 -42331609 -46480057 -51258462 -56488053 -61916965 -67232866 -72088920 -76142517 -79100791
40015 -79100791 -80765072 -81065741 -80080064 -78029656 -75257505 -72184448 -69245995 -66816596
40007 -66816596 -65137156 -64266505 -64075324 -64289257 -64567519 -64586397 -64100535 -62976611 -61208532
39998 -61208532 -58914702 -56305485 -53619873 -51057569 -48741423 -46721907 -45004741 -43574834
39990 -43574834 -42405131 -41457236 -40685179 -40043148 -39485083 -38946518 -38320747 -37458750 -36207700
39981 -36207700 -34465680 -32213493 -29509613 -26470418 -23262058 -20104072 -17265334 -15039251
39973 -15039251 -13701564 -13461990 -14422162 -16553349 -19703187 -23627118 -28027825 -32587603
39965 -32587603 -36990954 -40944386 -44201626 -46598433 -48093008 -48795028 -48957692 -48917375 -48994597
39956 -48994597 -49395932 -50156331 -51137299 -52070787 -52628368 -52497029 -51446099 -49371867 -46311156
39947 -46311156 -42422904 -37944439 -33135786 -28230912 -23413077 -18817271 -14544446 -10667955
39939 -10667955 -7228457 -4231810 -1664176 480171 2178651 3384874 4057342 4196308
39931 4196308 3868534 3204843 2366280 1489836 639166 -211789 -1150743 -2268684 -3600670
39922 -3600670 -5091061 -6593689 -7904973 -8819249 -9187575 -8958195 -8186206 -7016279 -5651155
39913 -5651155 -4315288 -3218196 -2523288 -2328756 -2660533 -3471037 -4642314 -6003179 -7369876
39904 -7369876 -8603600 -9660865 -10610742 -11607415 -12826100 -14386130 -16292852 -18426180
39896 -18426180 -20584905 -22568385 -24256863 -25652421 -26863990 -28048255 -29337772 -30789614
39888 -30789614 -32373157 -33993193 -35528558 -36866866 -37928273 -38680275 -39142583 -39374884
39880 -39374884 -39445104 -39391586 -39202737 -38828699 -38216428 -37342027 -36217019 -34865672 -33291535
39871 -33291535 -31457475 -29293932 -26734743 -23766811 -20471106 -17031778 -13704279 -10758331
39863 -10758331 -8427364 -6885254 -6243376 -6543905 -7735867 -9646789 -11979650 -14356045
39855 -14356045 -16397868 -17814277 -18459316 -18347458 -17635932 -16586227 -15511167 -14716052 -14449590
39846 -14449590 -14875466 -16060123 -17968257 -20470716 -23376935 -26489055 -29654545 -32794811
39838 -32794811 -35906434 -39044877 -42297709 -45749132 -49441833 -53350666 -57382736 -61406062
39830 -61406062 -65291321 -68941921 -72296527 -75309751 -77931927 -80104302 -81769404 -82884480
39822 -82884480 -83425945 -83380382 -82728801 -81440452 -79490331 -76896725 -73756890 -70259429 -66668841
39813 -66668841 -63290072 -60419635 -58288128 -57008073 -56550239 -56763348 -57427306 -58310617 -59207595
39804 -59207595 -59955776 -60452390 -60679322 -60717712 -60721861 -60847821 -61171543 -61643325 -62099351 -62317326
39794 -62317326 -62088486 -61280112 -59868158 -57930065 -55606253 -53052871 -50404820 -47755789
39786 -47755789 -45158837 -42653366 -40312747 -38282664 -36772481 -35989935 -36052500 -36927968 -38437552
39777 -38437552 -40317114 -42303551 -44206103 -45934374 -47478840 -48864617 -50110473 -51214437
39769 -51214437 -52164144 -52954226 -53595380 -54112816 -54540560 -54917613 -55287968 -55704560 -56236405
39760 -56236405 -56975323 -58034367 -59529316 -61542392 -64083419 -67076205 -70389743 -73901702
39752 -73901702 -77550536 -81335238 -85261202 -89271098 -93205645 -96813033 -99797808 -101889053
39744 -101889053 -102906671 -102803587 -101666318 -99673602 -97034270 -93933438 -90505448 -86834237
39736 -86834237 -82969862 -78947709 -74801820 -70572139 -66312296 -62104430 -58079367 -54430136
39728 -54430136 -51402434 -49251536 -48170184 -48210250 -49232298 -50911986 -52809189 -54475779
39720 -54475779 -55558590 -55857210 -55321063 -54002300 -52000082 -49426219 -46399055 -43052274
39712 -43052274 -39542050 -36044865 -32745759 -29817476 -27390997 -25523047 -24173520 -23208004
39704 -23208004 -22433183 -21657473 -20754290 -19701724 -18584317 -17560895 -16813887 -16497126 -16696708
39695 -16696708 -17415523 -18582417 -20074821 -21740764 -23416525 -24945915 -26202929 -27108323
39687 -27108323 -27630108 -27770658 -27553621 -27020554 -26235838 -25290359 -24294774 -23360200 -22574381
39678 -22574381 -21986991 -21611001 -21431653 -21407411 -21458900 -21460419 -21252633 -20679242 -19631824 -18083591
39668 -18083591 -16103426 -13851782 -11560405 -9493805 -7892912 -6913514 -6584216 -6807032
39660 -6807032 -7404588 -8192694 -9044003 -9916095 -10838445 -11872750 -13070652 -14450063 -15998270
39651 -15998270 -17692172 -19514777 -21452735 -23478549 -25535130 -27536826 -29386712 -31001129
39643 -31001129 -32333395 -33390661 -34236506 -34973449 -35708412 -36513286 -37393873 -38275666 -39011748
39634 -39011748 -39416585 -39323199 -38647842 -37433624 -35846242 -34118820 -32477417 -31093611 -30084174
39625 -30084174 -29530394 -29471819 -29864732 -30546150 -31251933 -31694933 -31663530 -31093489 -30089830
39616 -30089830 -28899987 -27851948 -27276574 -27433895 -28457325 -30323851 -32858630 -35780773
39608 -35780773 -38781036 -41600296 -44074197 -46132100 -47765944 -48993197 -49829381 -50276980
39600 -50276980 -50335163 -50028781 -49440791 -48722144 -48063327 -47639008 -47558152 -47846338 -48460918 -49318897
39590 -49318897 -50319394 -51357886 -52337273 -53175557 -53805681 -54169803 -54218931 -53924583 -53294099
39581 -53294099 -52373137 -51228938 -49925579 -48508491 -47004116 -45426208 -43780172 -42070400
39573 -42070400 -40322777 -38620251 -37125239 -36058177 -35629214 -35957264 -37022529 -38676858
39565 -38676858 -40703630 -42899637 -45147854 -47452779 -49918581 -52670865 -55752115 -59041365
39557 -59041365 -62243132 -64957959 -66804108 -67534521 -67102648 -65665948 -63545875 -61166888
39549 -61166888 -58985175 -57413976 -56759273 -57180270 -58677750 -61105448 -64203267 -67652235
39541 -67652235 -71137471 -74392577 -77209337 -79424625 -80912212 -81595471 -81473166 -80637058
39533 -80637058 -79263513 -77575709 -75790235 -74072970 -72523987 -71191377 -70095697 -69245837
39525 -69245837 -68641240 -68268459 -68100903 -68103223 -68236586 -68462629 -68747385 -69065497 -69400819 -69739764
39515 -69739764 -70061269 -70333467 -70523200 -70613310 -70616962 -70583132 -70596115 -70774699 -71270880 -72258906
39505 -72258906 -73902339 -76297689 -79414615 -83066239 -86932314 -90628038 -93787244 -96126710
39497 -96126710 -97473835 -97759075 -96989369 -95225048 -92575463 -89210504 -85370166 -81354470
39489 -81354470 -77489004 -74075779 -71346432 -69431964 -68351939 -68016084 -68234297 -68744003
39481 -68744003 -69266184 -69582138 -69598317 -69363122 -69022522 -68733480 -68576272 -68509130 -68387809 -68036594
39471 -68036594 -67329177 -66238252 -64836326 -63254231 -61617675 -59990981 -58358873 -56659542
39463 -56659542 -54848657 -52952809 -51081830 -49399224 -48071346 -47219449 -46892517 -47068068
39455 -47068068 -47673949 -48614294 -49786653 -51090796 -52438231 -53767666 -55061132 -56347468
39447 -56347468 -57681480 -59101689 -60589252 -62055736 -63367528 -64387348 -65007032 -65162776
39439 -65162776 -64838990 -64063956 -62894071 -61390493 -59603480 -57575007 -55352372 -52997091
39431 -52997091 -50584401 -48201302 -45947712 -43932854 -42257298 -40984231 -40115264 -39583314
39423 -39583314 -39263689 -38997877 -38625173 -38017169 -37106372 -35899290 -34470076 -32937673 -31431913
39414 -31431913 -30055718 -28854925 -27808100 -26838777 -25839281 -24693325 -23294855 -21567523
39406 -21567523 -19483331 -17070426 -14402436 -11573668 -8673241 -5769846 -2910390 -126948
39398 -126948 2557201 5126798 7574655 9896047 12078848 14097721 15916285 17491630
39390 17491630 18774632 19707195 20221464 20242656 19695443 18517632 16684203 14233830 11280595
39381 11280595 7999743 4593501 1254004 -1862491 -4644229 -7014987 -8911660 -10261356
39373 -10261356 -10979058 -11001409 -10347950 -9172763 -7762975 -6468969 -5596953 -5321245 -5659555
39364 -5659555 -6512134 -7728688 -9159803 -10670803 -12125867 -13367856 -14216691 -14492941 -14057416
39355 -14057416 -12850526 -10916523 -8403706 -5540272 -2594554 166945 2512194 4261280
39347 4261280 5289121 5518719 4914498 3484492 1292955 -1522931 -4741738 -8061109
39339 -8061109 -11124433 -13574886 -15127683 -15636293 -15125367 -13776582 -11873396 -9724737
39331 -9724737 -7592200 -5641976 -3932980 -2439774 -1098446 141713 1279339 2250586
39323 2250586 2952609 3290340 3223811 2793071 2108537 1310507 517228 -210979 -872009 -1490559
39313 -1490559 -2080416 -2626828 -3096365 -3462216 -3728185 -3941210 -4187412 -4567809 -5154774
39304 -5154774 -5943231 -6822254 -7589666 -8011788 -7905285 -7204571 -5983892 -4424444 -2743165
39295 -2743165 -1118165 355110 1662988 2838205 3911315 4866183 5611806 5983934 5787353
39286 5787353 4871668 3208037 924980 -1719039 -4412847 -6880404 -8941084 -10527224
39278 -10527224 -11668237 -12459110 -13023584 -13474110 -13873543 -14212570 -14417643 -14390549 -14061274
39269 -14061274 -13425026 -12541450 -11497167 -10357445 -9139647 -7823353 -6384282 -4825207
39261 -4825207 -3185098 -1525693 92935 1633216 3085996 4458528 5753133 6952156
39253 6952156 8019618 8915516 9608969 10081723 10329041 10372857 10289404 10229446 10400998 11008514
39243 11008514 12179714 13923688 16138623 18652309 21267699 23799471 26101004 28081986
39235 28081986 29715840 31040655 32157375 33217714 34386714 35779633 37401151 39126424
39227 39126424 40741446 42021718 42806020 43032078 42731297 42003596 40992672 39862820 38765757
39218 38765757 37796754 36961995 36183314 35342048 34333565 33098908 31621725 29903412 27938412
39209 27938412 25706817 23190544 20404768 17423210 14377466 11430466 8743557 6454270
39201 6454270 4663778 3425159 2734514 2536892 2750035 3291634 4092096 5087836 6204364
39192 6204364 7343960 8391443 9243964 9854059 10257858 10562387 10893161 11333344 11890454
39183 11890454 12503617 13077610 13520756 13772359 13817630 13692652 13478202 13277249 13175735
39174 13175735 13199997 13295129 13343016 13216655 12844433 12251262 11557813 10944421 10605944 10723684
39164 10723684 11460467 12962476 15348082 18683596 22967465 28143716 34140596 40904883
39156 40904883 48400728 56566723 65255987 74197291 83002409 91217938 98398847 104177069
39148 104177069 108308641 110697020 111398716 110615517 108668516 105945207 102823109 99593893
39140 99593893 96418551 93326423 90247594 87062448 83660152 79996558 76128987 72205468
39132 72205468 68413506 64924088 61866810 59341600 57442804 56265926 55883135 56296705
39124 56296705 57398576 58967795 60717365 62368597 63712135 64627841 65067423 65026117 64528751
39115 64528751 63636287 62456933 61136509 59816569 58578766 57414428 56247368 55001889
39107 55001889 53676469 52379837 51309087 50681841 50657579 51285441 52496936 54135635 56000261
39098 56000261 57880694 59581440 60940631 61854368 62305174 62379905 62262159 62200010 62464052
39089 62464052 63306732 64920658 67394925 70686555 74632633 79009267 83612544 88323824
39081 88323824 93134142 98124519 103416938 109120912 115299604 121965668 129100474 136685371
39073 136685371 144738508 153349673 162695402 173014834 184546693 197454721 211776423
39066 211776423 227411615 244142251 261663390 279608646 297561827 315054522 331558498
39059 331558498 346489804 359239773 369232967 375994673 379206073 378735094 374641396 367156587
39051 367156587 356642574 343539889 328325239 311490006 293533096 274952308 256226508
39044 256226508 237792675 220023335 203206119 187530579 173095142 159943436 148118931
39037 148118931 137706481 128830881 121609549 116088834 112203857 109781417 108573589 108296047
39029 108296047 108658392 109392276 110282133 111186323 112030029 112769481 113352286 113702950 113741934
39020 113741934 113422635 112764244 111868203 110916721 110155105 109858850 110287419 111630167 113954956
39011 113954956 117175437 121054787 125254904 129420593 133268950 136648920 139549124 142056424
39003 142056424 144290431 146347738 148277788 150088377 151762890 153275690 154605346 155748389
38995 155748389 156728505 157595342 158419077 159293568 160347708 161746943 163671522 166284140
38987 166284140 169716077 174086049 179535160 186247033 194435196 204301587 215980763 229484829
38979 229484829 244666056 261216704 278715112 296701122 314743184 332466081 349536970
38972 349536970 365630154 380391705 393416066 404245865 412408693 417492338 419232593
38965 419232593 417570932 412655072 404792862 394394190 381925585 367873760 352702368
38958 352702368 336803693 320469345 303899523 287240651 270620335 254160264 237975182
38951 237975182 222176271 206882266 192225143 178341034 165354060 153368741 142475210
38944 142475210 132754247 124266679 117028505 110991269 106044950 102038953 98800398 96136409
38936 96136409 93828481 91637612 89330537 86722452 83720686 80348526 76732307 73054065
38928 73054065 69496220 66208662 63304528 60865343 58937702 57525019 56588461 56059777
38920 56059777 55854836 55878951 56028145 56197866 56305183 56317155 56266939 56240988 56339123 56630614
38910 56630614 57132279 57815519 58628431 59514680 60417995 61268094 61952450 62293709 62061439
38901 62061439 61030339 59062911 56174918 52554126 48529141 44501227 40856057 37875638
38893 37875638 35673730 34172378 33124290 32174986 30951341 29153859 26623391 23361676
38885 23361676 19508389 15295425 10996674 6877930 3146414 -92439 -2854892 -5263389
38877 -5263389 -7498455 -9735862 -12092144 -14594394 -17177574 -19703617 -21994815 -23873977
38869 -23873977 -25200790 -25891508 -25914504 -25266656 -23946225 -21939834 -19233656 -15845581 -11861105
38860 -11861105 -7449608 -2847038 1687853 5919594 9661594 12775669 15156763 16717901
38852 16717901 17383093 17088844 15794214 13500802 10280474 6299566 1822169 -2819831
38844 -2819831 -7285725 -11291555 -14653543 -17292776 -19208682 -20446975 -21084979 -21235606
38836 -21235606 -21050582 -20703357 -20351881 -20100842 -19982986 -19962714 -19952408 -19834949 -19494286 -18851955
38826 -18851955 -17893294 -16664778 -15244406 -13710613 -12132981 -10581392 -9130564 -7846084
38818 -7846084 -6761208 -5861740 -5084532 -4324740 -3451003 -2333514 -881321 930257 3060354
38809 3060354 5427320 7933358 10471234 12921466 15163245 17107800 18735099 20103674
38801 20103674 21319150 22473869 23587575 24580401 25296455 25572558 25320100 24575576 23490478
38792 23490478 22266850 21074795 19991856 18984360 17927628 16651013 14992855 12850858
38784 12850858 10213341 7162769 3854805 484464 -2750754 -5685464 -8212243 -10289929
38776 -10289929 -11932998 -13194411 -14157289 -14937229 -15682624 -16560914 -17730144 -19303182 -21314001
38767 -21314001 -23697573 -26295974 -28894598 -31275934 -33268884 -34777497 -35785696 -36341612
38759 -36341612 -36526123 -36413064 -36035432 -35375529 -34389702 -33060750 -31452273 -29731959 -28142866
38750 -28142866 -26928951 -26248018 -26114487 -26398986 -26881058 -27325170 -27545152 -27438210 -26990803
38741 -26990803 -26268415 -25396396 -24530170 -23812035 -23322371 -23047046 -22884772 -22698486 -22383853
38732 -22383853 -21913330 -21333414 -20729970 -20196016 -19820700 -19688004 -19862461 -20356897 -21102852
38723 -21102852 -21950531 -22706776 -23194000 -23301566 -23008356 -22371003 -21485728 -20441189 -19284738
38714 -19284738 -18019063 -16627660 -15108556 -13493570 -11845982 -10243873 -8756801 -7418732
38706 -7418732 -6204473 -5025943 -3760887 -2306336 -630049 1205946 3057504 4735948
38698 4735948 6054909 6874357 7135626 6883548 6269738 5528924 4925725 4685586 4939802
38689 4939802 5711719 6944500 8542226 10393257 12370055 14325448 16105735 17578970
38681 17578970 18656862 19290522 19441294 19049829 18031244 16306907 13857566 10768200
38673 10768200 7240238 3563086 52348 -3025845 -5517096 -7402937 -8780160 -9810800
38665 -9810800 -10668010 -11495339 -12383291 -13358797 -14382227 -15350060 -16106351 -16468028 -16263872
38656 -16263872 -15378721 -13790937 -11592682 -8984051 -6235245 -3622849 -1362784 433011
38648 433011 1763466 2714660 3418168 4002507 4551081 5083920 5573182 5983082 6309688
38639 6309688 6597241 6921507 7347594 7885014 8471320 9005939 9423749 9763373 10180495
38630 10180495 10892833 12091970 13876061 16233573 19069105 22242395 25598165 28980577
38622 28980577 32237450 35224370 37817563 39933799 41541680 42647875 43260404 43352337
38614 43352337 42850696 41656330 39681329 36886693 33310435 29082170 24420181 19607635
38606 19607635 14952034 10742138 7219171 4568479 2922355 2358294 2885509 4427364
38598 4427364 6816074 9812818 13153173 16601186 19986055 23203102 26182982 28852571
38590 28852571 31112523 32842192 33927429 34298526 33962006 33009690 31596953 29899880
38582 29899880 28075877 26248378 24514058 22950280 21603145 20462488 19453672 18470579
38574 18470579 17440631 16381722 15411473 14699601 14388300 14520806 15012084 15675470 16292206
38565 16292206 16687128 16768750 16515058 15924065 14970461 13598221 11747532 9393154 6573739
38556 6573739 3404039 67145 -3214505 -6220995 -8769064 -10722579 -11986293 -12505561
38548 -12505561 -12283286 -11401219 -10025472 -8390208 -6766955 -5424484 -4578618 -4339700 -4682028
38539 -4682028 -5460626 -6475692 -7552924 -8597505 -9599993 -10603492 -11656787 -12772246
38531 -12772246 -13897508 -14909970 -15645805 -15964775 -15827857 -15345327 -14759088 -14357827 -14366458
38522 -14366458 -14869666 -15804866 -17011153 -18291020 -19453504 -20338177 -20832379 -20884480 -20508171
38513 -20508171 -19777791 -18818120 -17785212 -16832577 -16070251 -15537165 -15199828 -14970527 -14730191
38504 -14730191 -14350012 -13715397 -12754840 -11470339 -9961121 -8427203 -7137251 -6356893 -6258903
38495 -6258903 -6855659 -7987865 -9375578 -10708659 -11739639 -12344856 -12535202 -12420282 -12149539
38486 -12149539 -11860422 -11653172 -11591940 -11715945 -12042103 -12552389 -13175824 -13783565 -14209810
38477 -14209810 -14295910 -13941613 -13143299 -12004882 -10717738 -9516139 -8621121 -8188605 -8278029
38468 -8278029 -8852895 -9810546 -11020716 -12347316 -13645619 -14752925 -15496934 -15725305 -15337256
38459 -15337256 -14299973 -12652476 -10508474 -8057516 -5551166 -3268086 -1469733 -364912
38451 -364912 -92461 -721343 -2264323 -4698079 -7976930 -12029768 -16746079 -21971848 -27530317
38442 -27530317 -33259206 -39039490 -44796882 -50476878 -56008725 -61276405 -66111133 -70312751
38434 -70312751 -73694426 -76129967 -77579544 -78084722 -77745068 -76696025 -75096769 -73123253
38426 -73123253 -70959181 -68783356 -66755471 -65002502 -63608870 -62614021 -62016771 -61781109
38418 -61781109 -61842172 -62119690 -62544181 -63085469 -63762116 -64621047 -65699364 -66991951 -68440412
38409 -68440412 -69943721 -71381149 -72635044 -73603763 -74204539 -74376568 -74092587 -73371188 -72271334
38400 -72271334 -70863060 -69193958 -67280009 -65128921 -62775233 -60298390 -57812882 -55441795
38392 -55441795 -53290753 -51428605 -49871918 -48574566 -47434380 -46328026 -45166666 -43944302
38384 -43944302 -42750015 -41737625 -41071802 -40878424 -41217401 -42080368 -43403982 -45086176 -46999210
38375 -46999210 -49004775 -50979843 -52849361 -54605188 -56291961 -57962576 -59627076 -61219094
38367 -61219094 -62589372 -63524697 -63788018 -63172238 -61552541 -58919042 -55380541 -51145251
38359 -51145251 -46492885 -41747727 -37249374 -33309737 -30152847 -27855537 -26322666 -25320740
38351 -25320740 -24561027 -23792634 -22861438 -21714488 -20363171 -18839525 -17175445 -15408954
38343 -15408954 -13596207 -11804629 -10083388 -8430927 -6783731 -5034903 -3072490 -819654
38335 -819654 1737719 4543202 7483411 10420223 13232143 15846883 18245650 20433405
38327 20433405 22393009 24054557 25301032 26007123 26089803 25546062 24460009 22973912 21235093
38318 21235093 19345628 17341548 15209817 12929658 10515324 8040927 5636642 3456725
38310 3456725 1633278 238728 -725649 -1316326 -1626199 -1771039 -1883604 -2101507 -2538012
38301 -2538012 -3243098 -4178253 -5225200 -6227212 -7041128 -7575451 -7803414 -7754940 -7498008
38292 -7498008 -7119032 -6707902 -6348643 -6113898 -6061987 -6236822 -6669601 -7378423 -8362924 -9595300
38282 -9595300 -11011652 -12507100 -13938506 -15139620 -15948963 -16241753 -15953794 -15091503 -13728809
38273 -13728809 -11990780 -10023836 -7962377 -5910851 -3951417 -2165531 -648386 493059
38265 493059 1154734 1262601 818166 -46576 -1041786 -1762232 -1804542 -909877 942310 3537425
38255 3537425 6516600 9500989 12190870 14412154 16117698 17362947 18267305 18966331
38247 18966331 19566286 20118387 20619541 21027084 21269960 21254476 20877799 20055363 18747305
38238 18747305 16962406 14737554 12114844 9138473 5868648 2388252 -1215786 -4886462
38230 -4886462 -8616104 -12431190 -16353766 -20371969 -24441267 -28506899 -32520645 -36437916
38222 -36437916 -40204712 -43749713 -46984264 -49804352 -52093035 -53726804 -54587053 -54577018
38214 -54577018 -53648119 -51833499 -49268435 -46172730 -42797993 -39375893 -36099699 -33133610
38206 -33133610 -30619906 -28669222 -27346270 -26665864 -26596386 -27058439 -27914832 -28959739 -29920119
38197 -29920119 -30482447 -30350475 -29321056 -27346493 -24553611 -21214418 -17688347 -14361551
38189 -14361551 -11597687 -9703618 -8909915 -9364769 -11136011 -14211872 -18493727 -23783918
38181 -23783918 -29780635 -36090731 -42262388 -47833658 -52393454 -55649138 -57483805 -57978633
38173 -57978633 -57385512 -56057680 -54362533 -52603026 -50968265 -49524044 -48238662 -47025259
38165 -47025259 -45782021 -44424235 -42909399 -41250629 -39509322 -37767802 -36096082 -34528033
38157 -34528033 -33053590 -31627514 -30192618 -28709900 -27182917 -25666528 -24257626 -23069550
38149 -23069550 -22196489 -21685252 -21536789 -21741023 -22317177 -23323001 -24822923 -26838079 -29309307
38140 -29309307 -32091225 -34981634 -37778732 -40342043 -42623257 -44649787 -46478904 -48158545
38132 -48158545 -49714440 -51153922 -52467358 -53621766 -54555980 -55186534 -55423123 -55185711 -54417912
38123 -54417912 -53097968 -51250706 -48957804 -46356303 -43617183 -40908965 -38363576 -36059822
38115 -36059822 -34024928 -32242224 -30656067 -29178241 -27706635 -26157275 -24495062 -22745392
38107 -22745392 -20982988 -19310178 -17838422 -16676001 -15916251 -15621895 -15806751 -16421637 -17355541
38098 -17355541 -18461761 -19604291 -20698927 -21718509 -22654569 -23460184 -24011034 -24106179 -23506029
38089 -23506029 -21990800 -19418869 -15764376 -11119152 -5659640 400822 6845265 13454704
38081 13454704 19987102 26162907 31681916 36269029 39721664 41933949 42897384 42694513
38073 42694513 41493134 39530142 37074406 34379393 31651694 29050720 26708569 24745153
38065 24745153 23263839 22332148 21960371 22085886 22566536 23189863 23705914 23878272 23529978
38056 23529978 22560719 20934499 18659740 15782339 12392139 8630575 4692704 824574
38048 824574 -2687637 -5547531 -7499344 -8380285 -8146552 -6863952 -4681578 -1813119 1470157
38039 1470157 4853068 8014129 10682192 12687064 13979034 14610109 14690740 14346526 13694631
38030 13694631 12843432 11902497 10984294 10186177 9554896 9048926 8521995 7748731 6495190
38021 6495190 4609769 2092727 -889276 -4048558 -7057872 -9631358 -11575385 -12800051
38013 -12800051 -13304091 -13154865 -12474707 -11426261 -10183380 -8888279 -7615318 -6365736
38005 -6365736 -5099951 -3789451 -2459781 -1207838 -197489 354776 204971 -868301
37997 -868301 -2985267 -6086878 -9907711 -14032055 -18016078 -21517675 -24374147 -26603492
37989 -26603492 -28347918 -29799157 -31137632 -32496985 -33950645 -35513590 -37153323 -38803814
37981 -38803814 -40376999 -41771493 -42883370 -43622378 -43929549 -43786590 -43209958 -42231851 -40879855
37972 -40879855 -39169987 -37120943 -34782449 -32256707 -29691129 -27237231 -24994642 -22971675
37964 -22971675 -21084947 -19199139 -17190273 -15008331 -12713616 -10467237 -8476512 -6924439
37956 -6924439 -5923242 -5509804 -5666245 -6337876 -7439946 -8865173 -10502327 -12260800 -14088791
37947 -14088791 -15977697 -17952298 -20050978 -22304534 -24722797 -27290576 -29964452 -32663446
37939 -32663446 -35260248 -37589458 -39480668 -40802838 -41493345 -41555874 -41038232 -40017870 -38610152
37930 -38610152 -36984044 -35354922 -33941224 -32901970 -32286745 -32022202 -31942855 -31857324 -31623900
37921 -31623900 -31199162 -30635367 -30033653 -29485452 -29033028 -28659857 -28305608 -27897339 -27388080
37912 -27388080 -26788701 -26176591 -25676136 -25425655 -25553142 -26168166 -27355190 -29151626 -31516468
37903 -31516468 -34315985 -37346388 -40386472 -43254321 -45845019 -48140024 -50189613 -52076288
37895 -52076288 -53872670 -55609889 -57268442 -58794327 -60131751 -61254249 -62176414 -62943003
37887 -62943003 -63609358 -64227789 -64838726 -65455213 -66039425 -66487714 -66643314 -66340039 -65460848
37878 -65460848 -63985183 -62002052 -59681409 -57217813 -54773862 -52446547 -50264249 -48209049
37870 -48209049 -46251653 -44380094 -42602247 -40915891 -39264608 -37513664 -35471922 -32959012
37862 -32959012 -29889773 -26335572 -22531512 -18825407 -15592826 -13153518 -11713392 -11337374
37854 -11337374 -11948916 -13353456 -15284687 -17466521 -19673743 -21770321 -23711434 -25511651
37846 -25511651 -27198130 -28774436 -30212306 -31470013 -32519348 -33361045 -34022022 -34544435
37838 -34544435 -34979907 -35390086 -35841256 -36382178 -37009941 -37643607 -38126326 -38262535 -37877080
37829 -37877080 -36868988 -35233039 -33038609 -30379217 -27324619 -23908871 -20169147 -16217489
37821 -16217489 -12298784 -8785480 -6092123 -4542801 -4256710 -5108080 -6774850 -8845761
37813 -8845761 -10934781 -12760394 -14172484 -15133495 -15674239 -15848564 -15707401 -15300649 -14696605
37804 -14696605 -13994139 -13306469 -12718470 -12244740 -11820334 -11333397 -10676608 -9780861 -8612538
37795 -8612538 -7147998 -5355739 -3205511 -699634 2093565 5024915 7880662 10428696
37787 10428696 12476884 13916503 14733111 14989351 14799052 14309292 13693847 13149092 12876031
37778 12876031 13034813 13678305 14700321 15843566 16781725 17239078 17083197 16344771 15164939
37769 15164939 13708748 12092351 10353655 8466944 6379890 4047743 1451525 -1399520
37761 -1399520 -4476397 -7745886 -11187516 -14801806 -18600498 -22579668 -26689914 -30822715
37753 -30822715 -34822724 -38517350 -41742706 -44351896 -46213764 -47225282 -47349416 -46660498
37745 -46660498 -45361144 -43749253 -42148039 -40834674 -39997005 -39724657 -40023203 -40837371 -42074219
37736 -42074219 -43620829 -45353000 -47135635 -48820927 -50251304 -51269571 -51735207 -51547607
37728 -51547607 -50677558 -49199238 -47302513 -45266449 -43394692 -41934985 -41009947 -40577418
37720 -40577418 -40431362 -40250697 -39690312 -38484216 -36516656 -33833441 -30602982 -27062501
37712 -27062501 -23479029 -20128323 -17275886 -15147650 -13893655 -13556935 -14056932 -15193221
37704 -15193221 -16676820 -18191656 -19469442 -20343224 -20753777 -20716404 -20280444 -19506517 -18461800
37695 -18461800 -17219984 -15856956 -14442327 -13031437 -11663783 -10370654 -9185135 -8140038
37687 -8140038 -7246813 -6467990 -5707891 -4838442 -3755410 -2440521 -996769 366634 1397100
37678 1397100 1877563 1679799 770432 -817878 -3017021 -5731320 -8825958 -12120096 -15404364
37669 -15404364 -18478593 -21187248 -23434132 -25175726 -26405169 -27139773 -27420136 -27320499 -26958066
37660 -26958066 -26484213 -26054066 -25792247 -25775322 -26031505 -26541585 -27231885 -27967679 -28561249
37651 -28561249 -28802068 -28508665 -27592163 -26105730 -24246275 -22294500 -20518503 -19089680
37643 -19089680 -18046920 -17312462 -16739461 -16168311 -15476409 -14612618 -13609554 -12568535 -11620321
37634 -11620321 -10879000 -10413630 -10250014 -10391324 -10834753 -11572511 -12583634 -13828828 -15254983
37625 -15254983 -16811581 -18478679 -20296221 -22371320 -24843420 -27814857 -31284689 -35126101
37617 -35126101 -39118119 -43007151 -46561652 -49597922 -51978700 -53600966 -54389897 -54307319
37609 -54307319 -53372000 -51681089 -49419545 -46847000 -44256914 -41910893 -39962845 -38399758
37601 -38399758 -37028465 -35522660 -33516773 -30710215 -26943070 -22223296 -16710700 -10676390
37593 -10676390 -4452166 1626152 7278081 12325529 16705182 20437295 23571146 26145581
37585 26145581 28189573 29752103 30925137 31830179 32569648 33171953 33564848 33596076 33095149
37576 33095149 31947597 30145091 27788884 25052892 22134490 19218023 16455727 13957239
37568 13957239 11783999 9955175 8468291 7321944 6519820 6048134 5842423 5771918 5659321
37559 5659321 5329983 4665647 3635365 2288959 718371 -991533 -2797947 -4707715
37551 -4707715 -6761430 -9007357 -11477002 -14168507 -17040533 -20016181 -22992193 -25847823
37543 -25847823 -28453654 -30686312 -32451073 -33702617 -34448130 -34725118 -34563750 -33956257 -32853528
37534 -32853528 -31191955 -28933375 -26092536 -22736337 -18959284 -14855716 -10510602 -6015935
37526 -6015935 -1497773 2872410 6896854 10389744 13208061 15258192 16482138 16837867
37518 16837867 16286663 14796573 12366211 9061445 5044364 573602 -4030345 -8443725
37510 -8443725 -12399191 -15719505 -18308280 -20108503 -21065674 -21127169 -20274328 -18556581 -16104564
37501 -16104564 -13123723 -9878654 -6668766 -3790447 -1490275 74639 852898 886504
37493 886504 278773 -841087 -2343753 -4113622 -6055504 -8097554 -10190972 -12307543
37485 -12307543 -14435083 -16566792 -18682910 -20734914 -22647670 -24341023 -25754688 -26862171
37477 -26862171 -27676201 -28254112 -28700821 -29159843 -29791758 -30749582 -32156049 -34077820 -36494567
37468 -36494567 -39275147 -42179732 -44895655 -47096581 -48506112 -48950602 -48391166 -46924318
37460 -46924318 -44742285 -42060136 -39040997 -35758588 -32214337 -28391693 -24313246 -20075760
37452 -20075760 -15857540 -11903971 -8497315 -5912781 -4362017 -3933125 -4549426 -5972616
37444 -5972616 -7857541 -9836458 -11595935 -12921418 -13708876 -13958161 -13760277 -13277711 -12708455
37435 -12708455 -12231977 -11955439 -11889790 -11970280 -12105413 -12221527 -12280609 -12270453 -12179021 -11967352
37425 -11967352 -11555899 -10837382 -9717972 -8168647 -6254122 -4113799 -1900116 286283
37417 286283 2419158 4514048 6569905 8528190 10271782 11659077 12577041 12993760 12987298
37408 12987298 12732505 12449556 12341229 12548038 13133308 14095172 15397148 17004431 18906313
37399 18906313 21108694 23600677 26320092 29143165 31902487 34417047 36518564 38073671
37391 38073671 39007515 39320973 39083097 38396037 37358309 36054668 34568098 32982654 31361567
37382 31361567 29722830 28043847 26296360 24482380 22645131 20854158 19180141 17674103
37374 17674103 16359221 15237046 14300923 13543011 12948253 12485738 12116104 11821103 11639491
37365 11639491 11682662 12112588 13085609 14685286 16875788 19498724 22314017 25063304 27527761
37356 27527761 29562558 31104345 32156329 32760026 32967200 32823652 32364896 31614454 30581831
37347 30581831 29269237 27691606 25893406 23937987 21868497 19670872 17272446 14580775
37339 14580775 11537505 8157315 4537004 835541 -2765319 -6104909 -9075214 -11630741
37331 -11630741 -13783069 -15596759 -17195175 -18764082 -20531065 -22714092 -25459244 -28798106
37323 -28798106 -32641244 -36802857 -41041407 -45101622 -48746821 -51776546 -54034089 -55413335
37315 -55413335 -55867564 -55413231 -54124049 -52121898 -49573559 -46689280 -43706436 -40847791
37307 -40847791 -38266947 -36012640 -34038544 -32256060 -30595990 -29038521 -27597320 -26280493
37299 -26280493 -25066314 -23913914 -22797045 -21730847 -20769956 -19981292 -19414044 -19086978 -18994150
37290 -18994150 -19114911 -19416536 -19851126 -20356244 -20865506 -21327219 -21722739 -22074009 -22434449
37281 -22434449 -22867619 -23425276 -24132894 -24982589 -25931006 -26901904 -27792025 -28477494 -28825482
37272 -28825482 -28724043 -28131725 -27119773 -25867714 -24601647 -23510845 -22695171 -22167161 -21888224
37263 -21888224 -21799030 -21821420 -21842645 -21711603 -21265855 -20379640 -19004667 -17183876 -15041169
37254 -15041169 -12761644 -10568014 -8686523 -7299261 -6497540 -6261899 -6482694 -7008787 -7695593
37245 -7695593 -8432521 -9152956 -9841463 -10541934 -11352627 -12393311 -13750420 -15428955 -17341133
37236 -17341133 -19336676 -21248452 -22919261 -24200677 -24949071 -25050499 -24475731 -23329879
37228 -23329879 -21855646 -20379503 -19226501 -18642518 -18749831 -19540807 -20901522 -22654198
37220 -22654198 -24606435 -26591652 -28485749 -30197583 -31649126 -32766495 -33488715 -33783566
37212 -33783566 -33658480 -33165448 -32403011 -31510857 -30648329 -29957778 -29527149 -29367956 -29414889
37203 -29414889 -29544217 -29606396 -29468771 -29059978 -28400453 -27602137 -26831519 -26248527 -25946394
37194 -25946394 -25915562 -26042807 -26145104 -26028544 -25552959 -24676174 -23457193 -22015930 -20466948
37185 -20466948 -18855400 -17123457 -15124885 -12683738 -9669163 -6050674 -1914729 2553056
37177 2553056 7105996 11484362 15464117 18892090 21695111 23864803 25433142 26453107
37169 26453107 26987507 27101219 26852946 26288389 25441304 24347163 23063247 21676032 20279212
37160 20279212 18930312 17619684 16282326 14848623 13299477 11693710 10161333 8872941
37152 8872941 7993539 7628014 7776943 8327616 9086774 9832465 10354639 10474368 10053083
37143 10053083 9003468 7300818 4988087 2172559 -984218 -4283072 -7510950 -10470032
37135 -10470032 -13008393 -15046516 -16589718 -17715310 -18534242 -19145501 -19609900 -19956984 -20214532
37126 -20214532 -20433757 -20686147 -21028467 -21457695 -21888505 -22170745 -22136062 -21648268 -20640900
37117 -20640900 -19138706 -17259147 -15185534 -13114327 -11199396 -9519999 -8080257 -6828109
37109 -6828109 -5679256 -4538683 -3315070 -1925220 -294295 1636016 3888995 6439194
37101 6439194 9220623 12154645 15177083 18245979 21327726 24372891 27297553 29984258
37093 29984258 32307654 34172731 35540011 36417987 36827412 36764006 36187221 35044009 33313436
37084 33313436 31045223 28369361 25472002 22552812 19786446 17302033 15180321 13461382
37076 13461382 12158620 11278594 10843143 10901686 11517759 12725768 14479410 16630557 18962839
37067 18962839 21261886 23371562 25196408 26657804 27651430 28050523 27758394 26772402 25214001
37058 25214001 23307619 21325874 19530004 18120884 17202175 16759529 16666264 16717965 16681499
37049 16681499 16340173 15529730 14168863 12279930 9986511 7483378 4994770 2743625
37041 2743625 938667 -234778 -638689 -223094 935059 2620578 4510166 6238173
37033 6238173 7478273 8017189 7799292 6930673 5648416 4274951 3174557 2712812 3211423
37024 3211423 4900505 7882046 12114467 17415560 23478380 29901678 36236814 42042351
37016 42042351 46929983 50591268 52805887 53438166 52430096 49800729 45660209 40235375
37008 40235375 33887153 27092637 20378617 14223435 8969324 4784765 1684236 -423153
37000 -423153 -1693227 -2328113 -2564025 -2644213 -2775488 -3089154 -3630260 -4381690 -5308613 -6400205
36990 -6400205 -7690207 -9247112 -11135416 -13363783 -15848501 -18415923 -20842687 -22908880
36982 -22908880 -24439622 -25329235 -25554300 -25177077 -24332836 -23196809 -21935879 -20658814 -19384688
36973 -19384688 -18047392 -16537853 -14761196 -12677430 -10312712 -7753643 -5140256 -2654875
36965 -2654875 -491913 1193585 2336813 2982667 3259998 3325364 3308167 3282477 3269690 3260204
36955 3260204 3241701 3227739 3280889 3520745 4109299 5216599 6979202 9465678 12659527
36946 12659527 16464581 20730583 25287682 29973662 34642123 39151466 43346226 47048085
36938 47048085 50070685 52259438 53540020 53949217 53628390 52779217 51599302 50221969
36930 50221969 48681065 46912383 44789525 42177105 38978997 35170583 30819958 26103209
36922 26103209 21301895 16762209 12815088 9689441 7461097 6055655 5289673 4922232
36914 4922232 4700313 4395687 3834531 2917881 1630506 38004 -1727969 -3498110 -5106726
36905 -5106726 -6435772 -7442048 -8150373 -8614008 -8867835 -8909283 -8724314 -8340296 -7862520
36896 -7862520 -7460782 -7312167 -7541955 -8203075 -9298336 -10814672 -12736262 -15029288 -17616750
36887 -17616750 -20367607 -23113273 -25687852 -27974983 -29939777 -31631927 -33161416 -34660720
36879 -34660720 -36250578 -38020865 -40027095 -42292134 -44801447 -47493057 -50257509 -52959808
36871 -52959808 -55475136 -57716910 -59645633 -61266381 -62626200 -63806572 -64893950 -65925348
36863 -65925348 -66838662 -67474545 -67650168 -67268938 -66394974 -65243962 -64101988 -63224001 -62756754
36854 -62756754 -62704023 -62937311 -63248932 -63427071 -63313746 -62815489 -61873928 -60433490 -58437327
36845 -58437327 -55850704 -52686143 -49005938 -44899558 -40456205 -35757452 -30897232 -26011893
36837 -26011893 -21293040 -16967785 -13253093 -10307570 -8206276 -6949748 -6494129 -6773754
36829 -6773754 -7697315 -9127373 -10872482 -12712814 -14453391 -15977539 -17270578 -18398362
36821 -18398362 -19448914 -20466447 -21412141 -22169839 -22588469 -22535077 -21932999 -20774894 -19117507
36812 -19117507 -17072361 -14799322 -12496493 -10374955 -8616798 -7329895 -6519077 -6087608
36804 -6087608 -5871252 -5694549 -5428788 -5029729 -4544284 -4090805 -3824064 -3892604 -4394807 -5345715
36794 -5345715 -6668101 -8209171 -9769091 -11126821 -12062507 -12384314 -11959325 -10733602 -8725406
36785 -8725406 -5991946 -2590301 1439938 6058020 11178882 16636797 22184047 27529037
36777 27529037 32394676 36573270 39964343 42589297 44576758 46116179 47391504 48519798
36769 48519798 49517430 50299969 50706241 50532925 49572599 47656047 44700354 40754953 36025952
36760 36025952 30857665 25666010 20843800 16675920 13299254 10717526 8850973 7586925
36752 7586925 6808341 6398801 6234426 6173605 6054899 5712689 5009155 3864126 2263252
36743 2263252 246253 -2103770 -4656450 -7225262 -9573126 -11441880 -12601579 -12907646
36735 -12907646 -12345934 -11040384 -9210337 -7095416 -4889403 -2716977 -654793 1230253
36727 1230253 2857079 4134037 4980212 5344778 5213632 4607906 3584193 2238238 703668
36718 703668 -863693 -2315945 -3544646 -4495087 -5155839 -5538557 -5672966 -5622721 -5497381
36709 -5497381 -5431031 -5528949 -5818444 -6242875 -6707288 -7146839 -7572214 -8061413 -8705697 -9550039
36699 -9550039 -10565810 -11659605 -12695152 -13511283 -13939859 -13831496 -13083499 -11658507 -9591044
36690 -9591044 -6984805 -3998813 -821098 2358152 5356028 7989707 10078889 11481196
36682 11481196 12148845 12164154 11720119 11053324 10369651 9800927 9402344 9176276 9103064 9164957
36672 9164957 9353811 9658513 10040277 10416521 10671912 10695434 10421650 9851290 9042137 8080302
36662 8080302 7049219 6008413 4986744 3991699 3033047 2150644 1429171 988661 955718
36653 955718 1428340 2439400 3916931 5651738 7302911 8467346 8800828 8136938 6545290
36644 6545290 4306358 1824123 -481757 -2269742 -3338873 -3654668 -3337015 -2610866 -1727849
36635 -1727849 -880746 -144526 527298 1249622 2129154 3210797 4473295 5863753 7337668
36626 7337668 8874510 10459412 12043992 13514301 14694027 15391594 15469506 14895498 13744880
36617 13744880 12154880 10261561 8157831 5893319 3506613 1059808 -1349747 -3602487
36609 -3602487 -5579400 -7182735 -8354349 -9092681 -9461784 -9584911 -9624257 -9754103 -10129106
36600 -10129106 -10844128 -11889776 -13122882 -14274947 -15005739 -14985235 -13973741 -11873684 -8739252
36591 -8739252 -4742359 -106004 4968614 10346534 15954856 21743185 27644983 33565588
36583 33565588 39392195 45005337 50283174 55107231 59378106 63035514 66068241 68504988
36575 68504988 70388967 71747872 72573175 72818137 72414324 71297210 69429627 66817615
36567 66817615 63518871 59642894 55337254 50756674 46025015 41213411 36353323 31478812
36559 31478812 26668302 22055597 17803060 14054618 10893944 8325024 6280422 4653423
36551 4653423 3342563 2291020 1503938 1037438 969454 1372775 2305546 3817967 5961032
36542 5961032 8784661 12323407 16576200 21488477 26944045 32769906 38748614 44626984
36534 44626984 50117897 54907404 58681812 61172519 62199847 61699899 59732440 56473171
36526 56473171 52188871 47194585 41802867 36282744 30840030 25617634 20706244 16155520
36518 16155520 11981197 8171527 4701439 1557265 -1238583 -3620260 -5495594 -6777124
36510 -6777124 -7409388 -7382727 -6735167 -5546585 -3925775 -1990941 149613 2405859 4700055
36501 4700055 6957229 9108172 11107679 12951190 14670167 16306891 17891399 19440820
36493 19440820 20975475 22525503 24110153 25700744 27198130 28447846 29290430 29623324
36485 29623324 29446479 28872885 28100137 27354705 26832868 26663967 26908989 27585645 28693785
36476 28693785 30215995 32090111 34178762 36270173 38121897 39523678 40343214 40540376
36468 40540376 40163700 39344451 38282957 37212468 36342919 35808505 35642339 35782019 36095386
36459 36095386 36416711 36588764 36504473 36136733 35546709 34870196 34289240 33995719 34149811
36450 34149811 34838583 36048886 37671205 39536695 41466668 43304353 44913495 46154303
36442 46154303 46862909 46856550 45968779 44098525 41246125 37517845 33103517 28248687 23236379
36433 23236379 18373183 13965195 10280692 7512033 5751483 4987548 5123234 6015996
36425 6015996 7530631 9581356 12135344 15170305 18610985 22285052 25924484 29210439
36417 29210439 31842783 33615054 34477273 34564314 34167943 33649647 33323184 33358521 33754126
36408 33754126 34390202 35127710 35888007 36663266 37462693 38249104 38921230 39353984 39465893
36399 39465893 39271922 38894768 38527909 38362168 38504023 38920429 39434048 39770556 39639465
36390 39639465 38817843 37204838 34828268 31809994 28316904 24522846 20589040 16656510
36382 16656510 12843006 9241253 5917341 2909636 231720 -2117603 -4141746 -5843229
36374 -5843229 -7237475 -8373581 -9337413 -10218870 -11053503 -11775557 -12219730 -12180750 -11505679
36365 -11505679 -10175116 -8331845 -6237832 -4177657 -2359691 -867133 326311 1304241
36357 1304241 2159052 2967974 3791710 4683619 5695734 6871215 8225010 9729170 11319903
36348 11319903 12925868 14498752 16025349 17515996 18985103 20448413 21944852 23556432
36340 23556432 25385238 27481470 29773765 32067897 34127519 35781823 36986056 37801133
36332 37801133 38315058 38560724 38480159 37951952 36856936 35137236 32820682 30015004 26890217
36323 26890217 23657869 20545868 17771425 15520564 13938235 13123208 13118227 13891355 15314759
36314 15314759 17155983 19095755 20773312 21846988 22056641 21279482 19566827 17140802
36306 17140802 14338985 11524966 9005688 6987725 5575309 4791656 4603493 4937144
36298 4937144 5684384 6705888 7844262 8950859 9915365 10680478 11234052 11588591 11766178
36289 11766178 11798942 11738968 11662573 11659767 11813164 12176930 12761897 13528044 14387546 15223833
36279 15223833 15924855 16416477 16678412 16735610 16634312 16422434 16151263 15898296 15789530
36270 15789530 15994083 16685264 17991645 19966961 22584339 25738735 29247782 32861400
36262 32861400 36293167 39267605 41563890 43044458 43671221 43512652 42736766 41586089
36254 41586089 40341555 39286110 38669973 38672773 39365858 40691723 42478343 44489893 46494665
36245 46494665 48320310 49872199 51111092 52011530 52534570 52634870 52292135 51537727 50456397
36236 50456397 49168835 47815058 46548844 45533444 44922015 44819401 45241770 46099253 47217883
36227 47217883 48397703 49484986 50427841 51291295 52228043 53422285 55032058 57148061
36219 57148061 59775090 62835815 66193124 69681297 73132441 76391597 79326860 81843745
36211 81843745 83900990 85513709 86735324 87626566 88228888 88552822 88579738 88270791 87579249
36202 87579249 86464153 84902186 82895366 80477374 77725193 74778030 71853434 69242099
36194 69242099 67268417 66221272 66276963 67442940 69545011 72264514 75210541 77996591
36186 77996591 80294488 81861177 82554575 82350950 81353176 79766746 77836543 75767754
36178 75767754 73669035 71543803 69328897 66957612 64417267 61781324 59212979 56945524
36170 56945524 55239098 54310121 54246785 54949963 56140009 57434359 58460107 58956032 58837129
36161 58837129 58211024 57338513 56539014 56068784 56024949 56322186 56749420 57070852 57118846 56841413
36151 56841413 56296870 55610941 54917950 54304424 53770756 53225182 52516702 51497210 50086131
36142 50086131 48305627 46267039 44116539 41975093 39913566 37977703 36238234 34822410
36134 34822410 33900354 33633910 34118123 35345376 37206525 39522319 42082154 44667940
36126 44667940 47061107 49051699 50466882 51211983 51295986 50817003 49908650 48674705 47147445
36117 47147445 45289349 43029587 40307954 37103906 33448398 29428249 25186807 20913798
36109 20913798 16818249 13089649 9860259 7180077 5012658 3259339 1812707 620149
36101 620149 -281569 -792647 -828891 -401624 355257 1224930 1982768 2462784 2589078 2369470
36091 2369470 1862634 1136704 237569 -824004 -2070465 -3549840 -5325797 -7462106 -9998312
36082 -9998312 -12919485 -16131340 -19458265 -22676173 -25570924 -27992472 -29878366 -31246573
36074 -31246573 -32178130 -32804429 -33294374 -33828644 -34559136 -35569098 -36858315 -38368100 -40032703
36065 -40032703 -41816278 -43698043 -45610577 -47381220 -48729702 -49332448 -48917688 -47343596
36057 -47343596 -44633153 -40966282 -36642229 -32024442 -27477399 -23305905 -19709010 -16757833
36049 -16757833 -14399768 -12486606 -10821584 -9214725 -7527367 -5687459 -3674289 -1491360
36041 -1491360 850952 3336280 5933931 8590380 11226576 13746299 16055285 18077567
36033 18077567 19750233 20996471 21704863 21746463 21029488 19555613 17438631 14875813 12092553
36024 12092553 9288334 6602824 4110912 1846659 -157396 -1840778 -3115786 -3896695
36016 -3896695 -4136595 -3851852 -3129030 -2118798 -1018410 -39748 634380 891092 707420
36007 707420 143365 -681830 -1615644 -2495589 -3174235 -3546368 -3567575 -3250698 -2638313 -1765483
35997 -1765483 -634557 782034 2510512 4532635 6755776 9014553 11104756 12833912
35989 12833912 14066172 14743764 14880144 14534974 13786796 12710398 11354974 9723905 7772520
35980 7772520 5440309 2707945 -357480 -3602264 -6832662 -9880614 -12654550 -15153349
35972 -15153349 -17439342 -19583304 -21607153 -23452807 -24994934 -26094598 -26668666 -26738783
35964 -26738783 -26433528 -25944749 -25463920 -25128905 -24997956 -25051708 -25214678 -25384512 -25459932 -25366705
35954 -25366705 -25084972 -24671193 -24254628 -23995278 -24020164 -24376724 -25028226 -25878734 -26794915
35945 -26794915 -27609052 -28119970 -28117848 -27434456 -25989731 -23802893 -20964560 -17595609 -13821206
35936 -13821206 -9768065 -5573214 -1388110 2630938 6343850 9646796 12476507 14795833
35928 14795833 16573777 17776049 18368889 18327554 17644545 16341116 14483407 12194734 9652695
35919 9652695 7066863 4640457 2523668 772216 -669331 -1945029 -3230548 -4665204
35911 -4665204 -6299779 -8076822 -9849294 -11434434 -12685466 -13547703 -14066949 -14346759 -14486408
35902 -14486408 -14540370 -14516783 -14403910 -14204594 -13964316 -13782300 -13797578 -14153084 -14955218 -16246303
35892 -16246303 -17992194 -20078006 -22312825 -24453821 -26253199 -27513067 -28124295 -28074240
35884 -28074240 -27425108 -26277835 -24739850 -22908047 -20865150 -18679643 -16404585 -14081456
35876 -14081456 -11755849 -9498025 -7409148 -5599932 -4150072 -3073604 -2312472 -1762678
35868 -1762678 -1321145 -935529 -639576 -558749 -878247 -1781202 -3381018 -5676407 -8547475
35859 -8547475 -11792781 -15188697 -18541266 -21706379 -24576550 -27055458 -29045065 -30455326
35851 -30455326 -31230667 -31380427 -30997622 -30250781 -29345065 -28468290 -27746414 -27222516 -26858635
35842 -26858635 -26556477 -26194096 -25668707 -24928162 -23980386 -22885356 -21739319 -20654332 -19734532
35833 -19734532 -19057918 -18672183 -18598450 -18826783 -19299980 -19904167 -20487229 -20902853 -21053656
35824 -21053656 -20906301 -20472141 -19768394 -18783225 -17464513 -15740202 -13559833 -10930857 -7925857
35815 -7925857 -4661269 -1271905 2096832 5281202 8094504 10339012 11834646 12457702
35807 12457702 12177547 11071260 9299819 7053804 4501069 1765183 -1063234 -3898714
35799 -3898714 -6630137 -9093824 -11062372 -12266308 -12454078 -11471404 -9324650 -6197662
35791 -6197662 -2413041 1647493 5635135 9308878 12570906 15452628 18059680 20502740
35783 20502740 22845263 25083224 27151100 28941939 30334328 31219415 31516739 31174468
35775 31174468 30167560 28513875 26310396 23766589 21205036 19015587 17574372 17157937
35767 17157937 17884746 19699671 22394996 25653412 29105169 32393885 35235597 37451284
35759 37451284 38967725 39799498 40024591 39755241 39105897 38170563 37020980 35720825 34338989
35750 34338989 32949900 31620871 30394339 29277136 28249116 27291392 26413544 25652439
35742 25652439 25036843 24543747 24082938 23527250 22775115 21810784 20725654 19683849 18849127
35733 18849127 18316094 18083617 18075434 18182894 18301708 18351372 18279936 18059973 17682196 17153823
35723 17153823 16502746 15777968 15035523 14312758 13606344 12866532 12008312 10934562 9565861
35714 9565861 7866327 5850499 3567690 1082688 -1522607 -4125151 -6540810 -8537568
35706 -8537568 -9888219 -10443679 -10195559 -9297225 -8027142 -6706560 -5610370 -4911873 -4676153
35697 -4676153 -4886957 -5482456 -6385266 -7523526 -8842265 -10302728 -11870555 -13501035 -15132688
35688 -15132688 -16693777 -18115770 -19344376 -20344404 -21099324 -21603431 -21842870 -21772035 -21305412
35679 -21305412 -20341143 -18807881 -16705620 -14117228 -11193364 -8129994 -5150002 -2483867
35671 -2483867 -342245 1113419 1787937 1652902 742088 -847596 -2956182 -5378653 -7905615
35662 -7905615 -10369937 -12676919 -14809740 -16817935 -18798776 -20873084 -23151219 -25689832
35654 -25689832 -28452565 -31297325 -34005355 -36342131 -38116298 -39204771 -39539492 -39077752
35646 -39077752 -37781561 -35617943 -32579101 -28714487 -24159528 -19140213 -13940559 -8842335
35638 -8842335 -4066571 254262 4065551 7357846 10138599 12424874 14253092 15687028
35630 15687028 16808524 17693171 18388997 18914438 19275590 19488885 19595719 19664102 19777452
35621 19777452 20012113 20412109 20978676 21687143 22519948 23485658 24605063 25878285 27265405
35612 27265405 28697419 30103746 31428667 32621173 33605412 34255099 34396340 33848715 32491113
35603 32491113 30321820 27483488 24239483 20906856 17766658 14984662 12578313 10447833
35595 10447833 8453437 6490992 4522009 2552061 593511 -1343535 -3221930 -4942307
35587 -4942307 -6342320 -7236792 -7467886 -6932735 -5584919 -3428637 -519492 3031366 7060447
35578 7060447 11369126 15754353 20042620 24105835 27840372 31117919 33749522 35504186
35570 35504186 36181187 35689072 34079687 31524583 28261837 24547202 20620663 16681239
35562 16681239 12866609 9245519 5829223 2595208 -489564 -3451722 -6300294 -9024564
35554 -9024564 -11607243 -14048194 -16377650 -18639219 -20846374 -22939990 -24777475 -26167379
35546 -26167379 -26941087 -27033515 -26532112 -25659335 -24686349 -23819622 -23122640 -22512009 -21818545
35537 -21818545 -20868298 -19539117 -17776298 -15580142 -12989640 -10077680 -6955175 -3768820
35529 -3768820 -678708 2183259 4755823 7065656 9203045 11263013 13282951 15214942
35521 15214942 16952714 18398874 19531052 20425811 21227472 22085557 23103014 24323805
35513 24323805 25753212 27376151 29143607 30933146 32524255 33629280 33982907 33449096
35505 33449096 32089213 30155980 28015168 26028187 24443358 23338651 22633563 22152349
35497 22152349 21697842 21102389 20250598 19088516 17629290 15949871 14169596 12412469
35489 12412469 10765431 9245715 7787337 6254431 4482552 2335664 -243464 -3208647
35481 -3208647 -6418798 -9676186 -12782434 -15591928 -18042545 -20159379 -22044654 -23864411
35473 -23864411 -25824637 -28126310 -30911442 -34230740 -38047992 -42262413 -46719229 -51202087
35465 -51202087 -55428334 -59071146 -61814549 -63427498 -63831239 -63132134 -61602697 -59614198
35457 -59614198 -57542947 -55679884 -54171363 -53011144 -52086275 -51254830 -50417559 -49552138 -48702213
35448 -48702213 -47936204 -47302999 -46811579 -46447212 -46212706 -46166538 -46435523 -47198060 -48644028
35439 -48644028 -50917662 -54057128 -57959325 -62395345 -67068419 -71671419 -75905533 -79464540
35431 -79464540 -82025533 -83280480 -83004119 -81121738 -77740344 -73130487 -67670744 -61778677
35423 -61778677 -55850246 -50219128 -45134248 -40746114 -37095796 -34111206 -31622521 -29404292
35415 -29404292 -27237957 -24973553 -22563203 -20050482 -17526924 -15089821 -12829384 -10840848
35407 -10840848 -9232115 -8106739 -7530945 -7507657 -7970544 -8796804 -9832847 -10925749 -11950409
35398 -11950409 -12825247 -13519000 -14053131 -14494181 -14926681 -15413849 -15971613 -16574634 -17185307
35389 -17185307 -17779498 -18352906 -18914024 -19479728 -20080749 -20767630 -21600289 -22616698 -23800662
35380 -23800662 -25079729 -26364866 -27608944 -28844949 -30179403 -31743169 -33620278 -35784386
35372 -35784386 -38074828 -40232365 -41983988 -43134690 -43618742 -43489548 -42864249 -41860223
35364 -41860223 -40555783 -38985280 -37156912 -35073973 -32748174 -30206098 -27495844 -24698557
35356 -24698557 -21943022 -19414018 -17340888 -15958733 -15452111 -15906760 -17292361 -19479865
35348 -19479865 -22278698 -25475861 -28865642 -32263877 -35504263 -38422164 -40841805 -42584193
35340 -42584193 -43500237 -43515369 -42662067 -41079747 -38973746 -36541936 -33895624 -31012435 -27751029
35331 -27751029 -23927542 -19417883 -14234649 -8544916 -2630997 3177667 8571226 13307166
35323 13307166 17232397 20278939 22441093 23752663 24282147 24145279 23513184 22593714 21584931
35314 21584931 20621142 19734692 18845884 17785171 16348852 14380179 11848332 8884573
35306 8884573 5747812 2729634 45738 -2231223 -4169353 -5919152 -7639300 -9444140
35298 -9444140 -11386971 -13469996 -15663595 -17923550 -20203200 -22459700 -24651217 -26723106
35290 -26723106 -28589738 -30127694 -31194016 -31666870 -31486755 -30671333 -29292953 -27433788
35282 -27433788 -25149872 -22470578 -19438366 -16168283 -12890792 -9943912 -7703805 -6477892
35274 -6477892 -6409636 -7440017 -9339977 -11793538 -14493022 -17208630 -19808803 -22231862
35266 -22231862 -24435665 -26361629 -27931794 -29068319 -29712761 -29833970 -29428694 -28521825 -27168732
35257 -27168732 -25459536 -23521865 -21512296 -19587535 -17862087 -16376857 -15101547 -13971517
35249 -13971517 -12936813 -11995352 -11194679 -10606484 -10293046 -10286330 -10588851 -11190042 -12083315
35240 -12083315 -13269810 -14742670 -16458283 -18313122 -20146254 -21774476 -23049303 -23915088
35232 -23915088 -24445537 -24838838 -25364978 -26284622 -27778364 -29915064 -32655344 -35866190 -39333700
35223 -39333700 -42783702 -45924545 -48509818 -50400089 -51596892 -52231366 -52510246 -52643515
35215 -52643515 -52785250 -53004988 -53285381 -53534188 -53606331 -53337320 -52582137 -51244860 -49289519
35206 -49289519 -46739345 -43680230 -40272443 -36752674 -33400851 -30466352 -28083058 -26222192
35198 -26222192 -24716841 -23351158 -21969095 -20546898 -19194719 -18090609 -17383490 -17114821
35190 -17114821 -17196912 -17454926 -17704784 -17820758 -17757875 -17526902 -17147767 -16611170 -15863845 -14818990
35180 -14818990 -13386765 -11513692 -9213696 -6576564 -3753096 -926640 1720771 4043291
35172 4043291 5958335 7452290 8560195 9331898 9803282 9981228 9842369 9348882 8486050
35163 8486050 7310740 5980160 4734650 3840090 3522202 3919334 5056022 6831768 9033801
35154 9033801 11388515 13643375 15641441 17349986 18834644 20200223 21526709 22820584
35146 22820584 23992444 24864841 25207102 24787918 23432613 21067673 17734600 13567640
35138 13567640 8752488 3494489 -1989048 -7463885 -12684957 -17425753 -21520504 -24894306
35130 -24894306 -27562164 -29601096 -31120845 -32255470 -33170053 -34053675 -35078768 -36339740
35122 -36339740 -37806753 -39324068 -40656744 -41565625 -41879787 -41539049 -40593331 -39163721 -37385553
35113 -37385553 -35362344 -33157039 -30827293 -28480429 -26305275 -24553144 -23477341 -23265258
35105 -23265258 -23992668 -25611365 -27968693 -30849907 -34025358 -37281296 -40426600 -43288858
35097 -43288858 -45719683 -47614196 -48930767 -49693650 -49971971 -49839863 -49328110 -48383545 -46860800
35088 -46860800 -44568136 -41361597 -37242537 -32399834 -27171129 -21952020 -17109235 -12934144
35080 -12934144 -9634259 -7340065 -6110310 -5932228 -6718697 -8302999 -10432505 -12770139
35072 -12770139 -14921561 -16501822 -17228485 -16995918 -15883362 -14090132 -11840464 -9311852
35064 -9311852 -6610250 -3782298 -846821 2166205 5182746 8076714 10696212 12910428
35056 12910428 14648882 15911032 16742837 17194125 17281468 16982124 16269275 15169716 13803429
35047 13803429 12371548 11093271 10126309 9514653 9189323 9018375 8877856 8705238 8506700
35038 8506700 8318811 8157561 7996348 7788160 7507662 7173381 6831172 6513293 6202630
35029 6202630 5823711 5266511 4435313 3302228 1937528 497158 -829199 -1885295 -2602401
35020 -2602401 -3021141 -3274650 -3540595 -3983486 -4712555 -5767151 -7121995 -8698366 -10377076
35011 -10377076 -12018606 -13491811 -14700730 -15593545 -16146575 -16335271 -16118374 -15453865 -14336505
35002 -14336505 -12823860 -11027972 -9083725 -7122865 -5266180 -3620864 -2266900 -1231269
34994 -1231269 -458290 214678 1060972 2425793 4637112 7894208 12186061 17279245 22777991
34985 22777991 28227976 33223558 37481976 40864699 43351624 44993796 45870126 46059399
34977 46059399 45628725 44638531 43160221 41291996 39154908 36865598 34503144 32094304
34969 32094304 29628348 27091678 24499300 21901830 19361960 16914935 14540994 12173814
34961 12173814 9747923 7261877 4819176 2617248 884497 -202643 -580625 -313471
34953 -313471 435897 1460862 2575984 3674325 4756967 5921769 7319496 9101377
34945 9101377 11377413 14189617 17499680 21195518 25117760 29092912 32954517 36548520
34937 36548520 39737182 42414530 44528315 46090784 47165429 47831366 48139221 48077457 47564987
34928 47564987 46475332 44684499 42125885 38832096 34944528 30681190 26274850 21914788
34920 21914788 17724496 13779796 10140914 6865014 3985953 1477240 -767793 -2909281
34912 -2909281 -5087799 -7343658 -9582076 -11609563 -13216610 -14255595 -14680549 -14551274
34904 -14551274 -14021728 -13324182 -12744703 -12578746 -13062155 -14291188 -16165587 -18390852 -20548376
34895 -20548376 -22203369 -23004769 -22748440 -21400499 -19087712 -16059855 -12630786 -9112567
34887 -9112567 -5760435 -2742338 -138932 2031178 3779377 5130429 6128111 6846299
34879 6846299 7382349 7828242 8237946 8613608 8918719 9109809 9170787 9134489 9080590 9107706
34869 9107706 9290413 9643703 10117907 10630328 11114388 11554140 11983982 12458129 13010093
34860 13010093 13623162 14228784 14741739 15119423 15405540 15718275 16183910 16863658 17724874
34851 17724874 18665762 19561888 20299504 20784073 20932469 20664292 19908062 18630906 16880677
34842 16880677 14809235 12648140 10638563 8950829 7636727 6635212 5819637 5054758
34834 5054758 4234119 3288691 2181286 909443 -475775 -1852874 -3041678 -3852864 -4156946
34825 -4156946 -3942240 -3339272 -2603601 -2060844 -2029278 -2746380 -4325422 -6752261 -9913151
34816 -9913151 -13636312 -17731367 -22013134 -26301764 -30406735 -34118834 -37231213 -39585466
34808 -39585466 -41115464 -41863263 -41961860 -41596366 -40957835 -40200972 -39416624 -38629143 -37820875
34799 -37820875 -36973267 -36105534 -35293633 -34661884 -34350182 -34467472 -35048543 -36035912 -37304276
34790 -37304276 -38724025 -40230947 -41856026 -43690249 -45802653 -48161611 -50605672 -52878269
34782 -52878269 -54706082 -55883690 -56330809 -56105955 -55381449 -54398161 -53417781 -52680796 -52371590
34773 -52371590 -52593573 -53359772 -54600043 -56178609 -57914252 -59601265 -61033419 -62030315
34765 -62030315 -62460215 -62252891 -61400067 -59945342 -57968086 -55566996 -52848859 -49925407
34757 -49925407 -46916606 -43954233 -41176786 -38709238 -36631530 -34952980 -33612710 -32510814
34749 -32510814 -31552088 -30675035 -29852699 -29075100 -28333806 -27620361 -26933406 -26280611 -25666853
34740 -25666853 -25073068 -24440014 -23670351 -22650997 -21283680 -19506750 -17300450 -14682072
$$ [...]
##END NTUPLES=NMR SPECTRUM
##END=
