##TITLE=31Pdec_DE-54_NaOH
 D2O, 24 sc
 25.6.2024
##JCAMPDX= 6.0         $$ Bruker NMR JCAMP-DX V2.0
##DATA TYPE= NMR SPECTRUM
##DATA CLASS= NTUPLES
##ORIGIN= UXNMR, Bruker Analytische Messtechnik GmbH
##OWNER= root
$$ XWIN-NMR		Version 3.5
$$ Tue Jun 25 16:27:32 2024 Russian Standard Time (UT+4h)  she@DPX200
##.OBSERVE FREQUENCY= 81.013821
##.OBSERVE NUCLEUS= ^31P
##.ACQUISITION MODE= SIMULTANEOUS
##.ACQUISITION SCHEME= undefined
##.AVERAGES= 24
##.DIGITISER RES= 17
##SPECTROMETER/DATA SYSTEM= spect
##.PULSE SEQUENCE= zgpg30
##.SOLVENT NAME= D2O
##.SHIFT REFERENCE= (INTERNAL, D2O, 0, 182.463)
##AUDIT TRAIL= $$ (NUMBER, WHEN, WHO, WHERE, WHAT)
$$ ##TITLE= Audit trail, XWIN-NMR		Version 3.5
$$ ##JCAMPDX= 5.01
$$ ##ORIGIN= Bruker BioSpin GmbH
$$ ##OWNER= she
$$ F:/spectra/data/she/nmr/P31/2/pdata/1/auditp.txt
$$ ##AUDIT TRAIL=  $$ (NUMBER, WHEN, WHO, WHERE, WHAT)
(   1,<2024-06-25 16:26:45.18 +0400>,<she>,<DPX200>,
      <created by zg, POWCHK disabled, PULCHK disabled
       configuration hash MD5:
       00 E9 B6 7A A2 85 ED C7 34 08 36 98 17 FE 4E 26
       data hash MD5: 32K
       51 BB CA 14 EF 15 D6 EB 21 3F D0 4E 56 E4 FC 86>)
(   2,<2024-06-25 16:26:47.64 +0400>,<she>,<DPX200>,
      <Start of raw data processing
       efp BC_mod = 2 LB = 1.5 FT_mod = 6 PKNL = 1 PHC0 = 2837.255 PHC1 = 59.28616 SI = 64K 
       data hash MD5: 64K
       FB 13 5D 90 A4 5B 05 0D C3 F6 91 4F 56 DD 04 93>)
(   3,<2024-06-25 16:27:08.45 +0400>,<she>,<DPX200>,
      <pk PHC0 = -38.19585 PHC1 = 0 
       data hash MD5: 64K
       EA 98 EC 4B 4F 36 6D 14 9B 34 99 2F 85 2B D9 E3>)
$$ ##END=
$$ 
$$ hash MD5
$$ E2 72 B7 EF 51 40 6E 54 3F 48 35 D3 5A 69 E9 B5
##$RELAX= 
##$RELAX= 
##$RELAX= 
##$RELAX= 
##$RELAX= 
##$RELAX= 
##$RELAX= 
##$RELAX= 
$$ Bruker specific parameters
$$ --------------------------
##$DU= <F:/spectra>
##$EXPNO= 2
##$NAME= <P31>
##$PROCNO= 1
##$TYPE= <nmr>
##$USER= <she>
##$AMP= (0..31)
100 100 100 100 100 100 100 100 100 100 100 100 100 100 100 100 100 100 
100 100 100 100 100 100 100 100 100 100 100 100 100 100 
##$AQSEQ= 0
##$AQ_mod= 1
##$AUNM= <au_zg>
##$AUTOPOS= <>
##$BF1= 81.014009
##$BF2= 200.13
##$BF3= 200.13
##$BF4= 200.13
##$BF5= 200.13
##$BF6= 200.13
##$BF7= 200.13
##$BF8= 200.13
##$BYTORDA= 1
##$CFDGTYP= 0
##$CFRGTYP= 5
##$CHEMSTR= <none>
##$CNST= (0..31)
1 1 145 1 1 1 1 1 1 1 1 1 1 1 1 1 1 1 1 1 1 1 1 1 1 1 1 1 1 1 1 1 
##$CPDPRG= <waltz16>
##$CPDPRG1= <>
##$CPDPRG2= <waltz16>
##$CPDPRG3= <>
##$CPDPRG4= <mlev>
##$CPDPRG5= <mlev>
##$CPDPRG6= <mlev>
##$CPDPRG7= <mlev>
##$CPDPRG8= <mlev>
##$CPDPRGB= <>
##$CPDPRGT= <>
##$D= (0..31)
0 1 0 0 0 0 0 0 0 0 0 0.03 2e-05 3e-06 0 0 0 0 0 0 0 0 0 0 0 0 0 0 0 0 
0 0 
##$DATE= 1719318404
##$DBL= (0..7)
120 120 120 11 120 120 24 19 
##$DBP= (0..7)
150 150 150 150 150 150 150 150 
##$DBP07= 0
##$DBPNAM0= <>
##$DBPNAM1= <>
##$DBPNAM2= <>
##$DBPNAM3= <>
##$DBPNAM4= <>
##$DBPNAM5= <>
##$DBPNAM6= <>
##$DBPNAM7= <>
##$DBPOAL= (0..7)
0.5 0.5 0.5 0.5 0.5 0.5 0.5 0.5 
##$DBPOFFS= (0..7)
0 0 0 0 0 0 0 0 
$$ [...]
##$SUBNAM2= <"">
##$SUBNAM3= <"">
##$SUBNAM4= <"">
##$SUBNAM5= <"">
##$SUBNAM6= <"">
##$SUBNAM7= <"">
##$SUBNAM8= <"">
##$SUBNAM9= <"">
##$SW= 369.568048894756
##$SWIBOX= (0..15)
0 1 3 0 0 0 0 0 0 0 0 0 0 0 0 0 
##$SW_h= 29940.119760479
##$TD= 32768
##$TD0= 1
##$TE= 0
##$TE2= 300
##$TE3= 300
##$TEG= 300
##$TL= (0..7)
0 120 53 12 22 120 120 120 
##$TP= (0..7)
150 150 150 150 150 150 150 150 
##$TP07= 0
##$TPNAME0= <>
##$TPNAME1= <>
##$TPNAME2= <>
##$TPNAME3= <>
##$TPNAME4= <>
##$TPNAME5= <>
##$TPNAME6= <>
##$TPNAME7= <>
##$TPOAL= (0..7)
0.5 0.5 0.5 0.5 0.5 0.5 0.5 0.5 
##$TPOFFS= (0..7)
0 0 0 0 0 0 0 0 
##$TUNHIN= 0
##$TUNHOUT= 0
##$TUNXOUT= 0
##$USERA1= <user>
##$USERA2= <user>
##$USERA3= <user>
##$USERA4= <user>
##$USERA5= <user>
##$V9= 5
##$VALIST= <valist>
##$VCLIST= <CCCCCCCCCCCCCCC>
##$VD= 0
##$VDLIST= <DDDDDDDDDDDDDDD>
##$VPLIST= <PPPPPPPPPPPPPPP>
##$VTLIST= <TTTTTTTTTTTTTTT>
##$WBST= 1024
##$WBSW= 4
##$XGAIN= (0..3)
0 0 0 0 
##$XL= 0
##$YL= 0
##$YMAX_a= 4051
##$YMIN_a= -3419
##$ZGOPTNS= <>
##$ZL1= 120
##$ZL2= 120
##$ZL3= 120
##$ZL4= 120
##$ABSF1= 0
##$ABSF2= 0
##$ABSG= 0
##$ABSL= 0
##$ALPHA= 0
##$AQORDER= 0
##$ASSFAC= 0
##$ASSFACI= 0
##$ASSFACX= 0
##$ASSWID= 0
##$AUNMP= <proc_1d>
##$AZFE= 0.1
##$AZFW= 0.5
##$BCFW= 0
##$BC_mod= 2
##$BYTORDP= 0
##$COROFFS= 0
##$CY= -3
##$DATMOD= 1
##$DC= 0
##$DFILT= <>
##$DTYPP= 0
##$F1P= 0
##$F2P= 0
##$FCOR= 1
##$FTSIZE= 65536
##$FT_mod= 6
##$GAMMA= 0
##$GB= 0
##$INTBC= 1
##$INTSCL= 9.790993e-09
##$ISEN= 30
##$LB= 1.5
##$LEV0= 0
##$LPBIN= 0
##$MAXI= 10000
##$MC2= 0
##$MEAN= 0
##$ME_mod= 0
##$MI= 50
##$NCOEF= 0
##$NC_proc= -9
##$NLEV= 6
##$NOISF1= 182.463
##$NOISF2= 159.3651
##$NSP= 0
##$NTH_PI= 0
##$NZP= 0
##$OFFSET= 182.463
##$PC= 4
##$PHC0= 2799.059
##$PHC1= 59.28616
##$PH_mod= 1
##$PKNL= yes
##$PPARMOD= 0
##$PSCAL= 0
##$PSIGN= 0
##$REVERSE= no
##$SF= 81.0140089999434
##$SI= 65536
##$SIGF1= 159.3651
##$SIGF2= -187.1042
##$SINO= 113.3802
##$SIOLD= 16384
##$SREGLST= <1H.CDCl3>
##$SSB= 0
##$STSI= 65536
##$STSR= 0
##$SW_p= 29940.119760479
##$SYMM= 0
##$S_DEV= 0
##$TDeff= 32768
##$TDoff= 0
##$TI= <>
##$TILT= no
##$TM1= 0
##$TM2= 0
##$TOPLEV= 0
##$USERP1= <user>
##$USERP2= <user>
##$USERP3= <user>
##$USERP4= <user>
##$USERP5= <user>
##$WDW= 1
##$XDIM= 65536
##$YMAX_p= 387486705
##$YMIN_p= -42574408
$$ End of Bruker specific parameters
$$ ---------------------------------
##NTUPLES= NMR SPECTRUM
##VAR_NAME=  FREQUENCY,     SPECTRUM/REAL,   SPECTRUM/IMAG
##SYMBOL=    X,             R,               I
##VAR_TYPE=  INDEPENDENT,   DEPENDENT,       DEPENDENT
##VAR_FORM=  AFFN,          ASDF,            ASDF
##VAR_DIM=   65536,         65536,           65536
##UNITS=     HZ,            ARBITRARY UNITS, ARBITRARY UNITS
##FACTOR=    0.456856943014862, 1,           1
##FIRST=     14782.0589164792, 0,            0
##LAST=      -15158.0608439998, 0,           0
##MIN=       -15158.0608439998, -42574408,   0
##MAX=       14782.0589164792, 387486705,    0
$$ Real data points
##PAGE= N=1
##DATA TABLE= (X++(R..R)), XYDATA
$$ [...]
$$ plain form
42641 -2113979 -3184662 -2347740 -176018 893079 -877518 -4477351 -7418776 -8278529
42633 -8278529 -6937961 -3286836 2316311 7450267 8768562 5711637 1616330 -7798
42625 -7798 659739 642453 -1824834 -5257804 -6622431 -4417507 -234994 2565083 2127362
42616 2127362 -109351 -1688910 -2692413 -5183009 -9037837 -10881400 -8500144 -4183173
42608 -4183173 -1723113 -1698743 -1865909 -861228 935098 3193190 5545841 6247228 3786081
42599 3786081 -97537 -1637923 335083 3304258 4834587 4877862 3814424 1070776
42591 1070776 -2951894 -5933433 -6318646 -5250597 -4425107 -3695773 -2252410 -538701 630201
42582 630201 1501820 2461585 3068194 3462792 5117057 8321391 10417873 8764047 4418199
$$ packed form
42641b113979j070683Q36922K171722J069097j770597l599833k941425q59753
42633h278529J340568L651125N603147N133956J318295l056925m095307j624128
42625g798O67537j7286k467287l432970j364627K204924M182513K800077m37721
42616B127362k236713j579559j003503k490596l854828j843563K381256M316971
42608d183173K460060K4370j67166J004681J796326K258092K352651P01387k461147
42599C786081l883618j540386J973006K969175J530329M3275j063438k743648
42591A070776m022670k981539l85213J068049Q25490P29334J443363J713709J168902
42582F30201Q71619R59765O06609L94598J654265L204334K096482j653826m345848
$$ plain form
42573 4418199 722742 -840723 -1167555 -895878 -10074 291489 -1790217 -5699358 -8445153
42564 -8445153 -8140558 -5911409 -3897149 -3068726 -3387064 -4281307 -4290763 -1847416 2697817
42555 2697817 6925021 8775993 8209532 6386155 4597813 4174442 5784558 8246875
42547 8246875 9460181 9058079 8723318 9359764 9597263 7958499 4961178 1918028 -1079102
42538 -1079102 -4646208 -8403342 -11014656 -11594905 -10422494 -8669837 -7721012 -8074597 -8695995
42529 -8695995 -8192712 -6584558 -4924290 -3527177 -2184580 -1798336 -3432388 -5503286
42521 -5503286 -4677950 -548630 3285248 4189954 3739309 3987777 3370666 -582469 -6409166
42512 -6409166 -10037033 -9985024 -8258205 -6825502 -6086368 -6206420 -7029895 -6984360 -4822571
$$ packed form
42573D418199l695457j563465l26832K71677Q85804L01563k081706l909141k745795
42564h445153L04595K229149K014260Q28423l18338q94243r456K443347M545233
42555B697817M227204J850972n66461j823377j788342m23371J610116K462317
42547H246875J213306m02102l34761O36446K37499j638764k997321l043150k997130
42538a079102l567106l757134k611314n80249J172411J752657R48825l53585o21398
42529h695995N03283J608154J660268J397113J342597L86244j634052k070898
42521e503286Q25336M129320L833878R04706m50645K48468o17111l953135n826697
42512f409166l627867N2009J726819J432703P39134j20052q23475M5535K161789
$$ plain form
42503 -4822571 -2102200 -1151931 -1086763 827093 3991588 4482470 1005304 -2752740 -3175969
42494 -3175969 -1081554 616677 916614 609475 477006 1365945 3986441 7072831 7936274
42485 7936274 6428624 5888135 8204025 10603745 9977061 7882663 7773705 9014622 7660758
42476 7660758 2565563 -3031370 -6091794 -6642586 -5676026 -3426258 -808394 145511 -1129160
42467 -1129160 -2523444 -2036469 -468436 -221557 -2426828 -6046530 -8840665 -8664857 -5031737
42458 -5031737 -189788 2387740 1474619 -649837 -992806 918941 3185183 4033612 3384130
42449 3384130 2533546 3020062 5376896 8407143 9989317 9011891 6238994 3090600 128712
42440 128712 -2783827 -5161142 -5360369 -1809376 4915658 11434084 13949955 11869907
$$ packed form
42503d822571K720371R50269O5168J913856L164495M90882l477166l758044m23229
42494c175969K094415J698231K99937l07139j32469Q88939K620496L086390Q63443
42485G936274j507650n40489K315890K399720o26684k094398j08958J240917j353864
42476G660758n095195n596933l060424n50792R66560K249768K617864R53905j274671
42467a129160j394284M86975J568033K46879k205271l619702k794135J75808L633120
42458e031737M841949K577528r13121k124456l42969J911747K266242Q48429o49482
42449C384130q50584M86516K356834L030247J582174r77426k772897l148394k961888
42440A28712k912539k377315j99227L550993O725034O518426K515871k080048
$$ plain form
42432 11869907 8261219 6097791 5207265 3983511 2504152 1754672 967868 -1213336
42424 -1213336 -3369052 -2674457 -73521 -126966 -4037228 -6663074 -3412852 3015292 6526954
42415 6526954 5915939 4828630 4881887 3976796 1632716 878874 3017446 4665389 2755140
42406 2755140 -548002 -1006630 1644855 3889569 3428296 1161561 -1064316 -2035961 -901309
42397 -901309 2107648 4631198 4159653 1384620 -391259 518034 2565710 4021894 5365421
42388 5365421 7454217 9197148 8793870 6320448 3621527 2194911 2201621 2878052 2896315
42379 2896315 993555 -2642165 -6104758 -7839778 -8411354 -9263024 -10460416 -10881715 -9995822
42370 -9995822 -8064535 -5171925 -1683755 783974 810481 -500761 -725596 119419 -630348
$$ packed form
42432A1869907l608688k163428q90526j223754j479359p49480p86804k181204
42424a213336k155716O94595K600936n3445l910262k625846L250222O428144L511662
42415F526954o11015j087309N3257r05091k344080p53842K138572J647943j910249
42406B755140l303142m58628K651485K244714m61273k266735k225877r71645J134652
42397i01309L008957K523550m71545k775033j775879R09293K047676J456184J343527
42388E365421K088796J742931m03278k473422k698921j426616O710O76431J8263
42379B896315j902760l635720l462593j735020n71576q51670j197392m21299Q85893
42370i995822J931287K892610L488170K467729K6507j311242k24835Q45015p49767
$$ plain form
42361 -630348 -3861080 -6420356 -5069034 -984980 1900826 2159626 2223937 4697732 9238472
42352 9238472 13374475 14964219 13525200 10396829 8048586 8158676 9757162 10007559
42344 10007559 7400057 3619770 1687847 2631538 4610844 5256945 4260248 3226158
42336 3226158 3224589 3337696 2200223 275344 -691884 -399287 -592153 -2352854 -4263106
42327 -4263106 -4355562 -2641087 -276732 2668093 6645632 10309553 10881053 7250836 1415874
42318 1415874 -3370767 -4836394 -2391764 2689064 7489315 9320972 7954525 5160033
42310 5160033 2219066 -730620 -3135680 -3913582 -3381069 -3324539 -4294529 -4592789 -2948869
42301 -2948869 -524583 901616 1159173 854870 -44544 -1307268 -1729616 -1190854 -2009293
$$ packed form
42361f30348l230732k559276J351322M084054K885806K58800O4311K473795M540740
42352I238472M136003J589744j439019l128371k348243J10090J598486K50397
42344A0007559k607502l780287j931923R43691J979306O46101r96697j034090
42336C226158j569J13107j137473j924879r67228K92597j92866j760701j910252
42327d263106r2456J714475K364355K944825L977539L663921N71500l630217n834962
42318A415874m786641j465627K444630N080828M800251J831657j366447k794492
42310E160033k940967k949686k405060p77902N32513N6530r69990k98260J643920
42301b948869K424286J426199K57557l04303q99414j262724m22348N38762q18439
$$ plain form
42292 -2009293 -6063725 -11564311 -14933961 -15153168 -13959739 -12453935 -10258014 -7884283
42284 -7884283 -6938432 -7216711 -6134988 -2240736 2693965 6316212 8645794 10909802
42276 10909802 12815189 12636697 9349175 3612930 -2588538 -6556298 -6513232 -3986408
42268 -3986408 -3249639 -6501283 -10536268 -10537860 -6755969 -4582485 -7304590 -11549500 -11886555
42259 -11886555 -8003380 -4433094 -3791761 -3515045 -291027 4934881 8574366 9427396
42251 9427396 9330608 9278016 7980462 5098007 3060087 3630441 4646904 2873913 -989412
42242 -989412 -3231523 -2922460 -3461752 -7113456 -10824601 -9940923 -4600938 234081 775449
42233 775449 -1903181 -4470813 -5479051 -5686079 -5694556 -5198730 -4477735 -4915182 -7000663
$$ packed form
42292b009293m054432n500586l369650k19207J193429J505804K195921K373731
42284g884283R45851k78279J081723L894252M934701L622247K329582K264008
42276A0909802J905387j78492l287522n736245o201468l967760M3066K526824
42268c986408P36769l251644m034985j592L781891K173484k722105m244910l37055
42259a1886555L883175L570286O41333K76716L224018N225908L639485Q53030
42251I427396r6788n2592j297554k882455k037920N70354J016463j772991l863325
42242i89412k242111L09063n39292l651704l711145Q83678N339985M835019N41368
42233G75449k678630k567632j008238k07028q477M95826P20995m37447k085481
$$ plain form
42224 -7000663 -8619792 -6806697 -1460591 3831960 5468398 3569916 1131185 189884
42216 189884 341431 762701 1725576 3400823 4765603 4891984 4241557 3502863 2164116
42207 2164116 -299000 -2673939 -3351630 -3096710 -4383684 -7609139 -9970772 -9182456 -6760443
42198 -6760443 -6090285 -8106297 -10503208 -10940486 -9537622 -8028844 -7697869 -8668425 -10330787
42189 -10330787 -11699321 -11695496 -9661780 -5646064 -243692 5413217 9559094 10633940
42181 10633940 8910316 6757973 6471918 8015587 9509133 9599589 8513865 7047059
42173 7047059 5633173 4472564 3453351 1756097 -1207745 -4103416 -4458327 -1987087
42165 -1987087 479265 764551 399570 1727236 3329811 1590267 -3401259 -7137458
$$ packed form
42224g000663j619129J813095N346106N292551J636438j898482k438731r41301
42216A89884J51547M21270R62875J675247J364780J26381o50427p38694j338747
42207B164116k463116k374939o77691K54920j286974l225455k361633P88316K422013
42198f760443O70158k016012k396911m37278J402864J508778L30975r70556j662362
42189a0330787j368534L825K033716M015716N402372N656909M145877J074846
42181A0633940j723624k152343k86055J543669J493546R0456j085724j466806
42173G047059j413886j160609j019213j697254k963842k895671l54911K471240
42165a987087K466352K85286l64981J327666J602575j739544m991526l736199
$$ plain form
42157 -7137458 -6999244 -5865390 -7131943 -8928861 -6718422 -176106 6208777 9084010
42149 9084010 9316307 8731082 7231776 4620080 2405473 1634699 984675 -669828 -1534199
42140 -1534199 442826 3340778 3087883 -523021 -3023823 -1534150 1167291 869224
42132 869224 -2023626 -3422133 -1382982 1887363 3666635 3597499 2306166 -389260 -4374139
42123 -4374139 -7927146 -9228677 -8368552 -6518161 -3990702 -799878 1416365 141359
42115 141359 -4867701 -10556910 -13245389 -11393375 -5738632 1605709 7482184 8947414
42107 8947414 5978004 2117594 774525 1344924 693901 -1869267 -3391962 -1716643
42099 -1716643 1057173 1334332 -995912 -2587344 -1445958 519191 561392 -1066568 -1947961
$$ packed form
42157g137458J38214J133854j266553j796918K210439O542316O384883K875233
42149I084010K32297n85225j499306k611696k214607p70774o50024j654503q64371
42140a534199J977025K897952k52895l610904k500802J489673K701441k98067
42132H69224k892850j398507K039151L270345J779272o9136j291333k695426l984879
42123d374139l553007j301531Q60125J850391K527459L190824K216243j275006
42115A41359n009060n689209k688479J852014N654743P344341N876475J465230
42107H947414k969410l860410j343069N70399o51023k563168j522695J675319
42099a716643K773816K77159k330244j591432J141386J965149M2201j627960q81393
$$ plain form
42090 -1947961 -1213963 -411725 -671563 -1042672 -670721 -1068860 -4340818 -9660336 -13500571
42081 -13500571 -13717361 -11730817 -9893276 -8375375 -6254334 -4522358 -5669083 -10199734
42073 -10199734 -15558567 -19112753 -20483422 -20055150 -17095080 -11266259 -4883035 -1296851
42065 -1296851 -1117268 -1988875 -2228012 -2582465 -3806981 -4766092 -4445793 -4070369 -5127425
42056 -5127425 -6356499 -5071373 -1263252 1747855 1118965 -2618017 -6730414 -8884527
42048 -8884527 -8319010 -5996492 -4096984 -4023052 -4589932 -3712225 -2003932 -2334025 -4893120
42039 -4893120 -5435291 -687764 6427743 9847217 7728064 3999086 2832744 4187136
42031 4187136 5235032 4135908 1649499 212763 1620585 4696877 5873454 3523634
$$ packed form
42090a947961P33998Q02238k59838l71109L71951l98139l271958n319518l840235
42081a3500571k16790J986544J837541J517901K121041J731976j146725m530651
42073a0199734n358833l554186j370669M28272K960070N828821O383224L586184
42065a296851J79583q71607k39137l54453j224516r59111L20299L75424j057056
42056e127425j229074J285126L808121L011107o28890l736982m112397k154113
42048h884527N65517K322518J899508P3932n66880Q77707J708293l30093k559095
42039d893120n42171M747527P115507L419474k119153l728978j166342J354392
42031D187136J047896j099124k486409j436736J407822L076292J176577k349820
$$ plain form
42023 3523634 733643 1488856 4953807 6656048 5085894 3339137 3520758 3694559 2475691
42014 2475691 2817908 7719458 14590666 17753413 15520159 11565434 9804263 10665354
42006 10665354 12083787 11728960 8482652 3745452 704938 333512 -670017 -5166908
41998 -5166908 -10064469 -9531203 -3630482 694267 -1346523 -6264462 -7606889 -4400745
41990 -4400745 -1262772 -1885400 -5456423 -8881563 -10039068 -8716534 -5984373 -3135313
41982 -3135313 -808724 749295 845280 -1031867 -3717775 -5245596 -5612411 -6679336 -8711949
41973 -8711949 -9521039 -8205318 -6863382 -6586930 -4780647 427416 5767514 6932372
41965 6932372 5210209 5172419 6792761 5644708 1492221 494439 6011215 12298142 11709856
$$ packed form
42023C523634k789991P55213L464951J702241j570154j746757J81621J73801j218868
42014B475691L42217M901550O871208L162747k233254l954725j761171Q61091
42006A0665354J418433l54827l246308m737200l040514l71426j003529m496891
41998e166908m897561N33266N900721M324749k040790m917939j342427L206144
41990d400745L137973o22628l571023l425140j157505J322534K732161K849060
41982c135313K326589J558019R5985j877147k685908j527821l66815j066925k032613
41973h711949q09090J315721J341936K76452J806283N208063N340098J164858
41965F932372j722163l7790J620342j148053m152487r97782N516776O286927n88286
$$ plain form
41956 11709856 4849182 -1179216 -2590274 -2031487 -2508540 -3037773 -1450697 1953882
41948 1953882 5187105 6812997 6213870 3430559 -161360 -2453826 -2737675 -1994702 -705642
41939 -705642 1784863 4942648 6192008 4067905 820684 3484 2191195 4734484
41931 4734484 5332786 4344101 3620065 4172508 5059257 4049155 -145270 -5720186 -8736023
41922 -8736023 -7200267 -3284838 -212717 1977256 5529657 10433352 13369262 11748970
41914 11748970 6790134 1709632 -1517986 -2718410 -2482514 -1921243 -2327757 -3720607
41906 -3720607 -4428800 -3181263 -812143 1207589 3002518 5481483 7796563 7458234
41898 7458234 3387757 -2339497 -6351752 -6905930 -4620828 -976263 3166049 7421189
$$ packed form
41956A1709856o860674o028398j411058N58787m77053n29233J587076L404579
41948A953882L233223J625892n99127k783311l591919k292466k83849P42973J289060
41939g05642K490505L157785J249360k124103l247221q17200K187711K543289
41931D734484N98302r88685p24036N52443Q86749j010102m194425n574916l015837
41922h736023J535756L915429L072121K189973L552401M903695K935910j620292
41914A1748970m958836n080502l227618j200424K35896N61271m06514j392850
41906c720607p08193J247537K369120K019732J794929K478965K315080l38329
41898G458234m070477n727254m012255n54178K285102L644565M142312M255140
$$ plain form
41890 7421189 10692939 11033371 7550287 2140627 -1967394 -3640680 -4463030 -5520788
41882 -5520788 -5504600 -3466633 -1696228 -3282444 -7457304 -10038263 -8733996 -5624454
41874 -5624454 -3642900 -2792815 -1214580 1633958 4582599 6641460 7678478 7569549
41866 7569549 6085998 3780476 2062353 2007542 3350350 4697771 4659766 2994775 781978
41857 781978 -763820 -1651157 -2904211 -5021008 -7199775 -8202478 -7434407 -5081960 -1839102
41848 -1839102 1285588 3447242 4408255 4050599 1698439 -3073180 -8999954 -13813706
41840 -13813706 -16716009 -18860073 -20864368 -21429792 -19541258 -16608316 -14702784 -13520603
41832 -13520603 -10982074 -6520595 -1865911 1609852 4471903 7371947 9129575 8088472
$$ packed form
41890G421189L271750L40432l483084n409660m108021j673286q22350j057758
41882e520788J6188K037967J770405j586216m174860k580959J304267L109542
41874e624454J981554Q50085J578235K848538K948641K058861J037018j08929
41866G569549j483551k305522j718123n4811J342808J347421l8005j664991k212797
41857G81978j545798q87337j253054k116797k178767j002703P68071K352447L242858
41848a839102L124690K161654R61013l57656k352160m771619n926774m813752
41840a3813706k902303k144064k004295n65424J888534K932942J905532J182181
41832a3520603K538529M461479M654684L475763K862051K900044J757628j041103
$$ plain form
41824 8088472 4825632 2174914 2360332 4871482 7474986 8715807 8817441 8441683 7575422
41815 7575422 6138394 5008772 5512469 7951315 11263136 14003649 15025111 13572528
41807 13572528 9946234 6141436 4433959 4722250 4404360 1662594 -2119932 -4115955
41799 -4115955 -3366647 -1313683 297362 895788 821742 636579 679703 736406 318160 -443586
41789 -443586 -745436 -279509 388230 1049594 2322474 4144666 5131175 4607461 3958397
41780 3958397 4379774 4553946 2659454 -237914 -1336345 -327757 146160 -1409705 -3177154
41771 -3177154 -2712173 130312 3691563 6133205 5870810 2350056 -2463038 -4961405
41763 -4961405 -3480643 174988 3479885 5766583 7142765 6976886 5301306 4062726
$$ packed form
41824H088472l262840k650718J85418K511150K603504J240821J01634l75758q66261
41815G575422j437028j129622N03697K438846L311821K740513J021462j452583
41807A3572528l626294l804798j707477K88291l17890k741766l782526j996023
41799d115955P49308K052964J611045N98426p4046j85163M3124N6703m18246p61746
41789d43586l01850M65927O67739O61364J272880J822192R86509n23714o49064
41780C958397M21377J74172j894492k897368j098431J008588M73917j555865j767449
41771c177154M64981K842485L561251K441642k62395l520754m813094k498367
41763d961405J480762L655631L304897K286698J376182j65879j675580j238580
$$ plain form
41755 4062726 4715830 5592695 3893595 -367325 -4602858 -7431454 -9940414 -13156465
41747 -13156465 -16448052 -18862882 -20035049 -19026061 -14234381 -5945938 2206593 6067732
41739 6067732 5151051 2972621 3060155 5264991 6334044 3803070 -1281356 -5840287 -8396120
41730 -8396120 -10115038 -12185427 -13746342 -13436845 -11660994 -9715996 -7675507 -5143385
41722 -5143385 -3404181 -4264745 -6718283 -7409542 -5105045 -2217092 -898669 -324862 416006
41713 416006 -583282 -5204720 -11295948 -14725052 -14605991 -13398329 -12286874 -9815197 -5371479
41704 -5371479 -740567 2761872 5758729 8191592 8207133 5588570 3700031 5506737
41696 5506737 9589493 12656478 14206179 15661894 16326513 14000074 9372170 6111492
$$ packed form
41755D062726O53104Q76865j699100m260920m235533k828596k508960l216051
41747a3156465l291587k414830j172167J008988M791680Q288443Q152531L861139
41739F067732r16681k178430Q7534K204836J069053k530974n084426m558931k555833
41730h396120j718918k070389j560915L09497J775851J944998K040489K532122
41722e143385J739204q60564k453538o91259K304497K887953J318423N73807P40868
41713D16006r99288m621438o091228l429104J19061J207662J111455K471677M443718
41704e371479M630912L502439K996857K432863J5541k618563j888539J806706
41696E506737M082756L066985J549701J455715O64619k326439m627904l260678
$$ plain form
41688 6111492 5837593 6057398 4225266 1239843 -475681 -167436 1427460 3483561 4767448
41679 4767448 3752161 874640 -774856 1102347 4984502 7649761 8192843 8056105
41671 8056105 8065164 7594596 6163511 3864612 592493 -3177724 -5195525 -3360461 838809
41662 838809 2908523 209352 -5152484 -8842567 -8406772 -4489750 412427 3476524
41654 3476524 3130065 411431 -1744829 -1391414 640371 2188234 2109703 390733 -3183182
41645 -3183182 -8786927 -14704387 -17241334 -14120145 -7898689 -4346791 -6359160 -10678988
41637 -10678988 -12323644 -11161148 -11200371 -13499942 -13742313 -8720787 -1669264 2197931
41629 2197931 2782790 3491038 4310148 1794672 -4004663 -7791345 -5850443 -607458 3484774
$$ packed form
41688F111492k73899K19805j832132k985423j715524L08245J594896K056101J283887
41679D767448j015287k877521j649496J877203L882155K665259N43082j36738
41671H056105R059m70568j431085k298899l272119l770217k017801J835064M199270
41662H38809K069714k699171n361836l690083M35795L917022M902177L064097
41654C476524l46459k718634k156260L53415K031785J547863p8531j718970l573915
41645c183182n603745n917460k536947L121189O221456L551898k012369m319828
41637a0678988j644656J162496l9223k299571k42371N021526P051523L867195
41629B197931N84859P08248Q19110k515476n799335l786682J940902N242985M092232
$$ plain form
41620 3484774 4940883 4033023 460102 -4439713 -6111470 -1536139 5815720 9368257
41612 9368257 7117044 2977195 1125214 2030345 3936796 5298587 5092696 2918719
41604 2918719 -291844 -2864622 -4035403 -4186572 -3774452 -3164680 -3099505 -4023672 -5269391
41595 -5269391 -6005609 -6385623 -6611080 -5831535 -3556035 -1249823 -691852 -1504312 -2194707
41586 -2194707 -2788066 -4223865 -5909789 -6384589 -5877877 -5576273 -4879539 -2530519 -326029
41577 -326029 -2040910 -7821925 -12999888 -13821968 -11441233 -8853649 -6969818 -5623027
41569 -5623027 -5474608 -6307641 -5788132 -2728225 274561 232159 -1846389 -2837051 -2211198
41560 -2211198 -1547150 -530814 2611134 6805462 8113866 4908904 2204 -3390750
$$ packed form
41620C484774J456109r07860l572921m899815j671757M575331P351859L552537
41612I368257k251213m139849j851981R05131J906451J361791k05891k173977
41604B918719l210563k572778j170781j51169M12120O09772O5175r24167j245719
41595e269391p36218l80014k25457P79545K275500K306212N57971q12460o90395
41586b194707n93359j435799j685924m74800N06712L01604O96734K349020K204490
41577c26029j714881n781015n177963q22080K380735K587584J883831J346791
41569e623027J48419q33033N19509L059907L002786m2402k078548r90662O25853
41560b211198O64048J016336L141948M194328J308404l204962m906700l392954
$$ plain form
41552 -3390750 -4963301 -5454590 -4504233 -2374237 -1324161 -2676346 -4145818 -2733071
41544 -2733071 800568 2993154 2544655 1324531 658625 -368993 -2096861 -2567056 -450725
41535 -450725 2207779 2387291 222010 -1413657 -988176 174016 580300 682023 1429309
41526 1429309 2283234 2012128 697922 -289535 -47952 1094758 2497379 3989885 5410614
41517 5410614 5916964 4498038 1500346 -767365 54292 3402585 5687273 4275321
41509 4275321 932942 -267598 1815647 4230673 4337007 3262273 3860732 6935797
41501 6935797 10920089 14007709 15163250 14145340 11982364 10410557 9551487 7519781
41493 7519781 3940819 2133633 5195349 10990919 14025479 12015648 7828828 4930372
$$ packed form
41552c390750j572551m91289R50357K129996J050076j352185j469472J412747
41544b733071L533639K192586m48499j220124o65906j027618j727868m70195K116331
41535d50725K658504J79512k165281j635667M25481J162192M06284J01723P47286
41526A429309Q53925k71106j314206r87457K41583J142710J402621J492506J420729
41517E410614N06350j418926k997692k267711Q21657L348293K284688j411952
41509D275321l342379j200540K083245K415026J06334j074734N98459L075065
41501F935797L984292L087620J155541j017910k162976j571807q59070k031706
41493G519781l578962j807186L061716N795570L034560k009831m186820k898456
$$ plain form
41485 4930372 3790632 3319573 3144485 3328618 3705836 4326487 5098382 4902010 3027065
41476 3027065 1385657 2675809 6136604 8156292 7667839 7449770 8838692 8996136 5761249
41467 5761249 1676912 -16398 -426226 -2220520 -4134964 -2789504 1153158 3215704
41459 3215704 1481667 -1300531 -2560653 -3195356 -4852938 -6998422 -8254509 -8444568
41451 -8444568 -7965614 -7008404 -6472918 -7666285 -9781089 -9555510 -5166799 827334 4080357
41442 4080357 3082447 -217670 -3447393 -5614686 -6198355 -4448645 -554244 3331200
41434 3331200 4386940 1838078 -1939409 -3547021 -1924999 827841 2086434 1357540
41426 1357540 -181564 -1784225 -3510329 -4954889 -5010845 -3044097 576146 4987325
$$ packed form
41485D930372j139740m71059j75088J84133L77218O20651P71895j96372j874945
41476C027065j641408J290152L460795K019688m88453k18069J388922J57444l234887
41467E761249m084337j693310m09828j794294j914444J345460L942662K062546
41459C215704j734037k782198j260122o34703j657582k145484j256087j90059
41451h444568M78954R57210N35486j193367k114804K25579M388711N994133L253023
41442D080357r97910l300117l229723k167293n83669J749710L894401L885444
41434C331200J055740k548862l777487j607612J622022K752840J258593p28894
41426A357540j539104j602661j726104j444560n5956J966748L620243M411179
$$ plain form
41418 4987325 8922157 10594127 8897261 4957708 1439581 127223 1036135 3587102
41410 3587102 7074312 9770507 9347970 5250242 -262651 -4190101 -5268257 -4111538
41402 -4111538 -1994853 -79594 1219568 2886418 6406627 11367620 14832459 14234531
41394 14234531 10413978 6759337 5671996 6864911 8855098 10762352 12136538 12049542
41386 12049542 9634773 5717534 3035045 3923584 7793858 11630978 13175259 12775185
41378 12775185 11714016 9959234 6953885 3954092 3613514 6740249 10803660 12512764
41370 12512764 11180566 8856415 7627563 7532073 7095391 5399413 3165693 1630109
41362 1630109 819493 -192716 -1433080 -1810399 -1231507 -1304507 -2748318 -3702077 -2459638
$$ packed form
41418D987325L934832J671970j696866l939553l518127j312358R08912K550967
41410C587102L487210K696195m22537m097728n512893l927450j078156J156719
41402d111538K116685J915259J299162J666850L520209M960993L464839n97928
41394A4234531l820553l654641j087341J192915J990187J907254J374186q6996
41386A2049542k414769l917239k682489Q88539L870274L837120J544281m00074
41378A2775185j061169j754782l005349k999793l40578L126735M063411J709104
41370A2512764j332198k324151j228852r5490m36682j695978k233720j535584
41362A630109q10616j012209j240364l77319N78892p3000j443811r53759J242439
$$ plain form
41353 -2459638 -510096 -415399 -1666886 -1637885 -180881 225826 -753547 -220841 2810264
41344 2810264 4779735 2698768 -860636 -1124672 2300830 5577530 6392782 6131610 6343715
41335 6343715 6249464 4729302 2492274 922761 82243 -1033999 -2908172 -4766661 -5073561
41326 -5073561 -2860713 703239 2378479 -294230 -6166657 -11668086 -14827675 -16676052
41318 -16676052 -18381447 -18838444 -16362284 -11554273 -6835267 -3603025 -1386980 236502
41310 236502 447262 -1493294 -4749898 -7501874 -8423198 -7106870 -3935735 -429582 1156218
41301 1156218 11948 -1864826 -2034527 -1096987 -1920046 -5267613 -8415526 -8832120 -6929700
41292 -6929700 -4001585 -57934 4176689 5612691 2347730 -2688583 -5062308 -4768391
$$ packed form
41353b459638J949542R4697j251487K9001J457004M06707r79373N32706L031105
41344B810264J969471k080967l559404k64036L425502L276700Q15252k61172K12105
41335F343715r4251j520162k237028j569513q40518j116242j874173j858489l06900
41326e073561K212848L563952J675240k672709n872427n501429l159589j848377
41318a6676052j705395m56997K476160M808011M719006L232242K216045J623482
41310B36502K10760j940556l256604k751976r21324J316328L171135L506153J585800
41301A156218j144270j876774j69701R37540q23059l347567l147913m16594J902420
41292f929700K928115L943651M234623J436002l264961n036313k373725K93917
$$ plain form
41284 -4768391 -5201405 -6902626 -6578151 -2674138 2186550 5322364 6711172 6347670 2916123
41275 2916123 -2794210 -6732756 -6465763 -4355633 -3537936 -3743819 -3699037 -4407755 -6611021
41266 -6611021 -7740022 -5287061 -1105678 1466924 2769744 4974621 6928750 5633745
41258 5633745 1846650 -739466 -1565825 -3452101 -6412776 -6300698 -1155869 5283443
41250 5283443 8298275 7063089 3292424 -1475949 -5296133 -5785373 -3223897 -1349469
41242 -1349469 -2818220 -5826246 -7104859 -6161330 -4528731 -2888507 -1320356 -707734
41234 -707734 -1287957 -945165 2445111 7489592 10434279 9836024 8135227 8158287 9562979
41225 9562979 9756898 7802737 6202957 7959465 12322560 15179296 14257534 11813105
$$ packed form
41284d768391m33014j701221L24475L904013M860688L135814J388808l63502l431547
41275B916123n710333l938546K66993K110130Q17697k05883M4782p08718k203266
41266f611021j129001K452961M181383K572602J302820K204877J954129j295005
41258E633745l787095k586116q26359j886276k960675J12078N144829O439312
41250E283443L014832j235186l770665m768373l820184m89240K561476J874428
41242a349469j468751l008026j278613R43529J632599J640224J568151O12622
41234g07734n80223L42792L390276N044481K944687n98255j700797K3060J404692
41225I562979J93919j954161j599780J756508M363095K856736r21762k444429
$$ plain form
41217 11813105 10485148 8950591 5005345 1047104 1608040 5757376 7361279 4110833
41209 4110833 945631 1984178 4158410 2850031 -379277 -829031 1394515 2099818
41201 2099818 369068 -310107 1693132 3641234 3136244 1321272 57471 -642720 -676194
41192 -676194 1683541 7032514 12325951 13429613 9683887 4617312 2344497 3834204
41184 3834204 6406743 6626742 3866203 719743 -403689 -115877 -449061 -1515758 -1655571
41175 -1655571 -479644 304573 -657080 -2775970 -4750334 -5952835 -6208178 -5471719 -4159092
41166 -4159092 -2770655 -998061 1682354 4379213 5042016 2831123 -717226 -3281418
41158 -3281418 -3737410 -2401407 -233833 1830106 3379916 4553489 5174626 4233571 1084803
$$ packed form
41217A1813105j327957j534557l945246l958241N60936M149336J603903l250446
41209D110833l165202J038547K174232j308379l229308m49754K223546P05303
41201B099818j730750o79175K003239J948102n04990j814972j263801p00191l3474
41192f76194K359735N348973N293437J103662l745726n066575k272815J489707
41184C834204K572539K19999k760539l146460j123432K87812l33184j066697j39813
41175a655571J175927P84217r61653k118890j974364j202501k55343P36459J312627
41166d159092J388437J772594K680415K696859O62803k210893l548349k564192
41158c281418m55992J336003K167574K063939J549810J173573O21137r41055l148768
$$ plain form
41149 1084803 -3124145 -6300583 -7615755 -7836662 -7537342 -6266657 -3897670 -1775452
41141 -1775452 -1737390 -4260957 -8010987 -11270261 -13687978 -16212504 -18959683 -19988204
41133 -19988204 -17664579 -13825389 -12205366 -13134979 -12438190 -7223121 -455494 2488249
41125 2488249 14002 -5290042 -10554164 -13933571 -13579569 -9065242 -3447722 -570535
41117 -570535 -321257 541510 3166648 5489987 6223471 6361929 6285539 4978948 3029179
41108 3029179 2878774 4757939 5612070 3659466 1035949 244081 839929 1391767 1824687
41099 1824687 1824001 -161216 -3877787 -5918854 -4179070 -1256119 -343488 84422 3738430
41090 3738430 9891457 13182609 10159860 3152195 -2794516 -4806335 -3797206 -2896404
$$ packed form
41149A084803m208948l176438j315172k20907K99320J270685K368987K122218
41141a775452L8062k523567l750030l259274k417717k524526k747179j028521
41133a9988204K323625L839190J620023r29613O96789N215069O767627K943743
41125B488249k474247n304044n264122l379407L54002M514327N617520K877187
41117e70535K49278Q62767K625138K323339P33484J38458p6390j306591j949769
41108C029179j50405J879165Q54131j952604k623517p91868N95848N51838M32920
41099A824687o86j985217l716571k041067J739784K922951R12631M27910L654008
41090C738430O153027L291152l022749p007665n946711k011819J009129R00802
$$ plain form
41082 -2896404 -4518966 -7908432 -9671711 -7461779 -2566827 1702993 3118648 1509874
41074 1509874 -1562133 -3100983 -765562 3754704 5585306 2817638 -475914 125288
41066 125288 3117146 3882826 1948215 1151748 3160936 5070631 4021014 711169 -2672456
41057 -2672456 -5234339 -7047687 -8308980 -9689688 -11676682 -13066174 -11992399 -8810878
41049 -8810878 -6019618 -4962357 -4519171 -3368684 -1635410 -33287 755432 -188337 -2820517
41040 -2820517 -4723801 -3319253 445315 3226392 4088851 4910976 5598888 2997205 -3559832
41031 -3559832 -9319440 -9699768 -6143161 -3162477 -1586286 1514584 7042565 11743094
41023 11743094 12415469 9685144 6631889 5238045 5075599 4675452 3525740 2738002 3514764
$$ packed form
41082b896404j622562l389466j763279K209932M894952M269820J415655j608774
41074A509874l072007j538850K335421M520266J830602k767668l293552O01202
41066A25288K991858P65680j934611p96467K009188J909695j049617l309845l383625
41057b672456k561883j813348j261293j380708j986994j389492J073775L181521
41049h810878K791260J057261M43186J150487J733274J602123P88719r43769k632180
41040b820517j903284J404548L764568K781077Q62459Q22125O87912k601683o557037
41031c559832n759608l80328L556607K980684J576191L100870N527981M700529
41023A1743094O72375k730325l053255j393844j62446m00147j149712p87738P76762
$$ plain form
41014 3514764 4982812 4633969 1648564 -1321522 -1034623 2252393 5010770 4651997 2221180
41005 2221180 559769 752552 1156658 -291446 -3579460 -6944090 -9298567 -11178615
40997 -11178615 -12905311 -13232634 -11103576 -7610783 -4421273 -1222613 2830657 5719644
40989 5719644 3839159 -2732123 -9224279 -11659110 -10715145 -8782746 -6144232 -2448844
40981 -2448844 540274 976366 473499 2493062 7538133 12458792 14380152 13138551
40973 13138551 9980290 6172650 3331626 3165082 5902120 9841561 12870423 13896874
40965 13896874 13047100 11436513 10695555 11795721 14142386 16159956 16545803 14852747
40957 14852747 11707531 8844027 7772272 7754169 6395678 3090379 321951 323193 2101753
$$ packed form
41014C514764J468048l48843k985405k970086K86899L287016K758377l58773k430817
41005B221180j661411J92783M04106j448104l288014l364630k354477j880048
40997a1178615j726696l27323K129058L492793L189510L198660M053270K888987
40989E719644j880485o571282o492156k434831R43965J932399K638514L695388
40981b448844K989118M36092n02867K019563N045071M920659J921360j241601
40973A3138551l158261l807640k841024j66544K737038L939441L028862J026451
40965A3896874q49774j610587p40958J100166K346665K017570L85847j693056
40957A4852747l145216k863504j071755j8103j358491l305299k768428J242J778560
$$ plain form
40948 2101753 3417686 3996832 4589095 4418699 2487186 544403 1601208 5500494 8739936
40939 8739936 8978335 7214385 5147664 2999812 837572 -243620 381307 1615454
40931 1615454 1898517 745328 -1317952 -3167164 -3365917 -1555519 374117 235674 -1256710
40922 -1256710 -1287969 798805 2466868 2034092 1282080 2453560 4609983 4972381 2747976
40913 2747976 -166924 -1672996 -1272543 193953 1565922 2317044 2950412 4039937 4886536
40904 4886536 4125701 1820059 -218184 -397769 1529926 5194114 9698621 12945185
40896 12945185 13096008 11248899 10344007 10669913 9141005 4356129 -487870 -1855956
40888 -1855956 -486088 947978 2571801 6334823 11638178 15451061 16362188 15518176
$$ packed form
40948B101753J315933N79146N92263j70396j931513j942783J056805L899286L239442
40939H739936K38399j763950k066721k147852k162240j081192O24927J234147
40931A615454K83063j153189k063280j849212j98753J810398J929636j38443j492384
40922a256710l1259K086774J668063m32776p52012J171480K156423L62398k224405
40913B747976k914900j506072M00453J466496J371969P51122O33368J089525Q46599
40904D886536p60835k305642k038243j79585J927695L664188M504507L246564
40896A2945185J50823j847109r04892L25906j528908m784876m843999j368086
40888a855956J369868J434066J623823L763022N303355L812883R11127q44012
$$ plain form
40880 15518176 13854386 11408156 9362829 9674193 12013814 13617019 12837202 10593299
40872 10593299 7863702 4438729 1140013 538104 3592621 7470813 8658531 7004416
40864 7004416 5045411 4474497 4995695 5776478 6175936 5418344 3203758 651693 -575103
40855 -575103 -53255 1532216 4098589 8342315 13826648 18103165 18754037 16012702 12641159
40846 12641159 11141921 11503981 11874736 11102768 10048699 10216207 11632833 12802605 12757621
40837 12757621 12434868 13530086 16313002 19202707 20614301 20694535 20706725 20947038 20232085
40828 20232085 17924330 15526386 15022261 16035050 16223551 14661088 13092688 13165479 14208129
40819 14208129 15006406 16025041 17900983 19113297 17771967 15131730 14525947 16626223
$$ packed form
40880A5518176j663790k446230k045327L11364K339621J603205p79817k243903
40872A0593299k729597l424973l298716o01909L054517L878192J187718j654115
40864G004416j959005n70914N21198P80783L99458p57592k214586k552065j226796
40855e75103N21848J585471K566373M243726N484333M276517O50872k741335l371543
40846A2641159j499238L62060L70755p71968j054069J67508J416626J169772m4984
40837A2757621l22753J095218K782916K889705J411594Q0234J2190K40313p14953
40828B0232085k307755k397944n04125J012789J88501j562463j568400P2791J042650
40819A4208129P98277J018635J875942J212314j341330k640237o05783K100276
$$ plain form
40811 16626223 18375162 17316068 14631493 12896922 13006578 14615917 17572778 21153324
40803 21153324 23459746 23458108 22471575 21982106 21182850 18616623 15080954 12599279 11295140
40794 11295140 9834122 8562200 9274887 11395062 11183312 6203903 -1251449 -6617102
40786 -6617102 -7601595 -5129778 -1234442 2255464 3755823 2537956 -498943 -3500444
40778 -3500444 -5035076 -4425703 -1455446 3339560 8535584 12797841 15594376 16414041
40770 16414041 14318426 9537253 4696545 2686325 3429649 4310555 3779838 2868144 2835404
40761 2835404 3055397 2115582 -171852 -2732103 -4380395 -4446391 -3109699 -1545676 -767725
40752 -767725 -26161 2332135 5997177 8361512 7845009 5737231 3618884 1116537 -1864298
$$ packed form
40811A6626223J748939j059094k684575j734571J09656J609339K956861L580546
40803B1153324K306422j638r86533m89469p99256k566227l535669k481675j304139
40794A1295140j461018j271922P12687K120175k11750m979409p455352n365653
40786f617102r84493K471817L895336L489906J500359j217867l036899l001501
40778c500444j534632O09373K970257M795006N196024M262257K796535Q19665
40770A6414041k095615m781173m840708k010220P43324Q80906n30717r11694l2740
40761B835404K19993r39815k287434k560251j648292o5996J336692J564023P77951
40752g67725P41564K358296L665042K364335n16503k107778k118347k502347k980835
$$ plain form
40743 -1864298 -2792703 644282 6526676 10594056 11518585 11260029 10694774 8487961 4535253
40734 4535253 809207 -2125974 -5776322 -9481951 -9383563 -4122962 1780215 3508525
40726 3508525 2258197 2272876 3619934 2304207 -3139804 -9343158 -12701282 -12893567 -11285155
40717 -11285155 -8899483 -6877808 -6316414 -6505072 -5343802 -2392577 326005 1221850
40709 1221850 928719 559396 174288 -206795 -55774 205257 -958530 -3825206 -6576098
40700 -6576098 -7837117 -8348467 -9099567 -9676060 -9672263 -9821320 -10290364 -9834490 -8372325
40691 -8372325 -8325066 -11053922 -13735036 -12640033 -8381725 -4920396 -4098520 -4390535 -4868017
40682 -4868017 -6755071 -9953572 -11103919 -7214599 392213 7411396 10687195 9845901
$$ packed form
40743a864298r28405L436985N882394M067380R24529k58556n65255k206813l952708
40734D535253l726046k935181l650348l705629R8388N260601N903177J728310
40726C508525j250328J4679J347058j315727n444011o203354l358124j92285J608412
40717a1285155K385672K021675N61394j88658J161270K951225K718582Q95845
40709A221850k93131l69323l85108l81083J51021K61031j163787k866676k750892
40700f576098j261019n11350p51100n76493L797j49057m69044M55874J462165
40691h372325M7259k728856k681114J095003M258308L461329Q21876k92015m77482
40682d868017j887054l198501j150347L889320P606812P019183L275799q41294
$$ plain form
40674 9845901 6283592 2327660 569671 2094036 5313826 7719108 8593018 8832302
40666 8832302 8427018 5997373 1502263 -2209131 -2111848 1356212 4937808 6758001 8229318
40657 8229318 11175329 14646497 16096537 14902900 12944535 11804597 11152170 10348298
40649 10348298 10014218 10823025 11636809 10175698 5542257 -455083 -4416811 -3794952 1018067
40640 1018067 6624530 9338205 8568618 7106769 7771107 10386168 12335905 11280273
40632 11280273 6974931 1412355 -2239908 -1808090 2010504 6576903 10293237 13349183
40624 13349183 15335406 14595007 11518599 10111568 13422048 18720092 20397835 17178236
40616 17178236 13255841 12211840 13156920 13796945 14021086 14507796 14360717 12717947 11107441
$$ packed form
40674I845901l562309l955932j757989J524365L219790K405282Q73910K39284
40666H832302m05284k429645m495110l711394R7283L468060L581596J820193J471317
40657H229318K946011L471168J450040j193637j958365j139938o52427q03872
40649A0348298l34080Q08807Q13784j461111m633441n997340l961728O21859M813019
40640A018067N606463K713675p69587j461849O64338K615061J949737j055632
40632A1280273m305342n562576l652263M31818L818594M566399L716334L055946
40624A3349183J986223p40399l076408j407031L310480N298044J677743l219599
40616A7178236l922395j044001R45080O40025K24141M86710j47079j642770j610506
$$ plain form
40607 11107441 11502125 12776052 11643756 7175809 2365904 752568 2869893 6412439
40599 6412439 8681515 8372082 6004003 3384920 2190627 2580108 3476378 4320427 5916245
40590 5916245 9137557 13344328 16710633 17856673 16574941 13253017 8617834 4339650
40582 4339650 2764631 4780819 8073169 8658887 4706571 -1647530 -6492699 -7487235
40574 -7487235 -4791263 161622 5577552 9429025 10235952 8407384 6128294 5251360
40566 5251360 5566918 5674830 5347341 6135675 9067951 12358691 12751828 9540799 5945315
40557 5945315 5298663 6856614 7214273 5366839 3949699 5096669 7577097 9199772
40549 9199772 9739729 9734341 8525061 5973137 4478071 6228297 9297870 9757822 7561607
$$ packed form
40607A1107441L94684J273927j132296m467947m809905j613336K117325L542546
40599F412439K269076l09433k368079k619083j194293L89481Q96270Q44049J595818
40590E916245L221312M206771L366305J146040j281732l321924m635183m278184
40582D339650j575019K016188L292350N85718l952316o354101m845169r94536
40574g487235K695972M952885N415930L851473Q06927j828568k279090q76934
40566E251360L15558J07912l27489P88334K932276L290740L93137l211029l595484
40557E945315o46652J557951L57659j847434j417140J146970K480428J622675
40549I199772N39957n388j209280k551924j495066J750226L069573M59952k196215
$$ plain form
40540 7561607 6918657 9953561 13142861 11983828 7083130 3306812 3872412 7311305
40532 7311305 10095986 10717249 10647002 11895154 14313593 15818038 15240182 13963186 13974190
40523 13974190 15259235 16421445 17064044 17820825 18576057 18772838 19410144 22522929 28271991
40514 28271991 34480088 39506640 43713862 47645018 50781612 52841872 54501341 56212647
40506 56212647 58212084 62224676 70862342 84312235 99571829 113587492 124668572
40499 124668572 130162726 126373284 113125173 95710846 79852017 67124019 57540830
40492 57540830 53149058 54903526 58367589 57566434 52413786 47863872 46109049 44449684
40484 44449684 41420257 39944231 42211525 45491593 46171278 45196115 46066698 49002599
$$ packed form
40540G561607o42950L034904L189300j159033m900698l776318N65600L438893
40532G311305K784681O21263p0247J248152K418439J504445n77856j276996J1004
40523A3974190J285045J162210O42599P56781P55232J96781O37306L112785N749062
40514B8271991O208097N026552M207222L931156L136594K060260J659469J711306
40506E6212647J999437M012592Q637666J3449893J5259594J4015663J1081080
40499A24668572N494154l789442j3248111j7414327j5858829j2727998r583189
40492E7540830m391772J754468L464063q01155n152648m549914j754823j659365
40484D4449684l029427j476026K267294L280068O79685r75163Q70583K935901
$$ plain form
40476 49002599 50595781 49025813 46631812 46432987 48136507 49170993 48848899 49753942
40468 49753942 54572988 62855119 72168254 81685248 92527910 104230057 113070359 115344710
40460 115344710 110878598 101995141 90582447 77900530 65732069 55369997 46359241
40453 46359241 38346596 33116628 32337740 34191238 34963125 33356914 30555883 26979322
40445 26979322 22487896 19234331 20019197 23313331 24175302 21341485 19226514 20995524
40437 20995524 23780498 23570366 21132771 19380095 17723616 13435608 7195088 3202681
40429 3202681 4156595 9156106 15934741 22040215 24307432 20709241 13341756 6925735
40421 6925735 3723639 2096419 331483 -713647 273470 2530011 4292420 5222194
$$ packed form
40476D9002599J593182j569968k394001j98825J703520J034486l22094R05043
40468D9753942M819046Q282131R313135R516994J0842662J1702147Q840302K274351
40460A15344710m466112q883457j1412694j2681917j2168461j0362072r010756
40453D6359241q012645n229968p78888J853498P71887j606211k801031l576561
40445B6979322m491426l253565P84866L294134Q61971k833817k114971J769010
40437B0995524K784974k10132k437595j752676j656479m288008o240520l992407
40429C202681R53914M999511O778635O105474K267217l598191p367485o416021
40421F925735l202096j627220j764936j045130R87117K256541J762409R29774
$$ plain form
40413 5222194 6728497 10553895 17249200 24977487 29890247 29445582 25838375 24334297
40405 24334297 27240473 31108322 31136019 26891700 22007669 19268208 18104597 16662490
40397 16662490 14175898 10676029 6062314 719153 -3831659 -6131456 -6276881 -5309412
40389 -5309412 -3627335 -1201495 1053545 1868515 1787225 2913579 5787762 8384860 9357988
40380 9357988 10179034 12106603 13092214 10745601 6989918 5947483 7617951 7894866 5475738
40371 5475738 4286655 7105760 10850305 11254785 9031211 7720449 7721224 6449217 3205109
40362 3205109 197551 -710686 749639 4453154 9204770 11700648 9697090 5879262
40354 5879262 5104104 7991235 10852868 11792004 12559416 13824634 13361397 10662249 8866182
$$ packed form
40413E222194J506303L825398O695305P728287M912760m44665l607207j504078
40405B4334297K906176L867849K7697m244319m884031k739461j163611j442107
40397A6662490k486592l499869m613715n343161m550812k299797j45425R67469
40389e309412J682077K425840K255040Q14970q1290J126354K874183K597098R73128
40380I357988Q21046J927569R85611k346613l755683j042435J670468K76915k419128
40371E475738j189083K819105L744545M04480k223574j310762P75j272007l244108
40362C205109l007558r08237J460325L703515M751616K495878k003558l817828
40354E879262p75158K887131K861633R39136P67412J265218m63237k699148j796067
$$ plain form
40345 8866182 9429871 8882707 4347940 -1031019 -2308446 -18714 1126651 -695606
40337 -695606 -3176174 -5030118 -7758647 -11690429 -14285436 -13734463 -11154465 -7897624
40329 -7897624 -3595689 1474993 4779920 4512824 2273861 609246 -417421 -1794337
40321 -1794337 -2212063 709206 6245541 10707143 12257531 12904045 14623600 16040522
40313 16040522 14975501 12536453 11959650 13827147 14960565 12610162 7859313 3948015
40305 3948015 2664673 3609090 5929277 9072715 11966964 12964864 11306725 8147985
40297 8147985 5734515 5687318 8059901 11684341 15209965 17860925 19286818 18986222 16472930
40288 16472930 12239863 8039116 5691705 5731415 7324197 9087157 9865382 9484524 9218584
$$ packed form
40345H866182N63689n47164m534767n378959j277427K289732J145365j822257
40337f95606k480568j853944k728529l931782k595007N50973K579998L256841
40329g897624M301935N070682L304927k67096k238963j664615j026667j376916
40321a794337m17726K921269N536335M461602J550388O46514J719555J416922
40313A6040522j065021k439048n76803J867497J133418k350403m750849l911298
40305C948015j283342R44417K320187L143438K894249R97900j658139l158740
40297H147985k413470m7197K372583L624440L525624K650960J425893l00596k513292
40288A6472930m233067m200747k347411L9710J592782J762960P78225l80858k65940
$$ plain form
40279 9218584 10724324 13793086 15911301 14968677 11723333 8585303 6827667 6445141
40271 6445141 7823817 11126250 14059059 13033142 7786364 2738596 1989781 4504618
40263 4504618 6288009 6109727 6320077 8184423 9478027 8084638 5694920 5496765 7167914
40254 7167914 6955270 3170158 -872220 -1016223 2266924 4862340 4786021 4369985 6303334
40245 6303334 9980440 13115405 15023746 16379133 17020292 16206405 14440498 12937141
40237 12937141 11481891 8798108 5118636 2503554 2218585 3443460 5044526 7056590
40229 7056590 9757543 12647811 15075558 16733153 16944947 14679960 10039652 4770069
40221 4770069 679052 -1552250 -1667966 599377 4340164 7031018 6620012 3716818
$$ packed form
40279I218584J505740L068762K118215r42624l245344l138030j757636l82526
40271F445141J378676L302433K932809j025917n246778n047768p48815K514837
40263D504618J783391j78282K10350J864346J293604j393389k389718j98155J671149
40254G167914k12644l785112m042378j44003L283147K595416p6319m16036J933349
40245F303334L677106L134965J908341J355387O41159q13887j765907j503357
40237A2937141j455250k683783l679472k615082k84969J224875J601066K012064
40229G056590K700953K890268K427747J657595K11794k264987m640308n269583
40221D770069m091017k231302j15716K267343L740787K690854m11006k903194
$$ plain form
40213 3716818 1003825 764662 3245845 6876075 9847926 11910625 14345844 17497786
40205 17497786 19241713 17613497 14215847 12420668 12312599 10577484 6128668 2445669
40197 2445669 2636408 5308972 7629578 9487710 11594425 12110213 9153885 5113155
40189 5113155 4344134 7225973 10291659 11914821 13955016 17531316 21063322 23452098
40181 23452098 25690039 27956064 28322619 26162590 24147192 24808776 27236388 29119014
40173 29119014 30129745 31188118 31975572 31453196 29875612 28422244 27679176 28064352 30653855
40164 30653855 35689094 41147407 44887915 47723845 52279975 58987132 65371072 69696067
40156 69696067 73418530 79211248 88042755 99311474 112796400 129077171 148460656
$$ packed form
40213C716818k712993k39163K481183L630230K971851K062699K435219L151942
40205A7497786J743927j628216l397650j795179j08069j735115m448816l682999
40197B445669J90739K672564K320606J858132K106715N15788k956328m040730
40189E113155p69021K881839L065686J623162K040195L576300L532006K388776
40181B3452098K237941K266025L66555k160029k015398O61584K427612J882626
40173B9119014J010731J058373P87454n22376j577584j453368p43068L85176K589503
40164C0653855N035239N458313L740508K835930M556130O707157O383940M324995
40156F9696067L722463N792718Q831507J1268719J3484926J6280771J9383485
$$ plain form
40149 148460656 170930015 197270556 228540879 262826979 292956212 309458480 307158285
40142 307158285 288595072 260774889 229740801 198956356 170916326 147484380 128701549
40135 128701549 113517546 102077590 95406666 92604620 90712086 88273805 86840800 87652269
40127 87652269 89033809 89100274 89343394 93026758 100854587 110681358 121385693 134893908
40119 134893908 153845850 178607023 207242308 237966877 271242368 308632564 347836479
40112 347836479 378714668 387486705 368061221 328437418 283617490 243118630 207777124
40105 207777124 176865605 153041546 138816947 132273788 129331326 128137434 128443716 128000752
40097 128000752 122620545 110130063 92755867 75436073 62446301 55003081 50965949
$$ packed form
40149A48460656K2469359K6340541L1270323L4286100L0129233J6502268k300195
40142C07158285j8563213k7820183l1034088l0784445k8040030k3431946j8782831
40135A28701549j5184003j1439956o670924k802046j892534k438281j433005Q11469
40127H7652269J381540O6465K43120L683364P827829R826771J0704335J3508215
40119A34893908J8951942K4761173K8635285L0724569L3275491L7390196L9203915
40112C47836479L0878189Q772037j9425484l9623803m4819928m0498860l5341506
40105B07777124l0911519k3824059j4224599o543159k942462j193892L06282m42964
40097A28000752n380207j2490482j7374196j7319794j2989772p443220m037132
$$ plain form
40090 50965949 47067645 42098217 37420919 34014593 30422681 24943478 18702229 14642901
40082 14642901 13860144 14610878 14768640 13651607 11522656 9023964 7382088 7592787 8908647
40073 8908647 9442616 8675384 8052413 8747518 10352997 12250769 14442866 16131203 15526486
40064 15526486 12687609 10684407 11651421 13157394 11421887 7275692 5311021 6806221
40056 6806221 7328368 3180661 -2921667 -5476037 -3455685 -688326 -5928 -446677 -319492
40047 -319492 196639 527792 1125935 1844447 970625 -2103365 -4640246 -3292463 1433129
40038 1433129 5528813 6333409 5163667 4618101 4930853 4204982 1407358 -2181905 -4439326
40029 -4439326 -4449700 -2925862 -1178863 -12523 651876 1432040 2768649 4365950 5352900
$$ packed form
40090E0965949l898304m969428m677298l406326l591912n479203o241249m059328
40082A4642901p82757P50734J57762j117033k128951k498692j641876K10699J315860
40073H908647N33969p67232o22971O95105J605479J897772K192097J688337o04717
40064A5526486k838877k003202R67014J505973j735507m146195j964671J495200
40056F806221N22147m147707o102328k554370K020352K767359O82398m40749J27185
40047c19492N16131L31153N98143P18512q73822l073990k536881J347783M725592
40038A433129M095684Q04596j169742n45566L12752p25871k797624l589263k257421
40029d439326j0374J523838J746999J166340O64399P80164J336609J597301R86950
$$ plain form
40020 5352900 5141323 4052741 2868939 1869517 765065 -384061 -883002 -522374 -428836
40011 -428836 -1946614 -4713199 -6494983 -5110402 -347498 5730303 10087478 11009127
40003 11009127 9956632 10635863 15126526 21332000 25563198 27233540 29173894 33362440
39995 33362440 38616073 43064298 46328280 47756507 45004596 37104107 27622055 21880023
39987 21880023 21375018 23240492 24657200 24952637 23419411 18605401 11363381 5950063
39979 5950063 5659724 8650021 10231625 8585567 6258054 6308380 8977769 12617204 16232587
39970 16232587 19720701 22031177 20589318 13624550 2958953 -6549256 -10974539 -10142486
39962 -10142486 -5994697 505437 8965328 16832826 20134769 18146408 15120916 15495875
$$ packed form
40020E352900k11577j088582j183802r99422j104452j149126m98941L60628R3538
40011d28836j517778k766585j781784J384581M762904O077801M357175R21649
40003A1009127j052495O79231M490663O205474M231198J670342J940354M188546
39995C3362440N253633M448225L263982J428227k751911p900489r482052n742032
39987B1880023n05005J865474J416708K95437j533226m814010p242020n413318
39979E950063k90339K990297J581604j646058k327513N0326K669389L639435L615383
39970A6232587L488114K310476j441859o964768j0665597r508209m425283Q32053
39962a0142486M147789O500134Q459891P867498L301943j988361l025492L74959
$$ plain form
39954 15495875 18753581 20923979 20017079 17600947 15527684 13780443 12067256 11171881
39946 11171881 11304282 10592088 6953978 1025845 -4111032 -6150455 -5667678 -4979222 -5708978
39937 -5708978 -7787669 -10125864 -11397199 -10262974 -5950563 471869 5820216 7006848
39929 7006848 3949053 -323963 -2662564 -2329363 -729841 101422 -1505887 -5672095
39921 -5672095 -9725044 -9718843 -4900002 450327 1576729 -1177196 -3506051 -3093570 -1547282
39912 -1547282 -363052 1757586 6186874 11479043 15001538 15685116 13602928 8773623
39904 8773623 2518575 -1576639 -749527 3398151 6504622 6137825 3150341 -718296
39896 -718296 -4157482 -5637292 -4132996 -821638 2115954 4556994 7929952 11392007
$$ packed form
39954A5495875L257706K170398r06900k416132k073263j747241j713187q95375
39946A1171881J32401p12194l638110n928133n136877k039423M82777O88456p29756
39937e708978k078691k338195j271335J134225M312411O422432N348347J186632
39929G006848l057795m273016k338601L33201J599522Q31263j607309m166208
39921e672095m052949O201M818841N350329J126402k753925k328855M12481J546288
39912a547282J184230K120638M429288N292169L522495O83578k082188m829305
39904H773623o255048m095214Q27112M147678L106471l66797k987484l868637
39896g18296l439186j479810J504296L311358K937592K441040L372958L462055
$$ plain form
39888 11392007 11541945 7373495 2918936 2683285 5978410 8005019 5712379 716533
39880 716533 -3023053 -2821607 920969 4963638 5566150 1978435 -2483948 -3818133 -1495576
39871 -1495576 1563152 2497688 849708 -1962277 -4066391 -4282523 -3104296 -2403443 -3168458
39862 -3168458 -3932750 -2551956 950483 4580312 6902726 7915880 7846608 6788330 5414731
39853 5414731 4433507 3360275 1327517 -1128584 -2845960 -4358157 -7310903 -11506369
39845 -11506369 -14820036 -16357055 -17174620 -17222064 -14409335 -8249340 -2009953 736716
39837 736716 -91276 -2503303 -5670156 -9435680 -12184955 -11972178 -9203070 -6050570 -3695993
39828 -3695993 -1946345 -811079 -399911 168067 1667900 2972543 2337345 160073 -1422998
$$ packed form
39888A1392007J49938m168450m454559k35651L295125K026609k292640m995846
39880G16533l739586K01446L742576M042669O02512l587715m462383j334185K322557
39871a495576L058728R34536j647980k811985k104114k16132J178227P00853p65015
39862c168458p64292J380794L502439L629829K322414J013154o9272j058278j373599
39853E414731r81224j073232k032758k456101j717376j512197k952746m195466
39845a1506369l313667j537019q17565m7444K812729O159995O239387K746669
39837G36716q27992k412027l166853l765524k749275K12777K769108L152500K354577
39828c695993J749648J135266M11168N67978J499833J304643o35198k177272j583071
$$ plain form
39819 -1422998 -1313666 38035 2274983 5022772 6615256 5500778 2814412 1042785
39811 1042785 307215 -1125973 -2689654 -1559297 2187030 4233975 2002455 -1100706
39803 -1100706 -122327 4967549 9955968 11710363 10018172 5688300 83858 -4177652
39795 -4177652 -5206329 -4532295 -5307854 -7878537 -9626007 -9221624 -8211219 -7669957 -5999736
39786 -5999736 -1632503 3923084 7475369 7563974 5171001 1921461 -1099597 -3283680
39778 -3283680 -4494308 -5089876 -5373549 -5286708 -4987992 -5091340 -5746163 -6118824 -5520967
39769 -5520967 -4509004 -4072456 -4252530 -4492358 -4853164 -5610615 -5818581 -3812345 355927
39760 355927 4244688 5654129 5014759 4143989 3443418 1853024 -599557 -1864499 -109278
$$ packed form
39819a422998J09332J351701K236948K747789J592484j114478k686366j771627
39811A042785p35570j433188j563681J130357L746327K046945k231520l103161
39803a100706R78379N089876M988419J754395j692191m329872n604442m261510
39795d177652j028677O74034p75559k570683j747470M04383J010405N41262J670221
39786e999736M367233N555587L552285Q8605k392973l249540l021058k184083
39778c283680j210628n95568k83673Q6841K98716j03348o54823l72661N97857
39769e520967J011963M36548j80074k39828l60806p57451k07966K006236M168272
39760C55927L888761J409441o39370q70770p00571j590394k452581j264942J755221
$$ plain form
39751 -109278 4152735 8790274 12003521 12923640 11397729 8458109 6395176 6859419 8794237
39742 8794237 9305212 6755352 2259575 -1789252 -3755666 -3436447 -1902715 -906350 -1340301
39733 -1340301 -1885550 -168412 4273437 9062525 11442220 10761200 8131133 4840705
39725 4840705 1997302 735371 1522631 3615928 6061177 8844371 12249564 15462630
39717 15462630 16769120 15230262 11741921 8459190 7217305 8079216 9340151 9494766
39709 9494766 9065679 9535416 10699590 10795842 9547059 8876826 9513920 9253953 6701100
39700 6701100 4681048 6748128 11268743 12586360 8416479 2840265 678227 1505013
39692 1505013 1217409 -2099878 -6047973 -7090345 -4208076 589560 4302069 5236480
$$ packed form
39751a09278M262013M637539L213247R20119j525911k939620k062933M64243J934818
39742H794237N10975k549860m495777m048827j966414L19219J533732R96365m33951
39733a340301n45249J717138M441849M789088K379695o81020k630067l290428
39725D840705k843403j261931P87260K093297K445249K783194L405193L213066
39717A5462630J306490j538858l488341l282731j241885Q61911J260935J54615
39709I494766m29087M69737J164174R6252j248783o70233O37094k59967k552853
39700F701100k020052K067080M520615J317617m169881n576214k162038Q26786
39692A505013k87604l317287l948095j042372K882269M797636L712509R34411
$$ plain form
39684 5236480 3849211 1755226 170331 -680437 -1359857 -3116820 -7233906 -13132786
39676 -13132786 -17470408 -16846839 -11823409 -6885433 -5792347 -7956060 -9848972 -8909058
39668 -8909058 -5486973 -1918893 -384492 -1105542 -2345062 -2715256 -3164388 -5378187 -8388481
39659 -8388481 -8760129 -4816313 1065172 5266163 6385145 4922096 1545069 -2464135
39651 -2464135 -4551449 -3079151 337654 2628457 3083440 3583633 5235259 6710541
39643 6710541 6320660 4247285 2120701 1360353 2371377 4602186 6921899 8243764
39635 8243764 7890789 5443326 1122099 -3062980 -3759719 424942 6394459 9043034
39627 9043034 6583033 2212961 228142 1585176 3713056 3803495 1740462 83370
$$ packed form
39684E236480j387269k093985j584895q50768o79420j756963m117086n898880
39676a3132786m337622O23569N023430M937976J093086k163713j892912R39914
39668h909058L422085L568080J534401p21050j239520l70194m49132k213799l010294
39659h388481l71648L943816N881485M200991J118982j463049l377027m009204
39651b464135k087314J472298L416805K290803M54983N00193J651626J475282
39643F710541l89881k073375k126584p60348J011024K230809K319713J321865
39635H243764l52975k447463m321227m185079o96739M184661N969517K648575
39627I043034k460001m370072j984819J357034K127880R0439k063033j657092
$$ plain form
39619 83370 1108576 3585147 3233630 -2603099 -11416808 -18050807 -20169176 -19418539 -17709682
39610 -17709682 -15141756 -12196952 -11028731 -12561840 -14230092 -12963212 -9376451 -6688966
39602 -6688966 -5987153 -4913269 -1347408 3528433 6685121 6636892 4612636 2989594 3129859
39593 3129859 4434433 5217986 4633357 3637822 3833339 5702313 8438567 11052460 12911746
39584 12911746 13639038 13505663 13665406 14749552 15212297 12488219 6321636 -218347 -3786289
39575 -3786289 -3976447 -2902916 -2607788 -3803878 -6204037 -8691079 -9611186 -8310441 -6302962
39566 -6302962 -5665173 -6280818 -6075454 -4279935 -2904286 -3938765 -6147923 -6084863 -2111558
39557 -2111558 3619199 7277616 6811241 3328007 -223598 -1400572 388027 4408976
$$ packed form
39619H3370J025206K476571l51517n836729q813709o633999k118369P50637J708857
39610a7709682K567926K944804J168221j533109j668252J266880L586761K687485
39602f688966P01813J073884L565861M875841L156688m8229k024256j623042J40265
39593C129859J304574P83553n84629r95535J95517J868974K736254K613893J859286
39584A2911746P27292j33375J59743J084146M62745k724078o166583o539983l567942
39575c786289j90158J073531K95128j196090k400159k487042r20107J300745K007479
39566f302962O37789o15645K05364J795519J375649j034479k209158O3060L973305
39557b111558N730757L658417m66375l483234l551605j176974J788599M020949
$$ plain form
39549 4408976 9946745 16520967 22853854 26787707 27245652 25852860 25565559 27660683
39541 27660683 30760978 32663593 32266219 29787303 26171676 22542299 19340177 15759276
39533 15759276 10976648 6137552 3738522 4281893 4951409 3067253 -86748 -752568
39525 -752568 2265226 5995494 7110261 5555884 3434910 1778624 55077 -1850737
39517 -1850737 -3019487 -3019668 -2557822 -1986113 -323368 3205079 7331637 9700207 9585464
39508 9585464 8596753 8465365 9113562 9410158 8940763 8132915 7146349 5704338 3969007
39499 3969007 2655830 2055821 1648682 1034718 748413 1684120 3832148 5859362 6163147
39490 6163147 4663206 3531099 5359730 10035671 14188246 14747775 12408604 10171663
$$ packed form
39549D408976N537769O574222O332887L933853M57945j392792k87301K095124
39541B7660683L100295J902615l97374k478916l615627l629377l202122l580901
39533A5759276m782628m839096k399030N43371O69516j884156l154001o65820
39525g52568L017794L730268J114767j554377k120974j656286j723547j905814
39517a850737j168750j81M61846N71709J662745L528447M126558K368570j14743
39508I585464r88711j31388O48197K96596m69395q07848r86566j442011j735331
39499C969007j313177o00009m07139o13964k86305R35707K148028K027214L03785
39490F163147j499941j132107J828631M675941M152575N59529k339171k236941
$$ plain form
39482 10171663 9019453 7201182 4017733 1738530 2274062 3976703 4034233 2854312
39474 2854312 3377250 6223402 8232576 6756394 3368997 1765367 3176629 5644416
39466 5644416 7411960 9117932 11906908 14632177 14452881 10239614 4230759 -298938
39458 -298938 -2243949 -2730354 -2715801 -2044901 -956049 -938089 -3134497 -6684066 -9477474
39449 -9477474 -10106529 -8576988 -5794515 -3085570 -1718411 -2060769 -3226036 -3777497 -2587085
39440 -2587085 709293 5152297 8396114 8500783 6033479 3045810 -65205 -4514239
39432 -4514239 -9404586 -10979612 -7588760 -2976595 -1846009 -3862056 -5075974 -3904663
39424 -3904663 -2173688 -975639 647252 2669859 3204349 1350292 -1921460 -5996960
$$ packed form
39482A0171663j152210j818271l183449k279203N35532J702641N7530j179921
39474B854312N22938K846152K009174j476182l387397j603630J411262K467787
39466E644416J767544J705972K788976K725269j79296m213267o008855m529697
39458b98938j945011m86405J4553O70900J088852J7960k196408l549569k793408
39449i477474o29055J529541K782473K708945J367159l42358j165267n51461J190412
39440b587085L296378M443004L243817J04669k467304k987669l111015m449034
39432d514239m890347j575026L390852M612165J130586k016047j213918J171311
39424c904663J730975J198049J622891K022607N34490j854057l271752m075500
$$ plain form
39416 -5996960 -10422217 -12081728 -6784922 4426019 14120891 16235547 12350467 7924644
39408 7924644 5154794 2702064 144542 -1282558 -1591091 -2360133 -4244752 -6576949
39400 -6576949 -9231493 -12770264 -16879018 -20315965 -22017825 -20994910 -16342127 -9198006
39392 -9198006 -3342507 -1398191 -1406756 325286 4007299 6867853 7899809 8498184 8620168
39383 8620168 6308047 1902389 -881255 301874 3408596 5299552 5451043 4686335
39375 4686335 2765541 -472212 -3421330 -4436618 -3930829 -2905098 -909168 2431053
39367 2431053 5289605 5601210 4296045 4000744 4901323 4457069 1361597 -2585516 -5161223
39358 -5161223 -6252285 -6780726 -6734157 -5534452 -3423675 -1331997 210143 1287845 2074801
$$ packed form
39416e996960m425257j659511N296806J1210941R694872K114656l885080m425823
39408G924644k769850k452730k557522j427100l08533p69042j884619k332197
39400f576949k654544l538771m108754l436947j701860J022915M652783P144121
39392i198006N855499J944316q565J732042L682013K860554J031956N98375J21984
39383H620168k312121m405658k783644J183129L106722J890956J51491p64708
39375D686335j920794l237753k949118j015288N05789J025731J995930L340221
39367B431053K858552L11605j305165k95301R00579m44254l095472l947113k575707
39358e161223j091062n28441M6569J199705K110777K091678J542140J077702P86956
$$ plain form
39349 2074801 2607592 2738458 1939729 -359788 -3737347 -6491252 -7038304 -5480946 -3371941
39340 -3371941 -2117878 -1999593 -2376784 -2114819 -78466 3585123 6286531 4381660 -3050647
39331 -3050647 -12291187 -18005367 -18040055 -14290409 -9409816 -4594267 -821476 181480
39323 181480 -1974681 -4594826 -4330144 -1094944 1914169 1928274 -860251 -4128292 -5486538
39314 -5486538 -3988511 -913882 1082457 680269 -719426 -1448930 -2245929 -4288553 -5577476
39305 -5577476 -2693309 3547114 7726929 6539856 2855553 1236659 2269665 3847939
39297 3847939 5432329 7566269 8893276 7612965 5314040 5558589 8468352 10293320
39289 10293320 9159193 7798875 8920198 10761745 9621408 4887111 -827419 -5189113
$$ packed form
39349B074801N32791J30866p98729k299517l377559k753905n47052J557358K109005
39340c371941J254063J18285l77191K61965K036353L663589K701408j904871p432307
39331c050647r240540n714180l4688L749646M880593M815549L772791J002956
39323A81480k156161k620145K64682L235200L009113J4105k788525l268041j358246
39314e486538J498027L074629J996339m02188j399695p29504p96999k042624j288923
39305e577476K884167O240423M179815j187073l684303j618894J033006J578274
39297C847939J584390K133940J327007j280311k298925K44549K909763J824968
39289A0293320j134127j360318J121323J841547j140337m734297n714530m361694
$$ plain form
39281 -5189113 -7318186 -6347227 -1663531 4995790 9785723 10136398 7006777 3395324
39273 3395324 1607188 2307783 4899284 7668622 8300151 5762191 1956766 471022
39265 471022 2967633 7232090 9518921 8714973 7358759 8232603 10762462 11723445 9191399
39256 9191399 4559050 324999 -2779400 -5268465 -6425409 -4432308 590148 5523150
39248 5523150 7619783 7751947 8486755 9680635 8513626 4247670 259968 -360721 670020
39239 670020 -913127 -6153973 -11862918 -15025057 -15623826 -14758722 -12571699 -9275864 -6262247
39230 -6262247 -4597772 -3715878 -2909747 -2736886 -3333359 -2697957 966264 5640152 6667822
39221 6667822 2158215 -4474664 -8222479 -7575432 -5006897 -3289355 -2715065 -2075659 -1247694
$$ packed form
39281e189113k129073R70959M683696O659321M789933L50675l129621l611453
39273C395324j788136P00595K591501K769338O31529k537960l805425j485744
39265D71022K496611M264457K286831q03948j356214Q73844K529859R60983k532046
39256I191399m632349m234051l104399k489065j156944J993101N022456M933002
39248E523150K096633J32164P34808J193880j167009m265956l987702o20689J030741
39239F70020j583147n240846n708945l162139n98769Q65104K187023L295835L013617
39230f262247J664475Q81894Q06131J72861n96473O35402L664221M673888J027670
39221F667822m509607o632879l747815O47047K568535J717542N74290O39406Q27965
$$ plain form
39212 -1247694 -1619712 -3821727 -6145478 -6380762 -4870449 -4322620 -6316859 -9301812 -10599632
39203 -10599632 -9132413 -5503401 -933995 2608410 2712885 -953323 -4999873 -5223661
39195 -5223661 -1297562 2874193 3575371 864721 -2196518 -2654580 53857 3778894
39187 3778894 5463637 4113918 1882399 1551882 3632772 6962080 10920457 14912054
39179 14912054 16510094 13272987 6927416 2888445 4299528 8749880 12182849 13608994
39171 13608994 13940359 12570943 8517916 4003071 3203098 6792579 10677739 11549431
39163 11549431 11253085 13358592 16990168 17287972 12179042 5715156 3033645 4024733
39155 4024733 4390339 1847027 -1646081 -3687234 -4291153 -4032113 -2358887 328343 1449705
$$ packed form
39212a247694l72018k202015k323751k35284J510313N47829j994239k984953j297820
39203a0599632J467219L629012M569406L542405J04475l666208m046550k23788
39195e223661L926099M171755P01178k710650l061239m58062K708437L725037
39187C778894J684743j349719k231519l30517K080890L329308L958377L991597
39179A4912054J598040l237107o345571m038971J411083M450352L432969J426145
39171A3608994L31365j369416m053027m514845p99973L589481L885160Q71692
39163A1549431k96346K105507L631576K97804n108930o463886k681511R91088
39155D024733L65606k543312l493108k041153o03919K59040J673226K687230J121362
$$ plain form
39146 1449705 -326168 -2305917 -1243089 1920484 3815027 3754311 3475819 2797949 -50090
39137 -50090 -3740750 -4138568 -449431 3148974 3778316 3753397 5824683 8262283 7873890
39128 7873890 5027411 2305305 459420 -977858 -1130745 639644 2315483 2080551
39120 2080551 2241473 6376544 13383053 18319140 18880439 17178106 15036367 11618308
39112 11618308 6724310 2828418 2051871 3555687 5365413 6719782 7415695 6819529
39104 6819529 4955329 3244968 3114106 4700260 7103998 8790567 8210607 5917827
39096 5917827 5539121 9948565 16516668 19214519 15911030 10398656 6400212 3264135
39088 3264135 -596215 -3609100 -3422159 -920543 1274527 2643204 4104096 4797317
$$ packed form
39146A449705j775873j979749J062828L163573J894543o0716k78492o77870k848039
39137e0090l690660l97818L689137L598405O29342k4919K071286K437600l88393
39128G873890k846479k722106j845885j437278j52887J770389J675839k34932
39120B080551J60922M135071P006509M936087N61299j702333k141739l418059
39112A1618308m893998l895892p76547J503816J809726J354369O95913n96166
39104F819529j864200j710361j30862J586154K403738J686569n79960k292780
39096E917827l78706M409444O568103K697851l303489n512374l998444l136077
39088C264135l860350l012885J86941K501616K195070J368677J460892O93221
$$ plain form
39080 4797317 2672846 -2120244 -6962762 -9687258 -9789957 -7271837 -2610662 2091560
39072 2091560 3996606 2136636 -1848557 -5432152 -6795662 -5502337 -3022991 -2002191
39064 -2002191 -3482181 -5327640 -4845413 -2347562 -480171 -643082 -1997632 -3582640
39056 -3582640 -5191004 -6094131 -5118584 -2663802 -1003789 -1853750 -4731457 -7966644 -10055566
39047 -10055566 -9878605 -7178741 -3368390 -471733 1334819 3780029 7366876 9590073
39039 9590073 7646229 2318959 -2107142 -1961182 2280360 6648071 7680590 5676136
39031 5676136 3853129 4556540 7207480 10247767 13597235 17695287 21032710 20773025
39023 20773025 16064952 9258069 3497777 189131 -1185731 -2099873 -4003955 -6996835
$$ packed form
39080D797317k124471m793090m842518k724496j02699K518120M661175M702222
39072B091560J905046j859970l985193l583595j363510J293325K479346J020800
39064b002191j479990j845459M82227K497851J867391j62911j354550j585008
39056c582640j608364r03127R75547K454782J660013q49961k877707l235187k088922
39047a0055566J76961K699864L810351K896657J806552K445210L586847K223197
39039I590073j943844n327270m426101J45960M241542M367711J032519k004454
39031E676136j823007P03411K650940L040287L349468M098052L337423k59685
39023B0773025m708073o806883n760292l308646j374862r14142j904082k992880
$$ plain form
39015 -6996835 -9232432 -8824744 -6303890 -3680978 -1191561 2801100 8033999 10925517
39007 10925517 8712545 3467081 -21620 415263 2896774 4861075 5839421 6542877
38999 6542877 6837590 5819957 3463929 1178601 327321 629188 756577 486545 1166702
38990 1166702 3440301 5702653 6119748 5194893 4482169 3446861 77716 -5313611 -9463301
38981 -9463301 -10025643 -7813843 -4444523 -373854 3342347 4065328 799802 -3400933
38973 -3400933 -4777385 -3378782 -2000792 -2015084 -2962822 -5154410 -9295621 -13647682 -14840754
38964 -14840754 -12311954 -9328254 -8530701 -8660131 -7064626 -3739901 -1227416 -1313591 -3043679
38955 -3043679 -3656189 -928283 4893542 11059277 14560203 14483963 11886205 8089261 4263137
$$ packed form
39015f996835k235597M07688K520854K622912K489417L992661N232899K891518
39007A0925517k212972n245464l488701M36883K481511J964301R78346P03456
38999F542877K94713j017633k356028k285328q51280L01867J27389k70032O80157
38990A166702K273599K262352M17095r24855p12724j035308l369145n391327m149690
38981i463301n62342K211800L369320M070669L716201P22981l265526m200735
38973c400933j376452J398603J377990j4292r47738k191588m141211m352061j193072
38964a4840754K528800K983700P97553j29430J595505L324725K512485q6175j730088
38955c043679o12510K727906N821825O165735L500926p6240k597758l796944l826124
$$ plain form
38946 4263137 1967279 2087329 3119291 2453457 -137504 -2115428 -1939187 -1260807 -2214646
38937 -2214646 -4310091 -5672902 -6008631 -6342723 -6592745 -5540663 -3240859 -1626872 -2051373
38928 -2051373 -3371895 -3391096 -1731947 -349470 -900963 -2262312 -1748659 985666 2697741
38919 2697741 592122 -3358528 -4331805 -826360 3474802 4661412 2984266 888754
38911 888754 -1021975 -3658325 -6518885 -7899194 -7667422 -7384986 -7504931 -6626610 -4158152
38902 -4158152 -1917591 -2011208 -4158912 -6102356 -6195175 -4976667 -4397672 -5782641 -8536604
38893 -8536604 -10972674 -12293526 -12963887 -12946515 -11049902 -7193225 -3956228 -3880031 -5918824
38884 -5918824 -6740094 -5214550 -3233772 -2103138 -994486 209226 -456820 -3573035
$$ packed form
38946D263137k295858J20050J031962o65834k590961j977924J76241O78380r53839
38937b214646k095445j362811l35729l34092k50022J052082K299804J613987m24501
38928b051373j320522j9201J659149J382477n51493j361349N13653K734325J712075
38919B697741k105619l950650r73277L505445M301162J186610j677146k095512
38911H88754j910729k636350k860560j380309K31772K82436j19945Q78321K468458
38902d158152K240561r3617k147704j943444r2819J218508N78995j384969k753963
38893h536604k436070j320852o70361J7372J896613L856677L236997P6197k038793
38884e918824q21270J525544J980778J130634J108652J203712o66046l116215
$$ plain form
38876 -3573035 -5843004 -3900950 516600 2077519 -1514478 -6716419 -8487286 -5736667
38868 -5736667 -1712866 -95883 -1458530 -3041189 -1597352 3247171 8402212 10298347
38860 10298347 8154318 3961578 38557 -2448740 -3321927 -3313175 -3846624 -5220212 -5139069
38851 -5139069 -1159307 4992800 7947598 4921258 -611531 -3431884 -3029574 -2851017
38843 -2851017 -4262380 -4883210 -3296681 -1841540 -2849854 -4761478 -4660776 -3130066
38835 -3130066 -3618200 -7419808 -11942300 -14156198 -13432577 -10440094 -5587546 114646
38827 114646 4410237 5825965 5612655 6327669 8936355 12253589 14653057 15337060 14416233
38818 14416233 12665814 10794713 8301101 3862978 -2224538 -7027285 -7873620 -5643595
$$ packed form
38876c573035k269969J942054M417550J560919l591997n201941j770867K750619
38868e736667M023801J616983j362647j582659J443837M844523N155041J896135
38860A0298347k144029m192740l923021k487297q73187Q752n33449j373588Q1143
38851e139069L979762O152107K954798l026340n532789k820353M02310J78557
38843b851017j411363o20830J586529J455141j008314j911624J00702J530710
38835c130066m88134l801608m522492k213898P23621K992483M852548N702192
38827A14646M295591J415728k13310P15014K608686L317234K399468O84003r20827
38818A4416233j750419j871101k493612m438123o087516m802747q46335K230025
$$ plain form
38810 -5643595 -3568567 -3167431 -3104336 -1964977 -389075 -129970 -2320212 -6712192 -11227587
38801 -11227587 -12443289 -8518469 -1982058 2340271 2723548 1895883 2383194 2971488 1305347
38792 1305347 -2225115 -5439610 -7695186 -9784754 -11332345 -10755254 -7792604 -4226394
38784 -4226394 -1942422 -1526714 -2536988 -3821242 -3799370 -1752632 1291153 3929078 6049455
38775 6049455 7963453 8811447 7632353 5364922 3719662 2441983 -62845 -3516450
38767 -3516450 -5673634 -5825186 -5960205 -7553814 -9305294 -9213210 -7197998 -4572138 -2409300
38758 -2409300 -1407869 -1808967 -2346391 -769834 3287244 7096069 7622130 4673232 733312
38749 733312 -1048039 1560939 8050501 13907615 13659440 7082368 388386 -815335
$$ packed form
38810e643595K075028M01136O3095J139359J575902K59105k190242m391980m515395
38801a1227587j215702L924820O536411M322329L83277q27665M87311N88294j666141
38792A305347l530462l214495k255576k089568j547591N77091K962650L566210
38784d226394K283972M15708j010274j284254K1872K046738L043785K637925K120377
38775F049455J913998Q47994j179094k267431j645260j277679k504828l453605
38767c516450k157184j51552j35019j593609j751480R2084K015212K625860K162838
38758b409300J001431m01098n37424J576557M057078L808825N26061k948898l939920
38749G33312j781351K608978O489562N857114k48175o577072o693982j203721
$$ plain form
38741 -815335 2197701 4282424 3416731 1330706 -1127387 -4836693 -8742876 -9586954 -6522120
38732 -6522120 -2885714 -1955474 -3408714 -5273987 -6926335 -8344190 -8297063 -5372076 80404
38723 80404 6395385 12144524 16248291 17657491 16223887 13271396 10409884 8337401
38715 8337401 7190172 6908133 6547813 4493935 431331 -3786445 -6155529 -6594444 -6295931
38706 -6295931 -6059944 -6146902 -6780215 -7827932 -8781415 -9680655 -10981063 -12009685 -11226453
38697 -11226453 -8903128 -7471335 -7639017 -6368808 -1278913 4636805 5999497 2103738
38689 2103738 -2346531 -3693147 -3348316 -4544766 -7900830 -11729563 -14673678 -16294904
38681 -16294904 -16329890 -14835259 -12316070 -8883027 -4278931 537741 3103448 1839351
$$ packed form
38741h15335L013036K084723q65693k086025k458093l709306l906183q44078L064834
38732f522120L636406R30240j453240j865273j652348j417855M7127K924987N452480
38723H0404O314981N749139M103767J409200j433604k952491k861512k072483
38715H337401j147229k82039l60320k053878m062604m217776k369084m38915K98513
38706f295931K35987q6958o33313j047717r53483q99240j300408j028622P83232
38697a1226453K323325J431793j67682J270209N089895N915718J362692l895759
38689B103738m450269j346616L44831j196450l356064l828733k944115j621226
38681a6294904l4986J494631K519189L433043M604096M816672K565707j264097
$$ plain form
38673 1839351 -2128649 -6343057 -9225357 -10199761 -9013236 -6323258 -4032422 -3529587
38665 -3529587 -4007535 -3605634 -1691435 953693 3377741 4558877 3080193 -1414706
38657 -1414706 -6543952 -8672600 -6415948 -1494660 3858489 8731033 12413285 13311513
38649 13311513 10436940 5269197 939312 -327376 1508379 4955427 8089354 9401464
38641 9401464 8656406 7187911 6771709 7902124 9450916 10176279 10265333 11034332 13084808
38632 13084808 15064002 14665752 11034152 5904611 2023174 602971 774238 1319510
38624 1319510 1997454 2733434 2454756 17963 -3705454 -5883163 -4631030 -1297343 1014336
38615 1014336 928168 -233530 -1011071 -1890704 -3727233 -5118072 -3414396 1367064 5580623
$$ packed form
38673A839351l968000m214408k882300r74404J186525K689978K290836N02835
38665c529587m77948M01901J914199K645128K424048J181136j478684m494899
38657a414706n129246k128648K256652M921288N353149M872544L682252Q98228
38649A3311513k874573n167743m329885j266688J835755L447048L133927J312110
38641I401464p45058j468495m16202J130415J548792P25363Q9054P68999K050476
38632A3084808J979194l98250l631600n129541l881437j420203J71267N45272
38624A319510O77944P35980k78678k436793l723417k177709J252133L333687K311679
38615A014336q6168j161698p77541q79633j836529j390839J703676M781460M213559
$$ plain form
38606 5580623 6212800 4873331 5763642 10180288 14938300 16400551 14317340 11131632
38598 11131632 9189290 9643269 12485406 15915987 16637636 12787862 6439848 1613888
38590 1613888 -91872 -322911 -572988 -52330 2404111 6122979 9373005 10979681 10174351
38581 10174351 6432145 1039765 -2423673 -1171584 3659506 8395403 10660055 10379420
38573 10379420 8106982 4740974 2339152 2401084 3149809 1245033 -3267467 -6589140
38565 -6589140 -6735708 -6326468 -7912835 -9567435 -8184761 -4949194 -3687390 -4756329
38557 -4756329 -4495649 -990361 3015977 3902624 1215677 -3140271 -7480375 -10816726
38549 -10816726 -12526460 -12831702 -12424072 -11000626 -7759445 -3862649 -2150701 -3159607
$$ packed form
38606E580623O32177j339469Q90311M416646M758012J462251k083211l185708
38598A1131632j942342M53979K842137L430581P21649l849774o348014m825960
38590A613888j705760k31039k50077N20658K456441L718868L250026J606676q05330
38581A0174351l742206n392380l463438J252089M831090M735897K264652k80635
38573A0379420k272438l366008k401822O1932P48725j904776m512500l321673
38565f589140j46568M09240j586367j654600J382674L235567J261804j068939
38557d756329K60680L505288M006338Q86647k686947m355948m340104l336351
38549a0816726j709734l05242M07630J423446L241181L896796J711948j008906
$$ plain form
38541 -3159607 -3718165 -1552213 632931 -1539125 -7740528 -12949691 -13922817 -12854919
38533 -12854919 -13553894 -16114525 -17183201 -14554999 -9787472 -6294633 -6077667 -8660054
38525 -8660054 -12195004 -14673589 -14570629 -11765547 -8274992 -6847399 -7883810 -8734638
38517 -8734638 -7233754 -4849616 -4490692 -6017894 -6487173 -4734543 -2882848 -2664982 -3055064
38508 -3055064 -2717872 -2048963 -1143578 1435571 5501822 7469789 4847349 476537 -1204438
38499 -1204438 -505997 -1048599 -3021010 -2654218 1247451 4954495 5603806 5343329 7259921
38490 7259921 10308369 11258427 9609091 7596074 6549234 5988215 5706893 6197783 6911475
38481 6911475 6142050 3341987 417028 -54238 2347134 5161393 5395303 2695447 -351558
$$ packed form
38541c159607n58558K165952K185144k172056o201403n209163r73126J067898
38533a2854919o98975k560631j068676K628202M767527L492839K16966k582387
38525h660054l534950k478585J02960K805082L490555J427593j036411q50828
38517h734638J500884K384138L58924j527202m69279J752630J851695K17866l90082
38508c055064L37192O68909R05385K579149M066251J967967k622440m370812j680975
38499a204438O98441n42602j972411L66792L901669L707044O49311k60477J916592
38490G259921L048448R50058j649336k013017j046840n61019k81322M90890P13692
38481F911475p69425k800063k924959m71266K401372K814259K33910k699856l047005
$$ plain form
38472 -351558 -1577125 -1904133 -3307025 -5066975 -4475913 -1207068 1647440 1611535 -380684
38463 -380684 -2003552 -2030641 -1611 3817183 6774889 5140661 -774436 -5553905 -5379404
38454 -5379404 -3158631 -3655634 -5942615 -5082300 21647 5252286 7610613 8277747 8515305
38445 8515305 6885339 2628923 -1401868 -1715290 1664765 5686501 7400852 5507122
38437 5507122 688953 -4124939 -5427460 -2595828 1354909 3362934 3270479 2396602 1040637
38428 1040637 -1160720 -3863412 -6493212 -8959638 -10739624 -10591592 -8408679 -5928365
38420 -5928365 -4288360 -2469785 284974 2322343 2032946 916880 1517607 3345867
38412 3345867 3867863 3081206 3793050 6829053 9007513 7293360 2796616 -940392 -2072560
$$ packed form
38472c51558j225567l27008j402892j759950N91062L268845K854508l5905j992219
38463c80684j622868k7089K029030L818794K957706j634228n915097m779469J74501
38454e379404K220773m97003k286981Q60315N103947N230639K358327O67134K37558
38445H515305j629966m256416m030791l13422L380055M021736J714351j893730
38437E507122m818169m813892j302521K831632L950737K008025r2455q73877j355965
38428A040637k201357k702692k629800k466426j779986J48032K182913K480314
38420e928365J640005J818575K754759K037369k89397j116066O00727J828260
38412C345867N21996p86657P11844L036003K178460j714153m496744l737008j132168
$$ plain form
38403 -2072560 -1337604 -83241 804570 540526 -1384095 -4446671 -7244014 -8472259 -7574238
38394 -7574238 -5018575 -2552760 -2561547 -6006273 -10832489 -13253995 -11244176 -6686234 -3735807
38385 -3735807 -4814642 -8155055 -9495318 -6474293 -1279118 1415393 -803912 -5743715
38377 -5743715 -9151649 -9210076 -8000667 -8517830 -10832158 -11929602 -9478808 -5008903 -2484161
38368 -2484161 -3897358 -7296894 -9414364 -9086077 -7291821 -4975142 -2543843 -1279554
38360 -1279554 -3265208 -8867741 -15230365 -18409337 -16886371 -12442587 -7878606 -4550846
38352 -4550846 -2053656 441748 2987241 4798560 5088062 3930823 2425357 2005029
38344 2005029 3377023 5812959 7376088 6211873 2204606 -2420907 -4546926 -2846182
$$ packed form
38403b072560P34956J254363Q87811k64044j924621l062576k797343j228245Q98021
38394g574238K555663K465815q787l444726m826216k421506K009819M557942K950427
38385c735807j078835l340413j340263L021025N195175K694511k219305m939803
38377e743715l407934n8427J209409n17163k314328j097444K450794M469905K524742
38368b484161j413197l399536k117470L28287J794256K316679K431299J264289
38360a279554j985654n602533o362624l178972J522966M443784M563981L327760
38352d550846K497190K495404K545493J811319K89502j157239j505466m20328
38344B005029J371994K435936J563129j164215m007267m625513k126019J700744
$$ plain form
38336 -2846182 734323 2520563 637420 -2983246 -4499287 -2116536 2334220 5871003
38328 5871003 7490489 8044913 7831278 5976701 2451232 -835371 -1960453 -1227819 -491368
38319 -491368 -684755 -1006240 -453319 742476 1557962 1614123 1653512 2317173 2586543 247145
38309 247145 -5289950 -11086148 -12899360 -9467499 -3407228 2266202 6834680 10454325
38301 10454325 12100163 10818056 7871985 5546441 4281602 2910065 1458406 1558849
38293 1558849 3640878 5544796 4904596 1842519 -1531347 -3593090 -4472534 -5196060 -6048730
38284 -6048730 -5933733 -3685219 -86656 2338369 2223618 1055614 918256 1616023 1524276
38275 1524276 182432 -2004431 -5602504 -10828432 -14811049 -13618516 -7755430 -2513512
$$ packed form
38336b846182L580505J786240j883143l620666j516041K382751M450756L536783
38328E871003J619486N54424k13635j854577l525469l286603j125082P32634P36451
38319d91368j93387l21485N52921J195795Q15486N6161L9389O63661K69370k339398
38309B47145n537095n796198j813212L431861O060271N673430M568478L619645
38301A0454325J645838j282107k946071k325544j264839j371537j451659J00443
38293A558849K082029J903918o40200l062077l373866k061743q79444p23526q52670
38284f048730J14997K248514L598563K425025j14751j168004j37358O97767r1747
38275A524276j341844k186863l598073n225928l982617J192533N863086N241918
$$ plain form
38267 -2513512 -1547797 -2940305 -3227275 -2350895 -2093084 -2005976 -140589 3390771 6502276
38258 6502276 8149727 8832779 8736275 7806651 7183665 7998281 8835088 6837296 1650704
38249 1650704 -3758504 -6493535 -6079550 -3338559 863775 5065294 7313614 6906460
38241 6906460 4949338 2736989 838370 54136 1545736 5056288 8214518 8642292
38233 8642292 6173964 2575511 -178150 -1123986 -795098 -829044 -2263955 -4098239 -4449326
38224 -4449326 -3062208 -1481407 -795963 -634040 -484518 -520163 -900438 -1661494 -3270429
38215 -3270429 -5604999 -6579726 -4153730 39819 1745248 -478319 -3581344 -4736964
38207 -4736964 -4559914 -4002222 -1623673 3026120 6247624 4369089 -646527 -3613554
$$ packed form
38267b513512R65715j392508k86970Q76380K57811Q7108J865387L531360L111505
38258F502276J647451O83052r6504r29624o22986Q14616Q36807j997792n186592
38249A650704n409208k735031M13985K740991M202334M201519K248320m07154
38241F906460j957122k212349j898619p84234J491600L510552L158230M27774
38233H642292k468328l598453k753661r45836L28888l3946j434911j834284l51087
38224d449326J387118J580801O85444J61923J49522l5645l80275p61056j608935
38215c270429k334570r74727K425996M193549J705429k223567l103025j155620
38207d736964J77050N57692K378549M649793L221504j878535n015616k967027
$$ plain form
38199 -3613554 -2892160 -915849 880546 3157133 5097621 4657762 3066980 4244078
38191 4244078 8086675 8977085 3662875 -3391159 -5991857 -4317322 -3021674 -3741350
38183 -3741350 -4160305 -3277611 -2717677 -2623182 -633182 3793048 7501161 7800851 5901954
38174 5901954 4529402 4383141 4871586 6446758 9853880 14041736 16865367 17394881 16051496
38165 16051496 13181154 9183435 5485454 3448975 2395561 549984 -1856263 -2263176
38157 -2263176 745279 5159384 7730127 7371068 5376310 3100186 629304 -2479051
38149 -2479051 -5984172 -8565950 -8556353 -5542208 -1240122 2155630 4584222 7633094 11049613
38140 11049613 11887107 8618121 4012023 1454163 110244 -2869640 -6433738 -6385498
$$ packed form
38199c613554P21394J976311J796395K276587J940488m39859j590782J177098
38191D244078L842597Q90410n314210p054034k600698J674535J295648p19676
38183c741350m18955Q82694N59934R4495J990000M426230L708113K99690j898897
38174E901954j372552j46261M88445J575172L407122M187856K823631N29514j343385
38165A6051496k870342l997719l697981k036479j053414j845577k406247m06913
38157b263176L008455M414105K570743l59059j994758k276124k470882l108355
38149b479051l505121k581778R597L014145M302086L395752K428592L048872L416519
38140A1049613Q37494l268986m606098k557860j343919k979884l564098M8240
$$ plain form
38132 -6385498 -2441272 247081 -1324695 -3215409 -709597 4149934 5609872 2581656
38124 2581656 -902509 -2568128 -4178448 -6825181 -8883090 -9857231 -11742624 -14543610
38116 -14543610 -14526902 -9732233 -3838834 -1326169 -1617433 -1602292 -1425441 -3230698 -5576160
38107 -5576160 -4193426 1373286 6296220 6889754 4920937 3839255 3856540 3167558 1853981
38098 1853981 1836353 3856502 6574211 8204829 7635797 4540724 -168486 -4363098 -6413055
38089 -6413055 -6743761 -6905901 -7533292 -8033073 -7757190 -6534201 -4481533 -2204375 -744382
38080 -744382 -440718 -354628 244709 555336 -271953 -1014172 355097 3382624 5190032
38071 5190032 4341058 2713654 2470789 2931899 2143377 334895 -342221 804299 1918646
$$ packed form
38132f385498L944226K688353j571776j890714K505812M859531J459938l028216
38124B581656l484165j665619j610320k646733k057909r74141j885393k800986
38116a4543610J6708M794669N893399K512665k91264J5141J76851j805257k345462
38107e576160J382734N566712M922934N93534j968817j081682J7285o88982j313577
38098A853981j7628K020149K717709J630618n69032l095073m709210m194612k049957
38089f413055l30706j62140o27391m99781K75883J222989K052668K277158J459993
38080g44382L03664Q6090N99337L10627q27289p42219J369269L027527J807408
38071E190032q48974j627404k42865M61110p88522j808482o77116J146520J114347
$$ plain form
38062 1918646 1249025 -706446 -2346121 -2936995 -2528554 -915683 2082670 5698298 8605982
38053 8605982 10200038 10802033 10712304 9722554 7550845 4212450 16458 -4290000 -7517883
38044 -7517883 -8823858 -8471898 -7258213 -5415835 -2943916 -828851 -631592 -2470188
38036 -2470188 -4538931 -5210014 -4570914 -3253420 -1072379 1926913 4197896 4286824 3191860
38027 3191860 3189269 4317363 4077495 1265022 -1859072 -2640816 -1907403 -2781364 -5961968
38018 -5961968 -8149956 -5957587 -300793 4258714 4419658 1520291 -372111 791578
38010 791578 3036107 3150703 544366 -2376420 -3029606 -805091 3244284 7372724 9445776
38001 9445776 7759288 2843860 -2078024 -3660581 -1628837 1144514 1675144 -603605
$$ packed form
38062A918646o69621j955471j639675n90874M08441J612871K998353L615628K907684
38053H605982J594056O01995q9729r89750k171709l338395m195992m306458l227883
38044g517883j305975L51960J213685J842378K471919K115065J97259j838596
38036b470188k068743o71083O39100J317494K181041K999292K270983Q8928j094964
38027C191860k591J128094k39868k812473l124094p81744P33413q73961l180604
38018e961968k187988K192369N656794M559507J60944k899367j892402J163689
38010G91578K244529J14596k606337k920786o53186K224515M049375M128440K073052
38001I445776j686488m915428m921884j582557K031744K773351N30630k278749
$$ plain form
37993 -603605 -4196290 -7396859 -9133877 -8628957 -5614389 -1536578 424879 -1864652
37985 -1864652 -6480062 -8707507 -6322729 -2420454 -1488565 -3580727 -4580114 -2125299
37977 -2125299 1207446 1520115 -1666627 -5681252 -8094720 -8181389 -6275085 -3657793 -2351076
37968 -2351076 -3028947 -3543954 -1550977 1551075 1572440 -3022676 -8692175 -10983360 -9514776
37959 -9514776 -7274370 -6093090 -4845810 -2070433 1471689 3772393 4136166 3515332
37951 3515332 2484033 319931 -3002854 -4936466 -2433285 3733770 8507094 7736214
37943 7736214 2795229 -1399881 -2047659 -259537 2131548 4892985 7931844 9900465
37935 9900465 9811395 8617258 7667070 6640627 4564432 2074717 944261 1700826 3319418
$$ packed form
37993f03605l592685l200569j737018N04920L014568M077811J961457k289531
37985a864652m615410k227445K384778L902275R31889k092162r99387K454815
37977b125299L332745L12669l186742m014625k413468q6669J906304K617292J306717
37968b351076o77871n15007J992977L102052K1365m595116n669499k291185J468584
37959i514776K240406J181280J247280K775377L542122K300704L63773o20834
37951C515332j031299k164102l322785j933612K503181O167055M773324p70880
37943G736214m940985m195110o47778J788122K391085K761437L038859J968621
37935I900465q9070j194137r50188j026443k076195k489715j130456P56565J618592
$$ plain form
37926 3319418 5121298 7274862 9245190 9634308 8480206 8176139 10598039 14176569
37918 14176569 15516618 13677406 11101057 9927581 9101085 6316642 1644084 -2534655
37910 -2534655 -4827373 -6269616 -8161821 -10098923 -11005549 -10868087 -10280240 -9157896 -7214623
37901 -7214623 -5189495 -4290392 -4613195 -5212462 -5570470 -5953685 -6474427 -6824232 -6770181
37892 -6770181 -5961438 -3675723 -19052 3096758 3797136 2698778 1577450 -63307
37884 -63307 -4315577 -10269091 -13211940 -10160475 -3736124 1541360 4553160 6523463
37876 6523463 6720914 3050351 -3522400 -8732778 -9858853 -8105193 -5487970 -2078941
37868 -2078941 2235702 5466121 5145263 1504644 -2402667 -3562921 -1519509 1380328
$$ packed form
37926C319418J801880K153564J970328L89118j154102l04067K421900L578530
37918A4176569J340049j839212k576349j173476q26496k784443m672558m178739
37910b534655k292718j442243j892205j937102r06626J37462N87847J122344J943273
37901g214623K025128Q99103l22803n99267l58008l83215n20742l49805N4051
37892f770181Q08743K285715L656671L115810P00378j098358j121328j640757
37884f3307m252270n953514k942849L051465O424351N277484L011800J970303
37876F523463J97451l670563o572751n210378j126075J753660K617223L409029
37868b078941M314643L230419l20858l640619l907311j160254K043412K899837
$$ plain form
37860 1380328 2004017 -484963 -3451399 -3758711 -1858305 -1221002 -3355967 -5545902 -4719463
37851 -4719463 -1571664 1064788 2402099 3779665 5310814 5157273 2546222 -547807
37843 -547807 -1597049 -73005 2928503 6447058 9993604 12692148 13148171 10492761
37835 10492761 5418357 -30836 -4097450 -6902469 -9847919 -13102018 -14626946 -12731821
37827 -12731821 -8836246 -6164533 -5942709 -6479694 -5997588 -4544801 -2686707 -278915
37819 -278915 2323338 3445153 2033918 -591565 -2331669 -2700908 -2184453 -312272 3481162
37810 3481162 7574564 9142222 7734413 5845432 5338557 5205505 3748144 1226495
37802 1226495 -838623 -1485424 -161579 3659381 8902686 12185425 10993486 7095470
$$ packed form
37860A380328O23689k488980k966436l07312J900406O37303k134965k189935Q26439
37851d719463L147799K636452J337311J377566J531149j53541k611051l094029
37843e47807j049242J524044L001508L518555L546546K698544M56023k655410
37835A0492761n074404n449193m066614k805019k945450l254099j524928J895125
37827a2731821L895575K671713K21824n36985M82106J452787J858094K407792
37819b78915K602253J121815j411235k625483j740104l69239N16455J872181L793434
37810C481162M093402J567658j407809j888981n06875j33052j457361k521649
37802A226495k065118o46801J323845L820960N243305L282739j191939l898016
$$ plain form
37794 7095470 4639985 5045897 6029841 5836689 5784024 7375644 9058286 7942051 3764790
37785 3764790 -757414 -3171501 -3304887 -2207122 -727135 369538 141419 -1618421
37777 -1618421 -3569196 -3754640 -1597631 1282008 2516800 1374496 -435625 -593174
37769 -593174 1252649 3170015 3367702 2394624 2333278 3983534 5619827 5026684 2476048
37760 2476048 936020 2877244 7251784 10409804 10030603 7248462 4552136 2698729
37752 2698729 700597 -1995136 -4770035 -6927733 -8111725 -7836589 -6134824 -4599459
37744 -4599459 -4970628 -6348473 -5662674 -1602939 3684217 7652791 10175124 12051789
37736 12051789 12720904 11465061 9445185 8244282 7313155 5171174 2546372 1894649
$$ packed form
37794G095470k455485M05912R83944j93152n2665J591620J682642j116235m177261
37785C764790m522204k414087j33386J097765J479987J096673k28119j759840
37777a618421j950775j85444K157009K879639J234792j142304j810121j57549
37769e93174J845823J917366J97687r73078o1346J650256J636293n93143k550636
37760B476048j540028J941224M374540L158020l79201k782141k696326j853407
37752B698729j998132k695733k774899k157698j183992K75136J701765J535365
37744d599459l71169j377845O85799M059735N287156L968574K522333J876665
37736A2051789O69115j255843k019876j200903r31127k141981k624802o51723
$$ plain form
37728 1894649 3871621 6475009 7835766 7817094 6628167 4097031 1133091 -51115
37720 -51115 1458449 3587218 3391602 307036 -3483191 -5530856 -5504997 -5277263 -6650574
37711 -6650574 -8977256 -9900306 -9054551 -9487098 -13473222 -18057022 -17738918 -11724854 -5586043
37702 -5586043 -4727264 -8650954 -12962819 -14711290 -13883675 -11521504 -8769218 -6921661
37694 -6921661 -6329312 -5537589 -2996348 632354 3051493 2947917 1090720 -868866 -1906888
37685 -1906888 -2266802 -3133269 -5184605 -7187271 -6972359 -4238065 -1121211 787439 2617208
37676 2617208 6165650 10767986 13732160 13414419 10737427 7978808 6697085 6299443
37668 6299443 4359312 -593871 -6393640 -9074006 -7929105 -6441619 -7005806 -7507774
$$ packed form
37728A894649J976972K603388J360757j8672j188927k531136k963940j184206
37720e1115J509564K128769j95616l084566l790227k047665K5859K27734j373311
37711f650574k326682r23050Q45755m32547l986124m583800L18104O014064O138811
37702e586043Q58779l923690m311865j748471Q27615K362171K752286J847557
37694f921661N92349P91723K541241L628702K419139j03576j857197j959586j038022
37685a906888l59914q66467k051336k002666K14912K734294L116854J908650J829769
37676B617208L548442M602336K964174l17741k676992k758619j281723l97642
37668F299443j940131m953183n799769k680366J144901J487486n64187n01968
$$ plain form
37660 -7507774 -5466954 -2947025 -3739398 -7143203 -8565079 -6047570 -2544789 -1307061
37652 -1307061 -2249584 -3684851 -4745305 -4971241 -3965929 -2679886 -2950488 -4642774 -5189843
37643 -5189843 -3078376 28442 1651383 1093723 -1295525 -5195765 -9052150 -9833769
37635 -9833769 -6334708 -1503054 568276 -926262 -3836740 -6627629 -9235374 -11058807
37627 -11058807 -10960860 -9689212 -9747075 -11606643 -12031954 -8119551 -1915266 1346146 -371635
37618 -371635 -3546832 -4148013 -3062920 -4332308 -9025907 -13713527 -15198138 -13948106
37610 -13948106 -11797129 -9008894 -5615999 -3355425 -3574529 -4762602 -4868325 -4652749
37602 -4652749 -5716030 -6582289 -4632850 -1329695 -1221716 -5363558 -9774588 -11245702
$$ packed form
37660g507774K040820K519929p92373l403805j421876K517509L502781J237728
37652a307061r42523j435267j060454k25936J005312J286043k70602j692286n47069
37643e189843K111467L106818J622941n57660k389248l900240l856385p81619
37635i833769L499061M831654K071330j494538k910478k790889k607745j823433
37627a1058807R7947J271648n7863j859568m25311L912403O204285L261412j717781
37618c71635l175197o01181J085093j269388m693599m687620j484611J250032
37610a3948106K150977K788235L392895K260574k19104j188073j05723K15576
37602d652749j063281q66259J949439L303155J07979m141842m411030j471114
$$ plain form
37594 -11245702 -10605413 -9028253 -5528095 -353020 3214963 3466147 3283277 5386437
37586 5386437 7730039 7211039 4987104 3862549 2853001 -707003 -5169844 -5974351
37578 -5974351 -2691243 339732 880313 1584364 4661916 8015665 8801576 7538976 6280696
37569 6280696 5102992 2855991 -86279 -1981937 -2062789 -1499198 -2261437 -5091383 -7888009
$$ packed form
37594a1245702O40289J577160L500158N175075L567983K51184j82870K103160
37586E386437K343602n19000k223935j124555j009548l560004m462841q04507
37578e974351L283108L030975N40581P04051L077552L353749P85911j262600j258280
37569F280696j177704k247001k942270j895658q0852N63591p62239k829946k796626
$$ [...]
##END NTUPLES=NMR SPECTRUM
##END=
