##TITLE=31Pdec_DE-54_DCM_KTFA
 CDCl3
 64 sc
 6.5.2024
##JCAMPDX= 6.0         $$ Bruker NMR JCAMP-DX V2.0
##DATA TYPE= NMR SPECTRUM
##DATA CLASS= NTUPLES
##ORIGIN= UXNMR, Bruker Analytische Messtechnik GmbH
##OWNER= root
$$ XWIN-NMR		Version 3.5
$$ Mon May  6 15:46:33 2024 Russian Standard Time (UT+4h)  she@DPX200
##.OBSERVE FREQUENCY= 81.013821
##.OBSERVE NUCLEUS= ^31P
##.ACQUISITION MODE= SIMULTANEOUS
##.ACQUISITION SCHEME= undefined
##.AVERAGES= 64
##.DIGITISER RES= 16
##SPECTROMETER/DATA SYSTEM= spect
##.PULSE SEQUENCE= zgpg30
##.SOLVENT NAME= CDCl3
##.SHIFT REFERENCE= (INTERNAL, CDCl3, 0, 248.564)
##AUDIT TRAIL= $$ (NUMBER, WHEN, WHO, WHERE, WHAT)
$$ ##TITLE= Audit trail, XWIN-NMR		Version 3.5
$$ ##JCAMPDX= 5.01
$$ ##ORIGIN= Bruker BioSpin GmbH
$$ ##OWNER= she
$$ F:/spectra/data/she/nmr/P31/1/pdata/1/auditp.txt
$$ ##AUDIT TRAIL=  $$ (NUMBER, WHEN, WHO, WHERE, WHAT)
(   1,<2024-05-06 15:45:25.57 +0400>,<she>,<DPX200>,
      <continue with go, POWCHK disabled, PULCHK disabled
       configuration hash MD5:
       00 E9 B6 7A A2 85 ED C7 34 08 36 98 17 FE 4E 26
       data hash MD5: 32K
       04 A7 84 CE 5B A3 AD BB 41 89 3F 31 C9 0A 6B 91>)
(   2,<2024-05-06 15:45:39.42 +0400>,<she>,<DPX200>,
      <Start of raw data processing
       efp BC_mod = 2 LB = 10 FT_mod = 6 PKNL = 1 PHC0 = -13308.45 PHC1 = 267.8834 SI = 64K 
       data hash MD5: 64K
       74 F0 2E 1A 62 37 E1 2A D1 1E 7D 63 CD A0 1F 25>)
(   3,<2024-05-06 15:45:58.56 +0400>,<she>,<DPX200>,
      <pk PHC0 = 8.230003 PHC1 = 0 
       data hash MD5: 64K
       BC 96 66 DD 29 B3 50 C8 29 98 7A 9D 9E 03 CF C2>)
(   4,<2024-05-06 15:46:02.12 +0400>,<she>,<DPX200>,
      <abs ABSG = 5 
       data hash MD5: 64K
       B1 5B DA 10 BC 4B D0 A5 78 CD 46 7A C4 6D 71 4A>)
$$ ##END=
$$ 
$$ hash MD5
$$ 88 0A 33 37 D3 34 8D 07 D4 7B 87 41 F4 C7 09 D1
##$RELAX= 
##$RELAX= 
##$RELAX= 
##$RELAX= 
##$RELAX= 
##$RELAX= 
##$RELAX= 
##$RELAX= 
##$RELAX= 
$$ Bruker specific parameters
$$ --------------------------
##$DU= <F:/spectra>
##$EXPNO= 1
##$NAME= <P31>
##$PROCNO= 1
##$TYPE= <nmr>
##$USER= <she>
##$AMP= (0..31)
100 100 100 100 100 100 100 100 100 100 100 100 100 100 100 100 100 100 
100 100 100 100 100 100 100 100 100 100 100 100 100 100 
##$AQSEQ= 0
##$AQ_mod= 1
##$AUNM= <au_zg>
##$AUTOPOS= <>
##$BF1= 81.014009
##$BF2= 200.13
##$BF3= 200.13
##$BF4= 200.13
##$BF5= 200.13
##$BF6= 200.13
##$BF7= 200.13
##$BF8= 200.13
##$BYTORDA= 1
##$CFDGTYP= 0
##$CFRGTYP= 5
##$CHEMSTR= <none>
##$CNST= (0..31)
1 1 145 1 1 1 1 1 1 1 1 1 1 1 1 1 1 1 1 1 1 1 1 1 1 1 1 1 1 1 1 1 
##$CPDPRG= <waltz16>
##$CPDPRG1= <>
##$CPDPRG2= <waltz16>
##$CPDPRG3= <>
##$CPDPRG4= <mlev>
##$CPDPRG5= <mlev>
##$CPDPRG6= <mlev>
##$CPDPRG7= <mlev>
##$CPDPRG8= <mlev>
##$CPDPRGB= <>
##$CPDPRGT= <>
##$D= (0..31)
0 1 0 0 0 0 0 0 0 0 0 0.03 2e-05 3e-06 0 0 0 0 0 0 0 0 0 0 0 0 0 0 0 0 
0 0 
##$DATE= 1714995826
##$DBL= (0..7)
120 120 120 11 120 120 24 19 
##$DBP= (0..7)
150 150 150 150 150 150 150 150 
##$DBP07= 0
##$DBPNAM0= <>
##$DBPNAM1= <>
$$ [...]
##$SUBNAM3= <"">
##$SUBNAM4= <"">
##$SUBNAM5= <"">
##$SUBNAM6= <"">
##$SUBNAM7= <"">
##$SUBNAM8= <"">
##$SUBNAM9= <"">
##$SW= 501.771253377433
##$SWIBOX= (0..15)
0 1 3 0 0 0 0 0 0 0 0 0 0 0 0 0 
##$SW_h= 40650.406504065
##$TD= 32768
##$TD0= 1
##$TE= 0
##$TE2= 300
##$TE3= 300
##$TEG= 300
##$TL= (0..7)
0 120 53 12 22 120 120 120 
##$TP= (0..7)
150 150 150 150 150 150 150 150 
##$TP07= 0
##$TPNAME0= <>
##$TPNAME1= <>
##$TPNAME2= <>
##$TPNAME3= <>
##$TPNAME4= <>
##$TPNAME5= <>
##$TPNAME6= <>
##$TPNAME7= <>
##$TPOAL= (0..7)
0.5 0.5 0.5 0.5 0.5 0.5 0.5 0.5 
##$TPOFFS= (0..7)
0 0 0 0 0 0 0 0 
##$TUNHIN= 0
##$TUNHOUT= 0
##$TUNXOUT= 0
##$USERA1= <user>
##$USERA2= <user>
##$USERA3= <user>
##$USERA4= <user>
##$USERA5= <user>
##$V9= 5
##$VALIST= <valist>
##$VCLIST= <CCCCCCCCCCCCCCC>
##$VD= 0
##$VDLIST= <DDDDDDDDDDDDDDD>
##$VPLIST= <PPPPPPPPPPPPPPP>
##$VTLIST= <TTTTTTTTTTTTTTT>
##$WBST= 1024
##$WBSW= 4
##$XGAIN= (0..3)
0 0 0 0 
##$XL= 0
##$YL= 0
##$YMAX_a= 9160
##$YMIN_a= -4275
##$ZGOPTNS= <>
##$ZL1= 120
##$ZL2= 120
##$ZL3= 120
##$ZL4= 120
##$ABSF1= 248.5645
##$ABSF2= -253.2056
##$ABSG= 5
##$ABSL= 3
##$ALPHA= 0
##$AQORDER= 0
##$ASSFAC= 0
##$ASSFACI= 0
##$ASSFACX= 0
##$ASSWID= 0
##$AUNMP= <proc_1d>
##$AZFE= 0.1
##$AZFW= 0.5
##$BCFW= 0
##$BC_mod= 2
##$BYTORDP= 0
##$COROFFS= 0
##$CY= -3
##$DATMOD= 1
##$DC= 0
##$DFILT= <>
##$DTYPP= 0
##$F1P= 0
##$F2P= 0
##$FCOR= 1
##$FTSIZE= 65536
##$FT_mod= 6
##$GAMMA= 0
##$GB= 0
##$INTBC= 1
##$INTSCL= 6.047779e-11
##$ISEN= 30
##$LB= 10
##$LEV0= 0
##$LPBIN= 0
##$MAXI= 10000
##$MC2= 0
##$MEAN= 0
##$ME_mod= 0
##$MI= 50
##$NCOEF= 0
##$NC_proc= -9
##$NLEV= 6
##$NOISF1= 182.463
##$NOISF2= 159.3651
##$NSP= 0
##$NTH_PI= 0
##$NZP= 0
##$OFFSET= 248.5645
##$PC= 4
##$PHC0= -13300.22
##$PHC1= 267.8834
##$PH_mod= 1
##$PKNL= yes
##$PPARMOD= 0
##$PSCAL= 0
##$PSIGN= 0
##$REVERSE= no
##$SF= 81.0140089999694
##$SI= 65536
##$SIGF1= 159.3651
##$SIGF2= -187.1042
##$SINO= 113.3802
##$SIOLD= 16384
##$SREGLST= <1H.CDCl3>
##$SSB= 0
##$STSI= 65536
##$STSR= 0
##$SW_p= 40650.406504065
##$SYMM= 0
##$S_DEV= 0
##$TDeff= 32768
##$TDoff= 0
##$TI= <>
##$TILT= no
##$TM1= 0
##$TM2= 0
##$TOPLEV= 0
##$USERP1= <user>
##$USERP2= <user>
##$USERP3= <user>
##$USERP4= <user>
##$USERP5= <user>
##$WDW= 1
##$XDIM= 65536
##$YMAX_p= 357954282
##$YMIN_p= -60422405
$$ End of Bruker specific parameters
$$ ---------------------------------
##NTUPLES= NMR SPECTRUM
##VAR_NAME=  FREQUENCY,     SPECTRUM/REAL,   SPECTRUM/IMAG
##SYMBOL=    X,             R,               I
##VAR_TYPE=  INDEPENDENT,   DEPENDENT,       DEPENDENT
##VAR_FORM=  AFFN,          ASDF,            ASDF
##VAR_DIM=   65536,         65536,           65536
##UNITS=     HZ,            ARBITRARY UNITS, ARBITRARY UNITS
##FACTOR=    0.620285442955139, 1,           1
##FIRST=     20137.2065510682, 0,            0
##LAST=      -20513.1999529968, 0,           0
##MIN=       -20513.1999529968, -60422405,   0
##MAX=       20137.2065510682, 357954282,    0
$$ Real data points
##PAGE= N=1
##DATA TABLE= (X++(R..R)), XYDATA
$$ [...]
$$ plain form
42882 6449048 6475476 6464275 6433934 6412711 6432775 6518697 6675383 6883828 7108618 7312678
42872 7312678 7469854 7568318 7605399 7580589 7493198 7345017 7142884 6896734 6614474 6299089
42862 6299089 5951612 5578319 5197084 4838218 4538179 4327976 4220949 4206092 4251224 4315394
42852 4315394 4364308 4380795 4365336 4327783 4276204 4210082 4121955 4006287 3869913 3737719 3650221
42841 3650221 3653525 3785094 4060456 4466666 4966211 5509891 6052021 6560445 7017712 7414934
42831 7414934 7743330 7989203 8135642 8169147 8085139 7887156 7580534 7166602 6642895 6009492
42821 6009492 5276278 4465096 3604723 2722439 1838662 967943 123729 -677934 -1417697
42812 -1417697 -2073804 -2623970 -3049524 -3341762 -3506752 -3564375 -3541648 -3464744 -3354227 -3224477
$$ packed form
42882F449048K6428j1201l0341k1223K0064Q5922J56686K08445K24790K04060
42872G312678J57176R8464L7081k4810q7391j48181k02133k46150k82260l15385
42862F299089l47477l73293l81235l58866l00039k10203j07027j4857M5132O4170
42852D315394M8914J6487j5459l7553n1579o6122q8127j15668j36374j32194q7498
42841C650221L304J31569K75362M06210M99545N43680N42130N08424M57267L97222
42831G414934L28396K45873J46439L3505q4008j97983l06622m13932n23707o33403
42821F009492p33214q11182q60373q82284q83777q70719q44214q01663p39763
42812a417697o56107n50166m25554k92238j64990n7623K2727P6904J10517J29750
$$ plain form
42802 -3224477 -3085244 -2942859 -2800449 -2658480 -2516834 -2377644 -2246411 -2129807 -2031594 -1950457
42792 -1950457 -1882734 -1829704 -1805585 -1841363 -1982001 -2277884 -2772974 -3491251 -4423424 -5518480
42782 -5518480 -6686026 -7811607 -8780247 -9499575 -9915356 -10016272 -9828032 -9399637 -8787025
42773 -8787025 -8039760 -7193939 -6271202 -5282207 -4233012 -3132376 -1997083 -852532 271691
42764 271691 1348149 2354731 3271310 4071578 4716839 5159010 5354988 5287180 4980295
42755 4980295 4505177 3966054 3475198 3124735 2966120 3003929 3204619 3515299 3883649 4269751
42745 4269751 4645852 4988343 5271172 5466914 5554154 5524739 5385407 5152941 4846293 4480980
42735 4480980 4069156 3623910 3162019 2700432 2248169 1800803 1343218 859176 340867
$$ packed form
42802c224477J39233J42385J42410J41969J41646J39190J31233J16604R8213Q1137
42792a950457O7723N3030K4119l5778j40638k95883m95090p18277r32173j095056
42782e518480j167546j125581r68640p19328m15781j00916J88240M28395O12612
42773h787025P47265Q45821R22737R88995J049195J100636J135293J144551J124223
42764B71691J076458J006582R16579Q00268O45261M42171J95978o7808l06885
42755D980295m75118n39123m90856l50463j58615L7809K00690L10680L68350L86102
42745D269751L76101L42491K82829J95742Q7240k9415j39332k32466l06648l65313
42735D480980m11824m45246m61891m61587m52263m47366m57585m84042n18309
$$ plain form
42726 340867 -207455 -772303 -1336872 -1885933 -2406726 -2884961 -3298031 -3610660 -3777971 -3756421
42716 -3756421 -3517783 -3060146 -2412585 -1632951 -799134 4952 705261 1250495 1618303
42707 1618303 1813960 1862818 1799390 1657419 1465567 1250112 1040694 872525 781082 791132
42697 791132 905809 1101616 1332196 1539857 1670360 1685081 1566356 1315638 947540 483416
42687 483416 -53625 -641979 -1263093 -1901393 -2543688 -3179786 -3804557 -4418993 -5027411 -5631332
42677 -5631332 -6224228 -6791396 -7315481 -7783931 -8193094 -8545918 -8844813 -9085613 -9258632
42668 -9258632 -9357019 -9385466 -9360892 -9303348 -9223596 -9115699 -8957760 -8718354 -8365035 -7872961
42658 -7872961 -7232164 -6451275 -5556666 -4588959 -3599792 -2649132 -1800762 -1114682 -638273
$$ packed form
42726C40867n48322n64848n64569n49061n20793m78235m13070l12629j67311K1550
42716c756421K38638M57637O47561P79634Q33817Q04086P00309N45234L67808
42707A618303J95657M8858o3428j41971j91852k15455k09418j68169r1443J0050
42697G91132J14677J95807K30580K07661J30503J4721j18725k50718l68098m64124
42687D83416n37041n88354o21114o38300o42295o36098o24771o14436o08418o03921
42677e631332n92896n67168n24085m68450m09163l52824k98895k40800j73019
42668i258632r8387k8447K4574N7544P9752J07897J57939K39406L53319M92074
42658g872961O40797P80889Q94609R67707R89167R50660Q48370O86080M76409
$$ plain form
42649 -638273 -399166 -401243 -624254 -1027816 -1559474 -2163665 -2787398 -3381726 -3902315 -4312442
42639 -4312442 -4588294 -4723688 -4731517 -4640206 -4484254 -4290030 -4062256 -3779248 -3402045 -2894343
42629 -2894343 -2242958 -1468112 -619424 237957 1038691 1727866 2266095 2631814 2823342
42620 2823342 2860787 2785599 2655178 2531746 2467930 2494095 2612412 2799734 3017422 3223419
42610 3223419 3381638 3466108 3460821 3358246 3158173 2865919 2488377 2029190 1487117 860757
42600 860757 158084 -595053 -1353481 -2060261 -2660150 -3113306 -3404345 -3544145 -3563930 -3503217
42590 -3503217 -3395436 -3256653 -3081571 -2847422 -2522965 -2079142 -1498983 -785158 36479
42581 36479 918228 1795870 2596236 3246270 3684397 3873868 3814328 3545712 3141092 2690725
$$ packed form
42649f38273K39107k077k23011m03562n31658o04191o23733n94328n20589m10127
42639d312442k75852j35394p829R1311J55952J94224K27774K83008L77203N07702
42629b894343O51385P74846Q48688Q57381Q00734O89175N38229L65719J91528
42620B823342L7445p5188j30421j23432o3816K6165J18317J87322K17688K05997
42610C223419J58219Q4470n287j02575k00073k92254l77542m59187n42073o26360
42600H60757p02673p53137p58428p06780n99889m53156k91039j39800j9785O0713
42590c503217J07781J38783J75082K34149L24457M43823N80159P13825Q21637
42581C6479Q81749Q77642Q00366O50034M38127J89471n9540k68616m04620m50367
$$ plain form
42571 2690725 2283589 1991902 1860818 1903247 2099943 2405610 2760985 3108644 3408560 3648707
42561 3648707 3847356 4046217 4296782 4644526 5116247 5714402 6419161 7195555 8001699
42552 8001699 8795487 9539497 10204466 10770921 11228829 11576818 11823104 11987706 12102469
42543 12102469 12205970 12334295 12511931 12746576 13028711 13334689 13631518 13881379 14044051
42534 14044051 14077425 13939548 13596316 13034019 12269263 11347753 10331107 9279871 8242615
42525 8242615 7254235 6339109 5513312 4784094 4148476 3593183 3096234 2629686 2163892
42516 2163892 1674107 1147868 588062 7494 -582402 -1179400 -1787698 -2407145 -3024041
42507 -3024041 -3610455 -4130983 -4551451 -4845230 -4995600 -4994829 -4842778 -4548736 -4136795 -3649830
$$ packed form
42571B690725m07136k91687j31084M2429J96696L05667L55375L47659K99916K40147
42561C648707J98649J98861K50565L47744M71721N98155P04759P76394Q06144
42552H001699P93788P44010O64969N66455M57908L47989K46286J64602J14763
42543A2102469J03501J28325J77636K34645K82135L05978K96829K49861J62672
42534A4044051L3374j37877l43232n62297p64756r21510j016646j051236j037256
42525H242615r88380r15126q25797p29218o35618n55293m96949m66548m65794
42516B163892m89785n26239n59806n80568n89896n96998o08298o19447o16896
42507c024041n86414n20528m20468k93779j50370P71J52051K94042M11941M86965
$$ plain form
42497 -3649830 -3145952 -2686321 -2319205 -2066916 -1920083 -1841210 -1776788 -1673813 -1494303 -1222892
42487 -1222892 -867003 -452535 -18033 391305 729454 954693 1033498 943446 676425 242721
42477 242721 -326182 -980442 -1662746 -2324270 -2938350 -3505186 -4045463 -4585717 -5141985 -5709505
42467 -5709505 -6263367 -6768281 -7189606 -7498435 -7670401 -7683859 -7522625 -7182978 -6679820 -6046728
42457 -6046728 -5328666 -4571087 -3811406 -3076461 -2384839 -1750121 -1182445 -688951 -275035
42448 -275035 53196 286628 412550 416110 282945 2834 -424595 -981631 -1625109 -2286881
42438 -2286881 -2886805 -3354159 -3645891 -3751662 -3685240 -3470484 -3130906 -2686441 -2155409 -1557427
42428 -1557427 -914063 -246495 428287 1100564 1768810 2437778 3113086 3792722 4459127
$$ packed form
42497c649830N03878M59631L67116K52289J46833P8873O4422J02975J79510K71411
42487a222892L55889M14468M34502M09338L38149K25239P8805r0052k67021m33704
42477B42721n68903o54260o82304o61524o14080n66836n40277n40254n56268n67520
42467e709505n53862n04914m21325l08829j71966j3458J61234L39647N03158O33092
42457f046728P18062P57579P59681P34945O91622O34718N67676M93494M13916
42448b75035L28231K33432J25922L560j33165k80111m27429n57036o43478o61772
42438b286881n99924m67354k91732j05771O6422K14756L39578M44465N31032N97982
42428a557427O43364O67568O74782O72277O68246O68968O75308O79636O66405
$$ plain form
42419 4459127 5078054 5607668 6013814 6281378 6413733 6421315 6308423 6067916 5687291 5162281
42409 5162281 4510437 3777070 3028619 2333919 1741320 1264184 883539 565672 282584
42400 282584 22613 -213194 -423443 -617034 -814441 -1039725 -1310510 -1633694 -2008204 -2429316
42390 -2429316 -2889384 -3376092 -3873549 -4369049 -4862426 -5371567 -5929053 -6569138 -7309898
42381 -7309898 -8139899 -9018122 -9888694 -10702567 -11433936 -12082855 -12663761 -13187133 -13644579
42372 -13644579 -14005235 -14224658 -14260664 -14087833 -13704913 -13134301 -12416908 -11606805 -10767579
42363 -10767579 -9968266 -9275392 -8741256 -8393730 -8233660 -8241007 -8385226 -8633815 -8956050 -9323013
42353 -9323013 -9706982 -10081943 -10424158 -10710876 -10917809 -11018742 -10989427 -10813942 -10490520 -10036552
$$ packed form
42419D459127O18927N29614M06146K67564J32355P582j12892k40507l80625n25010
42409E162281o51844p33367p48451o94700n92599m77136l80645l17867k83088
42400B82584k59971k35807k10249j93591j97407k25284k70785l23184l74510m21112
42390b429316m60068m86708m97457m95500m93377n09141n57486o40085p40760
42381g309898q30001q78223q70572q13873p31369o48919n80906n23372m57446
42372a3644579l60656k19423l6006J72831L82920N70612P17393Q10103Q39226
42363a0767579P99313O92874N34136L47526J60070p347j44219k48589l22235l66963
42353i323013l83969l74961l42215k86718k06933j00933K9315J75485L23422M53968
$$ plain form
42343 -10036552 -9493627 -8929581 -8430806 -8081707 -7937853 -8005969 -8241167 -8562471 -8878781
42334 -8878781 -9114087 -9223528 -9197744 -9057657 -8843103 -8598573 -8360082 -8148195 -7970171 -7828988
42324 -7828988 -7732746 -7698006 -7744692 -7885250 -8114364 -8405484 -8716392 -9000612 -9218852 -9346358
42314 -9346358 -9375081 -9311003 -9167647 -8958105 -8689517 -8363083 -7979246 -7544212 -7073288 -6589131
42304 -6589131 -6117123 -5682428 -5311591 -5036820 -4897739 -4936708 -5188750 -5671356 -6379465 -7287435
42294 -7287435 -8355744 -9538115 -10785984 -12049860 -13278948 -14420357 -15418635 -16216839
42286 -16216839 -16761083 -17009115 -16939890 -16558605 -15893331 -14984918 -13876381 -12607720 -11217316
42277 -11217316 -9746229 -8240911 -6752844 -5336570 -4047688 -2940274 -2061992 -1446551
$$ packed form
42343a0036552N42925N64046M98775L49099J43854o8116k35198l21304l16310
42334h878781k35306j09441K5784J40087K14554K44530K38491K11887J78024J41183
42324g828988R6242L4740m6686j40558k29114k91120l10908k84220k18240j27506
42314i346358k8723O4078J43356K09542K68588L26434L83837M35034M70924M84157
42304f589131M72008M34695L70837K74771J39081l8969k52042m82606p08109r07970
42294g287435j068309j182371j247869j263876j229088j141409r98278p98204
42286a6216839n44244k48032O9225L81285O65274R08413J108537J268661J390404
42277a1217316J471087J505318J488067J416274J288882J107414Q78282O15441
$$ plain form
42269 -1446551 -1106165 -1028528 -1181500 -1524733 -2022921 -2653586 -3404535 -4261853 -5195594 -6152797
42259 -6152797 -7063701 -7858386 -8484480 -8917363 -9160578 -9239133 -9188455 -9040974 -8814703 -8510442
42249 -8510442 -8120277 -7641123 -7082444 -6462549 -5798063 -5096291 -4356845 -3581347 -2784007
42240 -2784007 -1994787 -1251025 -581286 8518 537572 1039634 1546162 2071934 2608843
42231 2608843 3128719 3592328 3959551 4196602 4280028 4200597 3968493 3616236 3194124 2757978
42221 2757978 2355138 2015424 1749883 1556698 1432160 1382501 1429989 1608702 1952504 2483498
42211 2483498 3207141 4113003 5175874 6354461 7589934 8808470 9929641 10878617 11597638
42202 11597638 12052427 12231886 12142937 11804426 11243431 10494929 9602974 8620000 7601863
$$ packed form
42269a446551L40386P7637j52972l43233m98188o30665p50949q57318r33741r57203
42259f152797r10904p94685o26094m32883k43215p8555N0678J47481K26271L04261
42249h510442L90165M79154N58679O19895O64486P01772P39446P75498P97340
42240b784007P89220P43762O69739N89804N29054N02062N06528N25772N36909
42231B608843N19876M63609L67223K37051Q3426p9431k32104l52257m22112m36146
42221B757978m02840l39714k65541j93185j24538m9659M7488J78713L43802N30994
42211B483498P23643R05862J062871J178587J235473J218536J121171R48976P19021
42202A1597638M54789J79459q8949l38511n60995p48502q91955r82974j018137
$$ plain form
42193 7601863 6599528 5651539 4781398 4000179 3310979 2711604 2195212 1751311 1368768
42184 1368768 1039232 757579 517699 305943 97336 -141082 -438999 -807709 -1228634
42175 -1228634 -1652815 -2013728 -2248117 -2314739 -2203294 -1933349 -1548976 -1114521 -711811 -434482
42165 -434482 -375077 -605054 -1153992 -1997636 -3061599 -4239710 -5418719 -6499549 -7409218
42156 -7409218 -8102841 -8558486 -8769203 -8737012 -8472240 -7997946 -7355242 -6604374 -5819144 -5076030
42146 -5076030 -4441667 -3962232 -3657111 -3518129 -3514556 -3602587 -3735853 -3872484 -3976114 -4013079
42136 -4013079 -3952189 -3772158 -3474464 -3091941 -2683022 -2310425 -2014560 -1796977 -1623585 -1445405
42126 -1445405 -1224367 -949948 -639610 -326462 -43918 184284 346927 444313 487075 495558
$$ packed form
42193G601863j002335r47989q70141p81219o89200n99375n16392m43901l82543
42184A368768l29536k81653k39880k11756k08607k38418k97917l68710m20925
42175a228634m24181l60913k34389o6622J11445K69945L84373M34455M02710K77329
42165d34482N9405k29977n48938q43644j063963j178111j179009j080830r09669
42156g409218o93623m55645k10717L2191K64772M74294O42704P50868P85230P43114
42146e076030O34363M79435L05121J38982L573q8031j33266j36631j03630l6965
42136d013079O0890J80031K97694L82523M08919L72597K95865K17583J73392J78180
42126a445405K21038K74419L10338L13148K82544K28202J62643R7386M2762Q483
$$ plain form
42116 495558 498911 533549 641256 866241 1249428 1819677 2584602 3525300 4597307 5736784
42106 5736784 6869272 7918905 8816697 9506820 9950742 10130716 10053917 9755107 9293068
42097 9293068 8738651 8159009 7605874 7112228 6695340 6361736 6111410 5940106 5838577
42088 5838577 5789180 5763561 5726279 5645019 5502437 5303137 5072458 4847504 4663238 4538534
42078 4538534 4468725 4429074 4387235 4317339 4208924 4068755 3917044 3779481 3676736 3615629
42068 3615629 3587467 3574972 3562675 3543472 3518768 3495295 3482052 3486965 3511372 3543824 3558402
42057 3558402 3521102 3401832 3185704 2878806 2507928 2116001 1754724 1475341 1319211 1309939
42047 1309939 1448017 1708493 2042878 2386610 2671108 2836831 2843675 2677353 2351932 1908077
$$ packed form
42116D95558L353L4638J07707K24985L83187N70249P64925R40698J072007J139477
42106E736784J132488J049633Q97792O90123M43922J79974p6799k98810m62039
42097I293068n54417n79642n53135m93646m16888l33604k50326j71304j01529
42088E838577m9397k5619l7282q1260j42582j99300k30679k24954j84266j24704
42078D538534o9809l9651m1839o9896j08415j40169j51711j37563j02745o1107
42068C615629k8162j2495j2297j9203k4704k3473j3243M913K4407L2452J4578
42057C558402l7300j19270k16128l06898l70878l91927l61277k79383j56130r272
42047A309939J38078K60476L34385L43732K84498J65723O844j66322l25421m43855
$$ plain form
42037 1908077 1405967 913449 492273 185989 12360 -37717 6196 106363 230391 360493
42027 360493 494925 641279 804575 976464 1133249 1245978 1296687 1288901 1244950 1193710
42017 1193710 1158969 1154799 1185936 1247607 1322671 1379016 1371693 1251798 979875 538203 -64113
42006 -64113 -795675 -1613531 -2473409 -3334492 -4158966 -4910156 -5552665 -6055405 -6396645 -6569720
41996 -6569720 -6587362 -6481278 -6294285 -6066535 -5822443 -5565656 -5284299 -4962335 -4590507 -4172725
41986 -4172725 -3727026 -3281636 -2867053 -2506655 -2210040 -1973000 -1783800 -1630564 -1503925
41977 -1503925 -1394279 -1289282 -1177075 -1053260 -923733 -798899 -684021 -574937 -462856
41968 -462856 -343961 -227042 -135641 -104658 -173058 -375572 -736587 -1266893 -1960934 -2793287
$$ packed form
42037A908077n02110m92518m21176l06284j73629n0077M3913J00167J24028J30102
42027C60493J34432J46354J63296J71889J56785J12729N0709p786m3951n1240
42017A193710l4741m170L1137O1671P5064N6345p323j19895k71923m41672o02316
42006f4113p31562q17856q59878q61083q24474p51190o42509n02740l41240j73075
41996f569720j7642J06084J86993K27750K44092K56787K81357L21964L71828M17782
41986d172725M45699M45390M14583L60398K96615K37040J89200J53236J26639
41977a503925J09646J04997J12207J23815J29527J24834J14878J09084J12081
41968d62856J18895J16919R1401L0983o8400k02514l61015n30306o94041q32353
$$ plain form
41958 -2793287 -3717535 -4671825 -5590526 -6416227 -7107296 -7641078 -8014621 -8242698 -8351876
41949 -8351876 -8372276 -8331364 -8252485 -8156645 -8063857 -7991652 -7950802 -7940161 -7943567 -7932029 -7872408
41938 -7872408 -7740082 -7530329 -7263815 -6984581 -6751325 -6623727 -6646828 -6838489 -7185210 -7647950
41928 -7647950 -8174090 -8709587 -9208059 -9637244 -9983735 -10254893 -10476352 -10685238 -10920888
41919 -10920888 -11214307 -11577386 -11994589 -12421989 -12796829 -13055148 -13149676 -13059860 -12790675 -12362767
41909 -12362767 -11800171 -11121877 -10340884 -9469915 -8528674 -7546274 -6555851 -5584457 -4645189
41900 -4645189 -3737079 -2852958 -1990454 -1159159 -378473 334413 980122 1585283 2195290
41891 2195290 2853434 3577941 4349681 5116065 5807744 6360356 6733481 6920609 6947024 6857523
$$ packed form
41958b793287r24248r54290r18701q25701o91069n33782l73543k28077j09178
41949h351876k0400M0912P8879R5840R2788P2205M0850J0641l406J1538N9621
41938g872408J32326K09753K66514K79234K33256J27598k3101j91661l46721m62740
41928g647950n26140n35497m98472m29185l46491k71158k21459k08886k35650
41919a0920888k93419l63079m17203m27400l74840k58319r4528Q9816K69185M27908
41909a2362767N62596O78294P80993Q70969R41241R82400R90423R71394R39268
41900d645189R08110Q84121Q62504Q31295P80686P12886O45709O05161O10007
41891B195290O58144P24507P71740P66384O91679N52612L73125J87128K6415q9501
$$ plain form
41881 6857523 6700723 6517223 6335115 6171958 6040475 5954760 5933367 5996751 6160598 6430187
41871 6430187 6799604 7254413 7773813 8331504 8898458 9449251 9968477 10451946 10901298
41862 10901298 11315691 11685186 11988349 12194570 12270011 12184626 11917633 11461187 10823651 10031834
41852 10031834 9128969 8167441 7200833 6280515 5455137 4766024 4235782 3857106 3591686
41843 3591686 3381943 3169253 2909773 2582369 2187928 1743375 1275515 817796 407785
41834 407785 80971 -139046 -247627 -257505 -189985 -66247 95449 276735 454489 598724
41824 598724 674799 649097 495545 200845 -231862 -780511 -1404005 -2047001 -2650088 -3162200
41814 -3162200 -3550570 -3804970 -3935149 -3962022 -3905128 -3771561 -3552455 -3229795 -2790734 -2242346
$$ packed form
41881F857523j56800j83500j82108j63157j31483q5715k1393O3384J63847K69589
41871F430187L69417M54809N19400N57691N66954N50793N19226M83469M49352
41862A0901298M14393L69495L03163K06221P5441q5385k66993m56446o37536p91817
41852A0031834r02865r61528r66608r20318q25378o89113n30242l78676k65420
41843C591686k09743k12690k59480l27404l94441m44553m67860m57719m10011
41834D07785l26814k20017j08581r878O7520J23738J61696J81286J77754J44235
41824E98724P6075k5702j53552k94700m32707n48649o23494o42996o03087n12112
41814c162200l88370k54400j30179k6873N6894J33567K19106L22660M39061N48388
$$ plain form
41804 -2242346 -1619699 -983491 -407966 36699 301604 370104 258543 6464 -339258 -738711
41794 -738711 -1165133 -1601868 -2035060 -2448879 -2826775 -3156491 -3433623 -3660360 -3840517 -3974537
41784 -3974537 -4057239 -4078626 -4027062 -3894322 -3681493 -3402933 -3084964 -2758250 -2446715 -2158292
41774 -2158292 -1882344 -1595368 -1272154 -896057 -462433 25739 565048 1155138 1796495
41765 1796495 2486315 3217456 3981366 4771350 5582302 6406576 7229216 8026382 8768803
41756 8768803 9429288 9990923 10451664 10822494 11119795 11355793 11531636 11635701 11647108 11542559
41746 11542559 11303703 10922395 10402500 9758704 9013566 8193491 7324450 6429548 5530594
41737 5530594 4652491 3825100 3077991 2429753 1879701 1408957 990758 603028 235112
$$ packed form
41804b242346O22647O36208N75525M44665K64905O8500j11561k52079l45722l99453
41794g38711m26422m36735m33192m13819l77896l29716k77132k26737j80157j34020
41784c974537q2702k1387N1564J32740K12829K78560L17969L26714L11535K88423
41774b158292K75948K86976L23214L76097M33624M88172N39309N90090O41357
41765A796495O89820P31141P63910P89984Q10952Q24274Q22640P97166P42421
41756H768803O60485N61635M60741L70830K97301K35998J75843J04065J1407j04549
41746A1542559k38856l81308n19895o43796p45138q20075q69041q94902q98954
41737E530594q78103q27391p47109o48238n50052m70744m18199l87730l67916
$$ plain form
41728 235112 -114833 -449166 -780459 -1136074 -1555780 -2084060 -2759480 -3602871 -4606687
41719 -4606687 -5729703 -6900825 -8032193 -9037490 -9849743 -10433339 -10786356 -10932191 -10904683
41710 -10904683 -10735096 -10447489 -10061553 -9596283 -9069371 -8493410 -7873609 -7209658 -6500415
41701 -6500415 -5748493 -4962803 -4158461 -3354110 -2567910 -1814389 -1103931 -444277 158156
41692 158156 698229 1172362 1578206 1914536 2182249 2384746 2524591 2596527 2581740 2448999
41682 2448999 2163921 1702645 1064480 278671 -598124 -1494108 -2339862 -3083060 -3694411
41673 -3694411 -4165682 -4505694 -4738807 -4904334 -5051386 -5226492 -5458712 -5751099 -6083481
41664 -6083481 -6423314 -6736830 -6995726 -7179655 -7276281 -7279248 -7184305 -6985946 -6677759 -6257697
$$ packed form
41728B35112l49945l34333l31293l55615m19706n28280o75420q43391j003816
41719d606687j123016j171122j131368j005297q12253n83596l53017j45835K7508
41710a0904683J69587K87607L85936M65270N26912N75961O19801O63951P09243
41701f500415P51922P85690Q04342Q04351P86200P53521P10458O59654O02433
41692A58156N40073M74133M05844L36330K67713K02497J39845P1936j4787j32741
41682B448999k85078m61276o38165p85809q76795q95984q45754p43198o11351
41673c694411m71271l40012k33113j65527j47052j75106k32220k92387l32382
41664f083481l39833l13516k58896j83929r6626k967R4943J98359L08187M20062
$$ plain form
41654 -6257697 -5736520 -5145183 -4535685 -3971498 -3509772 -3184202 -2997855 -2928049 -2937925 -2988766
41644 -2988766 -3050596 -3109732 -3170339 -3248155 -3360048 -3516446 -3720151 -3968656 -4255150 -4566956
41634 -4566956 -4883573 -5176341 -5410519 -5550954 -5572375 -5471644 -5274694 -5031618 -4800851 -4630805
41624 -4630805 -4548050 -4555709 -4639847 -4778827 -4950705 -5135960 -5316648 -5475814 -5599609 -5680045
41614 -5680045 -5714113 -5697987 -5620209 -5459652 -5191247 -4797466 -4279919 -3664923 -2999678 -2340220
41604 -2340220 -1735635 -1214392 -778081 -405410 -64654 271554 615360 959332 1278268
41595 1278268 1536892 1702642 1758869 1711028 1582382 1403434 1202678 1002541 819104 662368
41585 662368 534879 428528 321908 182556 -23229 -315819 -690107 -1112221 -1526781 -1871206
$$ packed form
41654f257697N21177N91337O09498N64187M61726L25570J86347O9806r876n0841
41644b988766o1830n9136o0607p7816j11893j56398k03705k48505k86494l11806
41634d566956l16617k92768k34178j40435k1421J00731J96950K43076K30767J70046
41624d630805Q2755p659q4138j38980j71878j85255j80688j59166j23795q0436
41614e680045l4068J6126P7778J60557K68405L93781N17547O14996O65245O59458
41604b340220O04585N21243M36311L72671L40756L36208L43806L43972L18936
41595A278268K58624J65750N6227m7841j28646j78948k00756k00137j83437j56736
41585F62368j27489j06351j06620j39352k05785k92590l74288m22114m14560l44425
$$ plain form
41575 -1871206 -2090393 -2145112 -2012036 -1679835 -1148042 -430585 440469 1416134 2436935
41566 2436935 3440875 4369517 5171791 5807324 6251194 6499854 6574835 6520487 6395909 6265257
41556 6265257 6189682 6220049 6388936 6704212 7148177 7682358 8254101 8803087 9270237 9610690
41546 9610690 9806537 9872009 9848184 9791045 9759159 9804658 9967676 10272643 10724739 11306293
41536 11306293 11975307 12669355 13315504 13842557 14190451 14314824 14188787 13804243 13172490
41527 13172490 12322351 11295532 10140660 8907299 7640337 6375707 5139156 3948311
41519 3948311 2815190 1746099 739648 -212314 -1117776 -1975066 -2768700 -3475208 -4075199
41510 -4075199 -4562472 -4943970 -5232199 -5437021 -5562239 -5607085 -5569069 -5445176 -5231406 -4922995
$$ packed form
41575a871206k19187n4719J33076L32201N31793P17457Q71054R75665J020801
41566B436935J003940R28642Q02274O35533M43870K48660P4981n4348j24578j30652
41556F265257p5575L0367J68887L15276M43965N34181N71743N48986M67150L40453
41546I610690J95847O5472k3825n7139l1886M5499J63018L04967M52096N81554
41536A1306293O69014O94048O46149N27053L47894J24373j26037l84544o31753
41527A3172490q50139j026819j154872j233361j266962j264630j236551j190845
41519C948311j133121j069091j006451r51962r05462q57290p93634p06508n99991
41510d075199m87273l81498k88229k04822j25218m4846L8016J23893K13770L08411
$$ plain form
41500 -4922995 -4517594 -4021173 -3453485 -2848908 -2250630 -1699818 -1224075 -829604 -499618
41491 -499618 -198904 117376 492976 959551 1527128 2179104 2875468 3565396 4205514 4776592
41481 4776592 5291347 5789585 6322118 6930055 7628239 8399324 9199482 9972418 10666727
41472 10666727 11251130 11721830 12098017 12407245 12668593 12882962 13035004 13104159 13077812 12959749
41462 12959749 12770389 12539401 12294279 12049659 11801831 11530996 11210434 10818197 10346184
41453 10346184 9803683 9215095 8612450 8024187 7464245 6927260 6392688 5834849 5233276
41444 5233276 4580367 3886262 3179861 2503202 1899160 1398145 1011495 734682 556745
41435 556745 469386 471382 568033 768014 1080021 1510284 2061202 2731443 3517286 4412875
$$ packed form
41500d922995M05401M96421N67688O04577N98278N50812M75743L94471L29986
41491d99618L00714L16280L75600M66575N67577O51976O96364O89928O40118N71078
41481D776592N14755M98238N32533O07937O98184P71085Q00158P72936O94309
41472A0666727N84403M70700L76187L09228K61348K14369J52042O9155k6347j18063
41462A2959749j89360k30988k45122k44620k47828k70835l20562l92237m72013
41453A0346184n42501n88588o02645n88263n59942n36985n34572n57839o01573
41444E233276o52909o94105p06401o76659o04042n01015l86650k76813j77937
41435E56745q7359J996R6651J99981L12007M30263N50918O70241P85843Q95589
$$ plain form
41425 4412875 5405938 6468568 7548486 8568823 9440260 10081739 10441113 10507731 10312748
41416 10312748 9917442 9394084 8806344 8195388 7574571 6932979 6247390 5500440 4698642
41407 4698642 3880917 3111751 2461958 1987268 1714843 1641751 1742733 1981287 2318800 2719729
41397 2719729 3154427 3602263 4055180 4518512 5006131 5531343 6098949 6702843 7327873
41388 7327873 7951041 8539519 9049045 9428289 9629931 9622712 9398189 8971203 8377191 7667908
41378 7667908 6903948 6143673 5432646 4799019 4256019 3807667 3453282 3189165 3008241
41369 3008241 2898921 2844999 2828597 2836204 2864084 2918181 3008033 3140314 3318047 3544817 3826797
41358 3826797 4167496 4559447 4982758 5414994 5845126 6279190 6732292 7213509 7715241
$$ packed form
41425D412875R93063J062630J079918J020337Q71437O41479L59374O6618j94983
41416A0312748l95306n23358n87740o10956o20817o41592o85589p46950q01798
41407D698642q17725p69166o49793m74690k72425p3092J00982K38554L37513M00929
41397B719729M34698M47836M52917M63332M87619N25212N67606O03894O25030
41388G327873O23168N88478N09526L79244K01642p219k24523m26986n94012p09283
41378G667908p63960p60275p11027o33627n43000m48352l54385k64117j80924
41369C008241j09320n3922j6402P607K7880N4097Q9852J32281J77733K26770K81980
41358C826797L40699L91951M23311M32236M30132M34064M53102M81217N01732
$$ plain form
41349 7715241 8213204 8674110 9063860 9351669 9510724 9518767 9361043 9035504 8558086 7965163
41339 7965163 7310538 6655795 6055406 5540798 5109376 4724216 4326965 3860599 3292448
41330 3292448 2626614 1900727 1170646 491053 -101715 -600860 -1030572 -1435193 -1859582
41321 -1859582 -2331139 -2853349 -3411706 -3984372 -4549512 -5087318 -5579139 -6006415 -6350465
41312 -6350465 -6593779 -6723266 -6734566 -6634969 -6442851 -6183482 -5882956 -5562444 -5234331 -4901001
41302 -4901001 -4556209 -4188487 -3785786 -3340309 -2852011 -2328769 -1782250 -1221072 -645113
41293 -645113 -44204 598987 1304707 2092395 2976178 3956960 5012029 6088076 7104690
41284 7104690 7970197 8604405 8959314 9030962 8859731 8519564 8098625 7676779 7307453 7010299
$$ packed form
41349G715241M97963M60906L89750K87809J59055Q043j57724l25539m77418n92923
41339G965163o54625o54743o00389n14608m31422l85160l97251m66366n68151
41330C292448o65834p25887p30081o79593n92768m99145m29712m04621m24389
41321a859582m71557n22210n58357n72666n65140n37806m91821m27276l44050
41312f350465k43314j29487j1300R9597J92118K59369L00526L20512L28113L33330
41302d901001L44792L67722M02701M45477M88298N23242N46519N61178N75959
41293f45113O00909O43191P05720P87688Q83783R80782J055069J076047J016614
41284G104690Q65507O34208L54909P1648j71231l40167m20939m21846l69326k97154
$$ plain form
41274 7010299 6776413 6582648 6408236 6246081 6103259 5991147 5912347 5853689 5789328 5690466
41264 5690466 5535497 5317420 5048803 4763989 4515915 4365166 4362963 4534359 4868855 5321937
41254 5321937 5825586 6302531 6679729 6898952 6923925 6743922 6374580 5857136 5255916 4651542
41244 4651542 4127481 3751851 3561058 3552612 3690548 3921245 4193231 4473183 4752271 5041724
41234 5041724 5361428 5727518 6143687 6598086 7065320 7511562 7900084 8194992 8362999
41225 8362999 8375275 8211674 7866593 7352190 6694725 5925047 5070071 4151853 3193719 2226016
41215 2226016 1285010 405988 -383085 -1063438 -1624836 -2065933 -2395458 -2631092 -2795171
41206 -2795171 -2909765 -2993541 -3059119 -3108552 -3128005 -3086609 -2943677 -2663152 -2229130 -1655007
$$ packed form
41274G010299k33886j93765j74412j62155j42822j12112p8800n8658o4361r8862
41264E690466j54969k18077k68617k84814k48074j50749k203J71396L34496M53082
41254E321937N03649M76945L77198K19223K4973j80003l69342n17444o01220o04374
41244D651542n24061l75630j90793q446J37936K30697K71986K79952K79088K89453
41234E041724L19704L66090M16169M54399M67234M46242L88522K94908J68007
41225H362999J2276j63601l45081n14403o57465p69678q54976r18218r58134r67703
41215B226016r41006q79022p89073o80353n61398m41097l29525k35634j64079
41206b795171j14594q3776o5578m9433j9453M1396J42932K80525M34022N74123
$$ plain form
41196 -1655007 -981690 -265790 436301 1081417 1646169 2127963 2542464 2917572 3283630
41187 3283630 3662613 4061449 4472378 4878010 5256067 5581127 5825082 5959933 5964607 5833852
41177 5833852 5584806 5257131 4905064 4583194 4330945 4162433 4066930 4019922 3998379 3991252
41167 3991252 3999897 4030098 4082327 4146683 4205220 4239823 4241114 4213517 4173706 4143110 4138577 4166463
41155 4166463 4223131 4300051 4388319 4479060 4561478 4623221 4654876 4655097 4631918 4599887 4576791 4582701
41143 4582701 4639968 4770671 4990469 5301586 5688780 6119758 6548971 6923786 7193352 7319558
41133 7319558 7286335 7102395 6796079 6406182 5973598 5535585 5122075 4754123 4444951 4202095
41123 4202095 4027540 3915064 3848128 3802131 3751281 3676565 3571273 3442052 3305232 3179715
$$ packed form
41196a655007O73317P15900P02091O45116N64752M81794M14501L75108L66058
41187C283630L78983L98836M10929M05632L78057L25060K43955J34851M674j30755
41177E833852k49046l27675l52067l21870k52249j68512r5503m7008k1543p127
41167C991252Q645L0201N2229O4356N8537L4603J291k7597l9811l0596m533K7886
41155D166463N6668P6920Q8268R0741Q2418O1743L1655K21k3179l2031k3096N910
41143D582701N7267J30703K19798L11117L87194M30978M29213L74815K69566J26206
41133G319558l3223j83940l06316l89897m32584m38013m13510l67952l09172k42856
41123D202095j74555j12476o6936m5997n0850p4716j05292j29221j36820j25517
$$ plain form
41113 3179715 3080235 3015236 2990028 3010072 3077830 3182695 3291919 3352606 3307082 3113491 2759954
41102 2759954 2266570 1677912 1051695 446802 -88211 -523702 -850199 -1070075 -1183478
41093 -1183478 -1177677 -1028368 -714049 -235184 373913 1047692 1704569 2266816 2677568 2910600
41083 2910600 2971507 2891359 2716434 2498400 2287039 2125034 2044370 2065406 2198814 2447650
41073 2447650 2806336 3257129 3768867 4302415 4822195 5307843 5758398 6185404 6598667
41064 6598667 6994073 7351847 7645893 7856826 7979582 8021477 7993435 7900930 7740595 7504796
41054 7504796 7191695 6815026 6407471 6014707 5682506 5443581 5311027 5280046 5333554 5445947
41044 5445947 5584306 5711414 5794147 5814650 5777199 5705245 5629549 5574351 5549712 5553491 5579420
$$ packed form
41113C179715r9480o4999k5208K0044O7758J04865J09224O0687m5524j93591l53537
41102B759954m93384n88658o26217o04893n35013m35491l26497k19876j13403
41093a183478N801J49309L14319M78865O09097O73779O56877N62247M10752K33032
41083B910600O0907q0148j74925k18034k11361j62005q0664K1036J33408K48836
41073B447650L58686M50793N11738N33548N19780M85648M50555M27006M13263
41064F598667L95406L57774K94046K10933J22756M1895k8042r2505j60335k35799
41054G504796l13101l76669m07555l92764l32201k38925j32554l0981N3508J12393
41044E445947J38359J27108Q2733K0503l7451p1954p5696n5198k4639L779K5929
$$ plain form
41033 5579420 5624466 5691459 5787978 5924030 6109110 6348568 6640767 6977242 7345565 7731968
41023 7731968 8120998 8492042 8815005 9049030 9148131 9074161 8811557 8374919 7804359 7151723
41013 7151723 6466165 5786427 5141807 4558677 4067197 3703954 3509256 3520424 3763137 4243056
41003 4243056 4940233 5808258 6777937 7763781 8672736 9415989 9922594 10149944 10086517 9747865
40993 9747865 9171096 8410819 7534049 6610419 5699138 4839268 4048711 3330780 2681628
40984 2681628 2093075 1551765 1040530 545699 67263 -375925 -751207 -1025405 -1178512
40975 -1178512 -1209997 -1135200 -975310 -747262 -458442 -107777 307939 785281 1306949 1840140
40965 1840140 2342567 2774602 3113046 3360867 3548015 3721737 3930186 4207149 4563990
$$ packed form
41033E579420M5046O6993R6519J36052J85080K39458K92199L36475L68323L86403
41023G731968L89030L71044L22963K34025R9101p3970k62604m36638n70560o52636
41013G151723o85558o79738o44620n83130m91480l63243j94698J1168K42713M79919
41003D243056O97177Q68025R69679R85844R08955P43253N06605K27350o3427l38652
40993I747865n76769p60277q76770r23630r11281q59870p90557p17931o49152
40984B681628n88553n41310n11235m94831m78436m43188l75282k74198j53107
40975a178512l1485P4797J59890K28048K88820L50665M15716M77342N21668N33191
40965A840140N02427M32035L38444K47821J87148J73722K08449K76963L56841
$$ plain form
40956 4563990 4988961 5450072 5899539 6281070 6540631 6637568 6552082 6288066 5873031 5355741
40946 5355741 4799777 4271962 3827944 3499784 3289466 3169674 3091560 2998498 2843156 2602430
40936 2602430 2283754 1919718 1554092 1226594 962610 769553 637995 545392 461639 356337
40926 356337 206508 2439 -249810 -528820 -800011 -1020029 -1144648 -1138992 -985274 -683367
40916 -683367 -244695 314866 977111 1717291 2497811 3267018 3968205 4556962 5016925 5362827
40906 5362827 5628432 5848626 6048340 6243095 6445430 6667903 6918783 7194930 7480482
40897 7480482 7756100 8014548 8271707 8564483 8936638 9421677 10031776 10755928 11565428
40888 11565428 12423131 13292690 14144267 14955389 15708961 16391730 16994129 17509855 17933827
$$ packed form
40956D563990M24971M61111M49467L81531K59561R6937q5486k64016m15035n17290
40946E355741n55964n27815m44018l28160k10318j19792p8114r3062j55342k40726
40936B602430l18676l64036l65626l27498k63984j93057j31558r2603q3753j05302
40926C56337j49829k04069k52249k79010k71191k20018j24619N656J53718L01907
40916f83367M38672N59561O62245P40180P80520P69207P01187N88757M59963L45902
40906E362827K65605K20194J99714J94755K02335K22473K50880K76147K85552
40897G480482K75618K58448K57159K92776L72155M85039O10099P24152Q09500
40888A1565428Q57703Q69559Q51577Q11122P53572O82769O02399N15726M23972
$$ plain form
40879 17933827 18259542 18477580 18575633 18539455 18354841 18011053 17504570 16840584 16031225 15093003
40869 15093003 14047192 12923876 11765752 10626425 9561272 8614271 7807448 7138494
40861 7138494 6587639 6130150 5748564 5439377 5211556 5078009 5045132 5107072 5248168 5450655
40851 5450655 5700904 5990206 6311902 6659429 7027347 7413766 7821536 8256833 8725150
40842 8725150 9225669 9746007 10259758 10728188 11105728 11348161 11422407 11315938 11042250 10638988
40832 10638988 10158675 9656411 9179737 8762429 8420184 8146394 7909823 7658256 7329803
40823 7329803 6869116 6243263 5452252 4530499 3537068 2536169 1574969 669340 -194647
40814 -194647 -1044155 -1897206 -2746224 -3554235 -4262739 -4805757 -5125421 -5187041 -4991635 -4581975
$$ packed form
40879A7933827L25715K18038R8053l6178j84614l43788n06483o63986q09359r38222
40869A5093003j045811j123316j158124j139327j065153r47001q06823o68954
40861G138494n50855m57489l81586l09187k27821j33547l2877O1940J41096K02487
40851E450655K50249K89302L21696L47527L67918L86419M07770M35297M68317
40842H725150N00519N20338N13751M68430L77540K42433P4246j06469k73688m03262
40832A0638988m80313n02264m76674m17308l42245k73790k36571k51567l28453
40823G329803m60687o25853p91011r21753r93431j000899r61200r05629q63987
40814a94647q49508q53051q49018q08011p08504n43018l19664o1620J95406M09660
$$ plain form
40804 -4581975 -4038004 -3461161 -2952054 -2588788 -2413069 -2428560 -2611154 -2925625 -3340066 -3831571
40794 -3831571 -4382238 -4970282 -5563039 -6116123 -6578106 -6896999 -7025792 -6927201 -6578393 -5974802
40784 -5974802 -5131361 -4081334 -2873532 -1566781 -220264 1116842 2409038 3628473
40776 3628473 4746533 5733684 6569631 7254735 7812713 8283062 8708880 9125627 9552555
40767 9552555 9987169 10404415 10762996 11018830 11141075 11123321 10984871 10763914 10509408 10276242
40757 10276242 10121234 10094674 10227259 10519262 10939655 11437146 11958397 12465571 12945683
40748 12945683 13407223 13865230 14322650 14758793 15131677 15392180 15500747 15437510 15203472
40739 15203472 14817030 14310417 13725566 13106092 12486316 11884330 11305161 10751421 10232052
$$ packed form
40804d581975N43971N76843N09107L63266J75719j5491j82594l14471m14441m91505
40794c831571n50667n88044n92757n53084m61983l18893j28793R8591L48808O03591
40784e974802Q43441J050027J207802J306751J346517J337106J292196J219435
40776C628473J118060R87151Q35947O85104N57978M70349M25818M16747M26928
40767I552555M34614M17246L58581K55834J22245j7754j38450k20957k54506k33166
40757A0276242j55008k6560J32585K92003M20393M97491N21251N07174M80112
40748A2945683M61540M58007M57420M36143L72884K60503J08567o3237k34038
40739A5203472l86442n06613n84851o19474o19776o01986n79169n53740n19369
$$ plain form
40730 10232052 9762376 9357182 9023853 8760815 8561884 8423592 8351230 8359572 8467011 8686077
40720 8686077 9015425 9436308 9912930 10395224 10824810 11145416 11315646 11317995 11159015 10862184
40710 10862184 10460913 9997708 9527109 9113087 8813837 8657749 8624689 8646968 8633257 8503862
40700 8503862 8218342 7782051 7232438 6617454 5978830 5344062 4723367 4108718 3478151
40691 3478151 2809695 2101822 1388271 735364 221023 -92857 -179737 -51803 250147 672214
40681 672214 1160689 1669702 2164373 2622912 3039148 3422586 3791796 4162136 4535597 4900689
40671 4900689 5241963 5550160 5823774 6060884 6248369 6357368 6349314 6190376 5867576 5398617
40661 5398617 4829901 4222746 3634144 3101321 2636734 2233619 1877041 1554863 1265475
$$ packed form
40730A0232052m69676m05194l33329k63038j98931j38292p2362Q342J07439K19066
40720H686077L29348M20883M76622M82294M29586L20606J70230K349j58980k96831
40710A0862184m01271m63205m70599m14022k99250j56088l3060K2279j3711j29395
40700H503862k85520m36291n49613o14984o38624o34768o20695o14649o30567
40691C478151o68456p07873p13551o52907n14341l13880q6880J27934L01950M22067
40681F72214M88475N09013M94671M58539M16236L83438L69210L70340L73461L65092
40671D900689L41274L08197K73614K37110J87485J08999q054j58938l22800m68959
40661E398617n68716o07155n88602n32823m64587m03115l56578l22178k89388
$$ plain form
40652 1265475 1021089 845964 769685 817621 1002251 1318578 1744635 2245745 2780009 3303462
40642 3303462 3775294 4164315 4455547 4653201 4777052 4853985 4909814 4965098 5034875 5130374
40632 5130374 5261358 5438098 5671212 5968091 6327156 6733130 7155992 7553900 7878707
40623 7878707 8082781 8126682 7987173 7663869 7181835 6588561 5946293 5322442 4780176 4369968
40613 4369968 4123020 4048193 4133799 4353823 4676504 5072453 5519961 6006711 6528834 7088210
40603 7088210 7687227 8320642 8967974 9592585 10149673 10598146 10909232 11069483 11080438 10956423
40593 10956423 10719967 10395747 10006501 9572555 9112741 8644172 8181890 7740550 7337559
40584 7337559 6994786 6737729 6593641 6589443 6747943 7080889 7580197 8211524 8914517 9611587
$$ packed form
40652A265475k44386j75125p6279M7936J84630L16327M26057N01110N34264N23453
40642C303462M71832L89021K91232J97654J23851P6933N5829N5284O9777R5499
40632E130374J30984J76740K33114K96879L59065M05974M22862L97908L24807
40623G878707K04074M3901j39509l23304m82034n93274o42268o23851n42266m10208
40613D369968k46948p4827Q5606K20024L22681L95949M47508M86750N22123N59376
40603G088210N99017O33415O47332O24611N57088M48473L11086J60251J0955j24015
40593A0956423k36456l24220l89246m33946m59814m68569m62282m41340m02991
40584G337559l42773k57057j44088m198J58500L32946M99308O31327P02993O97070
$$ plain form
40574 9611587 10222671 10680209 10939252 10982024 10819190 10488196 10045771 9553905 9065395 8617635
40564 8617635 8236294 7940304 7738359 7617356 7534313 7423488 7219125 6881753 6413001 5851938
40554 5851938 5258034 4692303 4204908 3829013 3576174 3432115 3357639 3299206 3206919 3051723
40544 3051723 2834599 2586270 2360330 2223396 2243892 2478775 2957426 3666037 4541417 5482917
40534 5482917 6381377 7151892 7754286 8194023 8507754 8743064 8940815 9125299 9303839
40525 9303839 9473299 9628076 9765136 9885112 9990746 10083699 10160625 10210570 10216257 10159654
40515 10159654 10029057 9823880 9555072 9241419 8902880 8552876 8193051 7814792 7408498
40506 7408498 6975284 6532482 6108384 5729412 5407244 5131840 4873095 4591705 4256863
$$ packed form
40574I611587O11084M57538K59043M2772j62834l30994m42425m91866m88510m47760
40564H617635l81341k95990k01945j21003q3043j10825k04363l37372m68752n61063
40554E851938n93904n65731m87395l75895k52839j44059p4476n8433r2287j55196
40544C051723k17124k48329k25940j36934K0496K34883M78651P08611Q75380R41500
40534E482917Q98460P70515O02394M39737L13731K35310J97751J84484J78540
40525I303839J69460J54777J37060J19976J05634R2953P6926M9945N687n6603
40515A0159654j30597k05177k68808l13653l38539l50004l59825l78259m06294
40506G408498m33214m42802m24098l78972l22168k75404k58745k81390l34842
$$ plain form
40497 4256863 3863216 3436874 3025622 2679104 2431499 2296235 2273137 2360811 2565471 2901225
40487 2901225 3382494 4013612 4781392 5653839 6584401 7519070 8404019 9192753 9852149
40478 9852149 10366091 10735455 10974991 11109597 11171705 11198271 11224064 11270618 11334789 11382745
40468 11382745 11352952 11168710 10758844 10082619 9150643 8031425 6838129 5700771 4737052
40459 4737052 4032996 3635493 3551757 3751599 4173390 4736128 5356299 5964188 6514126 6986658
40449 6986658 7384085 7722721 8025061 8313142 8602394 8895509 9178673 9423846 9597768
40440 9597768 9673601 9639944 9505097 9297380 9061895 8852389 8717808 8687115 8759698 8907575
40430 8907575 9089241 9267354 9420601 9545968 9655115 9770103 9919125 10129571 10417858
$$ packed form
40497D256863l93647m26342m11252l46518k47605j35264k3098Q7674K04660L35754
40487B901225M81269O31118P67780Q72447R30562R34669Q84949P88734O59396
40478I852149N13942L69364K39536J34606O2108K6566K5793M6554O4171M7956
40468A1382745k9793j84242m09866o76225r31976j119218j193296j137358r63719
40459D737052p04056l97503q3736J99842M21791N62738O20171O07889N49938M72532
40449F986658L97427L38636L02340K88081K89252K93115K83164K45173J73922
40440I597768P5833l3657j34847k07717k35485k09506j34581l0693P2583J47877
40430H907575J81666J78113J53247J25367J09147J14988J49022K10446K88287
$$ plain form
40421 10417858 10779651 11185136 11582025 11906238 12097491 12114067 11940142 11582830 11062434
40412 11062434 10403153 9629747 8770579 7862700 6953774 6098837 5354189 4771849 4395256
40403 4395256 4254553 4360864 4701213 5235592 5896752 6594599 7228503 7707462 7971048
40394 7971048 8001349 7821568 7484644 7057725 6606054 6178608 5799296 5467810 5170348 4894952
40384 4894952 4643633 4435701 4301560 4270844 4360503 4567452 4867647 5220744 5578003 5890903
40374 5890903 6118613 6233243 6222188 6087433 5842917 5512114 5127282 4729525 4367004 4089346
40364 4089346 3938818 3941267 4100171 4395494 4786610 5217386 5622682 5936854 6103798 6085309
40354 6085309 5864053 5440968 4831377 4064330 3185184 2256853 1355017 557122 -70007
$$ packed form
40421A0417858L61793M05485L96889L24213J91253J6576j73925l57312n20396
40412A1062434o59281p73406q59168r07879r08926q54937p44648n82340l76593
40403D395256j40703J06311L40349N34379O61160O97847O33904M78959K63586
40394G971048L0301j79781l36924m26919m51671m27446l79312l31486k97462k75396
40384D894952k51319k07932j34141l0716Q9659K06949L00195L53097L57259L12900
40374E890903K27710J14630j1055j34755k44516l30803l84832l97757l62521k77658
40364D089346j50528K449J58904K95323L91116M30776M05296L14172J66944j8489
40354F085309k21256m23085o09591p67047q79146r28331r01836p97895o27129
$$ plain form
40345 -70007 -478470 -641793 -553825 -225822 319089 1054575 1959138 3017406 4212563 5514830
40335 5514830 6873676 8218357 9466842 10540536 11380852 11962966 12302856 12456125 12508815
40326 12508815 12560841 12704059 13000174 13465838 14070577 14748381 15418804 16009742 16473237
40317 16473237 16789756 16963880 17018809 16993692 16940892 16918678 16980031 17162552 17482395 17930954
40307 17930954 18473198 19050392 19590426 20023879 20299031 20389753 20295567 20036880 19648260 19170834
40297 19170834 18645068 18106359 17584912 17107997 16700431 16381573 16161623 16041252 16014526
40288 16014526 16070920 16193330 16354415 16516964 16641467 16697996 16675364 16581464 16434365 16250319
40278 16250319 16037327 15798424 15540693 15281574 15047470 14866945 14764607 14759457 14866502 15097964
$$ packed form
40345g0007m08463j63323Q7968L28003N44911P35486R04563J058268J195157J302267
40335E514830J358846J344681J248485J073694Q40316N82114L39890J53269N2690
40326A2508815N2026J43218K96115M65664O04739O77804O70423N90938M63495
40317A6473237L16519J74124N4929k5117n2800k2214O1353J82521L19843M48559
40307A7930954N42244N77194N40034M33453K75152R0722r4186k58687l88620m77426
40297A9170834n25766n38709n21447m76915m07566l18858k19950j20371k6726
40288A6014526N6394J22410J61085J62549J24503N6529k2632r3900j47099j84046
40278A6250319k12992k38903k57731k59119k34104j80525j02338n150J07045K31462
$$ plain form
40268 15097964 15461577 15956671 16571079 17281845 18060159 18878092 19713588 20551393 21380138
40259 21380138 22188232 22962039 23688357 24359942 24980257 25564002 26132479 26705648 27294587
40250 27294587 27898390 28507245 29108772 29691666 30243253 30743780 31163701 31467510 31622557
40241 31622557 31608551 31423701 31085020 30623228 30075925 29483175 28885704 28322117 27823492
40232 27823492 27408791 27085254 26852326 26703494 26623751 26587625 26564388 26530643 26482955 26442204
40222 26442204 26447249 26542016 26761807 27122356 27612982 28195398 28809769 29386983 29862767 30188797
40212 30188797 30338677 30308941 30115906 29790181 29372668 28915193 28483424 28154304 28001959
40203 28001959 28075411 28380020 28874619 29487512 30143765 30790682 31411155 32022392 32664368
$$ packed form
40268A5097964L63613M95094O14408P10766P78314Q17933Q35496Q37805Q28745
40259B1380138Q08094P73807P26318O71585O20315N83745N68477N73169N88939
40250B7294587O03803O08855O01527N82894N51587N00527M19921L03809J55047
40241C1622557j4006j84850l38681m61792n47303n92750n97471n63587m98625
40232B7823492m14701l23537k32928j48832p9743l6126k3237l3745m7688m0751
40222B6442204N045R4767K19791L60549M90626N82416O14371N77214M75784L26030
40212C0188797J49880k9736j93035l25725m17513m57475m31769l29120j52345
40203B8001959P3452L04609M94599O12893O56253O46917O20473O11237O41976
$$ plain form
40194 32664368 33384126 34220428 35192497 36296767 37513365 38818090 40191428 41618864
40186 41618864 43084868 44568536 46046903 47504757 48943996 50385674 51863259 53412014
40178 53412014 55062044 56839504 58774234 60907708 63295543 66002303 69090252 72606116
40170 72606116 76570847 80976698 85793088 90978923 96496562 102322781 108454522 114909789
40162 114909789 121725772 128956433 136670705 144950539 153886472 163568347 174071170 185439734
40154 185439734 197677701 210744542 224557704 238992939 253877442 268977855 283991839
40147 283991839 298552344 312248163 324658216 335394281 344146964 350729321 355109844
40140 355109844 357423869 357954282 357080385 355204796 352675838 349723565 346422586 342687833
$$ packed form
40194C2664368P19758Q36302R72069J104270J216598J304725J373338J427436
40186D1618864J466004J483668J478367J457854J439239J441678J477585J548755
40178E3412014J650030J777460J934730K133474K387835K706760L087949L515864
40170G2606116L964731M405851M816390N185835N517639N826219O131741O455267
40162A14909789O815983P230661P714272Q279834Q935933R681875J0502823J1368564
40154A85439734J2237967J3066841J3813162J4435235J4884503J5100413J5013984
40147B83991839J4560505J3695819J2410053J0736065Q752683O582357M380523
40140C55109844K314025N30413q73897j875589k528958k952273l300979l734753
$$ plain form
40132 342687833 338303252 332977668 326416443 318392639 308800287 297677760 285200095 271649101
40124 271649101 257373187 242745103 228121970 213812580 200058565 187032966 174852209
40117 174852209 163592402 153302142 144008654 135717496 128408203 122030608 116507532 111745447
40109 111745447 107647617 104121237 101075157 98413082 96030582 93820442 91684548 89546789
40101 89546789 87361124 85110939 82800020 80440647 78046793 75636474 73239411 70901701
40093 70901701 68682145 66641701 64830998 63279514 61987874 60925125 60034100 59246308
40085 59246308 58503475 57778691 57089386 56496358 56087199 55948231 56135121 56654945 57467789
40076 57467789 58505612 59696969 60985526 62337214 63738957 65194773 66722576 68351255
$$ packed form
40132C42687833m384581n325584o561225q023804r592352j1122527j2477665j3550994
40124B71649101j4275914j4628084j4623133j4309390j3754015j3025599j2180757
40117A74852209j1259807j0290260r293488q291158p309293o377595n523076m762085
40109A11745447m097830l526380l046080k662075k382500k210140k135894k137759
40101H9546789k185665k250185k310919k359373k393854k410319k397063k337710
40093G0901701k219556k040444j810703j551484j291640j062749q91025p87792
40085E9246308p42833p24784o89305n93028m09159j38968J86890N19824Q12844
40076E7467789J037823J191357J288557J351688J401743J455816J527803J628679
$$ plain form
40068 68351255 70116016 72051364 74184215 76531975 79109412 81942822 85083446 88609408
40060 88609408 92610063 97156560 102271043 107907709 113950978 120225846 126511554 132554322
40052 132554322 138082265 142828449 146564234 149138017 150508068 150756168 150073919 148725103
40044 148725103 146998040 145163778 143448738 142021537 140989123 140396795 140227804 140401068
40036 140401068 140769950 141127915 141225516 140799076 139607605 137471368 134302258 130116252 125024572
40027 125024572 119209234 112892704 106307739 99669388 93151907 86876254 80911400 75285551
40019 75285551 69998838 65032276 60354310 55928807 51725016 47725827 43930510 40351641
40011 40351641 37009096 33924517 31117828 28605723 26401529 24516239 22960113 21742941
$$ packed form
40068F8351255J764761J935348K132851K347760K577437K833410L140624L525962
40060H8609408M000655M546497N114483N636666O043269O274868O285708O042768
40052A32554322N527943M746184L735785K573783J370051K48100o82249j348816
40044A48725103j727063j834262j715040j427201j032414n92328j68991J73264
40036A40401068L68882L57965R7601m26440j191471k136237l169110m186006n091680
40027A25024572n815338o316530o584965o638351o517481o275653n964854n625849
40019G5285551n286713m966562m677966m425503m203791l999189l795317l578869
40011D0351641l342545l084579k806689k512105k204194j885290j556126j217172
$$ plain form
40003 21742941 20870178 20334325 20105470 20127917 20327131 20624540 20952863 21265286 21535937
39994 21535937 21752779 21906575 21981793 21955624 21807032 21530662 21146339 20697446 20238068 19814169
39984 19814169 19446254 19120492 18792154 18399377 17880037 17184927 16286311 15185259 13918469
39975 13918469 12558858 11203440 9949880 8871965 8005392 7348022 6870592 6530483 6282557
39966 6282557 6084858 5900714 5700382 5463362 5179255 4845275 4462739 4037304 3583908
39957 3583908 3131376 2720652 2395842 2192306 2126831 2192851 2362156 2593119 2843252 3081963
39947 3081963 3299773 3512137 3757394 4089346 4566274 5238992 6139777 7272753 8607101
39938 8607101 10075984 11583610 13019264 14273715 15252860 15885435 16124461 15945150 15343908
$$ packed form
40003B1742941q72763n35853k28855K2447J99214K97409L28323L12423K70651
39994B1535937K16842J53796P5218k6169j48592k76370l84323m48893m59378m23899
39984A9814169l67915l25762l28338l92777n19340o95110q98616j101052j266790
39975A3918469j359611j355418j253560j077915q66573o57370m77430l40109k47926
39966F282557j97699j84144k00332k37020k84107l33980l82536m25435m53396
39957C583908m52532m10724l24810k03536o5475O6020J69305K30963K50133K38711
39947C081963K17810K12364K45257L31952M76928O72718R00785J132976J334348
39938H607101J468883J507626J435654J254451R79145O32575K39026j79311o01242
$$ plain form
39929 15343908 14341622 12989243 11369549 9590200 7769119 6017736 4427388 3060981
39921 3060981 1949452 1091795 458010 -4195 -357256 -656700 -934766 -1192673 -1405077
39912 -1405077 -1532211 -1531396 -1363640 -997280 -412715 391090 1391937 2546006 3796875
39903 3796875 5088078 6372819 7616950 8796206 9891593 10885568 11759719 12494537 13072321
39894 13072321 13482687 13727512 13821813 13789242 13654092 13433918 13137293 12768516 12335916 11857465
39884 11857465 11360088 10874548 10429369 10044710 9725591 9456638 9203056 8920305 8569388
39875 8569388 8130924 7611047 7035343 6432714 5817509 5180570 4494520 3729398 2869463
39866 2869463 1923680 927375 -63944 -986503 -1782888 -2415059 -2870783 -3160364 -3304973
$$ packed form
39929A5343908j002286j352379j619694j779349j821081j751383j590348j366407
39921C060981j111529q57657o33785m62205l53061k99444k78066k57907k12404
39912a405077j27134Q15J67756L66360N84565Q03805J000847J154069J250869
39903C796875J291203J284741J244131J179256J095387R93975Q74151P34818N77784
39894A3072321M10366K44825R4301l2571j35150k20174k96625l68777m32600m78451
39884A1857465m97377m85540m45179l84659l19119k68953k53582k82751l50917
39875H569388m38464n19877n75704o02629o15205o36939o86050p65122q59935
39866B869463r45783r96305r91319r22559p96385o32171m55724k89581j44609
$$ plain form
39857 -3304973 -3322625 -3218789 -2985214 -2606201 -2069824 -1380955 -570724 304174 1174182 1974220
39847 1974220 2654560 3181074 3531116 3693384 3672712 3493458 3196067 2827569 2431249 2040145
39837 2040145 1675701 1349640 1065755 819820 599031 383939 153571 -109184 -414902
39828 -414902 -767115 -1160972 -1579787 -1991748 -2350273 -2599981 -2688374 -2581182 -2276144 -1807662
39818 -1807662 -1237622 -635738 -59493 457041 903071 1283363 1608393 1886392 2119680
39809 2119680 2305465 2438557 2512384 2517698 2443093 2282211 2047013 1779158 1549573 1441999
39799 1441999 1525645 1828479 2322973 2930543 3542689 4049863 4367297 4450467 4298615 3948739
39789 3948739 3463834 2919211 2390169 1942727 1627379 1475510 1499105 1694391 2048246 2544593
$$ packed form
39857c304973j7652J03836K33575L79013N36377O88869Q10231Q74898Q70008Q00038
39847A974220O80340N26514L50042J62268k0672j79254k97391l68498l96320l91104
39837B040145l64444l26061k83885k45935k20789k15092k30368k62755l05718
39828d14902l52213l93857m18815m11961l58525k49708q8393J07192L05038M68482
39818a807662N70040O01884N76245N16534M46030L80292L25030K77999K33288
39809B119680J85785J33092P3827N314p4605j60882k35198k67855k29585j07574
39799A441999Q3646L02834M94494O07570O12146N07174L17434Q3170j51852l49876
39789C948739m84905n44623n29042m47442l15348j51869K3595J95286L53855M96347
$$ plain form
39779 2544593 3168299 3905513 4740559 5651178 6606062 7568556 8505928 9398293 10241218
39770 10241218 11042132 11815887 12583045 13368193 14193052 15064088 15961748 16839865 17637216
39761 17637216 18294882 18770683 19046351 19128457 19045012 18838017 18552644 18226858 17886545 17547789
39751 17547789 17222672 16923065 16659741 16438237 16254928 16095678 15937316 15750712 15504514
39742 15504514 15169714 14725886 14169011 13518841 12821967 12147055 11571633 11164064 10967037
39733 10967037 10988099 11199896 11550192 11979477 12440561 12911246 13392706 13894047 14412706
39724 14412706 14922913 15378721 15729013 15935948 15987627 15899618 15706204 15447413 15158634 14865816
39714 14865816 14585076 14324512 14087084 13873722 13685165 13522305 13387200 13286828 13237236
$$ packed form
39779B544593O23706P37214Q35046R10619R54884R62494R37372Q92365Q42925
39770A0241218Q00914P73755P67158P85148Q24859Q71036Q97660Q78117P97351
39761A7637216O57666M75801K75668Q2106q3445k06995k85373l25786l40313l38756
39751A7547789l25117k99607k63324k21504j83309j59250j58362j86604k46198
39742A5504514l34800m43828n56875o50170o96874o74912n75422m07569j97027
39733A0967037K1062K11797L50296M29285M61084M70685M81460N01341N18659
39724A4412706N10207M55808L50292K06935N1679q8009j93414k58791k88779k92818
39714A4865816k80740k60564k37428k13362j88557j62860j35105j00372m9592
$$ plain form
39705 13237236 13262353 13384686 13612595 13932829 14312988 14710848 15083589 15392056 15600198
39696 15600198 15673365 15579277 15292491 14799378 14099781 13204972 12135438 10921592 9606270
39687 9606270 8245421 6905291 5657094 4569929 3701788 3090130 2746140 2655758 2785862
39678 2785862 3091470 3521920 4027346 4566350 5112826 5658688 6211082 6785208 7395205
39669 7395205 8046507 8733435 9443795 10167435 10901978 11650467 12412005 13171855 13897438
39660 13897438 14542386 15056527 15398024 15543804 15494868 15274689 14921611 14478387 13982098
39651 13982098 13457030 12912957 12350451 11771275 11187432 10622097 10101329 9642379 9246124
39642 9246124 8897162 8569878 8236807 7876213 7476679 7037282 6563946 6065343 5551992
$$ packed form
39705A3237236K5117J22333K27909L20234L80159L97860L72741L08467K08142
39696A5600198P3167r4088k86786m93113o99597q94809j069534j213846j315322
39687I606270j360849j340130j248197j087165q68141o11658l43990r0382J30104
39678B785862L05608M30450N05426N39004N46476N45862N52394N74126O09997
39669G395205O51302O86928P10360P23640P34543P48489P61538P59850P25583
39660A3897438O44948N14141L41497J45780m8936k20179l53078m43224m96289
39651A3982098n25068n44073n62506n79176n83843n65335n20768m58950l96255
39642I246124l48962l27284l33071l60594l99534m39397m73336m98603n13351
$$ plain form
39633 5551992 5038162 4541899 4079679 3658711 3274109 2914104 2568656 2234401 1914229
39624 1914229 1614744 1343898 1107393 903065 716372 521445 288515 -5577 -368395
39615 -368395 -788031 -1235984 -1675082 -2067557 -2378985 -2578945 -2643350 -2561175 -2342214 -2019346
39605 -2019346 -1642102 -1264101 -930154 -667530 -482477 -360797 -271806 -176371 -38913 160486
39595 160486 420198 721240 1039347 1358389 1678786 2017771 2402010 2856020 3391343 4000294
39585 4000294 4655321 5313013 5921947 6433835 6815870 7060043 7185429 7232604 7252728 7294702
39575 7294702 7392610 7554965 7758941 7954311 8079012 8080926 7935157 7648834 7254395 6798388
39565 6798388 6331720 5902969 5554580 5321900 5233751 5311244 5562741 5976952 6519159 7134399
$$ packed form
39633E551992n13830m96263m62220m20968l84602l60005l45448l34255l20172
39624A914229k99485k70846k36505k04328j86693j94927k32930k94092l62818
39615c68395m19636m47953m39098l92475l11428j99960o4405Q2175K18961L22868
39605b019346L77244L78001L33947K62624J85053J21680Q8991R5435J37458J99399
39595A60486K59712L01042L18107L19042L20397L38985L84239M54010N35323O08951
39585D000294O55027O57692O08934N11888L82035K44173J25386M7175K0124M1974
39575G294702R7908J62355K03976J95370J24701J914j45769k86323l94439m56007
39565F798388m66668m28751l48389k32680q8149P7493K51497M14211N42207O15240
$$ plain form
39555 7134399 7758152 8331585 8815606 9197381 9486723 9706286 9882757 10042900 10212473
39546 10212473 10414131 10663576 10966511 11319315 11714088 12146236 12620598 13151534 13755234
39537 13755234 14438071 15188804 15980245 16779249 17558410 18303675 19016288 19710268 20405659
39528 20405659 21117281 21841631 22548694 23184745 23685590 23992855 24065283 23882569 23445104
39519 23445104 22773750 21910197 20914933 19859936 18816665 17843596 16978159 16235107 15609554
39510 15609554 15081427 14619637 14186672 13745042 13265487 12734755 12159900 11566808 10992659
39501 10992659 10474568 10038523 9692871 9428405 9223985 9054735 8900185 8751104 8614559
39492 8614559 8516271 8498529 8612040 8901914 9391377 10069487 10888469 11771945 12630736 13381076
$$ packed form
39555G134399O23753N73433M84021L81775K89342K19563J76471J60143J69573
39546A0212473K01658K49445L02935L52804L94773M32148M74362N30936O03700
39537A3755234O82837P50733P91441P99004P79161P45265P12613O93980O95391
39528B0405659P11622P24350P07063O36051N00845L07265P2428j82714m37465
39519B3445104o71354q63553r95264j054997j043271r73069q65437p43052o25553
39510A5609554n28127m61790m32965m41630m79555n30732n74855n93092n74149
39501A0992659n18091m36045l45652k64466k04420j69250j54550j49081j36545
39492H614559r8288j7742J13511K89874M89463O78110Q18982Q83476Q58791P50340
$$ plain form
39482 13381076 13960856 14340227 14523249 14539553 14429549 14230007 13965548 13646834 13272715
39473 13272715 12833670 12316205 11709187 11011452 10237247 9414990 8577925 7750937 6941471
39464 6941471 6140796 5335569 4523047 3720299 2960916 2280412 1699388 1215184 806840
39455 806840 449752 131589 -138196 -329975 -407737 -351028 -175361 60453 266316 348486
39445 348486 240923 -73421 -559992 -1148355 -1757642 -2320114 -2794747 -3169741 -3457650 -3687180
39435 -3687180 -3893314 -4106236 -4340676 -4589242 -4823216 -5001570 -5085041 -5049226 -4890516 -4622141
39425 -4622141 -4263489 -3830740 -3335812 -2793567 -2229958 -1683164 -1196387 -807501 -541787
39416 -541787 -409772 -408323 -522234 -724811 -977869 -1232930 -1435807 -1535595 -1496931 -1312140
$$ packed form
39482A3381076N79780L79371J83022J6304j10004j99542k64459l18714l74119
39473A3272715m39045n17465o07018o97735p74205q22257q37065q26988q09466
39464F941471q00675q05227q12522q02748p59383o80504n81024m84204m08344
39455H06840l57088l18163k69785j91779p7762N6709J75667K35814K05863Q2170
39445C48486j07563l14344m86571n88363o09287n62472m74633l74994k87909k29530
39435c687180k06134k12922k34440k48566k33974j78354q3471L5815J58710K68375
39425d622141L58652M32749M94928N42245N63609N46794M86777L88886K65714
39416e41787J32015J449j13911k02577k53058k55061k02877r9788L8664J84791
$$ plain form
39406 -1312140 -1008180 -643228 -291044 -17797 138212 174034 114261 -5939 -157528 -327452
39396 -327452 -520280 -753455 -1048587 -1421070 -1870784 -2377292 -2902195 -3398499 -3823811 -4152656
39386 -4152656 -4383920 -4541128 -4665362 -4802822 -4990747 -5245753 -5557397 -5888189 -6180180
39377 -6180180 -6367368 -6391700 -6218677 -5847351 -5310338 -4662816 -3964851 -3264960 -2591868 -1956115
39367 -1956115 -1357714 -794028 -263620 234838 705848 1157717 1597654 2023752 2420174
39358 2420174 2759818 3012716 3155165 3176587 3084202 2905372 2685240 2477509 2329927 2269957
39348 2269957 2296860 2383903 2489912 2574878 2612410 2594076 2525948 2421972 2299189 2176830
39338 2176830 2077803 2029443 2061184 2199129 2459423 2842652 3330584 3886152 4457848 4989523
$$ packed form
39406a312140L03960L64952L52184K73247J56009L5822n9773j20200j51589j69924
39396c27452j92828k33175k95132l72483m49714n06508n24903m96304m25312l28845
39386d152656k31264j57208j24234j37460j87925k55006l11644l30792k91991
39377f180180j87188k4332J73023L71326N37013O47522O97965O99891O73092O35753
39367a956115N98401N63686N30408M98458M71010M51869M39937M26098L96422
39358B420174L39644K52898J42449K1422r2385j78830k20132k07731j47582n9970
39348B269957K6903Q7043J06009Q4966L7532j8334o8128j03976j22783j22359
39338B176830r9027m8360L1741J37945K60294L83229M87932N55568N71696N31675
$$ plain form
39328 4989523 5434488 5769551 6002802 6170541 6323862 6511058 6764249 7095242 7499314
39319 7499314 7961995 8465318 8993215 9536020 10091797 10661994 11242837 11818323 12360118
39310 12360118 12834150 13208537 13457570 13561347 13505172 13282611 12901776 12390100 11792568
39301 11792568 11162046 10545335 9971454 9447704 8964631 8505892 8056895 7608421 7155585
39292 7155585 6694684 6219980 5721630 5186379 4602522 3968154 3298493 2627596 2002899
39283 2002899 1475372 1089926 879267 861133 1036445 1386424 1869842 2424355 2975024 3448444
39273 3448444 3786382 3952589 3930960 3718705 3320595 2748251 2024022 1185123 283043 -623989
39263 -623989 -1483068 -2257406 -2930949 -3506271 -3999733 -4438336 -4858724 -5304612 -5819372 -6435424
$$ packed form
39328D989523M44965L35063K33251J67739J53321J87196K53191L30993M04072
39319G499314M62681N03323N27897N42805N55777N70197N80843N75486N41795
39310A2360118M74032L74387K49033J03777n6175k22561l80835n11676n97532
39301A1792568o30522o16711n73881n23750m83073m58739m48997m48474m52836
39292G155585m60901m74704m98350n35251n83857o34368o69661o70897o24697
39283B002899n27527l85446k10659j8134J75312L49979M83418N54513N50669M73420
39273C448444L37938J66207k1629k12255l98110n72344p24229q38899r02080r07032
39263f23989q59079p74338o73543n75322m93462m38603m20388m45888n14760o16052
$$ plain form
39253 -6435424 -7166391 -8006750 -8937745 -9933879 -10965710 -11999736 -12999313 -13928743 -14759217
39244 -14759217 -15473574 -16067555 -16546421 -16917437 -17181339 -17327867 -17339008 -17198773 -16904219
39235 -16904219 -16472054 -15937614 -15345857 -14736786 -14130604 -13519280 -12868979 -12132661 -11267493
39226 -11267493 -10249899 -9082656 -7792204 -6418849 -5005269 -3588398 -2197117 -855079
39218 -855079 414511 1586899 2639892 3562270 4359644 5051815 5662487 6208126 6691961
39209 6691961 7104015 7425010 7632613 7709336 7650274 7467618 7189819 6855463 6503388 6161732
39199 6161732 5839854 5527128 5199854 4833245 4413289 3944003 3447660 2957241 2503075
39190 2503075 2099879 1742571 1415226 1108716 836220 637350 569052 688081 1032147 1605683
$$ packed form
39253f435424p30967q40359r30995r96134j031831j034026r99577r29430q30474
39244a4759217p14357n93981m78866l71016k63902j46528j1141J40235K94554
39235a6904219M32165N34440N91757O09071O06182O11324O50301P36318Q65168
39226a1267493J017594J167243J290452J373355J413580J416871J391281J342038
39218h55079J269590J172388J052993R22378P97374O92171O10672N45639M83835
39209F691961M12054L20995K07603P6723n9062j82656k77799l34356l52075l41656
39199F161732l21878l12726l27274l66609m19956m69286m96343m90419m54166
39190B503075m03196l57308l27345l06510k72496j98870o8298J19029L44066N73536
$$ plain form
39180 1605683 2374015 3267031 4190441 5040982 5722176 6158773 6308550 6169158 5776735
39171 5776735 5194312 4492994 3734436 2963846 2215412 1522084 918496 433137 76100
39162 76100 -168180 -339014 -490595 -679904 -953427 -1334608 -1816021 -2360397 -2911159 -3408395
39152 -3408395 -3804284 -4073404 -4215807 -4252387 -4213920 -4127789 -4007830 -3850891 -3639714 -3349547
39142 -3349547 -2956369 -2445267 -1816772 -1088768 -294007 524017 1314491 2022322 2592773
39133 2592773 2978630 3148656 3094632 2833480 2402066 1845904 1207312 519322 -192412 -902685
39123 -902685 -1580021 -2184204 -2669434 -2991883 -3118681 -3035435 -2751283 -2301963 -1750194 -1180439
39113 -1180439 -685441 -346289 -213241 -295962 -567450 -978295 -1473160 -2002438 -2527230 -3019993
$$ packed form
39180A605683P68332Q93016R23410Q50541O81194M36597J49777j39392l92423
39171E776735n82423p01318p58558p70590p48434o93328o03588m85359l57037
39162G6100k44280j70834j51581j89309k73523l81181m81413n44376n50762m97236
39152c408395l95889k69120j42403l6580L8467Q6131J19959J56939K11177K90167
39142c349547L93178N11102O28495P28004P94761Q18024P90474P07831N70451
39133B592773L85857J70026n4024k61152m31414n56162o38592o87990p11734p10273
39123i02685o77336o04183m85230l22449j26798Q3246K84152M49320N51769N69755
39113a180439M94998L39152J33048q2721k71488m10845m94865n29278n24792m92763
$$ plain form
39103 -3019993 -3463747 -3851110 -4183132 -4467229 -4713295 -4927609 -5106201 -5231771 -5278417 -5224955
39093 -5224955 -5071557 -4850018 -4620044 -4452472 -4408746 -4526544 -4814410 -5252129 -5794529 -6380081
39083 -6380081 -6944734 -7435940 -7819539 -8077100 -8198631 -8177836 -8013460 -7714843 -7307154 -6832527
39073 -6832527 -6345958 -5906915 -5568328 -5365221 -5306659 -5375287 -5535586 -5746270 -5969739 -6175280
39063 -6175280 -6338582 -6441272 -6470380 -6414907 -6259357 -5978838 -5541710 -4921749 -4115675 -3157398
39053 -3157398 -2119749 -1099371 -189408 547583 1093757 1472231 1730401 1919791 2080655
39044 2080655 2235526 2391940 2550420 2711406 2876619 3045707 3213019 3368268 3501092
39035 3501092 3606766 3689958 3764116 3846204 3949457 4078377 4227645 4383301 4524399 4626381
$$ packed form
39103c019993m43754l87363l32022k84097k46066k14314j78592j25570m6646N3462
39093e224955J53398K21539K29974J67572M3726j17798k87866m37719n42400n85552
39083f380081n64653m91206l83599k57561j21531K0795J64376K98617M07689M74627
39073f832527M86569M39043L38587K03107N8562o8628j60299k10684k23469k05541
39063f175280j63302j02690k9108N5473J55550K80519M37128O19961Q06074R58277
39053c157398J037649J020378R09963P36991N46174L78474K58170J89390J60864
39044B080655J54871J56414J58480J60986J65213J69088J67312J55249J32824
39035C501092J05674Q3192P4158Q2088J03253J28920J49268J55656J41098J01982
$$ plain form
39025 4626381 4667978 4639481 4546987 4409554 4251882 4097560 3964896 3863262 3788195 3717585
39015 3717585 3614066 3436248 3155192 2768164 2302994 1811485 1355355 990623 756709
39006 756709 674426 752429 996463 1414369 2013515 2792814 3734418 4799712 5931869 7064334
38996 7064334 8132094 9081929 9879303 10511197 10984823 11322864 11557197 11723513 11857677
38987 11857677 11992829 12156629 12369520 12644475 12987372 13397221 13867177 14387215 14946915
38978 14946915 15535201 16136046 16723225 17259311 17702101 18016722 18187176 18220594 18142006 17983671
38968 17983671 17775295 17538642 17286306 17023086 16749066 16463294 16166628 15863233 15561770
38959 15561770 15276806 15029011 14842175 14737559 14728893 14820883 15010799 15290061 15643704 16049368
$$ packed form
39025D626381M1597k8497r2494j37433j57672j54322j32664j01634p5067p0610
39015C717585j03519j77818k81056l87028m65170m91509m56130l64732k33914
39006G56709q2283P8003K44034M17906N99146P79299R41604J065294J132157J132465
38996G064334J067760R49835P97374O31894M73626L38041K34333J66316J34164
38987A1857677J35152J63800K12891K74955L42897M09849M69956N20038N59700
38978A4946915N88286O00845N87179N36086M42790L14621J70454L3418p8588j58335
38968A7983671k08376k36653k52336k63220k74020k85772k96666l03395l01463
38959A5561770k84964k47795j86836j04616q666R1990J89916K79262L53643M05664
$$ plain form
38949 16049368 16479510 16908381 17320822 17717685 18115127 18539070 19017995 19575901 20225661
38940 20225661 20962880 21761647 22574268 23336719 23979600 24441638 24680931 24679825 24442519 23988199
38930 23988199 23344134 22542104 21618871 20618962 19597098 18617587 17748578 17050269 16559426
38921 16559426 16276770 16165488 16164846 16214501 16277940 16353113 16465250 16646916 16917282 17271746
38911 17271746 17685512 18126256 18567319 18994729 19405431 19798181 20162324 20471805 20689591
38902 20689591 20780806 20726753 20531790 20220516 19828286 19390218 18932939 18471337 18009917 17545925
38892 17545925 17071455 16574890 16044721 15476755 14880773 14280720 13707342 13188520 12743631
38883 12743631 12382946 12108046 11909561 11762762 11624787 11437267 11136174 10667498 10003357
$$ packed form
38949A6049368M30142M28871M12441L96863L97442M23943M78925N57906O49760
38940B0225661P37219P98767Q12621P62451O42881M62038K39293j106k37306m54320
38930B3988199o44065q02030r23233r99909j021864r79511q69009o98309m90843
38921A6559426k82656j11282o42M9655O3439P5173J12137J81666K70366L54464
38911A7271746M13766M40744M41063M27410M10702L92750L64143L09481K17786
38902B0689591R1215n4053j94963l11274l92230m38068m57279m61602m61420m63992
38892A7545925m74470m96565n30169n67966n95982o00053n73378n18822m44889
38883A2743631l60685k74900j98485j46799j37975j87520l01093m68676o64141
$$ plain form
38874 10003357 9151075 8150636 7062564 5953033 4882273 3898703 3038346 2327568 1785793
38865 1785793 1424863 1245158 1233092 1364592 1613641 1959309 2385293 2872514 3391559 3901832
38855 3901832 4358412 4721831 4965878 5083000 5089288 5027463 4961898 4962332 5081878 5341019 5726080
38844 5726080 6201845 6731222 7292654 7887197 8531933 9244689 10031319 10883811 11786625
38835 11786625 12721085 13661712 14569192 15389577 16062981 16535313 16764554 16720463 16384004
38826 16384004 15751344 14839725 13688684 12354933 10905755 9415380 7962855 6626877
38818 6626877 5476758 4563171 3912129 3522560 3367115 3397128 3552479 3774473 4017807
38809 4017807 4257954 4491746 4730964 4991790 5285421 5614274 5973916 6357708 6761897
$$ packed form
38874A0003357q52282j000439j088072j109531j070760r83570q60357p10778n41775
38865A785793l60930j79705j2066J31500K49049L45668M25984M87221N19045N10273
38855C901832M56580L63419K44047J17122O288o1825o5565M34J19546K59141L85061
38844E726080M75765N29377N61432N94543O44736P12756P86630Q52492R02814
38835A1786625R34460R40627R07480Q20385O73404M72332K29241m4091l36459
38826A6384004o32660r11619j151041j333751j449178j490375j452525j335978
38818F626877j150119r13587o51042l89569j55445L0013J55351K21994K43334
38809D017807K40147K33792K39218K60826K93631L28853L59642L83792M04189
$$ plain form
38800 6761897 7190988 7662386 8206517 8858649 9643426 10559174 11570518 12613828 13613550
38791 13613550 14502993 15242313 15828054 16291023 16682286 17051423 17425666 17799544 18139716
38782 18139716 18401234 18545755 18553042 18422872 18170367 17820117 17402748 16953541 16509616 16102846
38772 16102846 15749906 15444653 15157402 14841674 14445557 13924072 13249237 12415007 11436246
38763 11436246 10344148 9181788 8000581 6854966 5793599 4849795 4036508 3348548
38755 3348548 2770059 2282509 1868826 1512305 1193236 888863 579990 260579 -58110
38746 -58110 -354635 -612676 -834759 -1045026 -1279059 -1566943 -1919838 -2327130 -2763698 -3200278
38736 -3200278 -3609881 -3968589 -4254641 -4450489 -4548508 -4556102 -4494818 -4391956 -4268662 -4131017
$$ packed form
38800F761897M29091M71398N44131O52132P84777R15748J011344J043310R99722
38791A3613550Q89443P39320N85741M62969L91263L69137L74243L73878L40172
38782A8139716K61518J44521P287j30170k52505l50250m17369m49207m43925m06770
38772A6102846l52940l05253k87251l15728l96117n21485o74835q34230r78761
38763A1436246j092098j162360j181207j145615j061367r43804q13287o87960
38755C348548n78489m87550m13683l56521l19069l04373l08873l19411l18689
38746e8110k96525k58041k22083k10267k34033k87884l52895m07292m36568m36580
38736c200278m09603l58708k86052j95848r8019p594O1284J02862J23294J37645
$$ plain form
38726 -4131017 -3968260 -3758148 -3476597 -3107766 -2650463 -2117787 -1530069 -904685 -247728
38717 -247728 448396 1199108 2013957 2880533 3755646 4571554 5256305 5758617 6065728 6207274
38707 6207274 6244519 6249408 6282063 6376539 6540248 6763795 7031845 7327584 7630973 7916663
38697 7916663 8156501 8326389 8413320 8418320 8353652 8235296 8073529 7865232 7591112 7219379
38687 7219379 6715176 6053211 5229676 4268833 3220501 2147989 1111025 151953 -707260
38678 -707260 -1455701 -2078731 -2548915 -2829859 -2890128 -2717331 -2324218 -1746251 -1035259 -252580
38668 -252580 538546 1282814 1943966 2513085 3008606 3464840 3911969 4356912 4775442 5119343
38658 5119343 5333201 5371469 5209783 4850071 4321357 3676494 2983486 2311679 1717094 1232918
$$ packed form
38726d131017J62757K10112K81551L68831M57303N32676N87718O25384O56957
38717b47728O96124P50712Q14849Q66576Q75113Q15908O84751N02312L07111J41546
38707F207274L7245M889L2655R4476J63709K23547K68050K95739L03389K85690
38697G916663K39838J69888Q6931N000o4668j18356j61767k08297k74120l71733
38687G219379n04203o61965q23535r60843j048332j072512j036964r59072q59213
38678g07260p48441o23030m70184k80944o0269J72797L93113N77967P10992P82679
38668b52580P91126P44268O61152N69119M95521M56234M47129M44943M18530L43901
38658E119343K13858L8268j61686l59712n28714o44863o93008o71807n94585m84176
$$ plain form
38648 1232918 868455 614814 453382 364582 335966 367531 470842 660819 944188 1311407
38638 1311407 1736506 2184107 2619695 3019275 3376107 3702911 4027985 4384984 4799150
38629 4799150 5275463 5793796 6312713 6779947 7145873 7376388 7461936 7420343 7292929 7135364
38619 7135364 7005804 6953038 7007068 7173740 7433706 7745517 8053295 8299583 8441802 8467290
38609 8467290 8400492 8297962 8231830 8267801 8446520 8775043 9228694 9758083 10296266 10765749
38599 10765749 11088055 11196496 11048582 10633213 9970673 9107121 8106824 7043973 5993626
38590 5993626 5020859 4169445 3454381 2862469 2361022 1909856 1470501 1010112 502350
38581 502350 -71098 -717526 -1431274 -2195229 -2984915 -3772490 -4529835 -5232642 -5866696 -6433869
$$ packed form
38648A232918l64463k53641j61432q8800k8616L1565J03311J89977K83369L67219
38638A311407M25099M47601M35588L99580L56832L26804L25074L56999M14166
38629D799150M76313N18333N18917M67234L65926K30515Q5548m1593j27414j57565
38619G135364j29560n2766N4030J66672K59966L11811L07778K46288J42219K5488
38609H467290o6798j02530o6132L5971J78719L28523M53651N29389N38183M69483
38599A0765749L22306J08441j47914m15369o62540q63552j000297j062851j050347
38590E993626r72767q51414p15064n91912n01447m51166m39355m60389n07762
38581E02350n73448o46428p13748p63955p89686p87575p57345p02807o34054n67173
$$ plain form
38571 -6433869 -6953229 -7454773 -7967743 -8509028 -9077554 -9657497 -10227609 -10769714 -11270017
38562 -11270017 -11712337 -12068635 -12295086 -12339823 -12161725 -11751314 -11140998 -10397542 -9601462
38553 -9601462 -8825849 -8124407 -7529653 -7056336 -6705381 -6466732 -6321828 -6247307 -6220664 -6225778
38543 -6225778 -6253867 -6297212 -6338970 -6346923 -6277151 -6086753 -5748969 -5264085 -4663397 -4006637
38533 -4006637 -3373056 -2845633 -2490444 -2338234 -2377093 -2559982 -2822426 -3101204 -3347641 -3534725
38523 -3534725 -3660004 -3744332 -3824375 -3938338 -4109783 -4337917 -4599943 -4862940 -5096881 -5281748
38513 -5281748 -5408127 -5475178 -5489130 -5462255 -5411035 -5353627 -5307915 -5290786 -5317440 -5399506 -5542710
38502 -5542710 -5746472 -6006237 -6315976 -6667499 -7046670 -7430122 -7785452 -8074363 -8256741
$$ packed form
38571f433869n19360n01544n12970n41285n68526n79943n70112n42105n00303
38562a1270017m42320l56298k26451m4737J78098M10411O10316P43456P96080
38553i601462P75613P01442N94754M73317L50955K38649J44904P4521K6643n114
38543f225778k8089m3345m1758p953O9772J90398L37784M84884O00688O56760
38533d006637O33581N27423L55189J52210l8859j82889k62444k78778k46437j87084
38523c534725j25279q4328q0043j13963j71445k28134k62026k62997k33941j84867
38513e281748j26379o7051j3952K6875N1220N7408M5712J7129k6654q2066j43204
38502e542710k03762k59765l09739l51523l79171l83452l55330k88911j82378
$$ plain form
38493 -8256741 -8294990 -8158920 -7830258 -7305083 -6593860 -5719838 -4715632 -3616981 -2454701
38484 -2454701 -1248667 -6975 1270698 2589031 3954031 5369466 6830931 8318982
38476 8318982 9795973 11210872 12511855 13660862 14641685 15456545 16113721 16614977 16951357
38467 16951357 17109714 17085478 16893872 16573109 16176929 15759238 15358455 14990368 14652952
38458 14652952 14337961 14039492 13753655 13471849 13174800 12832543 12410714 11880729 11231000
38449 11231000 10475713 9656910 8837132 8084599 7457647 6995139 6714477 6613018 6668125
38440 6668125 6835789 7052627 7245554 7347960 7316196 7139493 6839845 6462719 6062723 5689666
38430 5689666 5379486 5151745 5012104 4956054 4970495 5032506 5108328 5156851 5138941 5028554
$$ packed form
38493h256741l8249J36070L28662N25175P11223Q74022J004206J098651J162280
38484b454701J206034J241692J277673J318333J365000J415435J461465J488051
38476H318982J476991J414899J300983J149007R80823Q14860O57176N01256L36380
38467A6951357J58357k4236j91606l20763l96180m17691m00783l68087l37416
38458A4652952l14991k98469k85837k81806k97049l42257m21829n29985o49729
38449A1231000p55287q18803q19778p52533o26952m62508k80662j01459N5107
38440F668125J67664K16838J92927J02406l1764j76703k99648l77126l99996l73057
38430E689666l10180k27741j39641n6050J4441O2011P5822M8523j7910j10387
$$ plain form
38420 5028554 4819517 4525242 4173605 3800550 3443542 3134431 2892946 2724148 2621915
38411 2621915 2576648 2582522 2640121 2753469 2924033 3146331 3409098 3702266 4025640 4393058
38401 4393058 4828146 5352527 5971754 6665629 7388305 8079759 8684905 9171909 9540330
38392 9540330 9814704 10027126 10198049 10324529 10380697 10330012 10144383 9822240 9397002 8930825
38382 8930825 8495352 8147677 7911861 7773514 7688958 7604376 7476043 7282543 7024366 6713474
38372 6713474 6360127 5963883 5511459 4980558 4347301 3594558 2717893 1726408 638979
38363 638979 -520069 -1721662 -2929372 -4098694 -5183256 -6147067 -6975561 -7677451 -8275459
38354 -8275459 -8791557 -9235477 -9602089 -9877375 -10048189 -10110056 -10069248 -9939028 -9733141 -9460403
$$ packed form
38420E028554k09037k94275l51637l73055l57008l09111k41485j68798j02233
38411B621915m5267N874N7599J13348J70564K22298K62767K93168L23374L67418
38401D393058M35088N24381O19227O93875P22676O91454O05146M87004L68421
38392I540330K74374K12422J70923J26480N6168n0685j85629l22143m25238m66177
38382H930825m35473l47675k35816j38347q4556q4582j28333j93500k58177l10892
38372F713474l53347l96244m52424n30901o33257p52743q76665r91485j087429
38363F38979j159048j201593j207710j169322j084562r63811q28494p01890n98008
38354h275459n16098m43920l66612k75286j70814o1867M0808J30220K05887K72738
$$ plain form
38344 -9460403 -9122344 -8713573 -8223879 -7641884 -6960237 -6181485 -5322817 -4417679 -3512632
38335 -3512632 -2658749 -1899114 -1256704 -727918 -284634 116535 522076 970762 1486132
38326 1486132 2072327 2713661 3379425 4034014 4648176 5204767 5696072 6116501 6457069
38317 6457069 6704268 6841727 6853195 6727263 6462836 6071502 5573837 4991795 4342818 3639256
38307 3639256 2892386 2118201 1342405 602423 -55650 -585703 -953291 -1145261 -1172501 -1064402
38297 -1064402 -858152 -588380 -281435 45242 380957 719575 1059074 1403012 1762336
38288 1762336 2154697 2599984 3114468 3707792 4383958 5143099 5980846 6886644 7845022
38279 7845022 8840268 9859426 10888572 11904216 12868031 13731772 14451222 15000948 15381334
$$ packed form
38344i460403L38059M08771M89694N81995O81647P78752Q58668R05138R05047
38335c512632Q53883P59635O42410N28786M43284M01169M05541M48686N15370
38326A486132N86195O41334O65764O54589O14162N56591M91305M20429L40568
38317F457069K47199J37459J1468j25932k64427l91334m97665n82042o48977p03562
38307C639256p46870p74185p75796p39982o58073n30053l67588j91970k7240J08099
38297a064402K06250K69772L06945L26677L35715L38618L39499L43938L59324
38288A762336L92361M45287N14484N93324O76166P59141Q37747R05798R58378
38279G845022R95246J019158J029146J015644R63815Q63741P19450N49726L80386
$$ plain form
38270 15381334 15614383 15730597 15753171 15687448 15521885 15240550 14839249 14334306 13758347 13146944
38260 13146944 12525604 11904741 11283629 10658571 10029275 9400833 8783341 8192367 7649857
38251 7649857 7181155 6805608 6525024 6318514 6148314 5972791 5758506 5486190 5151274
38242 5151274 4761864 4335148 3891251 3444903 2998839 2544364 2070825 1579013 1089571
38233 1089571 640463 275266 29800 -76143 -40472 123306 388472 716612 1059628 1364577
38223 1364577 1582411 1678820 1642394 1485275 1235080 922477 572126 202296 -168577 -516260
38213 -516260 -812834 -1035553 -1174770 -1234260 -1224329 -1153426 -1023599 -831864 -577020 -268881
38203 -268881 66035 387924 655890 841761 937775 956104 923300 873325 840993 856619 941887
$$ packed form
38270A5381334K33049J16214K2574o5723j65563k81335m01301n04943n75959o11403
38260A3146944o21340o20863o21112o25058o29296o28442o17492n90974n42510
38251G649857m68702l75547k80584k06510j70200j75523k14285k72316l34916
38242E151274l89410m26716m43897m46348m46064m54475m73539m91812m89442
38233A089571m49108l65197k45466j05943L5671J63778K65166L28140L43016L04949
38223A364577K17834R6409l6426j57119k50195l12603l50351l69830l70873l47683
38213e16260k96574k22719j39217n9490R931P0903J29827J91735K54844L08139
38203b68881L34916L21889K67966J85871R6014J8329l2804m9975l2332J5626Q5268
$$ plain form
38192 941887 1105978 1341855 1625750 1923884 2206164 2460262 2697866 2949233 3248586 3617329
38182 3617329 4053228 4531095 5014225 5469374 5876337 6227536 6519467 6742350 6875046
38173 6875046 6889401 6762418 6489351 6090447 5608918 5102918 4635530 4265252 4038354 3984399
38163 3984399 4115239 4426129 4897252 5495056 6173998 6879951 7556666 8155622 8646198
38154 8646198 9020420 9288752 9470000 9582452 9639875 9649312 9606111 9487593 9252469 8851556
38144 8851556 8247170 7431908 6437595 5330893 4198443 3127950 2191553 1435655 878559
38135 878559 514880 324023 278969 352032 516400 745141 1010551 1285503 1546686 1778684
38125 1778684 1977559 2151896 2319189 2497762 2698246 2920047 3154918 3393739 3629756
$$ packed form
38192I41887J64091K35877K83895K98134K82280K54098K37604K51367K99353L68743
38182C617329M35899M77867M83130M55149M06963L51199K91931K22883J32696
38173F875046J4355j26983k73067l98904m81529n06000m67388l70278k26898n3955
38163C984399J30840L10890M71123N97804O78942P05953O76715N98956M90576
38154H646198L74222K68332J81248J12452N7423R437m3201j18518k35124m00913
38144H851556o04386q15262r94313j106702j132450j070493r36397p55898n57096
38135H78559l63679j90857m5054P3063J64368K28741K65410K74952K61183K31998
38125A778684J98875J74337J67293J78573K00484K21801K34871K38821K36017
$$ plain form
38116 3629756 3854682 4050973 4187914 4227047 4135714 3901754 3541681 3098423 2629705 2192425
38106 2192425 1829612 1564347 1400065 1323679 1309261 1323174 1331626 1308900 1243526 1141713 1028527
38095 1028527 945137 939140 1048741 1287593 1638447 2058661 2494422 2897878 3241651 3526117
38085 3526117 3776690 4032025 4328475 4687791 5112218 5586209 6080879 6558768 6980055
38076 6980055 7312181 7540807 7675630 7746041 7788884 7836496 7911953 8031249 8206253 8442413
38066 8442413 8731071 9042631 9328212 9531743 9606424 9526524 9289955 8913426 8424355 7852523
38056 7852523 7223388 6554834 5857452 5136020 4390524 3618519 2821780 2015986 1237219
38047 1237219 539800 -14441 -370811 -495344 -384149 -66017 403545 956281 1528650
$$ packed form
38116C629756K24926J96291J36941L9133r1333k33960l60073m43258m68718m37280
38106B192425l62813k65265j64282p6386j4418J3913Q452k2726o5374j01813j13186
38095A028527q3390n997J09601K38852L50854M20214M35761M03456L43773K84466
38085C526117K50573K55335K96450L59316M24427M73991M94670M77889M21287
38076F980055L32126K28626J34823P0411M2843M7612P5457J19296J75004K36160
38066H442413K88658L11560K85581K03531P4681p9900k36569l76529m89071n71832
38056G852523o29135o68554o97382p21432p45496p72005p96739q05794p78767
38047A237219o97419n54241l56370j24533J11195L18132M69562N52736N72369
$$ plain form
38038 1528650 2075669 2575341 3022735 3418243 3756667 4021627 4186035 4217317 4085920 3775061
38028 3775061 3288334 2651361 1905759 1097211 262395 -579314 -1425279 -2280729 -3146819
38019 -3146819 -4011725 -4847676 -5613290 -6259786 -6740032 -7018680 -7080464 -6934498 -6614049 -6172066
38009 -6172066 -5672821 -5181249 -4753030 -4427851 -4226090 -4148528 -4179529 -4293483 -4461756 -4656947
37999 -4656947 -4854631 -5035248 -5186821 -5305729 -5393576 -5452690 -5484689 -5492979 -5485021 -5469411 -5446982
37988 -5446982 -5400433 -5289354 -5055054 -4634119 -3975365 -3054728 -1884966 -518854 955061
37979 955061 2424280 3769771 4885856 5698857 6179734 6344988 6243375 5933892 5466613
37970 5466613 4875235 4181350 3403940 2568400 1712925 891161 169082 -384860 -713731
$$ packed form
38038A528650N47019M99672M47394L95508L38424K64960J64408L1282j31397l10859
38028C775061m86727o36973p45602q08548q34816q41709q45965q55450q66090
38019c146819q64906q35951p65614o46496m80246k78648o1784J45966L20449M41983
38009f172066M99245M91572M28219L25179K01761P7562l1001j13954j68273j95191
37999d656947j97684j80617j51573j18908q7847n9114l1999q290P958J5610K2429
37988e446982M6549J11079K34300M20935O58754R20637J169762J366112J473915
37979I55061J469219J345491J116085Q13001M80877J65254j01613l09483m67279
37970E466613n91378o93885p77410q35540q55475q21764p22079n53942l28871
$$ plain form
37961 -713731 -785171 -599122 -188049 390538 1067389 1776435 2466426 3106339 3684601 4203409
37951 4203409 4669691 5085538 5442274 5720768 5896453 5945302 5849208 5601936 5215705 4725059
37941 4725059 4183805 3654120 3191133 2828779 2573153 2407063 2303533 2239546 2201040 2177592
37931 2177592 2154074 2108511 2019258 1876455 1689140 1482771 1289560 1139494 1058070 1068970
37921 1068970 1194765 1452085 1845173 2364115 2988639 3692791 4446067 5211122 5941401
37912 5941401 6581993 7075602 7373370 7446960 7295710 6944086 6430172 5791544 5056099 4242134
37902 4242134 3366190 2452239 1534892 654044 -154195 -862362 -1449042 -1893607 -2175651
37893 -2175651 -2281309 -2211515 -1985346 -1635522 -1198153 -701684 -159988 427522 1069412 1773315
$$ packed form
37961g13731p1440J86049M11073N78587O76851P09046O89991O39913N78262N18808
37951D203409M66282M15847L56736K78494J75685M8849r6094k47272l86231m90646
37941D725059n41254n29685m62987l62354k55626j66090j03530o3987l8506k3448
37931B177592k3518m5563q9253j42803j87315k06369j93211j50066q1424J0900
37921A068970J25795K57320L93088N18942O24524P04152P53276P65055P30279
37912E941401O40592M93609K97768P3590j51250l51624n13914o38628p35445q13965
37902D242134q75944r13951r17347q80848q08239p08167n86680m44565k82044
37893b175651j05658O9794K26169L49824M37369M96469N41696N87510O41890P03903
$$ plain form
37883 1773315 2539161 3356764 4207265 5066617 5909310 6710811 7447925 8098054 8639702
37874 8639702 9055844 9339160 9495870 9545162 9513701 9427509 9304396 9148958 8950640 8685677
37864 8685677 8324751 7846890 7255144 6585159 5899728 5270844 4759121 4401197 4208789
37855 4208789 4175275 4283336 4510320 4831440 5221284 5653326 6098284 6524490 6903093 7216768
37845 7216768 7466596 7672043 7863318 8069445 8307146 8575092 8856212 9127338 9371314
37836 9371314 9584925 9778820 9971195 10180541 10421367 10702623 11026226 11384406 11757496
37827 11757496 12114616 12418496 12633817 12737089 12724369 12612435 12431311 12211210 11970700
37818 11970700 11711647 11421927 11083099 10679184 10203048 9658447 9058565 8424135 7782975
$$ packed form
37883A773315P65846Q17603Q50501Q59352Q42693Q01501P37114O50129N41648
37874H639702M16142K83316J56710M9292l1461q6192j23113j55438j98318k64963
37864H685677l60926m77861n91746o69985o85431o28884n11723l57924j92408
37855D208789l3514J08061K26984L21120L89844M32042M44958M26206L78603L13675
37845G216768K49828K05447J91275K06127K37701K67946K81120K71126K43976
37836I371314K13611J93895J92375K09346K40826K81256L23603L58180L73090
37827A1757496L57120L03880K15321J03272j2720j11934j81124k20101k40510
37818A1970700k59053k89720l38828m03915m76136n44601n99882o34430o41160
$$ plain form
37809 7782975 7168567 6613556 6137926 5737699 5381646 5018719 4592329 4054765 3376996
37800 3376996 2552777 1598017 546511 -557004 -1665102 -2735442 -3736343 -4648797 -5464410
37791 -5464410 -6180751 -6797887 -7319383 -7756474 -8129787 -8464194 -8778708 -9077850 -9348911
37782 -9348911 -9564294 -9685663 -9668438 -9467501 -9044897 -8378262 -7467110 -6334674 -5025373
37773 -5025373 -3600386 -2133449 -706093 600010 1713519 2582801 3180495 3503860 3574411
37764 3574411 3437821 3160370 2818299 2481893 2201591 2002998 1891900 1864395 1915363 2041164
37754 2041164 2236993 2492594 2790484 3108581 3425819 3727373 4006913 4265903 4511732
37745 4511732 4755798 5010787 5285983 5581139 5881572 6157370 6368080 6472073 6437642 6251509
$$ packed form
37809G782975o14408n55011m75630m00227l56053l62927m26390n37564o77769
37800C376996q24219r54760j051506j103515j108098j070340j000901r12454q15613
37791e464410p16341o17136n21496m37091l73313l34407l14514k99142k71061
37782i348911k15383j21369J7225K00937M22604O66635R11152J132436J309301
37773e025373J424987J466937J427356J306103J113509Q69282N97694L23365P0551
37764C574411j36590k77451l42071l36406k80302j98593j11098k7505N0968J25801
37754B041164J95829K55601K97890L18097L17238L01554K79540K58990K45829
37745D511732K44066K54989K75196K95156L00433K75798K10710J03993l4431j86133
$$ plain form
37735 6251509 5920817 5467733 4920009 4303078 3637720 2943319 2243047 1566118 944146
37726 944146 402933 -45214 -403692 -687765 -918569 -1118450 -1307263 -1497294 -1687127 -1858801
37716 -1858801 -1982404 -2027568 -1976142 -1828773 -1601586 -1315600 -986619 -622744 -230173 178913
37706 178913 583713 959644 1287104 1558414 1779034 1962885 2125286 2278221 2430127 2587438
37696 2587438 2753486 2924036 3084118 3211164 3283774 3289682 3226693 3096464 2897056 2620908
37686 2620908 2260223 1815954 1304154 755042 204346 -319136 -803482 -1256220 -1699634
37677 -1699634 -2162777 -2673637 -3251752 -3900943 -4604968 -5330150 -6034966 -6680780 -7237330
37668 -7237330 -7681684 -7994504 -8158098 -8158349 -7990104 -7663927 -7210696 -6680145 -6131129 -5614984
$$ packed form
37735F251509l30692m53084n47724o16931o65358o94401p00272o76929o21972
37726I44146n41213m48147l58478k84073k30804j99881j88813j90031j89833j71674
37716a858801j23603m5164N1426J47369K27187K85986L28981L63875L92571M09086
37706A78913M04800L75931L27460K71310K20620J83851J62401J52935J51906J57311
37696B587438J66048J70550J60082J27046P2610N908o2989j30229j99408k76148
37686B620908l60685m44269n11800n49112n50696n23482m84346m52738m43414
37677a699634m63143n10860n78115o49191p04025p25182p04816o45814n56550
37668g237330m44354l12820j63594k51J68245L26177M53231N30551N49016N16145
$$ plain form
37658 -5614984 -5157284 -4745837 -4331771 -3845192 -3219138 -2410934 -1412304 -246902 1039734
37649 1039734 2391697 3752358 5071579 6310404 7442505 8451588 9325253 10047899
37641 10047899 10597221 10948498 11086681 11019919 10785374 10442460 10056946 9683887 9355483
37632 9355483 9075661 8821285 8549691 8210908 7760529 7168946 6425035 5535490 4522535
37623 4522535 3422468 2285278 1172498 149122 -731437 -1444026 -2000833 -2446038 -2837088
37614 -2837088 -3221527 -3621293 -4031846 -4434096 -4808892 -5143518 -5427513 -5644524 -5769551
37605 -5769551 -5775101 -5641561 -5364359 -4954989 -4438695 -3852300 -3241972 -2658426 -2149331 -1751692
37595 -1751692 -1486768 -1358076 -1352758 -1447343 -1617238 -1845616 -2126517 -2460581 -2846488 -3273040
$$ packed form
37658e614984M57700M11447M14066M86579O26054Q08204R98630J165402J286636
37649A039734J351963J360661J319221J238825J132101J009083Q73665P22646
37641A0047899N49322L51277J38183o6762k34545l42914l85514l73059l28404
37632I355483k79822k54376k71594l38783m50379n91583p43911q89545j012955
37623D522535j100067j137190j112780j023376q80559p12589n56807m45205l91050
37614b837088l84439l99766m10553m02250l74796l34626k83995k17011j25027
37605e769551n550J33540K77202M09370N16294N86395O10328N83546N09095L97639
37595a751692K64924J28692N318r4585j69895k28378k80901l34064l85907m26552
$$ plain form
37585 -3273040 -3715984 -4141261 -4512834 -4800561 -4984423 -5055368 -5014841 -4873337 -4646902 -4352548
37575 -4352548 -4005503 -3618856 -3202865 -2762591 -2296910 -1801622 -1273767 -711593 -110213
37566 -110213 540096 1247652 2008972 2804005 3602676 4378935 5122526 5840596 6548147 7253143
37556 7253143 7945429 8596444 9169653 9633771 9968473 10158553 10182410 10005942 9588458 8897862
37546 8897862 7926259 6698730 5273611 3736307 2188525 733708 -539338 -1569959
37538 -1569959 -2331497 -2828311 -3087537 -3150455 -3066091 -2886507 -2662118 -2436165 -2239039 -2084566
37528 -2084566 -1970385 -1882891 -1804842 -1723032 -1634585 -1551061 -1498620 -1512186 -1624098 -1851639 -2189619
37517 -2189619 -2612234 -3084295 -3576884 -4078814 -4596318 -5140501 -5711019 -6287030 -6830484
$$ packed form
37585c273040m42944m25277l71573k87727j83862p0945M0527J41504K26435K94354
37575d352548L47045L86647M15991M40274M65681M95288N27855N62174O01380
37566a10213O50309P07556P61320P95033P98671P76259P43591P18070P07551P04996
37556G253143O92286O51015N73209M64118L34702J90080K3857j76468m17484o90596
37546H897862r71603j227529j425119j537304j547782j454817j273046j030621
37538a569959p61538m96814k59226o2918Q4364J79584K24389K25953J97126J54473
37528b084566J14181Q7494P8049Q1810Q8447Q3524N2441j3566j11912k27541l37980
37517b189619m22615m72061m92589n01930n17504n44183n70518n76011n43454
$$ plain form
37508 -6830484 -7297846 -7652165 -7870226 -7944566 -7882689 -7704589 -7437699 -7108745 -6734801 -6318020
37498 -6318020 -5847267 -5306133 -4684260 -3988588 -3251178 -2529717 -1897855 -1426814 -1164645
37489 -1164645 -1120852 -1261811 -1518701 -1805845 -2042899 -2171541 -2160154 -1998640 -1691891 -1258306
37479 -1258306 -731657 -160002 401568 902053 1305503 1599206 1796990 1935238 2061507
37470 2061507 2220274 2441890 2737498 3098947 3502954 3920271 4328563 4723204 5119620
37461 5119620 5546018 6031151 6592677 7228947 7915399 8607125 9248525 9787313 10186783
37452 10186783 10430856 10521227 10470409 10295048 10011709 9635552 9182055 8671218 8131424 7598706
$$ packed form
37508f830484m67362l54319k18061p4340O1877J78100K66890L28954L73944M16781
37498f318020M70753N41134O21873O95672P37410P21461O31862M71041K62169
37489a164645M3793j40959k56890k87144k37054j28642J1387J61514L06749M33585
37479a258306N26649N71655N61570N00485M03450K93703J97784J38248J26269
37470B061507J58767K21616K95608L61449M04007M17317M08292L94641L96416
37461E119620M26398M85133N61526O36270O86452O91726O41400N38788L99470
37452A0186783K44073R0371n0818j75361k83339l76157m53497n10837n39794n32718
$$ [...]
##END NTUPLES=NMR SPECTRUM
##END=
