##TITLE=31Pdec_DE-54_DCM_KD6
 CDCl3
 24 sc
 6.5.2024
##JCAMPDX= 6.0         $$ Bruker NMR JCAMP-DX V2.0
##DATA TYPE= NMR SPECTRUM
##DATA CLASS= NTUPLES
##ORIGIN= UXNMR, Bruker Analytische Messtechnik GmbH
##OWNER= root
$$ XWIN-NMR		Version 3.5
$$ Mon May  6 15:54:51 2024 Russian Standard Time (UT+4h)  she@DPX200
##.OBSERVE FREQUENCY= 81.013821
##.OBSERVE NUCLEUS= ^31P
##.ACQUISITION MODE= SIMULTANEOUS
##.ACQUISITION SCHEME= undefined
##.AVERAGES= 24
##.DIGITISER RES= 16
##SPECTROMETER/DATA SYSTEM= spect
##.PULSE SEQUENCE= zgpg30
##.SOLVENT NAME= CDCl3
##.SHIFT REFERENCE= (INTERNAL, CDCl3, 0, 248.564)
##AUDIT TRAIL= $$ (NUMBER, WHEN, WHO, WHERE, WHAT)
$$ ##TITLE= Audit trail, XWIN-NMR		Version 3.5
$$ ##JCAMPDX= 5.01
$$ ##ORIGIN= Bruker BioSpin GmbH
$$ ##OWNER= she
$$ F:/spectra/data/she/nmr/P31/1/pdata/1/auditp.txt
$$ ##AUDIT TRAIL=  $$ (NUMBER, WHEN, WHO, WHERE, WHAT)
(   1,<2024-05-06 15:53:43.60 +0400>,<she>,<DPX200>,
      <created by zg, POWCHK disabled, PULCHK disabled
       configuration hash MD5:
       00 E9 B6 7A A2 85 ED C7 34 08 36 98 17 FE 4E 26
       data hash MD5: 32K
       93 B1 93 9B 5A 4A DE 60 3B E5 09 9F 97 B3 46 0B>)
(   2,<2024-05-06 15:53:46.10 +0400>,<she>,<DPX200>,
      <Start of raw data processing
       efp BC_mod = 2 LB = 10 FT_mod = 6 PKNL = 1 PHC0 = -13300.22 PHC1 = 267.8834 SI = 64K 
       data hash MD5: 64K
       EC BF 24 BF 3C 65 3C F7 4E 60 95 CD E4 AF 8D 2D>)
(   3,<2024-05-06 15:54:01.29 +0400>,<she>,<DPX200>,
      <pk PHC0 = -35.76588 PHC1 = 0 
       data hash MD5: 64K
       A5 0B C2 3D A7 84 36 E9 8C 34 54 D3 82 90 5D A9>)
(   4,<2024-05-06 15:54:22.40 +0400>,<she>,<DPX200>,
      <pk PHC0 = 15 PHC1 = 0 
       data hash MD5: 64K
       99 DB 15 F2 35 A9 10 45 E7 88 D2 C8 CD 47 DF 51>)
$$ ##END=
$$ 
$$ hash MD5
$$ 23 F6 68 97 B6 B9 C7 85 2E 49 C7 1C 9F 2D AF B7
##$RELAX= 
##$RELAX= 
##$RELAX= 
##$RELAX= 
##$RELAX= 
##$RELAX= 
##$RELAX= 
##$RELAX= 
##$RELAX= 
$$ Bruker specific parameters
$$ --------------------------
##$DU= <F:/spectra>
##$EXPNO= 1
##$NAME= <P31>
##$PROCNO= 1
##$TYPE= <nmr>
##$USER= <she>
##$AMP= (0..31)
100 100 100 100 100 100 100 100 100 100 100 100 100 100 100 100 100 100 
100 100 100 100 100 100 100 100 100 100 100 100 100 100 
##$AQSEQ= 0
##$AQ_mod= 1
##$AUNM= <au_zg>
##$AUTOPOS= <>
##$BF1= 81.014009
##$BF2= 200.13
##$BF3= 200.13
##$BF4= 200.13
##$BF5= 200.13
##$BF6= 200.13
##$BF7= 200.13
##$BF8= 200.13
##$BYTORDA= 1
##$CFDGTYP= 0
##$CFRGTYP= 5
##$CHEMSTR= <none>
##$CNST= (0..31)
1 1 145 1 1 1 1 1 1 1 1 1 1 1 1 1 1 1 1 1 1 1 1 1 1 1 1 1 1 1 1 1 
##$CPDPRG= <waltz16>
##$CPDPRG1= <>
##$CPDPRG2= <waltz16>
##$CPDPRG3= <>
##$CPDPRG4= <mlev>
##$CPDPRG5= <mlev>
##$CPDPRG6= <mlev>
##$CPDPRG7= <mlev>
##$CPDPRG8= <mlev>
##$CPDPRGB= <>
##$CPDPRGT= <>
##$D= (0..31)
0 1 0 0 0 0 0 0 0 0 0 0.03 2e-05 3e-06 0 0 0 0 0 0 0 0 0 0 0 0 0 0 0 0 
0 0 
##$DATE= 1714996422
##$DBL= (0..7)
120 120 120 11 120 120 24 19 
##$DBP= (0..7)
150 150 150 150 150 150 150 150 
##$DBP07= 0
##$DBPNAM0= <>
$$ [...]
##$SUBNAM2= <"">
##$SUBNAM3= <"">
##$SUBNAM4= <"">
##$SUBNAM5= <"">
##$SUBNAM6= <"">
##$SUBNAM7= <"">
##$SUBNAM8= <"">
##$SUBNAM9= <"">
##$SW= 501.771253377433
##$SWIBOX= (0..15)
0 1 3 0 0 0 0 0 0 0 0 0 0 0 0 0 
##$SW_h= 40650.406504065
##$TD= 32768
##$TD0= 1
##$TE= 0
##$TE2= 300
##$TE3= 300
##$TEG= 300
##$TL= (0..7)
0 120 53 12 22 120 120 120 
##$TP= (0..7)
150 150 150 150 150 150 150 150 
##$TP07= 0
##$TPNAME0= <>
##$TPNAME1= <>
##$TPNAME2= <>
##$TPNAME3= <>
##$TPNAME4= <>
##$TPNAME5= <>
##$TPNAME6= <>
##$TPNAME7= <>
##$TPOAL= (0..7)
0.5 0.5 0.5 0.5 0.5 0.5 0.5 0.5 
##$TPOFFS= (0..7)
0 0 0 0 0 0 0 0 
##$TUNHIN= 0
##$TUNHOUT= 0
##$TUNXOUT= 0
##$USERA1= <user>
##$USERA2= <user>
##$USERA3= <user>
##$USERA4= <user>
##$USERA5= <user>
##$V9= 5
##$VALIST= <valist>
##$VCLIST= <CCCCCCCCCCCCCCC>
##$VD= 0
##$VDLIST= <DDDDDDDDDDDDDDD>
##$VPLIST= <PPPPPPPPPPPPPPP>
##$VTLIST= <TTTTTTTTTTTTTTT>
##$WBST= 1024
##$WBSW= 4
##$XGAIN= (0..3)
0 0 0 0 
##$XL= 0
##$YL= 0
##$YMAX_a= 1133
##$YMIN_a= -1448
##$ZGOPTNS= <>
##$ZL1= 120
##$ZL2= 120
##$ZL3= 120
##$ZL4= 120
##$ABSF1= 0
##$ABSF2= 0
##$ABSG= 0
##$ABSL= 0
##$ALPHA= 0
##$AQORDER= 0
##$ASSFAC= 0
##$ASSFACI= 0
##$ASSFACX= 0
##$ASSWID= 0
##$AUNMP= <proc_1d>
##$AZFE= 0.1
##$AZFW= 0.5
##$BCFW= 0
##$BC_mod= 2
##$BYTORDP= 0
##$COROFFS= 0
##$CY= -3
##$DATMOD= 1
##$DC= 0
##$DFILT= <>
##$DTYPP= 0
##$F1P= 0
##$F2P= 0
##$FCOR= 1
##$FTSIZE= 65536
##$FT_mod= 6
##$GAMMA= 0
##$GB= 0
##$INTBC= 1
##$INTSCL= 6.047779e-11
##$ISEN= 30
##$LB= 10
##$LEV0= 0
##$LPBIN= 0
##$MAXI= 10000
##$MC2= 0
##$MEAN= 0
##$ME_mod= 0
##$MI= 50
##$NCOEF= 0
##$NC_proc= -10
##$NLEV= 6
##$NOISF1= 182.463
##$NOISF2= 159.3651
##$NSP= 0
##$NTH_PI= 0
##$NZP= 0
##$OFFSET= 248.5645
##$PC= 4
##$PHC0= -13320.99
##$PHC1= 267.8834
##$PH_mod= 1
##$PKNL= yes
##$PPARMOD= 0
##$PSCAL= 0
##$PSIGN= 0
##$REVERSE= no
##$SF= 81.0140089999694
##$SI= 65536
##$SIGF1= 159.3651
##$SIGF2= -187.1042
##$SINO= 113.3802
##$SIOLD= 16384
##$SREGLST= <1H.CDCl3>
##$SSB= 0
##$STSI= 65536
##$STSR= 0
##$SW_p= 40650.406504065
##$SYMM= 0
##$S_DEV= 0
##$TDeff= 32768
##$TDoff= 0
##$TI= <>
##$TILT= no
##$TM1= 0
##$TM2= 0
##$TOPLEV= 0
##$USERP1= <user>
##$USERP2= <user>
##$USERP3= <user>
##$USERP4= <user>
##$USERP5= <user>
##$WDW= 1
##$XDIM= 65536
##$YMAX_p= 282072101
##$YMIN_p= -48535076
$$ End of Bruker specific parameters
$$ ---------------------------------
##NTUPLES= NMR SPECTRUM
##VAR_NAME=  FREQUENCY,     SPECTRUM/REAL,   SPECTRUM/IMAG
##SYMBOL=    X,             R,               I
##VAR_TYPE=  INDEPENDENT,   DEPENDENT,       DEPENDENT
##VAR_FORM=  AFFN,          ASDF,            ASDF
##VAR_DIM=   65536,         65536,           65536
##UNITS=     HZ,            ARBITRARY UNITS, ARBITRARY UNITS
##FACTOR=    0.620285442955139, 1,           1
##FIRST=     20137.2065510682, 0,            0
##LAST=      -20513.1999529968, 0,           0
##MIN=       -20513.1999529968, -48535076,   0
##MAX=       20137.2065510682, 282072101,    0
$$ Real data points
##PAGE= N=1
##DATA TABLE= (X++(R..R)), XYDATA
$$ [...]
43223 -123839 59770 129840 52419 -180491 -556486 -1047749 -1611610 -2191031 -2721105 -3141869
43213 -3141869 -3411856 -3516527 -3469019 -3303476 -3064108 -2795895 -2541859 -2344852 -2246268 -2277380
43203 -2277380 -2448065 -2740862 -3112907 -3502846 -3841163 -4064908 -4134618 -4045698 -3827490 -3531128
43193 -3531128 -3213580 -2924699 -2699695 -2556621 -2497812 -2514251 -2591610 -2716423 -2880133 -3079145
43183 -3079145 -3311941 -3577469 -3877816 -4222590 -4629107 -5116233 -5695737 -6366009 -7108901
43174 -7108901 -7888154 -8650362 -9331951 -9873232 -10234908 -10409481 -10421843 -10318327 -10148432 -9946781
43164 -9946781 -9722806 -9461901 -9136135 -8718713 -8196210 -7574940 -6880542 -6151572 -5429232
43155 -5429232 -4746949 -4124188 -3567041 -3073797 -2640330 -2261199 -1926799 -1620158 -1316636
43146 -1316636 -987252 -604863 -151664 374696 959774 1577001 2195197 2783279 3308943
43137 3308943 3733607 4009674 4085359 3917413 3486498 2807386 1928656 921987 -134309
43128 -134309 -1171654 -2142650 -3024645 -3815211 -4523137 -5160525 -5738912 -6267605 -6751156
43119 -6751156 -7186780 -7565936 -7881778 -8138423 -8355450 -8564405 -8799273 -9085029 -9427510
43110 -9427510 -9806424 -10173215 -10456113 -10574118 -10457904 -10070161 -9415679 -8536416 -7495826
43101 -7495826 -6361416 -5191915 -4030077 -2900102 -1809143 -751893 283891 1312212
43093 1312212 2343535 3379393 4409181 5411259 6357606 7219760 7975133 8612748 9135059
43084 9135059 9552408 9872664 10094619 10211171 10219349 10129165 9967015 9775023 9607358 9521244
43074 9521244 9561691 9745596 10054260 10438028 10828452 11150965 11335808 11329385 11106274 10676734
43064 10676734 10082933 9382652 8627467 7846899 7046830 6221725 5371453 4510729 3664559
43055 3664559 2853049 2076321 1310079 515202 -343979 -1282601 -2287273 -3318802 -4321347
43046 -4321347 -5231890 -5986625 -6525350 -6797203 -6769129 -6433990 -5812889 -4949292 -3898365
43037 -3898365 -2717789 -1463161 -185913 1070002 2273175 3408513 4476303 5486053
43029 5486053 6447860 7365595 8234468 9041774 9766946 10378554 10830546 11063179 11012707 10628959
43019 10628959 9895077 8841393 7546673 6124964 4702929 3396978 2298554 1470184
43011 1470184 948490 747481 857797 1242783 1836020 2545048 3263295 3888689 4343723
43002 4343723 4588567 4620324 4459798 4136774 3685250 3149230 2587836 2068126 1645147 1340155
42992 1340155 1130057 954340 736976 414779 -38784 -604720 -1230254 -1857166 -2451697
42983 -2451697 -3017922 -3586518 -4187649 -4826128 -5471844 -6066436 -6539978 -6831695 -6909868 -6784766
42973 -6784766 -6507828 -6154858 -5799057 -5485859 -5221385 -4979290 -4720653 -4414901 -4050812
42964 -4050812 -3633947 -3174763 -2676287 -2130003 -1523395 -854084 -139944 582099 1265986
42955 1265986 1865733 2337688 2638535 2726887 2572867 2171720 1552032 771784 -95906 -978376
42945 -978376 -1812499 -2546687 -3140765 -3567545 -3815351 -3888548 -3804738 -3589958 -3274298 -2889353
42935 -2889353 -2466464 -2033096 -1606215 -1185435 -751112 -270473 289609 948080 1699035
42926 1699035 2509311 3325253 4085458 4734335 5233206 5567767 5749789 5809618 5779506 5675294
42916 5675294 5487637 5189018 4752788 4173620 3478957 2726964 1993987 1359119 892157
42907 892157 645936 650602 909410 1399354 2078994 2900151 3816260 4783348 5756628 6689094
42897 6689094 7535430 8258882 8836396 9259549 9532433 9669229 9692838 9633700 9527056 9408259
42887 9408259 9308059 9250304 9252344 9325578 9473574 9688348 9948789 10224229 10481035 10685878
42877 10685878 10801269 10776988 10548112 10048741 9239605 8135948 6819166 5424173 4107227
42868 4107227 3007366 2214779 1754343 1586332 1621906 1748568 1859295 1877910 1773098 1556811
42858 1556811 1269184 958022 661834 400856 175283 -32094 -250365 -512182 -843046
42849 -843046 -1250264 -1715339 -2194079 -2626136 -2950666 -3120839 -3111394 -2919448 -2562769 -2077673
42839 -2077673 -1514432 -928305 -368559 129879 550150 893661 1177161 1425636 1661945
42830 1661945 1897778 2130214 2343522 2512529 2605235 2585823 2420412 2086216 1581772 933013
42820 933013 189848 -587271 -1343368 -2036687 -2633580 -3097145 -3381842 -3440811 -3241350 -2777615
42810 -2777615 -2073059 -1173878 -140134 960953 2060324 3093452 4007296 4764331 5341686
42801 5341686 5727078 5915420 5909249 5723640 5393420 4978009 4559040 4228692 4071021 4141820
42791 4141820 4453890 4973907 5633212 6348326 7041655 7653416 8141842 8475568 8625766
42782 8625766 8565366 8278384 7774768 7099826 6328637 5545817 4821701 4197710 3685668 3276282
42772 3276282 2948461 2674911 2424980 2168161 1879897 1548018 1176847 787138 411782
42763 411782 87376 -157822 -316623 -409971 -482521 -587218 -766480 -1038757 -1393748 -1794456
42753 -1794456 -2184294 -2499892 -2689058 -2728371 -2632354 -2449499 -2246728 -2088035 -2014272 -2031019
42743 -2031019 -2109743 -2202908 -2266892 -2282307 -2262486 -2247398 -2287975 -2430050 -2704770 -3125494 -3686142
42732 -3686142 -4357783 -5086242 -5796677 -6407260 -6846923 -7068630 -7053029 -6804291 -6344378 -5710267
42722 -5710267 -4953321 -4136586 -3327250 -2585780 -1955815 -1458723 -1094777 -850542 -709022
42713 -709022 -657039 -685878 -786332 -943804 -1138465 -1350282 -1564367 -1773017 -1975208 -2176234
42703 -2176234 -2386982 -2618659 -2871773 -3126288 -3343236 -3480304 -3511732 -3438892 -3285850 -3085390
42693 -3085390 -2865922 -2646825 -2443324 -2276245 -2179060 -2196459 -2373853 -2741924 -3301948 -4017015
42683 -4017015 -4813187 -5591900 -6249927 -6699464 -6881830 -6772969 -6382541 -5748681 -4929503
42674 -4929503 -3992173 -3001377 -2010041 -1055485 -162788 646717 1347856 1911349 2312793
42665 2312793 2545977 2631407 2612680 2540973 2456278 2376157 2296709 2201616 2071782 1891519 1652017
42654 1652017 1353950 1008946 637879 264132 -97457 -451473 -825302 -1259959 -1790861
42645 -1790861 -2428626 -3150728 -3908098 -4641684 -5299129 -5843437 -6251963 -6511155 -6614396
42636 -6614396 -6565934 -6387162 -6119325 -5820120 -5555705 -5390441 -5376020 -5542697 -5896491 -6423780
42626 -6423780 -7099836 -7895869 -8782319 -9729768 -10709039 -11690392 -12642379 -13532750 -14332646
42617 -14332646 -15021456 -15587972 -16026835 -16333514 -16501361 -16521332 -16383084 -16076853 -15596658
42608 -15596658 -14944655 -14135383 -13198361 -12177927 -11129568 -10112823 -9182492 -8381035 -7734029
42599 -7734029 -7248548 -6913738 -6703919 -6584401 -6517781 -6466448 -6389389 -6237266 -5952962 -5481306
42589 -5481306 -4783994 -3851156 -2703281 -1383704 53203 1552439 3064011 4543014
42581 4543014 5945116 7220637 8312660 9164125 9733132 10007888 10010913 9789571 9400309
42572 9400309 8896515 8323359 7716120 7099015 6486232 5887262 5313642 4780856 4302792
42563 4302792 3883239 3512121 3170461 2841183 2518526 2210297 1933063 1705602 1546348
42554 1546348 1476128 1522465 1720364 2106408 2706577 3521835 4518421 5629327 6767826
42545 6767826 7846346 8790882 9545640 10070424 10337352 10331394 10054456 9529194 8798270 7916902
42535 7916902 6940885 5916148 4875204 3840142 2826720 1845358 900873 -4779 -866838
42526 -866838 -1674495 -2413817 -3073648 -3647646 -4129685 -4507029 -4758491 -4861221 -4803221 -4594037
42516 -4594037 -4266570 -3868575 -3449409 -3050107 -2700711 -2422773 -2232776 -2144543 -2170734 -2322955
42506 -2322955 -2609166 -3028942 -3569891 -4208396 -4913906 -5652507 -6386286 -7070075 -7651023
42497 -7651023 -8074885 -8296728 -8289583 -8047073 -7582003 -6924768 -6121303 -5227000 -4296057 -3372019
42487 -3372019 -2485452 -1657987 -905957 -239296 341224 842122 1269142 1618727 1876599
42478 1876599 2025712 2058551 1985576 1834630 1642265 1442609 1259628 1105125 980550 879078
42468 879078 786750 685057 557859 401249 230239 76476 -22901 -39281 37352 195724
42458 195724 407721 637691 853141 1033042 1170958 1272489 1348916 1410949 1466755 1525469
42448 1525469 1601984 1716378 1886064 2116429 2397673 2709470 3028474 3333760 3609435 3845549
42438 3845549 4036940 4179246 4263736 4274512 4190721 3994170 3680779 3272005 2819908 2400192
42428 2400192 2093581 1963216 2038220 2309161 2734418 3252146 3792061 4283419 4659213 4860255
42418 4860255 4843149 4591721 4125563 3498727 2787817 2075884 1439212 939067 616439 488919
42408 488919 551333 781007 1145221 1607364 2130559 2679804 3223471 3734206 4189529 4572626
42398 4572626 4872451 5081082 5188289 5177372 5027152 4720088 4250546 3626948 2867362 1993605
42388 1993605 1028498 -2988 -1070149 -2131799 -3132721 -4006146 -4686125 -5126663 -5317856
42379 -5317856 -5290087 -5104655 -4835525 -4548633 -4284813 -4052048 -3829713 -3581441 -3269048 -2862401
42369 -2862401 -2346271 -1727383 -1040766 -349403 268371 742698 1038093 1168947 1195961 1204025
42359 1204025 1270910 1439957 1707186 2025962 2324556 2527596 2573700 2426430 2079347 1556307
42349 1556307 907451 202001 -480650 -1061781 -1477844 -1697426 -1733902 -1645326 -1518927 -1446015
42339 -1446015 -1497584 -1709377 -2080141 -2581035 -3169864 -3803109 -4442038 -5054011 -5612442 -6097753
42329 -6097753 -6498954 -6813631 -7044696 -7195036 -7263947 -7248525 -7149044 -6973697 -6738781 -6464528
42319 -6464528 -6169965 -5870057 -5576177 -5298394 -5047308 -4834735 -4675098 -4588580 -4601914 -4739535
42309 -4739535 -5004190 -5358735 -5725939 -6011868 -6139792 -6073221 -5816096 -5395587 -4843001 -4185012
42299 -4185012 -3446810 -2660559 -1871330 -1136987 -523480 -98772 73672 -56039 -510608
42290 -510608 -1270184 -2263476 -3373676 -4460732 -5392636 -6073635 -6459203 -6554231 -6399083
42281 -6399083 -6053587 -5587655 -5078707 -4607614 -4245536 -4034032 -3969994 -4006577 -4071701 -4095781
42271 -4095781 -4035995 -3887230 -3677190 -3450677 -3251379 -3107974 -3028075 -3000974 -3007004 -3027874
42261 -3027874 -3052304 -3076890 -3106809 -3158382 -3258814 -3438222 -3716643 -4094764 -4553723 -5061819
42251 -5061819 -5582650 -6081180 -6526627 -6892374 -7155141 -7296439 -7306245 -7184421 -6936729 -6569181
42241 -6569181 -6088321 -5509473 -4865592 -4207039 -3590059 -3061052 -2646381 -2352358 -2172714
42232 -2172714 -2096747 -2112371 -2203040 -2342620 -2494066 -2614885 -2667321 -2628119 -2493588 -2278695
42222 -2278695 -2011725 -1727272 -1460220 -1241931 -1097735 -1043864 -1083502 -1203721 -1375550 -1557940
42212 -1557940 -1704898 -1774373 -1736521 -1578182 -1302187 -924317 -472590 10262 466565 831821
42202 831821 1050229 1088904 942332 626615 170009 -394541 -1034689 -1723853 -2445177 -3190489
42192 -3190489 -3953133 -4718544 -5457758 -6125764 -6663503 -7002326 -7071217 -6807342 -6169324 -5150595
42182 -5150595 -3788309 -2163334 -390133 1400402 3080934 4547620 5737121 6635382
42174 6635382 7273207 7709672 8010971 8232746 8409208 8548922 8637350 8646520 8549428 8333230
42164 8333230 8005084 7588676 7115264 6615839 6118218 5647138 5223110 4860010 4566248
42155 4566248 4352294 4239502 4261021 4450947 4827513 5380457 6068917 6829274 7588375 8277419
42145 8277419 8843017 9252494 9491840 9558281 9453415 9182579 8760108 8214131 7585241 6920130
42135 6920130 6266085 5669866 5178281 4835069 4672180 4699463 4899745 5233719 5652788 6112588
42125 6112588 6579787 7030239 7443058 7797090 8072250 8252706 8327736 8290175 8136423 7870344
42115 7870344 7507976 7077951 6616714 6162573 5751824 5416057 5178553 5050150 5026279 5085623
42105 5085623 5190618 5291762 5337011 5283297 5104722 4795433 4369538 3859561 3311020 2770787
42095 2770787 2271955 1822006 1399868 963439 465398 -128014 -822656 -1592640 -2387688
42086 -2387688 -3146845 -3812223 -4338937 -4700081 -4886855 -4904884 -4769186 -4500821 -4126415 -3678587
42076 -3678587 -3193879 -2706781 -2242321 -1812174 -1418066 -1061734 -755679 -527112 -411400
42067 -411400 -438609 -621768 -953648 -1412610 -1972748 -2612233 -3315630 -4069113 -4851588 -5627590
42057 -5627590 -6346980 -6952553 -7393001 -7636789 -7681366 -7552715 -7295395 -6960629 -6600664 -6269010
42047 -6269010 -6017877 -5887498 -5893520 -6023775 -6248020 -6533144 -6853339 -7190575 -7527864 -7841277
42037 -7841277 -8096567 -8253309 -8274740 -8137497 -7835844 -7379657 -6789966 -6096092 -5334747 -4548037
42027 -4548037 -3778009 -3059057 -2412276 -1845122 -1356879 -947909 -628723 -423693 -365855 -484774
42017 -484774 -794844 -1290605 -1949250 -2735695 -3606738 -4514661 -5411382 -6252158 -6996876 -7608833
42007 -7608833 -8053853 -8303840 -8347011 -8201403 -7922495 -7596186 -7317621 -7166941 -7194343 -7417724
41997 -7417724 -7826539 -8384277 -9028253 -9671150 -10209575 -10541256 -10587341 -10311896 -9730267 -8902584
41987 -8902584 -7915714 -6860957 -5813763 -4819239 -3886116 -2991453 -2095610 -1162257 -175287
41978 -175287 853852 1889957 2885685 3795323 4585512 5239960 5757920 6148341 6423270
41969 6423270 6594589 6676139 6688351 6658652 6613639 6567811 6519455 6458958 6381817 6291895 6188840
41958 6188840 6050153 5826427 5458619 4907108 4172246 3293759 2333473 1355320 412221
41949 412221 -459834 -1243232 -1935450 -2540329 -3057803 -3479088 -3790518 -3982527 -4057612 -4033258
41939 -4033258 -3938856 -3807586 -3666717 -3531442 -3405388 -3285214 -3163476 -3026956 -2853490 -2612184
41929 -2612184 -2268505 -1791935 -1163703 -383687 524517 1513174 2517584 3470433 4318409
41920 4318409 5034224 5619033 6094551 6488768 6821744 7097555 7305209 7427524 7453821 7390694
41910 7390694 7265080 7117044 6985791 6897615 6863478 6886583 6972864 7135847 7392388 7752439
41900 7752439 8209736 8739456 9304323 9865058 10388475 10849704 11231624 11527603 11749212
41891 11749212 11932695 12135706 12422505 12844729 13426764 14158907 14996095 15860899 16653441
41882 16653441 17270023 17626117 17674469 17411199 16869792 16108487 15197297 14207384 13201590
41873 13201590 12224230 11291719 10389777 9482177 8528845 7504059 6405196 5249414 4062939
41864 4062939 2869453 1681493 495795 -706593 -1953970 -3271450 -4666388 -6119048
41856 -6119048 -7583989 -9001477 -10312769 -11472718 -12456793 -13263317 -13912540 -14443113 -14905300
41847 -14905300 -15350355 -15817338 -16321355 -16848367 -17359543 -17803588 -18131997 -18311314 -18327803
41838 -18327803 -18182600 -17879536 -17412126 -16757729 -15883858 -14765729 -13408187 -11861741 -10223427
41829 -10223427 -8620065 -7180875 -6011395 -5176414 -4691529 -4520284 -4578635 -4752021 -4925045
41820 -4925045 -5013719 -4986328 -4865060 -4710292 -4595088 -4578661 -4686968 -4906468 -5191658 -5480713
41810 -5480713 -5711643 -5834805 -5821611 -5669383 -5400556 -5055039 -4678226 -4310246 -3981482 -3715394
41800 -3715394 -3535105 -3467480 -3539938 -3770505 -4156681 -4669092 -5251890 -5828301 -6310178 -6612079
41790 -6612079 -6669142 -6453735 -5984151 -5321820 -4558882 -3800335 -3144340 -2663326 -2389809 -2312340
41780 -2312340 -2385317 -2550435 -2760108 -2990580 -3238967 -3510592 -3809756 -4141055 -4515279 -4948217
41770 -4948217 -5448555 -6003418 -6573487 -7101745 -7530153 -7815093 -7935226 -7890465 -7695251 -7371505
41760 -7371505 -6944805 -6442515 -5889979 -5303819 -4687141 -4033233 -3338806 -2619199 -1913900
41751 -1913900 -1276236 -752915 -367554 -119265 4949 15519 -85482 -298592 -615361 -1009019
41741 -1009019 -1433029 -1828901 -2140564 -2330063 -2388829 -2340313 -2232470 -2122641 -2061350 -2081967
41731 -2081967 -2198908 -2411564 -2709478 -3076631 -3494572 -3944174 -4405905 -4859794 -5286390
41722 -5286390 -5668076 -5989167 -6235155 -6393556 -6457161 -6427478 -6315898 -6142993 -5937496 -5733923
41712 -5733923 -5565845 -5454727 -5400032 -5378048 -5351740 -5286128 -5160612 -4972706 -4733065 -4454945
41702 -4454945 -4142667 -3784757 -3356699 -2833465 -2205020 -1485409 -710666 71766 815622
41693 815622 1485503 2062462 2546283 2955208 3322525 3688906 4091061 4550749 5069487 5630928
41683 5630928 6206998 6761461 7247900 7605171 7757170 7622509 7133553 6256750 5003218
41674 5003218 3424403 1597990 -385652 -2431343 -4444896 -6342317 -8061734 -9571532
41666 -9571532 -10869462 -11973406 -12908388 -13694436 -14338397 -14832197 -15158478 -15301130 -15255102
41657 -15255102 -15030539 -14651039 -14150253 -13570269 -12960028 -12368756 -11833075 -11364192 -10944516
41648 -10944516 -10537365 -10104383 -9621289 -9085276 -8512368 -7926947 -7348900 -6786026 -6237221
41639 -6237221 -5704902 -5208133 -4787449 -4498099 -4394990 -4515919 -4869424 -5431145 -6148730
41630 -6148730 -6951984 -7764168 -8512064 -9133999 -9584754 -9836007 -9872611 -9687600 -9279843 -8656422
41620 -8656422 -7838508 -6866674 -5800977 -4713297 -3673578 -2735123 -1924750 -1241078 -660647
41611 -660647 -148883 327993 793552 1256525 1711499 2143170 2530612 2848936 3069216 3160615
41601 3160615 3097531 2869762 2489836 1992187 1423218 826624 232052 -345773 -897520 -1408767
41591 -1408767 -1860465 -2242910 -2572045 -2892382 -3260421 -3717530 -4269013 -4881566 -5499302
41582 -5499302 -6067856 -6553201 -6947521 -7262953 -7518905 -7728510 -7888888 -7979967 -7974098 -7851747
41572 -7851747 -7612551 -7273475 -6855282 -6366194 -5791593 -5093980 -4223213 -3134284 -1807324
41563 -1807324 -262867 1433322 3177792 4847208 6320718 7499345 8316305 8737441
41555 8737441 8756101 8387801 7667573 6650519 5414669 4062917 2718649 1511556 556567
41546 556567 -66297 -324581 -236809 132487 685478 1309930 1899997 2373141 2679191 2800615
41536 2800615 2745125 2533717 2189329 1730947 1173712 530743 -187519 -975750 -1833170 -2756775
41526 -2756775 -3730945 -4720053 -5669271 -6512907 -7184827 -7626141 -7790718 -7653340 -7222939
41517 -7222939 -6555336 -5754394 -4954540 -4289239 -3859554 -3716202 -3859013 -4247993 -4817417
41508 -4817417 -5488127 -6178077 -6812572 -7333624 -7705998 -7918719 -7984156 -7937742 -7837580 -7758452
41498 -7758452 -7775802 -7943302 -8274701 -8739093 -9270035 -9782190 -10189517 -10422206 -10440112 -10238936
41488 -10238936 -9846398 -9310183 -8683342 -8012817 -7334065 -6672027 -6046629 -5479184 -4995296
41479 -4995296 -4621423 -4376328 -4262463 -4262712 -4344379 -4467788 -4595242 -4697785 -4759311 -4777390
41469 -4777390 -4759582 -4715836 -4650876 -4561034 -4436254 -4264383 -4035413 -3746035 -3404777 -3034709
41459 -3034709 -2669467 -2342442 -2074660 -1868149 -1707317 -1565754 -1413889 -1224730 -977727
41450 -977727 -662766 -285256 130016 540745 896577 1152241 1277358 1259395 1101695 820175
41440 820175 439739 -10062 -498811 -995606 -1465701 -1867358 -2154377 -2285901 -2238961 -2015693
41430 -2015693 -1639757 -1143394 -552651 121302 881715 1739008 2701675 3769706 4932445
41421 4932445 6169351 7450424 8734889 9971067 11101080 12069539 12830572 13348754 13595799
41412 13595799 13549023 13195664 12541439 11617209 10477508 9188970 7812858 6389980 4935348
41403 4935348 3445030 1911679 340606 -1242559 -2796438 -4275706 -5640462 -6858433
41395 -6858433 -7904242 -8762134 -9431470 -9927495 -10271915 -10476450 -10529387 -10395008 -10029353
41386 -10029353 -9406238 -8540391 -7495138 -6370472 -5276732 -4304299 -3500538 -2863895 -2359044
41377 -2359044 -1945849 -1605443 -1348459 -1202643 -1189357 -1302377 -1499081 -1707968 -1849755 -1863217
41367 -1863217 -1724256 -1450097 -1087660 -691977 -303997 63339 425648 814453 1256191
41358 1256191 1751227 2262695 2722510 3053379 3195479 3123097 2843887 2385280 1779438 1056364
41348 1056364 247639 -603954 -1438066 -2181005 -2760512 -3122606 -3239699 -3105207 -2719695
41339 -2719695 -2080050 -1181563 -33706 1320869 2799332 4292173 5691933 6921902
41331 6921902 7950634 8787820 9466598 10021988 10474472 10824014 11054329 11142391 11067068 10814005
41321 10814005 10377860 9763693 8986965 8070458 7038992 5916238 4727208 3504723 2293523
41312 2293523 1146934 117570 -750667 -1422912 -1866678 -2046386 -1928263 -1498115 -784615
41303 -784615 125150 1089018 1934211 2494605 2646341 2329520 1552059 379921 -1079860
41294 -1079860 -2699548 -4352240 -5930330 -7355148 -8575646 -9561171 -10296967 -10786809 -11058430
41285 -11058430 -11162343 -11158966 -11099563 -11013695 -10911627 -10797712 -10682360 -10583499 -10519010 -10497814
41275 -10497814 -10515143 -10552296 -10579058 -10557853 -10449740 -10222270 -9858236 -9362574 -8763054 -8102180
41265 -8102180 -7423360 -6759189 -6128524 -5542580 -5014594 -4566750 -4230906 -4043109 -4034300 -4220840
41255 -4220840 -4598276 -5140577 -5805221 -6542482 -7305568 -8058106 -8777453 -9454386 -10089960
41246 -10089960 -10689115 -11251174 -11760170 -12180073 -12458953 -12542274 -12391364 -11999768 -11399534
41237 -11399534 -10653546 -9838089 -9025741 -8276670 -7637879 -7143708 -6812418 -6640496 -6600730
41228 -6600730 -6648394 -6733967 -6815541 -6863407 -6854395 -6761508 -6548880 -6178445 -5625021 -4889374 -4000556
41217 -4000556 -3007660 -1968432 -941915 13809 842981 1497123 1944656 2182198 2241969
41208 2241969 2189399 2108057 2075570 2139649 2303091 2521183 2710589 2768537 2600439 2148587
41198 2148587 1409489 431648 -701948 -1893896 -3046030 -4067075 -4877927 -5414579 -5627245
41189 -5627245 -5478548 -4946666 -4034559 -2778641 -1248668 463090 2258335 4047730 5759685
41180 5759685 7341685 8756002 9973816 10971653 11731060 12239120 12487095 12467556 12173584
41171 12173584 11603468 10770234 9710439 8485713 7174747 5859408 4610799 3478781
41163 3478781 2485926 1627510 879972 216734 -376019 -892895 -1315512 -1626093 -1819533
41154 -1819533 -1907872 -1916158 -1872414 -1796708 -1694920 -1560489 -1382592 -1155495 -884378 -586494
41144 -586494 -289504 -28417 159501 243339 209324 68197 -146954 -392774 -630407 -834424
41134 -834424 -993448 -1106423 -1178432 -1216279 -1223806 -1200270 -1145777 -1072168 -1011594 -1015317 -1141782
41123 -1141782 -1439705 -1933731 -2617551 -3455352 -4389748 -5353670 -6284053 -7134970 -7886966
41114 -7886966 -8548886 -9149850 -9722374 -10281911 -10811358 -11258353 -11547648 -11603475 -11373395 -10846905
41104 -10846905 -10065291 -9120112 -8138109 -7254073 -6579219 -6175560 -6043769 -6126633 -6326413
41095 -6326413 -6532534 -6653048 -6639398 -6493501 -6252899 -5961464 -5641842 -5284360 -4856363 -4324188
41085 -4324188 -3675045 -2928745 -2135179 -1359334 -660516 -75554 385637 730376 965872
41076 965872 1085172 1065187 878641 513788 -9047 -634135 -1283303 -1878667 -2362569 -2704521
41066 -2704521 -2894569 -2932012 -2819545 -2565489 -2188230 -1715460 -1176575 -593346 24661 677476
41056 677476 1367725 2094325 2850171 3623456 4399979 5163979 5896925 6575466 7171121 7654806
41046 7654806 8007393 8232691 8364703 8461836 8588046 8789268 9076582 9423451 9776701 10074360
41036 10074360 10261565 10298734 10161763 9837996 9321927 8612395 7711661 6626628 5372244
41027 5372244 3975961 2480945 945717 -561173 -1970846 -3225158 -4284851 -5132705
41019 -5132705 -5773483 -6233261 -6556703 -6797757 -7003496 -7199178 -7384951 -7546339 -7669746
41010 -7669746 -7751988 -7800104 -7825897 -7841551 -7858754 -7889081 -7941693 -8017062 -8100597 -8162702 -8168031
40999 -8168031 -8089480 -7918768 -7668395 -7364852 -7036326 -6699933 -6354749 -5984654 -5568515 -5090288
40989 -5090288 -4543970 -3934765 -3280443 -2613292 -1979108 -1429603 -1008306 -734951 -597214
40980 -597214 -557272 -571900 -614694 -687536 -816958 -1039930 -1385714 -1858925 -2429447 -3035333
40970 -3035333 -3600009 -4057064 -4371441 -4547950 -4623643 -4647351 -4656454 -4663364 -4657931 -4620634 -4535334
40959 -4535334 -4395162 -4203955 -3978191 -3749053 -3559227 -3451230 -3451649 -3560321 -3750287 -3976682
40949 -3976682 -4188055 -4335281 -4377240 -4283928 -4037235 -3630164 -3066791 -2364526 -1557045 -694421
40939 -694421 161099 942104 1583975 2034138 2263609 2278292 2122597 1867990 1587454 1328055
40929 1328055 1097588 872286 618033 310078 -59285 -485644 -963725 -1497089 -2100350
40920 -2100350 -2791998 -3581881 -4461718 -5405463 -6378895 -7350835 -8298162 -9203267 -10049123
40911 -10049123 -10817775 -11493308 -12066447 -12537930 -12919524 -13231891 -13498536 -13737436 -13954558
40902 -13954558 -14142492 -14283422 -14353567 -14327851 -14184572 -13908366 -13489226 -12918531 -12186724 -11286081
40892 -11286081 -10217659 -8998987 -7669342 -6290011 -4937093 -3686859 -2598285 -1699910
40884 -1699910 -986183 -424191 31984 424599 780295 1108557 1410382 1690291 1962803
40875 1962803 2249697 2571957 2943544 3370261 3850457 4372707 4911022 5424218 5864446
40866 5864446 6191486 6383402 6437309 6362039 6168727 5863715 5445589 4907650 4245878 3468442
40856 3468442 2600022 1677333 739593 -178542 -1047602 -1839875 -2527262 -3083507 -3489697
40847 -3489697 -3739455 -3840387 -3811030 -3676237 -3465284 -3213922 -2966637 -2773911 -2683287 -2727977
40837 -2727977 -2917927 -3235853 -3638672 -4064584 -4445272 -4719812 -4844583 -4795222 -4562207 -4145856
40827 -4145856 -3555457 -2811972 -1949923 -1015430 -61260 858546 1693882 2404502 2966085
40818 2966085 3373132 3635579 3769270 3784562 3679430 3442077 3062986 2550061 1938465 1290621
40808 1290621 687315 212421 -66885 -120515 31822 323680 661432 952485 1131144 1173272
40798 1173272 1095420 939731 752368 565928 391884 221862 33757 -199195 -497296 -865289
40788 -865289 -1291058 -1753310 -2231805 -2711336 -3176195 -3600311 -3942456 -4152967 -4190819 -4043002
40778 -4043002 -3736106 -3333776 -2920488 -2578421 -2366669 -2309603 -2395585 -2582819 -2808788 -3001530
40768 -3001530 -3091426 -3021192 -2752281 -2268440 -1578001 -714314 267941 1300662 2311273
40759 2311273 3229847 3994550 4556622 4883958 4961217 4786875 4370672 3733968 2911634 1951450
40749 1951450 908589 -163748 -1224175 -2250295 -3241419 -4216122 -5204847 -6238967 -7338991
40740 -7338991 -8505359 -9714866 -10924389 -12081176 -13136112 -14055211 -14826128 -15459446 -15985626
40731 -15985626 -16447958 -16892255 -17356366 -17863091 -18417287 -19005156 -19594946 -20140781 -20590200
40722 -20590200 -20892672 -21006453 -20904725 -20582434 -20060402 -19380158 -18588228 -17718002 -16780788
40713 -16780788 -15771778 -14686910 -13540066 -12369643 -11229625 -10170105 -9219688 -8381105
40705 -8381105 -7641936 -6992121 -6436549 -5995680 -5695210 -5551789 -5562425 -5701365 -5923877 -6174279
40695 -6174279 -6395345 -6535820 -6552856 -6409010 -6068579 -5500196 -4688703 -3651445 -2448701
40686 -2448701 -1179637 37045 1089833 1897396 2420448 2661427 2654677 2451050 2102331
40677 2102331 1651743 1133062 573918 -3925 -588765 -1181577 -1790983 -2421667 -3063242
40668 -3063242 -3686273 -4247976 -4705856 -5033129 -5227029 -5303868 -5284031 -5177925 -4982183 -4686112
40658 -4686112 -4281870 -3773058 -3180557 -2544992 -1923350 -1378438 -964523 -714859 -634666 -699960
40648 -699960 -861893 -1056646 -1218855 -1294094 -1247052 -1065721 -763334 -377115 39114 428820
40638 428820 748622 979629 1129628 1225055 1295498 1357069 1402175 1400047 1306451 1077063 679206
40627 679206 98953 -657473 -1567344 -2597787 -3711779 -4871246 -6036035 -7159495 -8184672
40618 -8184672 -9047529 -9690693 -10082675 -10230577 -10177020 -9982910 -9706967 -9392786 -9066645 -8741748
40608 -8741748 -8422885 -8108630 -7792034 -7461759 -7103767 -6702028 -6237702 -5688787 -5033113
40599 -5033113 -4255688 -3357953 -2363982 -1318871 -278347 705106 1591254 2352099 2967395
40590 2967395 3423417 3716903 3858345 3868988 3773247 3592832 3346229 3051308 2726294 2385858
40580 2385858 2032940 1652052 1212830 687747 75678 -585572 -1228828 -1783686 -2202263
40571 -2202263 -2471150 -2608607 -2655328 -2666426 -2705711 -2838109 -3117511 -3574043 -4209105 -5002219
40561 -5002219 -5923716 -6942329 -8022063 -9112296 -10139410 -11006463 -11603905 -11830545 -11618561
40552 -11618561 -10951477 -9866146 -8439292 -6767709 -4951662 -3085135 -1251647 476538
40544 476538 2037446 3378407 4456898 5243702 5726910 5913867 5828521 5503900 4973065
40535 4973065 4263880 3400452 2408543 1319151 167691 -1008115 -2167608 -3264923 -4250374
40526 -4250374 -5077317 -5709652 -6124203 -6308942 -6263283 -6003185 -5566375 -5011407 -4409580 -3833239
40516 -3833239 -3343666 -2980826 -2759330 -2675005 -2719626 -2892952 -3201994 -3648898 -4219205 -4880654
40506 -4880654 -5591900 -6312441 -7006725 -7642282 -8185587 -8599031 -8841887 -8878337 -8692564 -8303327
40496 -8303327 -7766371 -7160060 -6563147 -6038936 -5631309 -5366139 -5250547 -5271344 -5399439 -5601827
40486 -5601827 -5854232 -6146048 -6475509 -6839736 -7226476 -7612235 -7967396 -8264961 -8487797
40477 -8487797 -8631033 -8699956 -8705871 -8662153 -8581704 -8476537 -8359430 -8246141 -8155953 -8110011 -8129281
40466 -8129281 -8234051 -8443939 -8774999 -9232507 -9803190 -10453061 -11133330 -11790846 -12377969
40457 -12377969 -12860323 -13223138 -13474213 -13638588 -13743488 -13800359 -13795334 -13694392 -13459231 -13063307
40447 -13063307 -12499631 -11779732 -10929070 -9983313 -8984980 -7977964 -7001210 -6086377 -5261552
40438 -5261552 -4556448 -4002697 -3628428 -3452422 -3483356 -3724669 -4180985 -4860197 -5766919 -6887986
40428 -6887986 -8177440 -9551133 -10896306 -12092834 -13037553 -13663306 -13947500 -13908943 -13596552
40419 -13596552 -13076714 -12424069 -11714560 -11016456 -10378503 -9820405 -9332152 -8883772 -8440134
40410 -8440134 -7972981 -7465948 -6914583 -6325757 -5717335 -5114657 -4541364 -4008155 -3506626
40401 -3506626 -3012450 -2496122 -1935928 -1327757 -688288 -50915 543347 1056150 1459886
40392 1459886 1741264 1899522 1941724 1880701 1738956 1553445 1371432 1234804 1163620 1153854
40382 1153854 1193469 1285676 1462654 1779827 2292792 3028650 3966886 5040578 6158027
40373 6158027 7233708 8213471 9084124 9867273 10603905 11336764 12094286 12877901 13655272
40364 13655272 14363062 14920405 15249640 15297941 15054013 14555518 13884101 13147489 12453593
40355 12453593 11886141 11490496 11272312 11205710 11245477 11338914 11435306 11493265 11487071 11411605 11282784
40344 11282784 11130372 10984198 10860032 10752491 10638120 10486010 10270387 9980299 9623831
40335 9623831 9226043 8821230 8441481 8105200 7810022 7533964 7245613 6919308 6546921
40326 6546921 6138492 5711279 5275783 4829575 4362420 3866739 3344885 2810150 2283802
40317 2283802 1790582 1352484 981023 671359 402762 146606 -121530 -411760 -717274
40308 -717274 -1021049 -1307400 -1568507 -1798113 -1975877 -2057111 -1981241 -1697255 -1189418 -486212
40298 -486212 350892 1248887 2142587 2985929 3755126 4445338 5062878 5616253 6109414 6538166
40288 6538166 6888655 7138076 7259915 7233964 7055991 6739669 6308183 5780353 5159141 4428249
40278 4428249 3558925 2525595 1324061 -17839 -1444045 -2885136 -4272941 -5546630
40270 -5546630 -6652423 -7544710 -8192634 -8589054 -8756421 -8746283 -8632022 -8495949 -8413111 -8435444
40260 -8435444 -8580324 -8826772 -9121096 -9391270 -9566188 -9593663 -9451356 -9147475 -8711691 -8180587
40250 -8180587 -7584652 -6943096 -6267521 -5569539 -4865872 -4178215 -3529688 -2941123 -2429761
40241 -2429761 -2011886 -1709204 -1554735 -1590874 -1855429 -2360797 -3078867 -3941584 -4856609 -5729401
40231 -5729401 -6483354 -7074151 -7496692 -7782937 -7991400 -8193214 -8460159 -8855460 -9425095
40222 -9425095 -10189911 -11142593 -12251407 -13466990 -14727506 -15962667 -17100717 -18079017 -18852996
40213 -18852996 -19398094 -19704942 -19772364 -19601890 -19194530 -18550278 -17672516 -16578505 -15311956
40204 -15311956 -13948929 -12590229 -11341885 -10293390 -9503734 -8998519 -8774694 -8807817 -9058583
40195 -9058583 -9476825 -10002139 -10562743 -11076995 -11461487 -11645079 -11583684 -11269714 -10732289 -10027477
40185 -10027477 -9221182 -8370593 -7511164 -6653294 -5787608 -4894288 -3952117 -2945322 -1868552
40176 -1868552 -731016 439891 1597007 2676602 3607876 4326503 4787070 4970216 4884575
40167 4884575 4566525 4079054 3506744 2943225 2472536 2151915 2003831 2019146 2167173 2407286
40157 2407286 2699009 3009465 3317820 3616878 3912272 4218866 4554162 4930963 5353855
40148 5353855 5822053 6335746 6899951 7521565 8199626 8913139 9614526 10237093 10717666
40139 10717666 11023225 11164173 11185169 11140943 11074050 11006475 10944118 10884989 10823929 10754360 10671957
40128 10671957 10581638 10502862 10467124 10507596 10646670 10886510 11203681 11547998 11847699 12022436
40118 12022436 12001163 11739112 11229046 10504596 9635297 8714610 7844014 7116213 6599459
40109 6599459 6325845 6288596 6451596 6767483 7194570 7704206 8277301 8895455 9534557 10165874
40099 10165874 10763490 11311458 11805236 12248524 12650675 13025864 13389668 13750298 14098977
40090 14098977 14407461 14635985 14747614 14721466 14558548 14278030 13907389 13473518 13000015
40081 13000015 12509137 12022494 11557301 11121194 10710670 10314418 9918170 9507232 9065877
40072 9065877 8575193 8010911 7342133 6533019 5550744 4380034 3038025 1579305 85762
40063 85762 -1354123 -2665625 -3799531 -4734418 -5473191 -6037037 -6457081 -6763357 -6973150
40054 -6973150 -7083834 -7074829 -6918507 -6594285 -6098639 -5447278 -4670778 -3807967 -2900740 -1990940
40044 -1990940 -1117209 -310197 411966 1043846 1587426 2045374 2417864 2703809 2903313
40035 2903313 3018840 3055178 3019086 2918259 2758946 2542587 2263092 1906886 1457764 906590
40025 906590 262064 -443795 -1159425 -1824683 -2382871 -2789446 -3017931 -3065682 -2959145 -2753456
40015 -2753456 -2521088 -2330564 -2224294 -2207158 -2251989 -2318648 -2375981 -2414529 -2443484 -2475564 -2511486
40004 -2511486 -2534422 -2515271 -2421586 -2224525 -1904830 -1460062 -909971 -293985 339660 946161
39994 946161 1490833 1950139 2311428 2573876 2749511 2862340 2944334 3027513 3133156 3263109
39984 3263109 3399660 3515346 3586838 3605626 3583032 3550108 3551143 3629076 3806796 4074211 4388629
39973 4388629 4687016 4902953 4982069 4892118 4624082 4182547 3570697 2781622 1804708 643768
39963 643768 -667220 -2064231 -3470501 -4819094 -6065662 -7185586 -8162632 -8980746 -9624457
39954 -9624457 -10084433 -10361926 -10468931 -10424507 -10248986 -9958459 -9562580 -9067675 -8483727 -7830490
39944 -7830490 -7138209 -6442418 -5777280 -5173559 -4663498 -4288082 -4098494 -4147325 -4472997 -5086056
39934 -5086056 -5963847 -7054185 -8284397 -9572035 -10835095 -12000286 -13007986 -13813783
39926 -13813783 -14388788 -14721424 -14821234 -14722259 -14482710 -14178403 -13888764 -13676388 -13565710 -13530240
39916 -13530240 -13496254 -13363260 -13033843 -12442227 -11571593 -10453730 -9151489 -7733754 -6257002
39907 -6257002 -4761975 -3282665 -1857538 -533756 639139 1623029 2403856 2993461 3417650
39898 3417650 3697957 3839290 3830384 3654993 3306784 2800503 2173740 1477323 758676 47077
39888 47077 -652094 -1353626 -2083488 -2868729 -3728273 -4665527 -5663509 -6683299 -7667250 -8548966
39878 -8548966 -9269879 -9797608 -10137877 -10333504 -10450179 -10555610 -10701651 -10916252 -11205051
39869 -11205051 -11556895 -11948311 -12347547 -12721853 -13047923 -13319522 -13546046 -13742779 -13920380
39860 -13920380 -14080938 -14221037 -14336154 -14421413 -14469485 -14470439 -14415699 -14302384 -14132685 -13907914
39850 -13907914 -13622458 -13263095 -12814557 -12268281 -11630329 -10925165 -10193404 -9484719 -8850163
39841 -8850163 -8337662 -7990120 -7842267 -7913659 -8199253 -8661750 -9230185 -9807747 -10288414 -10577937
39831 -10577937 -10612901 -10373319 -9886200 -9217825 -8454263 -7676380 -6941526 -6280677 -5707964
39822 -5707964 -5230968 -4853351 -4571237 -4370447 -4229361 -4126564 -4048837 -3995138 -3974414 -3998022
39812 -3998022 -4069823 -4178029 -4292516 -4369127 -4358859 -4217256 -3910660 -3419488 -2739826 -1883048
39802 -1883048 -873180 254942 1452850 2652981 3768778 4706206 5382850 5744690 5774198
39793 5774198 5491086 4949803 4234395 3446775 2685108 2016538 1457690 977501 524427
39784 524427 61922 -410978 -865904 -1270545 -1614394 -1919553 -2232650 -2603829 -3063060 -3602895
39774 -3602895 -4172975 -4687301 -5042468 -5142798 -4926064 -4382370 -3560678 -2561124 -1514838
39765 -1514838 -555910 206968 710320 941263 929088 729153 406174 21292 -375658 -748968
39755 -748968 -1076238 -1346060 -1556476 -1715188 -1839839 -1954841 -2082813 -2233549 -2397197 -2546550
39745 -2546550 -2647562 -2673029 -2614835 -2492232 -2353411 -2267108 -2304124 -2514925 -2912755 -3468566
39735 -3468566 -4118152 -4778240 -5367392 -5826063 -6128190 -6278363 -6295767 -6194313 -5970857 -5608157
39725 -5608157 -5090311 -4421596 -3638511 -2809175 -2020480 -1358063 -885600 -629508 -573858 -667319
39715 -667319 -839088 -1017049 -1142159 -1177077 -1110047 -954746 -745752 -529667 -353515 -253584
39705 -253584 -248524 -339873 -519719 -780791 -1123061 -1554644 -2089688 -2746794 -3548465 -4518955
39695 -4518955 -5677576 -7026901 -8539586 -10151063 -11764487 -13267446 -14552481 -15532491
39687 -15532491 -16147938 -16368777 -16195116 -15658178 -14820670 -13774094 -12629829 -11502866 -10491912
39678 -10491912 -9663548 -9046701 -8637864 -8412103 -8333412 -8360844 -8451909 -8568052 -8684562 -8800004
39668 -8800004 -8935860 -9122217 -9376635 -9689660 -10025803 -10337901 -10584967 -10743647 -10809399 -10790633
39658 -10790633 -10702200 -10561752 -10387225 -10192752 -9984583 -9761831 -9523078 -9273126 -9023209
39649 -9023209 -8784652 -8562437 -8354054 -8152664 -7950098 -7738039 -7510254 -7268523 -7030230
39640 -7030230 -6832063 -6726272 -6770818 -7017163 -7497906 -8215029 -9131143 -10168842 -11222646
39631 -11222646 -12182775 -12962793 -13518480 -13847846 -13972946 -13916587 -13689939 -13296304 -12742460
39622 -12742460 -12045670 -11233041 -10338289 -9400476 -8463626 -7573428 -6769214 -6072608 -5477131
39613 -5477131 -4944894 -4415097 -3823200 -3123069 -2302794 -1388050 -431561 508308 1391315
39604 1391315 2209416 2982909 3741218 4500593 5251615 5961853 6590127 7103937 7491749
39595 7491749 7765314 7952124 8081991 8173601 8226597 8222647 8135219 7943543 7644343 7256634
39585 7256634 6818586 6378273 5981387 5659745 5424898 5270223 5181436 5150540 5184917 5304522
39575 5304522 5526553 5845552 6221893 6588019 6870838 7017827 7012775 6875619 6651800 6400488
39565 6400488 6186848 6077506 6135417 6410972 6929272 7678578 8608451 9642599 10701536
39556 10701536 11723295 12673372 13543266 14341328 15079491 15760292 16370405 16884224 17273721
39547 17273721 17517046 17602008 17526039 17295510 16925672 16441847 15881481 15294184 14736146 14259418
39537 14259418 13901291 13679083 13591939 13627984 13772984 14014583 14337275 14710426 15079507 15370231
39527 15370231 15506364 15433285 15136978 14650366 14043193 13398399 12785070 12239517 11760228
39518 11760228 11315186 10856966 10340292 9735399 9031120 8227652 7326790 6328844 5238445
39509 5238445 4072991 2865670 1660962 507772 -543638 -1440996 -2132193 -2575027 -2750201
39500 -2750201 -2667377 -2358862 -1865921 -1227633 -477812 351963 1229146 2121489 3003168 3861735
39490 3861735 4700604 5535114 6384707 7264374 8175966 9099854 9991446 10788874 11432439
39481 11432439 11887365 12157989 12286315 12336074 12369599 12427667 12521388 12639014 12761927 12878900
39471 12878900 12990340 13101593 13210949 13300634 13337346 13283267 13111260 12814911 12408629 11921288
39461 11921288 11389920 10855707 10359543 9935150 9602212 9363443 9206213 9105807 9027848
39452 9027848 8930638 8770145 8508603 8123849 7614305 6996830 6300316 5561531 4826797 4156272
39442 4156272 3623331 3304402 3261761 3527067 4093534 4920099 5945096 7103073 8338550
39433 8338550 9613660 10909557 12222163 13552590 14894182 16220912 17483204 18614784
39425 18614784 19548899 20237358 20663795 20844730 20817844 20623855 20292223 19838515 19272956
39416 19272956 18611245 17877038 17093203 16270026 15402766 14483485 13519181 12542058 11603599
39407 11603599 10756163 10033715 9442097 8962307 8563220 8216390 7905409 7625605 7375563
39398 7375563 7146929 6919736 6666145 6359587 5983062 5532322 5013930 4441360 3832023
39389 3832023 3206349 2588636 2008520 1500488 1098536 826067 686401 660914 716917 820418
39379 820418 946879 1086434 1243277 1429612 1655834 1922147 2218086 2531399 2860226 3220103
39369 3220103 3641721 4161157 4807090 5589223 6490825 7466526 8445402 9339566 10058793
39360 10058793 10529066 10708410 10592336 10206661 9593457 8799293 7871494 6861354 5828242
39351 5828242 4838070 3953814 3221811 2660845 2259332 1981302 1778253 1602575 1417992
39342 1417992 1203721 952714 668677 366576 75703 -161486 -300306 -311514 -195126 18855
39332 18855 282827 548767 781847 968035 1117430 1263441 1454545 1737020 2133830 2630194
39322 2630194 3174349 3693886 4120065 4409652 4556399 4589660 4562862 4537178 4565232 4677793
39312 4677793 4875863 5131156 5396443 5622329 5772562 5831590 5804387 5712720 5589730 5471180
39302 5471180 5383439 5334325 5314608 5311272 5323969 5372734 5490651 5705050 6018029 6397475 6783418
39291 6783418 7106133 7307344 7357072 7262673 7068997 6848367 6680217 6624660 6699915 6874911
39281 6874911 7082536 7248087 7318462 7277905 7146001 6965387 6789814 6676976 6682771 6853156
39271 6853156 7214947 7770618 8499709 9364371 10314698 11292095 12233076 13076600 13774845
39262 13774845 14302562 14658876 14859601 14924665 14868295 14696645 14411822 14017767 13524050 12946091
39252 12946091 12302526 11611495 10887516 10139710 9371837 8585469 7787361 6998728 6259582
39243 6259582 5621749 5131802 4813492 4660233 4640604 4711223 4829028 4958921 5077552 5175397
39233 5175397 5257218 5339149 5441517 5579965 5759550 5974686 6213333 6461166 6703077 6923321
39223 6923321 7107806 7250074 7358170 7456525 7578228 7748307 7964778 8187265 8341233 8339338
39213 8339338 8112474 7636481 6941198 6097500 5189455 4285735 3423340 2609810 1840359
39204 1840359 1118115 463960 -89486 -513290 -794998 -941858 -976014 -925965 -815951 -654079
39194 -654079 -423644 -84807 410435 1096126 1975176 3016278 4164443 5356385 6531475
39185 6531475 7635702 8622980 9459193 10129323 10642435 11028697 11328091 11577180 11801797
39176 11801797 12017622 12233318 12450286 12660012 12845403 12989393 13085745 13143706 13183608 13228438
39166 13228438 13298338 13409913 13576132 13801882 14075455 14362417 14608891 14755410 14755141 14588196
39156 14588196 14267318 13835189 13355819 12901938 12539245 12308785 12211359 12200894 12193258 12090861
39146 12090861 11814807 11331799 10665599 9890037 9107706 8423097 7919814 7648293 7625047
39137 7625047 7840121 8268070 8878226 9641236 10530727 11521423 12586228 13693856 14807143
39128 14807143 15882111 16868605 17713224 18364593 18779965 18931201 18807590 18414513 17770002
39119 17770002 16902626 15851497 14665855 13401768 12117018 10867414 9705822 8681540
39111 8681540 7836178 7194536 6753854 6478834 6308756 6175500 6022200 5811066 5518277
39102 5518277 5125779 4622176 4014984 3344143 2683500 2125168 1752958 1616977 1719491
39093 1719491 2016000 2429076 2868578 3250921 3512003 3611557 3529799 3260075 2803145 2167761
39083 2167761 1377243 476206 -469421 -1381198 -2182410 -2812176 -3234859 -3442232 -3448341 -3280371
39073 -3280371 -2970642 -2553131 -2064037 -1543189 -1033091 -573974 -196055 86542 275240
39064 275240 379445 407834 365393 257696 97973 -88140 -262123 -376216 -380901 -235576
39054 -235576 79933 556882 1156042 1815271 2464749 3044113 3513451 3853135 4054306 4107857
39044 4107857 4000553 3722082 3279238 2707944 2074434 1463517 959658 630041 516319
39035 516319 636285 991894 1578189 2388899 3417008 4650451 6064067 7610840 9217737
39026 9217737 10790848 12228998 13439668 14351371 14921583 15142170 15042412 14687395 14170008
39017 14170008 13596640 13067916 12658112 12400490 12286025 12276409 12323580 12385391 12432169 12446022
39007 12446022 12417954 12346363 12236950 12101600 11954826 11809780 11677083 11566093 11483979 11429450
38997 11429450 11384383 11310331 11153989 10859718 10383895 9706092 8834458 7805825 6683147
38988 6683147 5551616 4511708 3667228 3109927 2904847 3078461 3609437 4424258 5403735
38979 5403735 6404088 7287679 7951534 8343012 8459464 8336358 8031577 7611850 7142946
38970 7142946 6682818 6278102 5965826 5779127 5750856 5909282 6266942 6810100 7495139 8252545
38960 8252545 8995428 9630431 10070745 10250653 10138924 9746720 9126214 8359748 7543613
38951 7543613 6771507 6119818 5634556 5321804 5146817 5044973 4940714 4765750 4470029
38942 4470029 4025305 3424965 2683418 1836031 938099 59497 -727633 -1365758 -1824741
38933 -1824741 -2101981 -2210266 -2164326 -1978084 -1673955 -1293627 -898000 -553701 -314436 -208062
38923 -208062 -234745 -374822 -602048 -897825 -1261864 -1714562 -2288876 -3014964 -3905262 -4947012
38913 -4947012 -6103593 -7320946 -8534548 -9675080 -10673134 -11463627 -11990465 -12212340 -12110275
38904 -12110275 -11695868 -11017408 -10160375 -9239469 -8380938 -7697493 -7263021 -7096614 -7162003
38895 -7162003 -7380519 -7649744 -7860503 -7910259 -7715257 -7222708 -6419802 -5334502 -4027261
38886 -4027261 -2579166 -1082966 362340 1658468 2720176 3490185 3949607 4118532 4046713
38877 4046713 3798523 3438654 3024663 2608424 2242078 1980538 1876071 1968074 2275387 2795838
38867 2795838 3511180 4391926 5399097 6485680 7603029 8712412 9794428 10848047
38859 10848047 11879263 12887991 13861539 14775639 15598881 16298016 16844028 17218140 17415351
38850 17415351 17445111 17331392 17112979 16840729 16568511 16340229 16180497 16095000 16079172 16128083
38840 16128083 16241130 16421311 16673262 17002358 17411901 17894952 18424291 18950211 19411956
38831 19411956 19756899 19954249 19994903 19880738 19613885 19194718 18629601 17942227 17180111
38822 17180111 16411423 15713668 15159608 14805161 14681185 14789589 15103725 15573188 16133170
38813 16133170 16718309 17278299 17788899 18252101 18685454 19107256 19525381 19933362 20314070
38804 20314070 20649700 20934102 21180045 21415558 21670982 21965614 22302768 22675583 23078790
38795 23078790 23518381 24012846 24585078 25249667 26001878 26812079 27626397 28373576 28977181
38786 28977181 29369891 29505116 29363451 28955088 28319972 27524914 26655458 25802327 25045736
38777 25045736 24442779 24022307 23789201 23736106 23857295 24157814 24653054 25358925 26278116
38768 26278116 27389463 28643800 29965159 31255845 32407171 33317630 33914289 34167734
38760 34167734 34093425 33740853 33177841 32476277 31701585 30906087 30126511 29386268 28702525
38751 28702525 28095764 27595734 27236279 27036946 26980183 26999757 26990584 26835855 26436484 25729052
38741 25729052 24688911 23324649 21671834 19789310 17755986 15664268 13608240 11668974
38733 11668974 9903224 8342139 7001351 5896044 5051114 4500489 4276838 4397197 4850222
38724 4850222 5589756 6538181 7599746 8679578 9702045 10624290 11443841 12199739 12965191
38715 12965191 13830285 14877662 16159649 17686591 19430759 21341743 23365100 25458293
38707 25458293 27601852 29804212 32098023 34528524 37139542 39963099 43013926 46286731
38699 46286731 49755788 53379084 57107725 60897270 64716511 68551533 72405904 76299569
38691 76299569 80269440 84373031 88693029 93337980 98435690 104119652 110511896 117706743
38683 117706743 125759949 134685890 144461010 155027702 166293387 178123672 190331091
38676 190331091 202660647 214774439 226242807 236554162 245153209 251507114 255186620
38669 255186620 255940723 253742257 248788934 241459053 232238537 221646488 210182389 198301140
38661 198301140 186405034 174837284 163870941 153697865 144424559 136076466 128609060
38654 128609060 121925996 115905462 110430749 105414499 100806308 96582020 92722501 89193576
38646 89193576 85936677 82874816 79932300 77059644 74250708 71542122 68995299 66671877
38638 66671877 64615849 62848919 61375726 60190480 59278786 58615252 58163156 57881964 57742101
38629 57742101 57739048 57897438 58261095 58872661 59751867 60883390 62222368 63716944 65335596
38620 65335596 67081838 68986999 71087860 73406216 75944107 78696312 81671173 84907366
38612 84907366 88477286 92474743 96992729 102102527 107845107 114239429 121302819 129071022
38604 129071022 137604773 146977658 157251681 168452990 180555120 193466300 207012291
38597 207012291 220912378 234757521 248005363 260002754 270037586 277415375 281552472
38590 281552472 282072101 278880580 272196567 262516348 250522319 236965356 222558861 207909424
38582 207909424 193488314 179632985 166564053 154406949 143213018 132979270 123667963
38575 123667963 115226410 107604954 100769336 94704278 89407414 84875821 81090609 78007188
38567 78007188 75556787 73657669 72227381 71187310 70458480 69955534 69586643 69261289 68902276
38558 68902276 68456462 67900088 67237082 66491890 65700437 64901761 64129826 63404537 62724172
38549 62724172 62063998 61383308 60637860 59792370 58829141 57750595 56573889 55318298 53991593
38540 53991593 52584540 51077302 49451708 47699993 45827169 43852027 41810621 39758253
38532 39758253 37762985 35890538 34188624 32678267 31352950 30182430 29120215 28115125
38524 28115125 27124370 26122305 25101389 24067660 23035845 22027090 21068759 20194147
38516 20194147 19439678 18838672 18413628 18171211 18102026 18182015 18370730 18607372 18812639 18903558
38506 18903558 18818331 18538129 18092594 17546489 16977010 16455147 16037570 15765129 15659816
38497 15659816 15717642 15903281 16153824 16391777 16540304 16534613 16329623 15906541 15277237 14482061
38487 14482061 13579828 12634594 11705487 10841687 10080078 9442485 8932452 8535296 8225915
38478 8225915 7983966 7807704 7714466 7724007 7835258 8013145 8193659 8301341 8267574 8042873
38468 8042873 7603216 6952597 6122337 5166358 4152195 3149371 2218640 1405843 741222
38459 741222 241258 -90727 -265714 -308876 -255272 -141618 2739 162081 335932 536207
38449 536207 781009 1086155 1455802 1875446 2312046 2723868 3076669 3357601 3578790 3768859
38439 3768859 3958228 4167302 4403734 4668150 4962399 5294689 5680303 6139821 6695706
38430 6695706 7365949 8154522 9042392 9984919 10918487 11773316 12485439 13001838 13278282
38421 13278282 13275546 12961499 12321623 11372570 10169143 8798645 7364982 5970659 4704121
38412 4704121 3634241 2808972 2254426 1973190 1943433 2121401 2449068 2866285 3323714
38403 3323714 3791305 4259216 4732794 5226085 5756844 6342517 6995435 7716975 8492721
38394 8492721 9291509 10070705 10787287 11410324 11928336 12348313 12689311 12975827 13232912
38385 13232912 13481014 13729486 13971154 14181507 14323764 14358527 14255222 14000956 13601754
38376 13601754 13074297 12432570 11677911 10798697 9779511 8614371 7317055 5923452 4484382
38367 4484382 3051694 1663993 339109 -922983 -2129316 -3282639 -4376470 -5396881
38359 -5396881 -6325734 -7141208 -7817545 -8328762 -8656738 -8798474 -8767516 -8589752 -8297280 -7923145
38349 -7923145 -7497701 -7047138 -6594699 -6163120 -5774679 -5445876 -5177959 -4949510 -4719000
38340 -4719000 -4440900 -4089656 -3677982 -3257055 -2897247 -2660701 -2580947 -2657929 -2866276 -3168989
38330 -3168989 -3529958 -3922664 -4334704 -4767761 -5232949 -5743497 -6308623 -6931339 -7608988
38321 -7608988 -8331989 -9077709 -9801737 -10433725 -10884153 -11062139 -10897703 -10360346 -9469201
38312 -9469201 -8293745 -6944571 -5553797 -4248532 -3126776 -2246579 -1632027 -1288701 -1215701
38303 -1215701 -1405949 -1836746 -2460214 -3202557 -3974187 -4686100 -5265712 -5666718 -5869580
38294 -5869580 -5873031 -5682825 -5307687 -4766795 -4100717 -3371006 -2642055 -1955268 -1313689 -687571
38284 -687571 -36176 668548 1429659 2229156 3043368 3859209 4681496 5527946 6415675 7346703
38274 7346703 8299785 9233534 10101425 10872643 11546930 12152302 12724158 13277224 13787977
38265 13787977 14199116 14443515 14473529 14280175 13894423 13372432 12772519 12133317 11461776
38256 11461776 10736234 9923232 8998865 7962037 6832247 5635571 4390637 3104097
38248 3104097 1775418 403676 -1008743 -2453576 -3911012 -5341460 -6680804 -7844624
38240 -7844624 -8741756 -9293245 -9451193 -9211795 -8617572 -7747425 -6699067 -5571826 -4455287
38231 -4455287 -3423277 -2529367 -1802253 -1243155 -827835 -512520 -241048 46956 404039
38222 404039 858542 1400735 1981708 2528797 2969684 3251840 3349379 3259230 2993643 2573573
38212 2573573 2022960 1362633 605185 -245124 -1184814 -2198663 -3249591 -4277684 -5209243
38203 -5209243 -5970994 -6503117 -6767681 -6752475 -6471522 -5962739 -5282134 -4494139 -3659859 -2827238
38193 -2827238 -2026706 -1272432 -566345 97458 728181 1333867 1918932 2485211 3035064
38184 3035064 3573607 4109342 4654166 5221708 5821026 6446435 7070505 7647125 8123324
38175 8123324 8451454 8595285 8530765 8245573 7738905 7020227 6107226 5026074 3816500
38166 3816500 2539421 1280225 141141 -777617 -1400639 -1694159 -1671301 -1385887 -917794
38157 -917794 -353186 235687 804959 1343586 1867862 2408715 2994742 3635443 4312045 4981749
38147 4981749 5593066 6102286 6482447 6724195 6833387 6828760 6739163 6598816 6441014 6292609
38137 6292609 6171553 6087809 6045004 6039023 6052851 6052348 5989607 5815892 5498303 5030396 4430829
38126 4430829 3732616 2971641 2181685 1396087 650328 -19660 -583470 -1022310 -1331171
38117 -1331171 -1515631 -1584825 -1544746 -1396957 -1144647 -802043 -399845 16924 395346 679476
38107 679476 812497 740762 423936 -151221 -961776 -1951241 -3043672 -4162191 -5243679
38098 -5243679 -6244882 -7139696 -7910993 -8542514 -9016296 -9317655 -9444242 -9412200 -9254037
38089 -9254037 -9008605 -8709386 -8378729 -8031013 -7679859 -7340614 -7024055 -6727043 -6430731
38080 -6430731 -6111577 -5759718 -5392907 -5056961 -4812047 -4712003 -4786367 -5031070 -5407305 -5845181
38070 -5845181 -6251711 -6526310 -6583763 -6375537 -5895948 -5167945 -4219141 -3067281 -1726345
38061 -1726345 -226169 1373375 2987689 4529289 5930415 7152629 8182478 9022035
38053 9022035 9681953 10177015 10520777 10719851 10773117 10679216 10448187 10108514 9704833 9289613
38043 9289613 8915843 8633711 8488265 8514039 8726924 9117822 9652402 10277380 10930131 11548112
38033 11548112 12077436 12482427 12756312 12927900 13056532 13212925 13453409 13799762 14232435
38024 14232435 14696977 15119683 15428726 15576212 15553973 15396236 15168247 14946778 14800527
38015 14800527 14775720 14888804 15126239 15450282 15808715 16146751 16420024 16606511 16712538
38006 16712538 16768077 16812465 16879365 16990701 17160852 17402015 17720419 18102455 18500962 18834157
37996 18834157 19001783 18912317 18509733 17789521 16798841 15621936 14357527 13097409 11912622
37987 11912622 10847758 9920651 9126154 8444668 7854298 7341325 6903506 6545580 6271107
37978 6271107 6075628 5944283 5855776 5792574 5752906 5756260 5836640 6026668 6343366 6785312
37968 6785312 7342085 8007848 8788806 9699621 10751841 11941770 13243921 14611815 15984773
37959 15984773 17298955 18500761 19558871 20469062 21247245 21912861 22472618 22916411 23229541
37950 23229541 23413006 23497198 23539076 23604031 23742074 23969039 24259701 24554466 24776284 24851007
37940 24851007 24724127 24369719 23790546 23010400 22061846 20974348 19767363 18449455 17021238
37931 17021238 15479968 13824971 12062804 10209995 8292622 6345096 4410807 2543161
37923 2543161 802310 -755019 -2088881 -3185557 -4058482 -4741733 -5280140 -5719175 -6095914
37914 -6095914 -6432552 -6734838 -6996386 -7206523 -7357729 -7450309 -7493901 -7505323 -7501642 -7489420
37904 -7489420 -7455090 -7362842 -7162945 -6806849 -6261151 -5514258 -4576434 -3479176 -2277534
37895 -2277534 -1051198 103307 1090913 1839076 2311995 2514276 2486799 2299181 2042038
37886 2042038 1819968 1742259 1905742 2369039 3128490 4111553 5195094 6240426 7128232
37877 7128232 7779975 8161791 8274896 8140963 7790869 7260647 6592499 5836688 5052117
37868 5052117 4305007 3663968 3189529 2919698 2857686 2968717 3189177 3445687 3676818 3848068
37858 3848068 3953403 4003925 4011777 3979917 3904128 3785193 3641927 3514757 3456077 3513156 3714026
37847 3714026 4062786 4542643 5120613 5750309 6374758 6933462 7375081 7671649 7827391
37838 7827391 7877430 7877348 7889226 7969928 8163992 8499692 8985979 9610107 10338363 11122335 11910566
37827 11910566 12662573 13360732 14014686 14652810 15299599 15947852 16542814 16991817 17197474
37818 17197474 17097625 16692499 16047945 15274750 14492960 13795861 13228377 12786919 12436079
37809 12436079 12130794 11834620 11530466 11223711 10938092 10705742 10554937 10500539 10540571 10658587
37799 10658587 10828441 11018374 11194201 11323087 11378369 11344043 11217481 11009499 10740921 10435255
37789 10435255 10110131 9772414 9419417 9043157 8632826 8174751 7653679 7059133 6396526
37780 6396526 5698123 5026441 4464804 4097790 3992312 4188897 4702277 5522864 6615117
37771 6615117 7917930 9352704 10836726 12294736 13665312 14903980 15985112 16902517
37763 16902517 17668638 18312329 18872926 19387738 19875312 20323362 20689203 20911995 20929029
37754 20929029 20689166 20161839 19342789 18256048 16949677 15484591 13920521 12306692
37746 12306692 10682167 9083375 7550280 6124272 4838748 3710435 2739703 1921948
37738 1921948 1263761 792332 548448 563567 833937 1309396 1905372 2530479 3112472 3609970
37728 3609970 4010115 4320935 4565379 4776665 4990691 5234220 5513096 5807153 6075616
37719 6075616 6271406 6358270 6323572 6182145 5971265 5739993 5536227 5393976 5324478 5316135
37709 5316135 5345018 5390023 5442530 5505173 5583535 5678205 5780919 5874078 5933014 5931342 5847885
37698 5847885 5671650 5403164 5053917 4645411 4206273 3766118 3349097 2972299 2650292
37689 2650292 2401132 2247703 2212203 2306943 2527428 2852408 3250575 3688649 4135177 4559785
37679 4559785 4932672 5228191 5431058 5540702 5571674 5551578 5518377 5516558 5590482 5775234
37669 5775234 6088556 6528024 7074314 7696782 8356641 9006984 9593624 10061117 10364561
37660 10364561 10483509 10432454 10262550 10051600 9884043 9827733 9916171 10141931 10462211 10813311
37650 10813311 11128457 11352684 11450340 11404648 11212183 10876598 10405308 9811018 9116959 8362209
37640 8362209 7603316 6910314 6356362 6000510 5865853 5920929 6075453 6197146 6146798 5820197
37630 5820197 5182352 4281479 3237591 2211057 1364322 829340 686444 954906 1594841
37621 1594841 2520303 3620431 4781769 5904798 6911317 7743707 8360191 8731660 8844010
37612 8844010 8705083 8350150 7839450 7246385 6641669 6081353 5603168 5229057 4968222
37603 4968222 4817722 4762959 4781753 4851251 4952782 5071657 5194303 5307182 5398322 5458186
37593 5458186 5476948 5439302 5321739 5097164 4747322 4276622 3717650 3123493 2552096 2053743
37583 2053743 1668173 1428598 1365462 1505990 1870273 2466310 3286085 4304368 5480656
37574 5480656 6761587 8080571 9355605 10491340 11390637 11973771 12197139 12063116 11617437
37565 11617437 10935944 10106535 9213508 8328905 7510285 6800762 6228378 5805105 5526954
37556 5526954 5375121 5317611 5312178 5311977 5273761 5166498 4978145 4718579 4416769 4111409 3838053
37545 3838053 3619482 3464535 3373752 3343986 3365533 3413388 3441203 3385581 3181090 2779561
37535 2779561 2165601 1362616 427230 -565513 -1539541 -2430433 -3190866 -3791785 -4222626
37526 -4222626 -4489963 -4612657 -4615184 -4523344 -4363388 -4161076 -3937964 -3706896 -3470507 -3223605
37516 -3223605 -2957375 -2663900 -2340482 -1992465 -1632545 -1276375 -936703 -618174 -313311
37507 -313311 -362 354462 788238 1327904 1978189 2716970 3499834 4270641 4972559 5555295
37497 5555295 5977503 6206332 6217454 5997867 5550868 4899640 4085981 3164441 2196407 1248387
37487 1248387 393230 -291921 -735802 -889351 -740321 -318326 312537 1070504 1875371
37478 1875371 2662200 3384762 4010402 4513842 4876853 5093602 5174103 5138622 5003788 4768851
37468 4768851 4410730 3890550 3168673 2223190 1066087 -249539 -1636113 -2990733 -4218652
37459 -4218652 -5251284 -6053143 -6617502 -6953949 -7073362 -6977491 -6658804 -6110170 -5337390
37450 -5337390 -4365857 -3237016 -1997287 -687264 660672 2013727 3324942 4524926
37442 4524926 5526274 6239438 6592815 6549406 6114968 5335452 4285252 3052054 1724861
37433 1724861 387512 -885212 -2031888 -3008524 -3790102 -4369593 -4756651 -4976451 -5066207
37424 -5066207 -5067587 -5017778 -4945265 -4874013 -4833054 -4862979 -5011804 -5319419 -5797439 -6414541 -7095426
37413 -7095426 -7736102 -8231205 -8502475 -8515681 -8279447 -7830101 -7212791 -6466355 -5613247 -4653833
37403 -4653833 -3566904 -2319060 -881696 750216 2544848 4431083 6308814 8068777
37395 8068777 9613952 10874259 11811724 12419112 12715390 12738264 12534155 12149842 11630388
37386 11630388 11021762 10370775 9718419 9091919 8504011 7959970 7463424 7012955 6592610
37377 6592610 6168322 5699280 5161220 4568275 3979181 3481913 3162436 3071767 3206471 3510872
37367 3510872 3898562 4282081 4597288 4813235 4926917 4950028 4897341 4782405 4619464 4426490
37357 4426490 4224953 4035343 3870408 3729716 3599112 3456556 3282458 3070168 2832541
37348 2832541 2602457 2427113 2357564 2436494 2687670 3109354 3672690 4325563 5001613 5631752
37338 5631752 6153898 6518421 6690014 6647502 6381855 5893233 5190361 4294728 3246428
37329 3246428 2104512 938307 -186140 -1217230 -2122668 -2888581 -3514923 -4009279 -4381842
37320 -4381842 -4643627 -4807028 -4885371 -4889964 -4827242 -4699836 -4511796 -4273663 -4002668 -3717370
37310 -3717370 -3430539 -3144984 -2854582 -2549542 -2223019 -1875395 -1513534 -1145619 -776217
37301 -776217 -406768 -41840 304165 606002 833884 963728 985757 906613 743283 512334
37291 512334 221849 -128165 -537978 -999131 -1489614 -1974487 -2411504 -2761275 -3000075 -3130071
37281 -3130071 -3181643 -3207147 -3270749 -3438891 -3771258 -4309102 -5061403 -5995963 -7043461 -8114542
37271 -8114542 -9120615 -9988209 -10664593 -11119409 -11346396 -11364106 -11212238 -10942462 -10606356
37262 -10606356 -10245048 -9884652 -9538173 -9209879 -8896647 -8584847 -8246964 -7843244 -7329745
37253 -7329745 -6669983 -5845931 -4864499 -3756957 -2571634 -1363720 -186863 911453 1892181
37244 1892181 2727023 3401357 3915577 4281164 4510254 4603189 4542678 4300428 3853511 3201155
37234 3201155 2373406 1429276 447685 -484115 -1282507 -1880846 -2244519 -2382855 -2349592 -2228284
37224 -2228284 -2108954 -2066770 -2148076 -2361916 -2675315 -3015988 -3287123 -3392728 -3265036 -2884014
37214 -2884014 -2282596 -1536389 -741769 9517 649579 1141024 1471496 1643225 1666359 1559793
37204 1559793 1355425 1098202 838257 618234 461970 368542 312691 251987 141070 -49153
37194 -49153 -313880 -607393 -852798 -966535 -887304 -596016 -118541 487220 1150285 1800837
37184 1800837 2375200 2815642 3072920 3114481 2932803 2545984 1989276 1303894 529135 -302319
37174 -302319 -1168940 -2063879 -2992326 -3959731 -4955026 -5938313 -6841248 -7581560 -8085036 -8303978
37164 -8303978 -8223954 -7858553 -7238861 -6405037 -5402584 -4281229 -3094041 -1897210 -752035
37155 -752035 272158 1098811 1652584 1874526 1738621 1263751 516691 -396338 -1348862
37146 -1348862 -2218409 -2907279 -3354495 -3539668 -3481935 -3234324 -2871835 -2474268 -2109027 -1820116
37136 -1820116 -1626658 -1530130 -1526126 -1614590 -1803681 -2106259 -2531602 -3076132 -3716792 -4410596
37126 -4410596 -5101995 -5735151 -6264614 -6659957 -6905950 -7002773 -6967637 -6834506 -6648912 -6459053
37116 -6459053 -6306887 -6221581 -6215331 -6281197 -6393020 -6507433 -6568520 -6517585 -6309689 -5931946
37106 -5931946 -5411934 -4807984 -4186664 -3602591 -3091403 -2674125 -2364720 -2175700 -2121053 -2215468
37096 -2215468 -2468251 -2873440 -3401448 -3997606 -4590239 -5107723 -5499613 -5751857 -5886214
37087 -5886214 -5943110 -5958724 -5950145 -5914533 -5837869 -5704745 -5503514 -5226530 -4868959 -4429877
37077 -4429877 -3916749 -3351118 -2772008 -2234516 -1802988 -1540318 -1496592 -1700650 -2156588 -2844988
37067 -2844988 -3727686 -4754686 -5871428 -7024068 -8161343 -9233567 -10191230 -10986212 -11577161
37058 -11577161 -11937143 -12058728 -11952804 -11642352 -11155816 -10522869 -9771883 -8928684 -8018665
37049 -8018665 -7073197 -6136321 -5265256 -4522061 -3959603 -3607417 -3462200 -3486150 -3614422 -3769734
37039 -3769734 -3878988 -3886256 -3758799 -3485949 -3072949 -2532637 -1877604 -1114747 -243832 739307
37029 739307 1836467 3040764 4332362 5675908 7019730 8299610 9450043 10420692
37021 10420692 11190389 11771406 12202168 12532039 12804639 13046962 13269341 13474657 13667997
37012 13667997 13857783 14047932 14229368 14379095 14466662 14461119 14333459 14056738 13609427 12983666
37002 12983666 12193759 11278657 10295656 9306920 8362730 7486905 6670934 5881241 5077416
36993 5077416 4232471 3345236 2440168 1556771 735566 8650 -600163 -1067664 -1364327
36984 -1364327 -1455991 -1314548 -931440 -327595 442737 1294814 2124050 2823567 3303156 3502696
36974 3502696 3398165 3003639 2371070 1583333 735715 -89777 -843956 -1513042 -2106277
36965 -2106277 -2639886 -3126264 -3568005 -3952076 -4243938 -4387618 -4317436 -3979441 -3352892 -2461359
36955 -2461359 -1369863 -172352 1023965 2114160 3011033 3659499 4045579 4195107 4161228
36946 4161228 4005322 3779402 3517305 3237418 2953583 2686684 2470243 2347980 2366015 2564085
36936 2564085 2968894 3590066 4417180 5416687 6530440 7680351 8782407 9767151 10597464
36927 10597464 11273634 11821914 12272198 12637019 12902864 13036393 12998870 12759498 12303137
36918 12303137 11633285 10771475 9752334 8615242 7397881 6136881 4873977 3659645
36910 3659645 2547610 1581015 777019 117337 -449897 -995093 -1582561 -2246263 -2978065
36901 -2978065 -3734864 -4460447 -5109754 -5662890 -6123496 -6506032 -6822578 -7077891 -7273742
36892 -7273742 -7417219 -7526801 -7632932 -7772265 -7976305 -8258207 -8604736 -8979338 -9335310
36883 -9335310 -9630761 -9836324 -9933226 -9907328 -9747028 -9448394 -9023660 -8505410 -7941110 -7379242
36873 -7379242 -6854317 -6379293 -5949725 -5556575 -5198792 -4887184 -4637797 -4461209 -4356377
36864 -4356377 -4312716 -4317088 -4359453 -4433530 -4532999 -4646838 -4757961 -4847678 -4904554 -4931969 -4947735
36853 -4947735 -4973607 -5019741 -5073300 -5097604 -5040826 -4847663 -4468246 -3863720 -3011190 -1909399
36843 -1909399 -583045 916968 2517793 4131602 5663479 7019874 8117777 8894490
36835 8894490 9316943 9388486 9150295 8674852 8051418 7366985 6688814 6054475 5472274 4930523
36825 4930523 4410738 3899307 3394342 2907420 2461306 2084082 1799722 1617285 1524100 1488595
36815 1488595 1473059 1449497 1409191 1361406 1324114 1313564 1338280 1399187 1493809 1620285 1777152
36804 1777152 1958186 2145820 2307877 2399887 2372161 2180424 1799403 1236914 541916 -200704
36794 -200704 -889853 -1434453 -1773790 -1884289 -1774277 -1473914 -1026209 -480833 109521 690427
36784 690427 1206060 1602184 1834538 1880092 1744257 1458576 1069656 624558 158103 -314244
36774 -314244 -795855 -1300736 -1841047 -2415815 -3004914 -3569791 -4061216 -4433946 -4664781 -4765540
36764 -4765540 -4782634 -4782703 -4833007 -4986306 -5273271 -5699258 -6243119 -6859779 -7488744 -8066633
36754 -8066633 -8538824 -8866710 -9030612 -9029876 -8880978 -8613554 -8264402 -7870283 -7461540 -7059170
36744 -7059170 -6676416 -6322257 -6002474 -5717517 -5461999 -5230489 -5026517 -4865284 -4764313
36735 -4764313 -4727732 -4736499 -4751896 -4729181 -4633077 -4449482 -4192289 -3905182 -3657008 -3529729
36725 -3529729 -3600834 -3924957 -4520036 -5361413 -6384571 -7495586 -8587976 -9563690 -10353401
36716 -10353401 -10929275 -11305893 -11531035 -11671918 -11800286 -11975959 -12229754 -12552096 -12894773
36707 -12894773 -13186112 -13351186 -13327645 -13073944 -12572078 -11826883 -10862153 -9714660 -8428864
36698 -8428864 -7053895 -5641274 -4241103 -2897390 -1645519 -512900 480554 1326560
36690 1326560 2036337 2644215 3198203 3737914 4272500 4774214 5192613 5479513 5608913
36681 5608913 5582451 5421649 5154476 4804370 4386972 3914976 3406235 2888167 2394810 1958232
36671 1958232 1598790 1318068 1097016 900491 686677 416494 57828 -416218 -1030176
36662 -1030176 -1803789 -2742572 -3826846 -5008199 -6217852 -7382091 -8434936 -9322581 -10003095
36653 -10003095 -10448102 -10648124 -10616962 -10390092 -10016897 -9550671 -9040595 -8526692 -8035699
36644 -8035699 -7575789 -7132183 -6669448 -6143997 -5522529 -4796764 -3987600 -3139032 -2306089
36635 -2306089 -1540760 -878977 -332168 113874 492891 847231 1215156 1619394 2060004
36626 2060004 2513335 2936729 3277462 3484357 3519834 3368627 3039953 2563326 1981177 1341721
36616 1341721 693671 82314 -455034 -895561 -1236887 -1495682 -1694686 -1843421 -1925344 -1900628
36606 -1900628 -1722297 -1355566 -791496 -51989 813118 1735279 2640825 3465860 4168548
36597 4168548 4734890 5175982 5518452 5793373 6029050 6249206 6474068 6721055 7003794
36588 7003794 7330081 7699836 8103643 8522130 8926503 9281222 9550182 9705976 9738110 9653688
36578 9653688 9467181 9183585 8785489 8233880 7484722 6514094 5339850 4029684 2691829
36569 2691829 1451752 423239 -316556 -741207 -876371 -790386 -577077 -334103 -142199
36560 -142199 -52599 -87004 -246601 -521124 -891784 -1329773 -1796572 -2249924 -2654169 -2990706
36550 -2990706 -3263966 -3499672 -3735122 -4005161 -4329061 -4701905 -5092284 -5448350 -5713574
36541 -5713574 -5848466 -5848560 -5749546 -5618430 -5537479 -5588674 -5841990 -6346808 -7124733 -8162951
36531 -8162951 -9409184 -10771738 -12128366 -13344089 -14292787 -14875693 -15032884 -14747876 -14046532
36522 -14046532 -12990902 -11668742 -10180855 -8628901 -7105462 -5687180 -4431349 -3375799
36514 -3375799 -2540585 -1929015 -1527088 -1303891 -1217595 -1228404 -1312582 -1467707 -1704362 -2029998
36504 -2029998 -2436257 -2896644 -3373161 -3827091 -4230590 -4576107 -4878563 -5166797 -5467931
36495 -5467931 -5794228 -6139483 -6484085 -6803314 -7074817 -7283525 -7422783 -7491613 -7491151 -7424509
36485 -7424509 -7300491 -7136731 -6958042 -6790692 -6657143 -6574602 -6556517 -6613079 -6747498 -6948850
36475 -6948850 -7186684 -7412675 -7569500 -7601431 -7461005 -7111469 -6529081 -5708163 -4666942
36466 -4666942 -3448991 -2116609 -738009 624484 1917924 3093476 4100402 4888496
36458 4888496 5420036 5682807 5694040 5492229 5122550 4625211 4032896 3376204 2689953 2012873
36448 2012873 1379221 808059 298452 -165075 -599226 -1008261 -1377661 -1678306 -1878426
36439 -1878426 -1957572 -1917505 -1786268 -1612452 -1450026 -1340576 -1303116 -1335639 -1422793 -1541427
36429 -1541427 -1662403 -1753094 -1782968 -1729210 -1578471 -1324965 -968059 -511635 34462 651784
36419 651784 1311108 1973347 2595616 3141504 3590769 3941604 4201681 4372237 4437221 4368805
36409 4368805 4149633 3798973 3385547 3016912 2808088 2843080 3147240 3683339 4371358 5119430
36399 5119430 5850163 6513887 7089771 7579812 7999845 8370032 8706528 9015065 9286511
36390 9286511 9495146 9601187 9558005 9321966 8861663 8164231 7238197 6113141 4836755
36381 4836755 3469692 2078702 728950 -522567 -1630679 -2563040 -3301205 -3844275 -4213760
36372 -4213760 -4454665 -4627845 -4793443 -4991438 -5229061 -5482628 -5713472 -5888910 -5996456
36363 -5996456 -6044789 -6053725 -6040466 -6008734 -5944239 -5817429 -5592726 -5241041 -4750598 -4131664
36353 -4131664 -3414373 -2642649 -1868086 -1145351 -527874 -62403 216739 291539 160718 -163434
36343 -163434 -661581 -1315494 -2112926 -3042915 -4080910 -5173075 -6233499 -7160447 -7864285
36334 -7864285 -8291876 -8435398 -8323369 -8000642 -7508199 -6871658 -6101439 -5201394 -4180024
36325 -4180024 -3059161 -1877085 -685613 456724 1492203 2371075 3059577 3547802 3851732
36316 3851732 4004442 4040199 3983143 3849506 3660775 3456003 3292541 3232952 3324602 3582366
36306 3582366 3982638 4469551 4967341 5391354 5655399 5678810 5396739 4772478 3806489 2537304
36296 2537304 1033440 -620240 -2336244 -4033751 -5642657 -7105083 -8377243 -9431235
36288 -9431235 -10253814 -10841579 -11196825 -11329030 -11261277 -11035394 -10710770 -10357472 -10046789 -9839565
36278 -9839565 -9771250 -9837099 -9986424 -10133260 -10182156 -10058951 -9733877 -9227848 -8600226 -7924483
36268 -7924483 -7263524 -6655144 -6110921 -5623996 -5177689 -4748755 -4304234 -3796548 -3164244
36259 -3164244 -2343345 -1287342 12243 1514204 3130765 4745809 6242909 7533454
36251 7533454 8574193 9367707 9947168 10353508 10615201 10737899 10705825 10491645 10069295
36242 10069295 9425567 8569796 7542232 6418505 5303711 4311835 3535663 3020640 2754551
36233 2754551 2674760 2686917 2688997 2597166 2367838 2006735 1559089 1085670 637168 237839
36223 237839 -117678 -455553 -805806 -1184067 -1580928 -1964466 -2293913 -2536837 -2681938 -2742808
36213 -2742808 -2751520 -2745257 -2752985 -2788952 -2854167 -2940991 -3035604 -3117876 -3162016 -3141127 -3036152 -2847418
36201 -2847418 -2604735 -2370084 -2228243 -2266485 -2551268 -3111229 -3931239 -4956525 -6103686
36192 -6103686 -7276101 -8381068 -9344296 -10117076 -10674640 -11009033 -11121414 -11016258 -10697041
36183 -10697041 -10163816 -9415477 -8458067 -7314346 -6026100 -4645410 -3220280 -1784162
36175 -1784162 -354569 1060568 2452996 3804604 5082427 6242489 7243496 8065691
36167 8065691 8725629 9277979 9800255 10364636 11009033 11721610 12446255 13105103 13626549
36158 13626549 13967179 14120719 14112455 13982399 13764291 13468641 13076015 12543058 11819768 10872155
36148 10872155 9700845 8346827 6882047 5391023 3953862 2637362 1493102 555897
36140 555897 -161874 -677052 -1035580 -1301131 -1536817 -1789320 -2081761 -2415620 -2778937 -3157558
36130 -3157558 -3545533 -3950187 -4389674 -4884895 -5449774 -6083084 -6764361 -7456876 -8119067
36121 -8119067 -8720301 -9251737 -9724792 -10158586 -10566287 -10950305 -11307933 -11640280 -11955957
36112 -11955957 -12266889 -12580425 -12893938 -13195356 -13468810 -13701547 -13887604 -14025992 -14115183
36103 -14115183 -14148425 -14113378 -13995660 -13782915 -13466600 -13041810 -12507448 -11868130 -11136485 -10333597
36093 -10333597 -9486900 -8627146 -7786126 -6995593 -6286772 -5689713 -5231239 -4930126 -4789535
36084 -4789535 -4789603 -4884707 -5009159 -5092490 -5081125 -4957993 -4749401 -4513944 -4318962 -4217130 -4233386
36073 -4233386 -4364844 -4590366 -4883703 -5222606 -5587612 -5950576 -6260825 -6439292 -6386473 -6003670
36063 -6003670 -5222240 -4031803 -2495573 -743309 1058185 2745605 4193750 5331901
36055 5331901 6140959 6640392 6875669 6910004 6816734 6668334 6524057 6422067 6379298 6396853
36045 6396853 6466501 6575053 6705635 6836998 6943816 7000769 6989859 6906614 6760447 6567949
36035 6567949 6342130 6083364 5777808 5405520 4953958 4427721 3847807 3242231 2636738
36026 2636738 2052560 1509917 1029941 629884 314760 73964 -111393 -254095 -350033 -379913
36016 -379913 -322589 -170349 64136 352167 659782 958025 1229077 1467483 1675974 1855964
36006 1855964 1996492 2068662 2030373 1839056 1465329 902137 168376 -692529 -1619960 -2549787
35996 -2549787 -3430587 -4235075 -4961013 -5622253 -6235839 -6811470 -7346084 -7823404 -8217571
35987 -8217571 -8499973 -8647229 -8647570 -8504072 -8235044 -7872001 -7454710 -7023607 -6612096 -6241367
35977 -6241367 -5917779 -5631222 -5354687 -5047604 -4664447 -4166755 -3534755 -2775334 -1924501
35968 -1924501 -1043675 -210408 495264 1007961 1295528 1372677 1300162 1165181 1050969 1011606
35958 1011606 1062849 1186646 1339993 1463542 1493163 1377262 1095011 665709 143600 -399145
35948 -399145 -893674 -1292545 -1579582 -1768943 -1894661 -1996009 -2104912 -2238616 -2397253 -2565195
35938 -2565195 -2716079 -2821538 -2862365 -2839656 -2782607 -2749226 -2817169 -3065139 -3549669 -4285047
35928 -4285047 -5234183 -6314965 -7420514 -8445140 -9305232 -9948280 -10350969 -10512489 -10449203
35919 -10449203 -10192944 -9790754 -9301429 -8786058 -8295318 -7861065 -7498188 -7215160 -7025173
35910 -7025173 -6950255 -7017035 -7248739 -7659137 -8251093 -9018403 -9947483 -11016197 -12189757
35901 -12189757 -13416204 -14624999 -15731183 -16644978 -17284221 -17586335 -17517665 -17078784 -16303996
35892 -16303996 -15253679 -14001714 -12624226 -11194826 -9785057 -8463672 -7290872 -6311065
35884 -6311065 -5551129 -5026782 -4752164 -4744676 -5020564 -5582786 -6406925 -7432030 -8562244
35875 -8562244 -9681926 -10681299 -11483217 -12058862 -12424656 -12622824 -12696968 -12675395 -12568205 -12374828
35865 -12374828 -12093600 -11726673 -11278929 -10753687 -10148763 -9455550 -8662848 -7765616 -6775444
35856 -6775444 -5726796 -4674164 -3680253 -2800300 -2069097 -1495361 -1064456 -746997 -508804
35847 -508804 -318291 -149965 14739 187538 372993 567446 757693 921021 1028219 1049967
35837 1049967 965244 769531 480032 135278 -211600 -503191 -687341 -723653 -588218 -278035
35827 -278035 186201 761491 1388052 1996415 2514836 2878741 3042880 2992005 2743425 2339594
35817 2339594 1836410 1294844 777869 348538 65299 -24434 111417 488846 1108325 1954195
35807 1954195 2993307 4175731 5439439 6717789 7946441 9067804 10034864 10817696
35799 10817696 11412079 11844054 12164283 12433118 12704510 13016789 13391462 13834709 14336191
35790 14336191 14865143 15369398 15783268 16044258 16111414 15976669 15665778 15231528 14743035
35781 14743035 14272922 13883580 13615332 13480108 13462746 13529778 13642931 13771925 13900605 14024625
35771 14024625 14144747 14261444 14372889 14474636 14559219 14615522 14628575 14580494 14453367 14233685
35761 14233685 13916278 13506531 13022465 12497939 11983368 11537612 11210374 11023591 10963076
35752 10963076 10984853 11031330 11047437 10988069 10814761 10488458 9969995 9234027 8289205 7189457
35742 7189457 6025947 4901683 3900536 3064497 2389181 1840028 1382069 1008522 753180
35733 753180 679975 855669 1320341 2069591 3053154 4184967 5357529 6457735 7384298
35724 7384298 8063783 8459301 8569170 8419787 8058054 7544015 6941695 6309994 5698587
35715 5698587 5149632 4699578 4375619 4188531 4128165 4165088 4257099 4358889 4434378 4469327
35705 4469327 4477961 4498059 4575664 4747087 5026166 5400099 5832595 6271873 6661730 6954090
35695 6954090 7120347 7157796 7088294 6949673 6783840 6626807 6503974 6430806 6415970 6462137
35685 6462137 6561019 6684693 6781534 6784921 6634282 6297765 5783748 5135964 4417223 3691856
35675 3691856 3015443 2434232 1989553 1718605 1645811 1767628 2041230 2387355 2709335 2920188
35665 2920188 2964656 2826532 2521023 2080549 1544133 954600 359839 -188660 -642947 -967645
35655 -967645 -1143719 -1162799 -1015487 -682829 -138820 635847 1636478 2823474 4123970
35646 4123970 5445483 6695584 7799836 8712444 9418221 9927566 10266951 10467718 10556435
35637 10556435 10549624 10453714 10269292 9998178 9650904 9250427 8828343 8414803 8028301 7670633
35627 7670633 7326633 6965874 6546814 6026470 5374714 4586095 3682578 2708067 1721359
35618 1721359 791709 -5300 -596298 -923944 -961815 -724403 -267631 322043 948375 1530183
35608 1530183 2022125 2424712 2780975 3160809 3636936 4260345 5046080 5976931 7021926
35599 7021926 8156234 9368758 10653906 11995795 13357264 14681042 15901623 16960541
35591 16960541 17817816 18456441 18880263 19106544 19154841 19035709 18744503 18264409 17578983
35582 17578983 16690353 15635832 14493711 13371181 12376044 11584544 11020977 10657245 10428830
35573 10428830 10257192 10069906 9814543 9465713 9025665 8518662 7980223 7444649 6935969
35564 6935969 6465913 6038086 5653926 5315864 5025604 4778605 4558419 4335146 4069836
35555 4069836 3723237 3266235 2690105 2013644 1281935 553763 -116489 -690462 -1144108
35546 -1144108 -1458062 -1611473 -1584784 -1367461 -963166 -388531 333036 1178332 2128218 3167238
35536 3167238 4280787 5452711 6664465 7894898 9119244 10307075 11420604 12416322
35528 12416322 13252452 13901033 14358693 14649424 14817583 14915081 14988005 15065194 15149489 15213646
35518 15213646 15204241 15054787 14704123 14112553 13269581 12192614 10920218 9503507 7997187
35509 7997187 6451932 4911768 3419070 2023820 788570 -218066 -939241 -1351661
35501 -1351661 -1481278 -1404802 -1234151 -1087961 -1059944 -1195189 -1481946 -1860495 -2244975 -2550180
35491 -2550180 -2714588 -2713959 -2564163 -2314577 -2034426 -1795985 -1660030 -1666887 -1831906 -2142508
35481 -2142508 -2557982 -3016538 -3450487 -3802930 -4037860 -4141871 -4121866 -4002274 -3821107 -3623415
35471 -3623415 -3453314 -3346873 -3326695 -3398423 -3550599 -3758990 -3993441 -4222899 -4416195 -4540404
35461 -4540404 -4561068 -4446991 -4178435 -3753998 -3191816 -2524613 -1792403 -1036005 -290856 420010
35451 420010 1090637 1729014 2346131 2945064 3517908 4049867 4523425 4918421 5210613 5373038
35441 5373038 5380541 5215188 4871908 4365162 3734689 3044978 2374965 1801460 1384087 1156345
35431 1156345 1121407 1250481 1486210 1754978 1985752 2125697 2144256 2026703 1765312 1354626
35421 1354626 791100 73886 -795251 -1812684 -2973273 -4269495 -5688831 -7209185 -8792687
35412 -8792687 -10379480 -11884601 -13201684 -14215785 -14824435 -14962587 -14624166 -13871130 -12822539
35403 -12822539 -11623571 -10405161 -9251339 -8187897 -7194819 -6233551 -5275141 -4318027 -3391876
35394 -3391876 -2550965 -1862723 -1394957 -1203239 -1320207 -1748622 -2458102 -3384003 -4429212
35385 -4429212 -5472956 -6389844 -7076030 -7473244 -7580270 -7446560 -7150757 -6773729 -6377329
35376 -6377329 -5995284 -5635398 -5287563 -4931860 -4543230 -4092392 -3546232 -2872470 -2050014
35367 -2050014 -1079841 11766 1181155 2381898 3577889 4749298 5890534 7002595
35359 7002595 8083865 9124001 10104157 11002950 11804043 12500619 13094619 13591660 13994710
35350 13994710 14300357 14500296 14586923 14558097 14416432 14163887 13797150 13308551 12692025 11950528
35340 11950528 11102310 10185067 9256320 8387784 7653854 7117619 6818277 6762020 6918352
35331 6918352 7224940 7602364 7974211 8283174 8496095 8598466 8584951 8452206 8195898 7810510
35321 7810510 7290416 6631898 5835865 4909838 3867486 2725792 1502570 218316 -1095828
35312 -1095828 -2387653 -3579539 -4577868 -5295070 -5673118 -5695423 -5382739 -4779214 -3937706
35303 -3937706 -2909071 -1735734 -449549 924952 2362501 3828187 5273744 6643361
35295 6643361 7888086 8981672 9928155 10755659 11499475 12183884 12811976 13367339 13825194
35286 13825194 14166315 14386802 14500289 14534351 14525387 14514746 14545666 14659169 14887394 15244128
35276 15244128 15714832 16251385 16777087 17202495 17445811 17449245 17187175 16668202 15934993 15062364
35266 15062364 14150168 13308180 12635115 12198688 12023512 12089551 12340022 12696714 13080265
35257 13080265 13429991 13714971 13930159 14079588 14156672 14132492 13956892 13569847 12916851 11962268
35247 11962268 10696455 9135225 7313887 5281363 3099649 848893 -1368284 -3431951
35239 -3431951 -5223114 -6649137 -7664125 -8274409 -8528659 -8500536 -8272838 -7926416 -7531479
35230 -7531479 -7138433 -6769152 -6413103 -6032978 -5581150 -5022375 -4352624 -3603657 -2830517
35221 -2830517 -2089457 -1417954 -823821 -283782 249367 830356 1497980 2254591 3061774
35212 3061774 3857149 4582641 5206918 5730233 6172608 6555203 6885474 7152502 7333723
35203 7333723 7409358 7376499 7254566 7079440 6891931 6729849 6628407 6624998 6759659 7065759
35193 7065759 7554172 8200965 8947432 9712985 10413568 10977322 11354413 11522113 11485890 11275949
35183 11275949 10940312 10538339 10137179 9808489 9619832 9619193 9818770 10188011 10661928 11161921
35173 11161921 11619251 11990197 12256855 12415418 12460456 12375297 12134057 11712929 11103582 10322748
35163 10322748 9415821 8453224 7517609 6683276 5996620 5469272 5087745 4830741 4681067
35154 4681067 4626622 4655439 4752589 4901683 5087502 5295107 5504518 5684866 5793991 5786349
35144 5786349 5626040 5297695 4809505 4188504 3472712 2704588 1926555 1176479 481923
35135 481923 -145062 -709525 -1230925 -1738698 -2268218 -2855435 -3526736 -4284709 -5097200 -5898530
35125 -5898530 -6605130 -7138978 -7448547 -7520420 -7380328 -7085735 -6712819 -6340895 -6037648 -5848401
35115 -5848401 -5791614 -5861098 -6033278 -6275948 -6555073 -6838237 -7095238 -7296383 -7409101 -7395595
35105 -7395595 -7216024 -6838521 -6250530 -5463082 -4505305 -3414994 -2232987 -1003212 226056
35096 226056 1404395 2485210 3432434 4225132 4859497 5348569 5719029 6003986 6233040
35087 6233040 6424494 6584042 6708903 6791906 6822607 6788854 6683400 6513851 6307973 6108348
35077 6108348 5958318 5887385 5903907 5997742 6149164 6336156 6533609 6705399 6798271 6746828
35067 6746828 6490692 5995330 5265544 4345550 3306149 2223898 1159859 146589 -810897
35058 -810897 -1722325 -2596833 -3434176 -4223827 -4946973 -5577459 -6082982 -6429824 -6590891 -6553299
35048 -6553299 -6321770 -5916798 -5368921 -4711883 -3977976 -3197251 -2398766 -1610388 -855895
35039 -855895 -151747 493627 1077727 1600772 2062740 2460735 2786658 3025956 3159049 3167090
35029 3167090 3042329 2799881 2484329 2164885 1918129 1804832 1851912 2048388 2355832 2725044
35019 2725044 3108252 3462410 3747821 3929272 3982276 3900558 3698427 3403994 3044558 2631408
35009 2631408 2154101 1589959 924161 167581 -638755 -1433474 -2150387 -2729971 -3123159
35000 -3123159 -3290814 -3204645 -2852266 -2243874 -1415451 -425128 656853 1761642 2835559
34991 2835559 3850979 4810493 5740683 6674517 7627193 8576220 9457667 10183562 10673341
34982 10673341 10883467 10820804 10535179 10097571 9576243 9022348 8469617 7942737 7462919
34973 7462919 7043155 6677516 6336696 5977434 5561039 5068244 4500984 3871869 3190081
34964 3190081 2453303 1650271 771749 -177346 -1173053 -2179185 -3162439 -4105187 -5005626
34955 -5005626 -5864445 -6668249 -7381813 -7952548 -8321179 -8431753 -8239674 -7719842 -6875118
34946 -6875118 -5741992 -4389676 -2910961 -1406787 29868 1324572 2424069 3293550
34938 3293550 3912274 4269122 4358861 4181570 3747100 3082192 2234364 1268580 257054
34929 257054 -734557 -1659787 -2497014 -3244347 -3906883 -4485642 -4975219 -5368377 -5660402 -5849595
34919 -5849595 -5936271 -5922971 -5813937 -5610393 -5303187 -4870293 -4285162 -3532737 -2621836 -1584146
34909 -1584146 -460559 714807 1922260 3153146 4400963 5654613 6897467 8110298
34901 8110298 9273124 10362979 11349384 12192663 12848873 13280437 13467736 13416564 13158831
34892 13158831 12747114 12245555 11719354 11223842 10794547 10441865 10154622 9912575 9701349
34883 9701349 9521054 9384217 9305931 9293109 9338870 9424174 9524887 9620404 9700093 9765549 9828420
34872 9828420 9904721 10007263 10138288 10284679 10418118 10501412 10499326 10388855 10163508 9830204
34862 9830204 9402161 8892569 8311784 7668754 6976380 6259004 5558006 4930910 4441570
34853 4441570 4142457 4054300 4151924 4365186 4596819 4748688 4743854 4537735 4120566 3516230
34843 3516230 2778983 1986026 1224643 576096 101472 -164790 -211002 -37030 356620 972435
34833 972435 1810549 2858497 4082702 5426935 6818991 8182077 9445300 10549446
34825 10549446 11448086 12106419 12500144 12615817 12453502 12031315 11389221 10588176 9702419
34816 9702419 8806983 7966262 7228855 6628952 6189069 5918801 5809979 5834552 5951002 6117930
34806 6117930 6306127 6500360 6690002 6856834 6970690 6996242 6904536 6679866 6318382 5822408
34796 5822408 5196821 4450807 3604136 2693959 1776779 921265 192157 -368981 -757063
34787 -757063 -1003124 -1159017 -1274790 -1382341 -1494725 -1617537 -1758577 -1925310 -2112831 -2294597
34777 -2294597 -2425502 -2456585 -2352697 -2103593 -1723765 -1242426 -688781 -78671 591506 1338821
34767 1338821 2176149 3092283 4043974 4966664 5796242 6487066 7017877 7387800 7608363
34758 7608363 7694839 7658541 7502755 7224760 6822874 6303765 5684891 4990166 4242310 3458508
34748 3458508 2653204 1844306 1054670 304951 -397520 -1065467 -1729211 -2425768 -3183295
34739 -3183295 -4006481 -4869912 -5724317 -6513674 -7194099 -7744974 -8169114 -8485699 -8721586
34730 -8721586 -8904004 -9055154 -9189186 -9312445 -9425868 -9525836 -9601042 -9628389 -9574567 -9406517
34720 -9406517 -9106413 -8682954 -8173848 -7639393 -7149501 -6766866 -6530535 -6446081 -6487336 -6609204
34710 -6609204 -6765276 -6922511 -7068613 -7212369 -7379300 -7603807 -7917926 -8338444 -8857395
34701 -8857395 -9441188 -10038878 -10593926 -11052727 -11368109 -11501256 -11425007 -11126469 -10604698 -9863484
34691 -9863484 -8905804 -7736977 -6376500 -4870228 -3292530 -1734081 -280396 1007594
34683 1007594 2101199 2998448 3712418 4262152 4669574 4959850 5161427 5304438 5417958
34674 5417958 5526963 5649825 5796840 5968778 6153728 6323549 6435704 6445359 6324555 6077181
34664 6077181 5739626 5366960 5014324 4724435 4525543 4436410 4471679 4643273 4958159 5416173
34654 5416173 6010825 6731687 7563412 8478338 9426666 10333138 11106064 11655819 11914006
34645 11914006 11845885 11453501 10770256 9849437 8751687 7537614 6268167 5008915 3831222
34636 3831222 2806310 1993283 1424755 1094489 952367 911949 871690 743218 474391 56255
34626 56255 -488454 -1127414 -1838294 -2615268 -3460559 -4368171 -5311279 -6241908 -7103215 -7846607
34616 -7846607 -8443952 -8890288 -9199391 -9397179 -9515900 -9589546 -9650428 -9726765 -9840362 -10003616
34606 -10003616 -10216829 -10467896 -10734953 -10990347 -11203628 -11342356 -11371076 -11250670 -10942182
34597 -10942182 -10418050 -9677926 -8760132 -7739957 -6713947 -5777946 -5008506 -4452135 -4121100
34588 -4121100 -3993262 -4015852 -4114468 -4206736 -4217057 -4087965 -3785618 -3299737 -2640619 -1836545
34578 -1836545 -933241 6679 908668 1697486 2311191 2711812 2889497 2860746 2662065 2339811
34568 2339811 1938424 1491176 1016580 520517 2799 -532661 -1066553 -1557874 -1949304
34559 -1949304 -2184859 -2232186 -2098337 -1831371 -1507570 -1210572 -1010864 -951346 -1040235 -1250548
34549 -1250548 -1526251 -1795301 -1987230 -2050305 -1963601 -1741777 -1431671 -1100445 -816878 -631018
34539 -631018 -559368 -581098 -646075 -690629 -654473 -492947 -182632 277798 868337 1548605
34529 1548605 2260325 2933477 3497157 3893900 4093937 4104147 3966253 3741587 3486256 3227519
34519 3227519 2953893 2624822 2194967 1641118 980155 271459 -396806 -932282 -1264247
34510 -1264247 -1361460 -1238060 -949001 -577906 -219462 39779 136124 34716 -271667 -766230
34500 -766230 -1411877 -2156560 -2941438 -3709611 -4411606 -5006176 -5459124 -5744704 -5852035 -5794019
34490 -5794019 -5612434 -5374096 -5158138 -5039337 -5073608 -5289897 -5689589 -6250968 -6933952 -7682174
34480 -7682174 -8424738 -9082871 -9583298 -9873692 -9933053 -9772896 -9429386 -8949556 -8376756 -7741664
34470 -7741664 -7062708 -6353765 -5632267 -4921770 -4248030 -3631856 -3083117 -2599361 -2170133
34461 -2170133 -1784667 -1437938 -1131163 -867481 -647279 -467073 -322039 -209539 -131081 -92015
34451 -92015 -99899 -163228 -291799 -498013 -796631 -1201476 -1720954 -2355837 -3099853 -3940239
34441 -3940239 -4856818 -5822562 -6808691 -7791105 -8750373 -9662518 -10487937 -11169648 -11644700
34432 -11644700 -11861698 -11793528 -11439737 -10821142 -9973074 -8941371 -7780313 -6549066 -5304871
34423 -5304871 -4095051 -2952010 -1893694 -928168 -58513 714815 1393577 1980653 2477659
34414 2477659 2884189 3201340 3437130 3607400 3729015 3809655 3842075 3806876 3681411 3449608
34404 3449608 3108575 2669948 2156254 1595104 1015277 446952 -75644 -513543 -828117
34395 -828117 -992028 -1001400 -881807 -683076 -464790 -280025 -164223 -130905 -172382 -264036
34385 -264036 -372018 -462889 -511835 -507078 -451096 -360587 -265311 -204131 -217292 -336668 -577658
34374 -577658 -935898 -1389676 -1905858 -2445636 -2967891 -3432070 -3804744 -4070743 -4243352 -4364964
34364 -4364964 -4494477 -4686148 -4970206 -5344589 -5781374 -6243979 -6704928 -7153623 -7590557
34355 -7590557 -8014573 -8413935 -8766856 -9048392 -9236864 -9316299 -9276730 -9115800 -8842044 -8476349
34345 -8476349 -8048409 -7589528 -7127049 -6683837 -6280718 -5937177 -5668758 -5483739 -5381462
34336 -5381462 -5351777 -5374196 -5417354 -5440687 -5399173 -5250167 -4961050 -4516404 -3922575 -3206548
34326 -3206548 -2407343 -1562671 -698410 171816 1037295 1880238 2674805 3395032 4022127
34317 4022127 4542617 4938914 5181534 5231035 5050589 4623419 3966472 3133871 2209867 1296462
34307 1296462 500606 -78750 -365291 -319718 51572 697428 1531879 2449622 3343073 4116815
34297 4116815 4696478 5032552 5102248 4911128 4493042 3906870 3230713 2554191 1967256 1544706
34287 1544706 1330485 1329317 1510080 1818967 2196591 2593598 2981182 3354370 3727596 4124396
34277 4124396 4565546 5061179 5610791 6210059 6857838 7556715 8307038 9100809 9921117
34268 9921117 10746168 11552832 12317126 13013650 13617135 14106826 14472163 14716902 14857998
34259 14857998 14916768 14904889 14813664 14615314 14278105 13788183 13166877 12474329 11796681 11221931
34249 11221931 10815994 10610881 10609221 10798827 11165709 11697457 12376600 13169657 14019689 14848618
34239 14848618 15570491 16109843 16415549 16463870 16252520 15793125 15108021 14231649 13212476
34230 13212476 12110797 10990515 9907174 8898265 7981763 7163904 6450839 5857088 5407422
34221 5407422 5132779 5061582 5207767 5559588 6076052 6694938 7348439 7977329 8537169 8996695
34211 8996695 9332812 9526512 9561867 9427733 9119721 8640523 7999876 7217154 6326441 5378972
34201 5378972 4437644 3563898 2802515 2170477 1653272 1209049 778773 299411 -281856
34192 -281856 -992847 -1823345 -2720875 -3602842 -4384303 -5009171 -5469125 -5802191 -6074348 -6354101
34182 -6354101 -6690196 -7099726 -7569877 -8071433 -8576814 -9073181 -9564069 -10059978 -10564659
34173 -10564659 -11065575 -11533579 -11931215 -12224938 -12395444 -12442265 -12382116 -12243469 -12060649 -11869397
34163 -11869397 -11703939 -11594585 -11564989 -11628941 -11787557 -12027712 -12321368 -12624460 -12875851 -13000491
34153 -13000491 -12921104 -12576946 -11941064 -11026716 -9880971 -8571726 -7176102 -5772804 -4435436
34144 -4435436 -3223741 -2174585 -1297987 -581017 3412 488477 908574 1295935 1677008
34135 1677008 2070132 2487280 2939453 3440972 4007372 4645477 5339863 6043461 6679480
34126 6679480 7157175 7397194 7356672 7043091 6511036 5844955 5138003 4476297 3930769 3552778
34116 3552778 3369745 3381498 3560200 3855456 4203990 4542163 4818796 5004692 5095723 5108727
34106 5108727 5072154 5015001 4958056 4910378 4871093 4833676 4789783 4732037 4656206 4561657 4448673
34095 4448673 4314807 4155762 3973591 3787261 3636274 3572067 3640778 3866119 4239523 4719653
34085 4719653 5240077 5722977 6095722 6304985 6322791 6142796 5771247 5219463 4501517 3635738
34075 3635738 2647197 1570697 454958 -634241 -1617897 -2418733 -2983170 -3298812 -3397597
34066 -3397597 -3344601 -3220821 -3107658 -3074993 -3172119 -3423011 -3828090 -4370967 -5025968 -5765006
34056 -5765006 -6565599 -7419066 -8331627 -9312422 -10353547 -11416880 -12438464 -13347027 -14083433
34047 -14083433 -14611192 -14917915 -15012057 -14916237 -14656127 -14247802 -13691862 -12980569 -12114204 -11114425
34037 -11114425 -10024637 -8898598 -7787736 -6737028 -5790583 -5000210 -4428906 -4144979 -4206665
34028 -4206665 -4640284 -5418568 -6449484 -7585303 -8654061 -9503824 -10042014 -10253475 -10191246
34019 -10191246 -9947158 -9617221 -9275878 -8965976 -8703929 -8494905 -8350072 -8296582 -8373885 -8618010
34009 -8618010 -9043106 -9630481 -10330212 -11074507 -11798423 -12460442 -13053774 -13602750 -14147235
34000 -14147235 -14724325 -15355181 -16039086 -16753335 -17457756 -18103035 -18640851 -19032644 -19254221
33991 -19254221 -19294791 -19151518 -18823328 -18308283 -17605890 -16722165 -15674519 -14495432 -13234118
33982 -13234118 -11953994 -10723782 -9603453 -8630211 -7811246 -7127635 -6548410 -6047049 -5609967
33973 -5609967 -5232112 -4905661 -4613342 -4332316 -4044092 -3741732 -3430245 -3122185 -2831620
33964 -2831620 -2567570 -2327667 -2094494 -1837448 -1519827 -1107239 -572882 101638 927810
33955 927810 1911040 3049306 4330033 5726428 7194970 8675745 10096272 11377527
$$ [...]
##END NTUPLES=NMR SPECTRUM
##END=
