##TITLE=31Pdec_DE-54_1
 D2O, 64 sc
 1.7.2024
##JCAMPDX= 6.0         $$ Bruker NMR JCAMP-DX V2.0
##DATA TYPE= NMR SPECTRUM
##DATA CLASS= NTUPLES
##ORIGIN= UXNMR, Bruker Analytische Messtechnik GmbH
##OWNER= root
$$ XWIN-NMR		Version 3.5
$$ Mon Jul  1 13:55:26 2024 Russian Standard Time (UT+4h)  she@DPX200
##.OBSERVE FREQUENCY= 81.013821
##.OBSERVE NUCLEUS= ^31P
##.ACQUISITION MODE= SIMULTANEOUS
##.ACQUISITION SCHEME= undefined
##.AVERAGES= 64
##.DIGITISER RES= 17
##SPECTROMETER/DATA SYSTEM= spect
##.PULSE SEQUENCE= zgpg30
##.SOLVENT NAME= DMSO
##.SHIFT REFERENCE= (INTERNAL, DMSO, 0, 198.062)
##AUDIT TRAIL= $$ (NUMBER, WHEN, WHO, WHERE, WHAT)
$$ ##TITLE= Audit trail, XWIN-NMR		Version 3.5
$$ ##JCAMPDX= 5.01
$$ ##ORIGIN= Bruker BioSpin GmbH
$$ ##OWNER= she
$$ F:/spectra/data/she/nmr/P31/2/pdata/1/auditp.txt
$$ ##AUDIT TRAIL=  $$ (NUMBER, WHEN, WHO, WHERE, WHAT)
(   1,<2024-07-01 13:54:20.39 +0400>,<she>,<DPX200>,
      <continue with go, POWCHK disabled, PULCHK disabled
       configuration hash MD5:
       00 E9 B6 7A A2 85 ED C7 34 08 36 98 17 FE 4E 26
       data hash MD5: 32K
       17 8C DE 9A F8 8E 97 A2 38 C9 B4 E8 C0 7D 5E 21>)
(   2,<2024-07-01 13:54:22.23 +0400>,<she>,<DPX200>,
      <Start of raw data processing
       efp BC_mod = 2 LB = 1.5 FT_mod = 6 PKNL = 1 PHC0 = 2643.763 PHC1 = 447.6863 SI = 64K 
       data hash MD5: 64K
       C7 E4 BC 3C 61 01 E6 4C D4 F1 59 FD 9A B0 7E 6B>)
(   3,<2024-07-01 13:54:50.60 +0400>,<she>,<DPX200>,
      <pk PHC0 = 187.6428 PHC1 = -467.8 
       data hash MD5: 64K
       EE AC F1 18 8C 15 DF 42 A7 61 FE 60 42 34 A6 A3>)
(   4,<2024-07-01 13:54:56.10 +0400>,<she>,<DPX200>,
      <abs ABSG = 5 
       data hash MD5: 64K
       7B 69 3B 12 03 D5 C8 6B A3 85 44 82 40 53 03 6D>)
$$ ##END=
$$ 
$$ hash MD5
$$ 20 6B A7 66 EC 2D 83 EE D8 47 FD B1 3A 79 F8 6D
##$RELAX= 
##$RELAX= 
##$RELAX= 
##$RELAX= 
##$RELAX= 
##$RELAX= 
##$RELAX= 
##$RELAX= 
$$ Bruker specific parameters
$$ --------------------------
##$DU= <F:/spectra>
##$EXPNO= 2
##$NAME= <P31>
##$PROCNO= 1
##$TYPE= <nmr>
##$USER= <she>
##$AMP= (0..31)
100 100 100 100 100 100 100 100 100 100 100 100 100 100 100 100 100 100 
100 100 100 100 100 100 100 100 100 100 100 100 100 100 
##$AQSEQ= 0
##$AQ_mod= 1
##$AUNM= <au_zg>
##$AUTOPOS= <>
##$BF1= 81.014009
##$BF2= 200.13
##$BF3= 200.13
##$BF4= 200.13
##$BF5= 200.13
##$BF6= 200.13
##$BF7= 200.13
##$BF8= 200.13
##$BYTORDA= 1
##$CFDGTYP= 0
##$CFRGTYP= 5
##$CHEMSTR= <none>
##$CNST= (0..31)
1 1 145 1 1 1 1 1 1 1 1 1 1 1 1 1 1 1 1 1 1 1 1 1 1 1 1 1 1 1 1 1 
##$CPDPRG= <waltz16>
##$CPDPRG1= <>
##$CPDPRG2= <waltz16>
##$CPDPRG3= <>
##$CPDPRG4= <mlev>
##$CPDPRG5= <mlev>
##$CPDPRG6= <mlev>
##$CPDPRG7= <mlev>
##$CPDPRG8= <mlev>
##$CPDPRGB= <>
##$CPDPRGT= <>
##$D= (0..31)
0 1 0 0 0 0 0 0 0 0.06 0 0.03 2e-05 3e-06 0 0 0.0002 0 0 0 0 0 0 0 0 0 
0 0 0 0 0 0 
##$DATE= 1719827563
##$DBL= (0..7)
120 120 120 11 120 120 24 19 
##$DBP= (0..7)
150 150 150 150 150 150 150 150 
##$DBP07= 0
##$DBPNAM0= <>
##$DBPNAM1= <>
$$ [...]
##$SUBNAM3= <"">
##$SUBNAM4= <"">
##$SUBNAM5= <"">
##$SUBNAM6= <"">
##$SUBNAM7= <"">
##$SUBNAM8= <"">
##$SUBNAM9= <"">
##$SW= 400.765351723535
##$SWIBOX= (0..15)
0 1 3 0 0 0 0 0 0 0 0 0 0 0 0 0 
##$SW_h= 32467.5324675325
##$TD= 32768
##$TD0= 1
##$TE= 0
##$TE2= 300
##$TE3= 300
##$TEG= 300
##$TL= (0..7)
0 120 53 12 22 120 120 120 
##$TP= (0..7)
150 150 150 150 150 150 150 150 
##$TP07= 0
##$TPNAME0= <>
##$TPNAME1= <>
##$TPNAME2= <>
##$TPNAME3= <>
##$TPNAME4= <>
##$TPNAME5= <>
##$TPNAME6= <>
##$TPNAME7= <>
##$TPOAL= (0..7)
0.5 0.5 0.5 0.5 0.5 0.5 0.5 0.5 
##$TPOFFS= (0..7)
0 0 0 0 0 0 0 0 
##$TUNHIN= 0
##$TUNHOUT= 0
##$TUNXOUT= 0
##$USERA1= <user>
##$USERA2= <user>
##$USERA3= <user>
##$USERA4= <user>
##$USERA5= <user>
##$V9= 5
##$VALIST= <valist>
##$VCLIST= <CCCCCCCCCCCCCCC>
##$VD= 0
##$VDLIST= <DDDDDDDDDDDDDDD>
##$VPLIST= <PPPPPPPPPPPPPPP>
##$VTLIST= <TTTTTTTTTTTTTTT>
##$WBST= 1024
##$WBSW= 4
##$XGAIN= (0..3)
0 0 0 0 
##$XL= 0
##$YL= 0
##$YMAX_a= 17077
##$YMIN_a= -15320
##$ZGOPTNS= <>
##$ZL1= 120
##$ZL2= 120
##$ZL3= 120
##$ZL4= 120
##$ABSF1= 198.0616
##$ABSF2= -202.7028
##$ABSG= 5
##$ABSL= 3
##$ALPHA= 0
##$AQORDER= 0
##$ASSFAC= 0
##$ASSFACI= 0
##$ASSFACX= 0
##$ASSWID= 0
##$AUNMP= <proc_1d>
##$AZFE= 0.1
##$AZFW= 0.5
##$BCFW= 0
##$BC_mod= 2
##$BYTORDP= 0
##$COROFFS= 0
##$CY= -3
##$DATMOD= 1
##$DC= 0
##$DFILT= <>
##$DTYPP= 0
##$F1P= 0
##$F2P= 0
##$FCOR= 1
##$FTSIZE= 65536
##$FT_mod= 6
##$GAMMA= 0
##$GB= 0
##$INTBC= 1
##$INTSCL= 9.790993e-09
##$ISEN= 30
##$LB= 1.5
##$LEV0= 0
##$LPBIN= 0
##$MAXI= 10000
##$MC2= 0
##$MEAN= 0
##$ME_mod= 0
##$MI= 50
##$NCOEF= 0
##$NC_proc= -6
##$NLEV= 6
##$NOISF1= 182.463
##$NOISF2= 159.3651
##$NSP= 0
##$NTH_PI= 0
##$NZP= 0
##$OFFSET= 198.0616
##$PC= 4
##$PHC0= 2831.406
##$PHC1= -20.11368
##$PH_mod= 1
##$PKNL= yes
##$PPARMOD= 0
##$PSCAL= 0
##$PSIGN= 0
##$REVERSE= no
##$SF= 81.0140089999434
##$SI= 65536
##$SIGF1= 159.3651
##$SIGF2= -187.1042
##$SINO= 113.3802
##$SIOLD= 16384
##$SREGLST= <1H.CDCl3>
##$SSB= 0
##$STSI= 65536
##$STSR= 0
##$SW_p= 32467.5324675325
##$SYMM= 0
##$S_DEV= 0
##$TDeff= 32768
##$TDoff= 0
##$TI= <>
##$TILT= no
##$TM1= 0
##$TM2= 0
##$TOPLEV= 0
##$USERP1= <user>
##$USERP2= <user>
##$USERP3= <user>
##$USERP4= <user>
##$USERP5= <user>
##$WDW= 1
##$XDIM= 65536
##$YMAX_p= 418112269
##$YMIN_p= -39005287
$$ End of Bruker specific parameters
$$ ---------------------------------
##NTUPLES= NMR SPECTRUM
##VAR_NAME=  FREQUENCY,     SPECTRUM/REAL,   SPECTRUM/IMAG
##SYMBOL=    X,             R,               I
##VAR_TYPE=  INDEPENDENT,   DEPENDENT,       DEPENDENT
##VAR_FORM=  AFFN,          ASDF,            ASDF
##VAR_DIM=   65536,         65536,           65536
##UNITS=     HZ,            ARBITRARY UNITS, ARBITRARY UNITS
##FACTOR=    0.49542278885378, 1,            1
##FIRST=     16045.7642231865, 0,            0
##LAST=      -16421.768244346, 0,            0
##MIN=       -16421.768244346, -39005287,    0
##MAX=       16045.7642231865, 418112269,    0
$$ Real data points
##PAGE= N=1
##DATA TABLE= (X++(R..R)), XYDATA
$$ [...]
42329e27461j244666o67023Q67501J598052P26872m66869n79048K3614K11783
$$ -527461 -1772127 -2439150 -1571649 26403 753275 286406 -292642 -269028 -57245
42320e7245o67J77750O67513O19539l0073l84539o5067K31859p2823o15136q32301
$$ -57245 -57912 119838 787351 1406890 1376817 992278 927211 1159070 1086247 471111 -361190
42309c61190p65910o77818m81212l5291M46699P15124Q46456R34649P98624L73806
$$ -361190 -1127100 -1804918 -2286130 -2321421 -1874722 -1159598 -313142 621507 1420131 1793937
42299A793937L7501J20092L73213L36149r665l45928n32112n88681l94483J05327
$$ 1793937 1831438 1951530 2324743 2660892 2651227 2305299 1773187 1184506 790023 895350
42289H95350N30842M12870j44785o03812p42877p95730q67265p62198m92995m08457
$$ 895350 1426192 1839062 1694277 1090465 347588 -448142 -1315407 -2077605 -2570600 -2979057
42279b979057n76955n12222J42408R97251J359044J077212O02831L45232L05919
$$ -2979057 -3556012 -4068234 -3925826 -2928575 -1569531 -492319 110512 455744 761663
42270G61663K97025K14988M7833j81758l95212m83217m08628k32691j7763K37475
$$ 761663 1058688 1273676 1321509 1139751 744539 261322 -147306 -379997 -397760 -160285
42260a60285N09298O24726L56539k49620p47432p16694k94502J3064O8754K23650
$$ -160285 349013 973739 1330278 1080658 333226 -383468 -677970 -664906 -596152 -372502
42250c72502N44262M89719j83058p06198k30127Q15481J132155K71462q74041
$$ -372502 171760 661479 478421 -227777 -457904 357577 1489732 1761194 887153
42241H87153j358297j126724n08407L38526J083289J136821M65742j33670j01700
$$ 887153 -471144 -1597868 -2106275 -1767749 -684460 452361 918103 784433 682733
42232F82733J33673r326l25866l59233k56699l18735k31484L65059R58901P78844
$$ 682733 816406 807080 481214 121981 -134718 -453453 -684937 -319878 639023 1417867
42222A417867O1369k67103k6329P8848k73590n87056m87833k14998k1K22931L10400
$$ 1417867 1479236 1212133 1185804 1264652 991062 404006 -83827 -298825 -298846 -75915 234485
42211B34485n6347n93870n08414K91548Q49025M43289m58357r56187p96208k79702
$$ 234485 178138 -415732 -924146 -632598 216427 659716 201359 -754828 -1551036 -1830738
42201a830738K73315N18508J60567m70060m92376L55868J187831J137539M58388
$$ -1830738 -1557423 -1038915 -878348 -1348408 -1840784 -1484916 -297085 840454 1298842
42192A298842j53004o68600j339607j750510j282476k39571M80173O97523R59418
$$ 1298842 1145838 477238 -862369 -2612879 -3895355 -4134926 -3654753 -2957230 -1997812
42183a997812J290423J018091P0064n67777j92236N86130P52589K64294j34454
$$ -1997812 -707389 310702 380766 -187011 -379247 206883 959472 1223766 1089312
42174A089312r6605K5662o0847j66912o9570P9056M6540l5634J56998N62738O25506
$$ 1089312 992707 1018369 957522 790610 721040 800096 846636 811002 968000 1530738 2156244
42163B156244l8869r99038j319617n83620O09968J283414J038178K69618l56500
$$ 2156244 2117375 1118337 -201280 -784900 -174932 1108482 2146660 2416278 2059778
42154B059778m64861k00295j01974n90688j407585j760991j214018j77236O83386
$$ 2059778 1594917 1394622 1292648 701960 -705625 -2466616 -3680634 -3857870 -3174484
42145c174484J170012J355979J094152L00946n42923q40051o84825n64075l97032
$$ -3174484 -2004472 -648493 445659 746605 203682 -636369 -1321194 -1885269 -2282301
42136b282301K88841J213914J369966N21970k41247m1761N01082L11502m41423
$$ -2282301 -1993460 -779546 590420 1112390 871143 829382 1330464 1641966 1200543
42127A200543o87189j83127J86035j04801m25083p1835N75333N69769k81092j149140
$$ 1200543 513354 330227 516262 411461 -13622 -85457 489876 1059645 778553 -370587
42117c70587j179063m06195L74387N04146J34431m5918K76343O52923N92894L47440
$$ -370587 -1549650 -1955845 -1581458 -1077312 -942881 -988799 -712456 -59533 533361 880801
42107H80801M82995Q45638O71785j44356o68016k54944M00862K59216m92399p61005
$$ 880801 1363796 2209434 2881219 2736863 2068847 1813903 2214765 2473981 1981582 1220577
42097A220577k51395J66978o7448l79064j76157Q3060k61785p90649n85283J94917
$$ 1220577 969182 1136160 1068712 689648 513491 596551 334766 -455883 -1041166 -846249
42087h46249M26667k14388o77719j36756P63951R46883M72633J80766K21421O385
$$ -846249 -419582 -633970 -1311689 -1448445 -684494 262389 735022 915788 1137209 1143594
42077A143594m92381n10360J72287O51130K37068l91590j70770P13702J086736
$$ 1143594 651213 140853 313140 964270 1201338 809748 638978 1352680 2439416
42068B439416M81252l42609o27115m94224l23454n7841L56854M78039N031m86787
$$ 2439416 2920668 2578059 1950944 1456720 1133266 1075425 1432279 1910318 1915349 1428562
42058A428562k10782O08304R37887L80734l16021m00981j09923j12087m47323
$$ 1428562 1217780 1826084 2763971 3144705 2828684 2427703 2317780 2205693 1758370
42049A758370n57701j83072K58428K16491l28004q11819o45105J26640P42750
$$ 1758370 1200669 1017597 1276025 1492516 1164512 352693 -292412 -165772 576978
42040E76978N20046k75767o88646k91631K81186K74473j39580j86805L94953J029062
$$ 576978 1097024 821257 132611 -159020 122166 396639 257059 70254 465207 1494269
42030A494269R91766J13891j081018j704596j220772j09065N24808L15997J17099
$$ 1494269 2486035 2599926 1518908 -185688 -1406460 -1515525 -990717 -674720 -557621
42021e57621O05140J059531M58782o84358q67930J00799P42780J65919o50956
$$ -557621 47519 1107050 1565832 881474 13544 114343 857123 1023042 372086
42012C72086n17788J82262L45803p7051k86578p3161O2465n0485j01458m8552
$$ 372086 -145702 36560 382363 305312 18734 -54427 8038 -42447 -143905 -192457
42002a92457j20433j68958J08467L72435j125p18019o93731L53041J324458J200115
$$ -192457 -312890 -481848 -373381 -946 -2071 -720090 -1413821 -1060780 263678 1463793
41992A463793L36547k24747j62301M0193L2062m2244n766N3958J0301r1775j31106
$$ 1463793 1800340 1575593 1413292 1453485 1485547 1443303 1437537 1491495 1501796 1410021 1278915
41981A278915p0186Q939k5700k20202m57765n80627n58045m41709k42265k069
$$ 1278915 1208729 1217668 1191968 971766 514001 -66626 -624671 -1066380 -1308645 -1310714
41971a310714J28165J06014J65920M91531Q40015Q28488M86020J41756j10298
$$ -1310714 -1182549 -1076535 -910615 -419084 420931 1249419 1735439 1877195 1766897
41962A766897l62041m28312o2995L55478Q4574q27006j349485q11376J81631O21888
$$ 1766897 1404856 976544 913549 1269027 1353601 526595 -822890 -1634266 -1452635 -830747
41952h30747L57338l9013j71601n031M41203R20635Q11605j26334j055266q94998
$$ -830747 -473409 -512422 -684023 -689054 -247851 672784 1484389 1358055 302789 -592209
41942e92209K00465R59696O43312j62121n67699m71959k89065k04862j62902j53265
$$ -592209 -391744 567952 1211264 1049143 481444 9485 -279580 -484442 -647344 -800609
41932h00609p2306L39868R79291J146833L79978p15906j059135m32845L21906
$$ -800609 -872915 -533047 446244 1593077 1973055 1257149 198014 -234831 87075
41923H7075M48435M2209m17583p07338p52354m07367K08156N15754J34381m70495
$$ 87075 535510 577719 160136 -547202 -1299556 -1706923 -1498767 -983013 -848632 -1319127
41913a319127n05833Q5252O01245O05476M06326L84680M01475J96139o1496n2235
$$ -1319127 -1824960 -1739708 -1138463 -532987 -126661 258019 659494 855633 794137 741902
41903G41902J24395J04819j47916l15512k52498j85667l26114n39909n22111j94905
$$ 741902 866297 971116 823200 507688 255190 69523 -256591 -796500 -1318611 -1513516
41893a513516J47090J33191j90344l08569N9192L70639o6115q36190o68655O88575
$$ -1513516 -1366426 -1233235 -1423579 -1732148 -1672956 -1302317 -1368432 -2204622 -2873277 -2184702
41883b184702J748585J231758l6459l20561M46859P28864p9078p69000l81691
$$ -2184702 -436117 795641 759182 438621 885480 1614344 1535266 766266 384575
41874C84575L32504L31072o4422j1610K80200O9597m28821l82774J24617J70333
$$ 384575 717079 1048151 983729 972119 1252319 1321916 893095 510321 634938 805271
41864H05271m29049p84880l67043K58810M47240L45863L32943L21195J18115q6251
$$ 805271 376222 -408658 -775701 -516891 -69651 276212 609155 930350 1048465 962214
41854I62214q0538l7939j20778q6920K47716N06086K22381m08452p38921m90925
$$ 962214 881676 843737 722959 636039 883755 1389841 1612222 1203770 464849 -26076
41844b6076N7223N80376R42835R74001N07307k25078o23103l67435J87697M40146
$$ -26076 31147 611523 1554358 2528359 3035666 2810588 2187485 1820050 2007747 2447893
41834B447893J68240m07667r56779j200261r52998l47238R3515M763k21227J18838
$$ 2447893 2616133 2208466 1251687 51426 -901572 -1248810 -1155295 -1150532 -1371759 -1252921
41824a252921Q91206J046913R8161r24748p44242L08791P00928q7329q64148n98257
$$ -1252921 -361715 685198 783359 -141389 -885631 -576840 124088 36759 -827389 -1425646
41814a425646Q7130O0288n05497n22931K37467Q79399Q03349L89784J19497j10765
$$ -1425646 -1338516 -1278228 -1783725 -2306656 -2069189 -1189790 -386441 3343 122840 12075
41804A2075m82525p56488o53299k37967L52877J074449J594106J292994P6268
$$ 12075 -470450 -1226938 -1880237 -2118204 -1765327 -690878 903228 2196222 2272490
41795B272490j213103j634891j152079m51953n4728J9186n8949j21716R013L66178
$$ 2272490 1059387 -575504 -1727583 -2179536 -2234264 -2215078 -2274027 -2395743 -2386730 -2020552
41785b020552O90229O89982M14820J78001J63966K52411J61928k95056r46989
$$ -2020552 -1330323 -640341 -225521 -47520 116446 368857 530785 235729 -711260
41776g11260j227303o93936L20769R43200Q10634M59915M03020L56445r2676n52150
$$ -711260 -1938563 -2632499 -2311730 -1368530 -557896 -97981 305039 661484 568808 16658
41766A6658l55612K26949K39018m65807r05281m45480K55408L14582p5385j48106
$$ 16658 -338954 -112005 127013 -338794 -1244075 -1689555 -1434147 -1119565 -1194950 -1343056
41756a343056J48384K52410J17441K69519P05438O92911o398n58739k52240M11179
$$ -1343056 -1194672 -942262 -824821 -555302 150136 843047 836649 277910 25670 436849
41746D36849N23435J42269k998J68299P3379l15760l32882R6174J28713n13434
$$ 436849 960284 1102553 1099555 1267854 1341233 1025473 692591 788765 917478 404044
41736D04044p69543J89185J420019J360323N5455r52669p81072o3995L74979N02140
$$ 404044 -365499 -176314 1243705 2604028 2659483 1706814 925742 861747 1236726 1738866
41726A738866M22652j08363r41621j228050n67417K52592L68048M4538J7100K25850
$$ 1738866 2161518 2053155 1111534 -116516 -683933 -431341 -63293 -18755 -1655 224195
41716B24195J08954k77376l89638j85762n1902P6310N47516J028229P49032j58518
$$ 224195 333149 55773 -333865 -519627 -571529 -495219 52297 1080526 1829558 1671040
41706A671040n92234n0330O72681P83696N65821N42775M02657l78426j388941
$$ 1671040 1078806 1028476 1701157 2484853 3050674 3593449 3996106 3617680 2228739
41697B228739j704156j209114o45786m19243j48947M88978J139623J245287P20394
$$ 2228739 524583 -684531 -1330317 -1749560 -1898507 -1409529 -269906 975381 1695775
41688A695775o5367o91688r32211q20210n75514l40300k7513M17253P64864P87955
$$ 1695775 1630408 938720 6509 -813701 -1389215 -1729515 -1757028 -1339775 -574911 213044
41678B13044O31042N41931M00320l4734n40574o49060m02183k77280l32013j18683
$$ 213044 844086 1386017 1786337 1751603 1211029 561969 159786 -117494 -449507 -568190
41668e68190M07322O67398M68317M35523R05462J136950M02933p16117j070470
$$ -568190 -160868 506530 974847 1410370 2315832 3452782 3855715 3139598 2069128
41659B069128o13791l34521o63622r70198p16385j62369L10060P22831J029355
$$ 2069128 1455337 1120816 457194 -513004 -1229389 -1391758 -1081698 -358867 670488
41650F70488Q92535L32877q0696r1614j51384n36609p73733m79146p8548k7226
$$ 670488 1563023 1895900 1815204 1723590 1572206 1035597 261864 -217282 -295830 -323056
41640c23056K1546M56133P23103J31298p70101p84489R1696N94634P5921o51859
$$ -323056 -301510 154623 877726 1009024 238923 -545566 -453870 140764 216685 -435174
41630d35174o79061j98373J69210L75136N96313N62379J5764n67386m88845J16769
$$ -435174 -1114235 -1312608 -1143398 -768262 -171949 390430 406194 -161192 -650037 -533268
41620e33268M02938l7397o73137p62928k03685M62518O65777L39347p6433j35217
$$ -533268 -130330 -167727 -840864 -1603792 -1807477 -1344959 -679182 -339835 -416268 -551485
41610e51485J30416L28820K55583O2862j19398l62100n94759m57615K17582J015792
$$ -551485 -421069 -92249 163334 226196 106798 -255302 -850061 -1307676 -1090094 -74302
41600g4302J303167Q53737k5865p91922r76057n07290R7447J69120k93228n71838
$$ -74302 1228865 2082602 2056737 1264815 288758 -218532 -121085 48035 -245193 -817031
41590h17031k06490L93508O19322M93595L82771K91211L4257j74527K0173M08660
$$ -817031 -1023521 -630013 -10691 482904 865675 1156886 1191143 1016616 1036789 1445449
41580A445449M33020Q8366m3813K50887M57886J42313m10461o68844n68215m15590
$$ 1445449 1878469 1966835 1923022 2173909 2631795 2774108 2363647 1694803 1126588 710998
41570G10998l62659l08711j80249l8174L7311J0248j14331k67975l43457k78147
$$ 710998 348339 39628 -140621 -178795 -141484 -131236 -245567 -513542 -856999 -1135146
41560a135146o6505K64091N82162O33166K75911k85464o65989o63298l32197J70283
$$ -1135146 -1201651 -937560 -355398 277768 553679 268215 -397774 -1061072 -1393269 -1222986
41550a222986N99637O39723K30644k07721k37095k1302o7578l68992l31754K84538
$$ -1222986 -623349 16374 247018 39297 -197798 -219100 -286678 -655670 -987424 -702886
41540g02886Q62605P07804o956m70123k37897L25466N61188K41025k21182k09272
$$ -702886 159719 867523 860567 390444 152547 478013 1039201 1280226 1059044 849772
41530H49772L74503Q66489N70884k67113o42055j24178M75939K15226o10324q75773
$$ 849772 1224275 2090764 2661648 2394535 1752480 1628302 2104241 2319467 1709143 833370
41520H33370k58001L25059Q1259n59675o75611j76324K26117J30668j32146j88655
$$ 833370 575369 900428 981687 422012 -253599 -429923 -203806 -73138 -205284 -393939
41510c93939j07561o239K90017Q30951J154907P59357k14383j113044j450721
$$ -393939 -501500 -507739 -217722 613229 1768136 2527493 2313110 1200066 -250655
41501b50655j180550n08335K01776N34825M49251M10652O80418P59344J57223
$$ -250655 -1431205 -1939540 -1737764 -1202939 -753688 -343036 337382 1096726 1253949
41492A253949n67566m31520L90268O60596m8497o95429m49182P2305J0522k70365
$$ 1253949 686383 254863 645131 1305727 1257230 561801 112619 184924 195446 -74919
41482g4919K7851O16943N84067m7486l76805l3348N05390Q37638Q97084M67422
$$ -74919 -47068 569875 1153942 1106456 729651 696303 1201693 2039331 2936415 3403837
41472C403837n19962j310064j018509K4270O70872O41940O49742Q54837N70263
$$ 3403837 2883875 1573811 555302 579572 1250444 1892384 2542126 3396963 3967226
41463C967226k55012o65074l03852q1218n91738j101948q87740m34492m15307
$$ 3967226 3712214 3047140 2743288 2662070 2070332 968384 80644 -353848 -769155
41454g69155n09288j95366K09450K78309L44627O49428N53550k72165q02106j24324
$$ -769155 -1278443 -1473809 -1264359 -986050 -641423 8005 561555 289390 -512716 -637040
41444f37040Q81850Q35625J21473J75048R77732J113508K00432n71261n08993
$$ -637040 244810 1080435 1201908 1376956 2354688 3468196 3668628 3097367 2588374
41435B588374l07808m80999m91812l3299K29246j22703n08647m77696m52989o76594
$$ 2588374 2280566 1799567 1307755 1274456 1503702 1380999 872352 394656 -58333 -734927
41425g34927n37655K66462R33374P65753K49008O9022l5806n00705q68265n66850
$$ -734927 -1272582 -1006120 -72746 693007 942015 1011037 975231 474526 -393739 -960589
41415i60589o2388j26266n02447m02465J24634M16216M11035N23042O06823K25684
$$ -960589 -1022977 -1149243 -1651690 -2054155 -1929521 -1513305 -1102270 -579228 27595 253279
41405B53279k29128P9242R22843J100883K56540n30544l59926K79492M51949J08402
$$ 253279 24151 103393 1026236 2127119 2383659 1853115 1493189 1772681 2224630 2333032
41395B333032j63639j39631n6224n2265n6715o1963j32029k43171l24584l33296
$$ 2333032 2169393 2029762 1973538 1921273 1864558 1802595 1670566 1427395 1102811 769515
41385G69515k07477N1508K20565N5078l24364n55444n57607n75259o79279o30224
$$ 769515 562038 613546 834111 889189 564825 9381 -548226 -1123485 -1802764 -2432988
41375b432988l03169J35601N18906P57347O60448J81932j82422J21161P59319
$$ -2432988 -2736157 -2600556 -2081650 -1324303 -663855 -481923 -664345 -543184 216135
41366B16135P77543p116o66949n37299j02028j1198m1979K41986N12568K55847
$$ 216135 993678 986562 319613 -217686 -319714 -330912 -372891 -130905 381663 637510
41356F37510k01296k06453O2601l3634l53921k13517K41200R2654p50567j181990
$$ 637510 436214 229761 292362 258728 -95193 -308710 -67510 25144 -725423 -1907413
41346a907413n48713L47386M96624N9075k30772l07281n35050p19006l37148L97970
$$ -1907413 -2456126 -2108740 -1612116 -1553041 -1783813 -2091094 -2626144 -3345150 -3682298 -3284328
41336c284328O16051M5620n05685k02422P39039J339100J015578K03081j88395
$$ -3284328 -2668277 -2622657 -3128342 -3330764 -2591725 -1252625 -237047 -33966 -222361
41327b22361J58728N79756K64644o37986j164909q40949k90316k44343m83007
$$ -222361 -63633 516123 780767 142781 -1022128 -1863077 -2153393 -2397736 -2880743
41318b880743l08581L37254R12109J175569J302284J202264N51051l91869p84895
$$ -2880743 -3189324 -2852070 -1939961 -764392 537892 1740156 2291207 1899338 1114443
41309A114443l45414J48621q5251p69497j016379m88220L40938Q46582P80106
$$ 1114443 769029 917650 832399 62902 -953477 -1441697 -1100759 -254177 525929
41300E25929K98888j94924l59872k88478m07273q16072j004372n19529L45059
$$ 525929 824817 629893 270021 -18457 -425730 -1241802 -2246174 -2765703 -2420644
41291b420644R01409R12473O95631N36366M34180L63339L45535K38475j51694
$$ -2420644 -1519235 -606762 88869 625235 1059415 1422754 1768289 2006764 1855070
41282A855070o71427q88677o72620l81370l24710l53026k11288l7983j52806m30565
$$ 1855070 1183643 294966 -377654 -759024 -1083734 -1436760 -1648048 -1686031 -1838837 -2269402
41272b269402k84047N48329J435731J417071L56053p84223j035248n35721j70246
$$ -2269402 -2553449 -2005120 -569389 847682 1203735 419512 -615736 -1151457 -1321703
41263a321703k59310k02733M49003J190900J256223O72571Q6481j72620k53827
$$ -1321703 -1581013 -1783746 -1334743 -143843 1112380 1784951 1871432 1698812 1444985
41254A444985k00347R7730L59905L0229q48706j469331j277927o55413k15388
$$ 1444985 1244638 1342368 1702273 1732502 883796 -585535 -1863462 -2518875 -2734263
41245b734263Q5775O07090J157468J158125N78391O0486N621R2769o6847k96793
$$ -2734263 -2648488 -2041398 -883930 274195 852586 913072 918693 1011462 944615 647822
41235F47822k62615j38419l43006p75298q68139m28446R3029L06951L40397L20189
$$ 647822 385207 246788 -96218 -871516 -1739655 -2168101 -2075072 -1768121 -1427724 -1107535
41225a107535m4491q38974j334187p47628N49068J353108J169190O53589M15269
$$ -1107535 -1152026 -1991000 -3325187 -4072815 -3523747 -2170639 -1001449 -347860 67409
41216F7409K56888l6060m2747M96958R38770O00122j20859l19207J05237N37515
$$ 67409 324297 288237 245490 742448 1681218 2281340 2160481 1841274 1946511 2484026
41206B484026O83335N99560M6575j059835j757953r51392O81675J116003k25652
$$ 2484026 3167361 3766921 3813496 2753661 995708 44316 725991 1841994 1616342
41197A616342j483170r57373N51288J133071N07087n3268M2534R7834k92882m81691
$$ 1616342 133172 -824201 -272913 860158 1367245 1313977 1356511 1454345 1161463 679772
41187F79772L4620P00688P30518J75340l17373l53539l0441L11320K81491k99741
$$ 679772 714392 1415080 2145598 2320938 2003565 1650026 1619585 1930905 2212396 1912655
41177A912655j090142j438067j081235l75000K67996P93707J195010J207780O74489
$$ 1912655 822513 -615554 -1696789 -2071789 -1803793 -1010086 184924 1392704 2067193
41168B067193m5297m12726l67786l40609o05050q64448o04871J99770Q70151O72782
$$ 2067193 2021896 1609170 1241384 900775 295725 -568723 -1173594 -973824 -103673 569109
41158E69109k65705r24650n09742N58859J135567P42000J1712l02286k21700j64454
$$ 569109 303404 -621246 -1130988 -572129 563438 1305438 1317150 1014864 793164 628710
41148F28710j53048P8296M12761L66267j74694o75226n97989m2555M62880O04075
$$ 628710 475662 553958 966719 1332986 1158292 483066 -114923 -157478 305402 909477
41138I09477M82476L03332J38081n229j14969k42780m28726m81396j08756N27122
$$ 909477 1391953 1695285 1833366 1828137 1713168 1470388 1041662 560266 451510 978632
41128I78632O94455l4575r70696r83355n9700M93126k28013j395537j484270k59267
$$ 978632 1673087 1638512 667816 -315539 -375239 117887 -110126 -1505663 -2989933 -3249200
41118c249200J031385J321970P95609J91353j77895l52342k69261R7198M58142
$$ -3249200 -2217815 -895845 -100236 91117 -86778 -439120 -708381 -611183 -153041
41109a53041N15414L49737J81233j2907k89487m04502j34551K39683K62165K8364
$$ -153041 362373 712110 893343 880436 590949 186447 51896 291579 553744 582108
41099E82108N9866M39064O28213L21418n1142J095K75514K45407r8957k86278
$$ 582108 641974 1081038 1709251 2030669 1979527 1980622 2256136 2501543 2402586 2116308
41089B116308j18055J14771J64259J00387j6727k56939m44749j63828N39815R09145
$$ 2116308 1998253 2113024 2277283 2377670 2360943 2104004 1659255 1495427 2035242 2944387
41079B944387M02959m70003q12392n84542n00010p86801q78833m94085j79798
$$ 2944387 3347346 2877343 2064951 1480409 980399 193598 -685235 -1179320 -1359118
41070a359118l47835m89810j2332O67003O51050p8824o23927m10879K41429Q05803
$$ -1359118 -1706953 -2196763 -2209095 -1542092 -891042 -969866 -1593793 -2004672 -1763243 -957440
41060i57440J090899R82573L46109n13271q69023m42384J70370L06570R3283Q8320
$$ -957440 133459 1116032 1462141 948870 79847 -362537 -192167 114403 207686 296006
41050B96006L83150N46594L15266r6098l59446l98117l53668l58647l54372j19017
$$ 296006 679156 1225750 1541016 1444918 1085472 687355 333687 -24960 -379332 -498349
41040d98349L82019P10063L84171l03492m06021M06677J176539Q18465l83440
$$ -498349 -116330 593733 977904 674412 268391 675068 1851607 2670072 2286632
41031B286632j132393q14390q0135L01044L76730M99409N53288K29269l00791
$$ 2286632 1154239 339849 259714 560758 937488 1436897 1990185 2219454 1918663
41022A918663n18219k37262K24586N03318N68618O62726R29806J018433J97898
$$ 1918663 1400444 1163182 1387768 1891086 2459704 3122430 4052236 5070669 5268567
41013E268567j679032l359970l119778r10739J154865J211945n2089m96247M57841
$$ 5268567 3589535 229565 -2890213 -3800952 -2646087 -1434142 -1486231 -1982478 -1524637
41004a524637J219849N27422q00993j212802m63548N26419J085488J118849N61838
$$ -1524637 -304788 222634 -578359 -1791161 -2254709 -1728290 -642802 476047 1037885
40995A037885m76641j273122j116682l02046K55202K78108K49366M12036N09722
$$ 1037885 561244 -711878 -1828560 -2130606 -1875404 -1597296 -1347930 -935894 -426172
40986d26172M95852O10209O76113K24424n27853p52179l08476j7475k86208m61305
$$ -426172 69680 679889 1356002 1580426 1052573 300394 -8082 -25557 -311765 -773070
40976g73070o3673L37674J91675k9612K37242N38519K35748k53753j71291J80935
$$ -773070 -836743 -499069 -307394 -337006 -99764 438755 674503 420750 249459 430394
40966D30394m0980o91627q75217m78520k00949j68998J75915P71579Q41004L11602
$$ 430394 389414 -302213 -1177430 -1655950 -1856899 -2025897 -1849982 -1078403 -237399 74203
40956G4203L8890K72573J81942n78183j080105o22968J01332K11496L1087K89883
$$ 74203 113093 385666 567608 -10575 -1090680 -1713648 -1612316 -1400820 -1369733 -1079850
40946a079850P44128O91028K67525J18352J68468j68203p72981q85413l71992
$$ -1079850 -335722 355306 622831 741183 909651 741448 -31533 -916946 -1288938
40937a288938P281k53382p30257p35538j17901P35595J276630J126703L99783
$$ -1288938 -1281657 -1535039 -2265296 -3000834 -3118735 -2383140 -1106510 20193 419976
40928D19976l11579n54202m62088l02155N5000O86887J024012M90647m26597o13806
$$ 419976 108397 -445805 -907893 -1210048 -1155048 -468161 555851 1046498 619901 6095
40918F095J19989P61797N74917O4629M2775L77952L07076l30122q04578m76171
$$ 6095 126084 887881 1462798 1527427 1570202 1948154 2255230 1925108 1120530 644359
40908F44359L44410P20611J81878o93988r20550k49285N87603Q24099M88957R0451
$$ 644359 988769 1709380 1891258 1197270 276720 27435 615038 1439137 1928094 2018545
40898B018545j30136k50009k80699j98732j60338k43793j70058K62177O67885
$$ 2018545 1888409 1638400 1357701 1158969 998631 754838 584780 846957 1514842
40889A514842N23969l9907m48748n30327n56680n64746l20165O4238J72420J5727
$$ 1514842 2038811 1998904 1550156 1019829 463149 -101597 -421762 -357524 -185104 -169377
40879a69377N2222L64610M81549J91927r9372n8422J11134J26209K4343j01424
$$ -169377 -117155 247455 729004 920931 821559 763137 874271 1000480 1024823 923399
40869I23399k56482k75327M4254L97414K02805m39798p24420l19253J74322K51348
$$ 923399 666917 391590 435844 833258 1036063 596265 -128155 -447408 -273086 -21738
40859b1738J72084J83334k8623m83753m07031N39040J285018P07864n75813r71478
$$ -21738 150346 333680 305057 -178696 -585727 -46687 1238331 1946195 1370382 398904
40849C98904j97417M23184k185p62473p43095R1111Q77484R39013L03185m53316
$$ 398904 201487 624671 622486 -139987 -883082 -791971 85513 1024526 1327711 874395
40839H74395o30248l6412O59471N97090j70859p12233m77939J0580Q707m07622
$$ 874395 244147 207735 867206 1464296 1293437 581204 103265 113845 122552 -285070
40829b85070n68698j81789L59985N32160K18920k80383n68570m53635n4600L43357
$$ -285070 -853768 -1035557 -675572 -143412 75508 -204875 -773445 -1227080 -1281680 -938323
40819i38323N30930M79226K95107J43190J10200N4224k73093q26391j159467r01837
$$ -938323 -407393 71833 366940 510130 620330 674554 401461 -424930 -1584397 -2486234
40809b486234j89876N43261R92689J006687N12850k27492n82410k27930L38586
$$ -2486234 -2676110 -2132849 -1140160 -133473 379377 151885 -430525 -658455 -319869
40800c19869M25381P4513j56310j06641n1864j775K47037M00474r4556r50733
$$ -319869 105512 180025 23715 -82926 -134790 -136565 110472 510946 416390 -534343
40790e34343j108961k74628M89092K62536m04580l96419L37609Q97486Q08055
$$ -534343 -1643304 -1917932 -1428840 -1166304 -1570884 -1967303 -1629694 -732208 75847
40781G5847M29799J58702p484j15744j20351j44435l41189m66705j08292O04191
$$ 75847 505646 664348 656864 541120 420769 276334 -64855 -531560 -639852 -35661
40771c5661J001705O86380p1330p88449j178999j060010l70422N24796R92400
$$ -35661 966044 1652424 1581094 792645 -386354 -1446364 -1816786 -1291990 -299590
40762b99590Q34892M90038L47042K73630P6407j5084K41035N16809K73581m01170
$$ -299590 535302 1025340 1372382 1646012 1722419 1707335 1948370 2465179 2738760 2337590
40752B337590q04786n17410Q8230L52390O8575m18148o50828m48372J9655M02134
$$ 2337590 1532804 1015394 1103624 1456014 1524589 1106441 455613 7241 26896 429030
40742D29030M55178K44287M0312J524K2843q0487l22195n28905n26256l05857
$$ 429030 884208 1128495 1168807 1170331 1193174 1112687 790492 261587 -264669 -570526
40732e70526l9155P7692M9671J22901M70882Q45007P51637R8795n35302n18526
$$ -570526 -609681 -531989 -482318 -359417 111465 956472 1708109 1806904 1271602 753076
40722G53076O6224N57730N71639L60656K59475J84921n1776k77035k14262k4565
$$ 753076 819300 1377030 1948669 2309325 2568800 2753721 2701945 2424910 2210648 2186083
40712B186083j15124m45769n13001j33184K12311N5135m06310o54351n66846l89504
$$ 2186083 2070959 1625190 1112189 979005 1191316 1246451 840141 185790 -381056 -770560
40702g70560j85410K08611O86624Q02114L78018j29229j40449L20947O53508L91520
$$ -770560 -955970 -747359 -60735 741379 1119397 990168 849719 1170666 1824174 2215694
40692B215694k82040p68803p05082l15524j16575l02650n20410l36509J52239
$$ 2215694 1933654 1164851 459769 144245 27670 -274980 -795390 -1131899 -979660
40683i79660L85200P1921l60070k75603L10135P04084M56971o619L276L95024
$$ -979660 -594460 -522539 -882609 -1158212 -848077 -143993 312978 306359 309635 704659
40673G04659L84255k66968o95378j26169P83956O14893p94085j866668j270771
$$ 704659 1088914 821946 126568 399 784355 1399248 605163 -1261505 -2532276
40664b532276L17765J141081O08306k45852l90098N3441M47576N59327M10124
$$ -2532276 -2214511 -1073430 -465124 -710976 -1101074 -1047633 -600057 -40730 369394
40655C69394r4985p84830r64039k29520P43756R25588K90266k40890j82607o3458
$$ 369394 274409 -510421 -1474460 -1703980 -960224 -34636 255630 14740 -167867 -231325
40645b31325m27830r39186r04121k55467M44661P47361O89959N76734O68481R55929
$$ -231325 -659155 -1598341 -2502462 -2757929 -2313268 -1565907 -875948 -299214 369267 1325196
40635A325196J046002M90423n57728j305657j241044p70072n20223l56927K47600
$$ 1325196 2371198 2861621 2303893 998236 -242808 -1012880 -1533103 -1890030 -1642430
40626a642430J060901J158453K86561o33084p29414k53168O1126J12431K54212
$$ -1642430 -581529 576924 863485 230401 -499013 -752181 -691055 -578624 -324412
40617c24412M31622K83318r5543k64684k49276m68291q06690n82665L09185J004456
$$ -324412 107210 390528 294985 30301 -218975 -687266 -1493956 -2076621 -1767436 -762980
40607g62980Q52491L16916J48175K72718K11230Q9167L33369O59425L69548l79525
$$ -762980 89511 406427 554602 827320 1038550 1127717 1461086 2120511 2490059 2110534
40597B110534o33665j60725J05991m05619r00683m91820L04312L66484k15862
$$ 2110534 1476869 1316144 1422135 1016516 115833 -375987 -71675 294809 78947
40588G8947l14149L52703P18108P0435p95891p76928n1548L34987L4855l21761
$$ 78947 -235202 117501 835609 906044 110153 -666775 -718323 -383336 -348481 -670242
40578f70242k67806r9441j96584m03805m15945l39286m57884o57514m92260J59096
$$ -670242 -938048 -1037489 -1234073 -1637878 -2053823 -2393109 -2850993 -3508507 -4000767 -3841671
40568c841671P84498P50622N5784n83547m79202K86997J025295J269856J144603
$$ -3841671 -3057173 -2306551 -2250767 -2834314 -3313516 -3026519 -2001224 -731368 413235
40559D13235Q60079L09393n01262j027010p73387j09095J79501Q1430L15562R48371
$$ 413235 1273314 1582707 1081445 54435 -718952 -828047 -648546 -567116 -251554 696817
40549F96817R73420j83833j506137j575003m69549M47327M21322J8240o2381R9414
$$ 696817 1670237 1486404 -19733 -1594736 -2064285 -1616958 -1195636 -1177396 -1239777 -1140363
40539a140363K00507L26099N40616N51509K93108K41267N81884O59796k9069q17981
$$ -1140363 -939856 -613757 -73141 478368 771476 1012743 1594627 2254423 2225354 1407373
40529A407373p34498j8538K69173p903Q5771P90161R94570k9137j287848j395150
$$ 1407373 672875 654337 923510 915607 1001378 1791539 2786109 2756972 1469124 73974
40519G3974n10753J15384P9765J16153N68430P88500L48548j57793o4094L60471
$$ 73974 -436779 -321395 -241630 -125477 442953 1231453 1580001 1422208 1358114 1718585
40509A718585M67487K47833J29983J32712q4204m96255o85609n06596k23678M7150
$$ 1718585 2186072 2433905 2563888 2696600 2612396 2116141 1430532 923936 700258 747408
40499G47408M95040J061564J216043N98333l90371r58001p85981l04076j21653
$$ 747408 1242448 2304012 3520055 4118388 3728017 2770016 1984035 1679959 1558306
40490A558306l26331m17738M0773P63685R44905K37521p13592j016466o20686
$$ 1558306 1231975 814237 855010 1618695 2563600 2801121 2087529 1071063 450377
40481D50377k24124j82248j04461L04999O13234L23546k22540k11397M81361J054770
$$ 450377 226253 44005 -60456 244543 857777 1181323 958783 747386 1228747 2283517
40471B283517Q27950J18481j71408L36979J035717R87541l0387j208626j517932
$$ 2283517 3111467 3229948 3058540 3395519 4431236 5418777 5388390 4179764 2661832
40462B661832q25121l807J53066j41881j05323M76275R97049R19671M43367Q3184
$$ 2661832 1836711 1832904 1985970 1844089 1738766 2215041 3212090 4131761 4575128 4658312
40452D658312n0477k13901m75939n94666m45147k49965k48894l25460j53699L11382
$$ 4658312 4607835 4393934 3917995 3323329 2878182 2628217 2379323 2053863 1900164 2211546
40442B211546O40585L33188n84645j455320j592451r83057k65381K9489M4716
$$ 2211546 2852131 3185319 2600674 1145354 -447097 -1430154 -1695535 -1666046 -1621330
40433a621330K64210P70835J134385J040116P00415M74003L47309Q6821k63249
$$ -1621330 -1357120 -586285 548100 1588216 2288631 2762634 3109943 3196764 2933515
40424B933515m12762l20492k63798l34436k59860P2153K81792K7063m09855m88188
$$ 2933515 2520753 2200261 1936463 1602027 1342167 1414320 1696112 1723175 1313320 825132
40414H25132k01798m6632k39739m40148l26315k7222J82384K53386K23663K4767
$$ 825132 623334 576702 336963 -103185 -429500 -456722 -274338 -20952 202711 227478
40404B27478l17361n29528m08757j29277L508l0404j7543J29925K82563L01378
$$ 227478 -89883 -619411 -1028168 -1157445 -1153937 -1184341 -1201884 -1071959 -789396 -488018
40394d88018J73140j5452j29576p4387J00820K65711L78992M41501L12898j36973
$$ -488018 -314878 -330330 -459906 -534293 -433473 -167762 211230 652731 965629 828656
40384H28656o47778o87495j05073O39673J048755J057801P88273K67885l22700
$$ 828656 180878 -506617 -611690 27983 1076738 2134539 2922812 3190697 2867997
40375B867997n63557l48153j46403l00113m47258j48534K98239K94150j08107
$$ 2867997 2304440 1956287 1809884 1509771 1062513 913979 1212218 1506368 1398261
40366A398261l69049l53839l28860k36962K07117P43418P39989K25014q6863L0849
$$ 1398261 1029212 675373 346513 109551 316668 1060086 1800075 2025089 1938226 1969075
40356A969075l4078o07961j080446q30373j06968M89859P69213P07125J31171
$$ 1969075 1934997 1327036 246590 -583783 -690751 -200892 568321 1275446 1406617
40347A406617p22782r69347j81832P20903N50277m95367j129535p68232j09500
$$ 1406617 683835 -285512 -467344 253559 803836 308469 -821066 -1589298 -1698798
40338a698798J03456L193J9743J35066J55870K04726M36706N68941J74859o49283
$$ -1698798 -1595342 -1592149 -1572406 -1437340 -1281470 -1076744 -640038 -71097 103762 -545521
40328e45521j276036j213814n50514K68312Q67519J065623Q00618K01772l09363
$$ -545521 -1821557 -3035371 -3585885 -3317573 -2450054 -1384431 -583813 -382041 -691404
40319f91404l09683R1290K77510p8245n13569m29309K0906K39225K09191M70967
$$ -691404 -1001087 -909797 -632287 -710532 -1224101 -1653410 -1632504 -1393279 -1184088 -713121
40309g13121J019919J067590K57124o19783o69219q9072K95066K30267J02809
$$ -713121 306798 1374388 1631512 1011729 342510 253438 548504 778771 881580
40300H81580J32571J81373J77958J48939k986k36016j40695M40906Q50616L93796
$$ 881580 1014151 1195524 1373482 1522421 1519435 1283419 1142724 1583630 2434246 2828042
40290B828042n00877p12433J965O65191M37115l93633r88564r36836m08896J93673
$$ 2828042 2327165 1614732 1616697 2281888 2719003 2325370 1336806 399970 -8926 184747
40280A84747N09788M66235L52536L98491M19192K63715L14890Q84045J364478
$$ 184747 694535 1160770 1513306 1911797 2330989 2594704 2909594 3793639 5158117
40271E158117Q69938l70854j220368j254280j125335j177475r08528k06454J28956
$$ 5158117 6028055 5657201 4436833 3182553 2057218 879743 -28785 -235239 -106283
40262a06283k22110l52579L30133Q88206L15116o84053p20108J08197N30122K22544
$$ -106283 -328393 -680972 -350839 537367 852483 168430 -551678 -443481 86641 309185
40252C09185Q4460M57640N91575J44070j66133R4158K78542j07022l93696J77646
$$ 309185 393645 851285 1442860 1586930 1420797 1514955 1793497 1686475 1292779 1470425
40242A470425J108827J279158M97974l81591o52151l86166m9265m3628m98248
$$ 1470425 2579252 3858410 4356384 3974793 3322642 2936476 2887211 2843583 2345335
40233B345335j025938q56849K68418J476323J607545O62492j87516j37114L03541
$$ 2345335 1319397 462548 730966 2207289 3814834 4477326 4289810 4152696 4456237
40224D456237K23488l09862l75674M14844J261247J167011K23366n56541n92858
$$ 4456237 4679725 4369863 3994189 4409033 5670280 6837291 7060657 6504116 5911258
40215E911258l89122o18124j064324j022846m89407k16120m98497o29475M3247
$$ 5911258 5522136 4904012 3839688 2816842 2327435 2111315 1612818 983343 1026590
40206A026590J059987J417367Q80542J31887k36826k71421j96876j4353K55127
$$ 1026590 2086577 3503944 4384486 4516373 4279547 4008126 3811250 3796897 4052024
40197D052024L98425L50650L56361N23715N41569J73372k34564j59979L20870
$$ 4052024 4450449 4801099 5157460 5681175 6222744 6396116 6161552 6001573 6322443
40188F322443O21847N07264L96300O26829Q15234L49524o24982j162017o11631
$$ 6322443 6944290 7451554 7847854 8474683 9289917 9639441 9014459 7852442 7240811
40179G240811N19802J112019P52202J38420J5115R9393m30715j518802k028829
$$ 7240811 7760613 8872632 9624834 9763254 9778369 9877762 9447047 7928245 5899416
40170E899416j274988j26620Q1053o17287r25732j84914P69735R40098M83942
$$ 5899416 4624428 4497808 4578861 3961574 3035842 2850928 3620663 4560761 5044703
40161E044703J10739j08487m62606o20640r280R38346R99527j28391j257956j273880
$$ 5044703 5155442 5046955 4584349 3963709 3954429 4892775 5892302 5763911 4505955 3232075
40151C232075m78237J65551M08552N77088N88397N0512q19668j243798r22186
$$ 3232075 2753838 2919389 3327941 3905029 4493426 4543938 3724270 2480472 1558286
40142A558286l51459k086J90667L58947L62977K19805L22742Q21763J193996Q82074
$$ 1558286 1206827 1204741 1395408 1754355 2117332 2337137 2659879 3481642 4675638 5557712
40132E557712Q5171n11840o00746m42721l50227l72401m20889l71487j03990K74707
$$ 5557712 5642883 5131043 4530297 4087576 3737349 3364948 2944059 2572572 2468582 2743289
40122B743289L75620L1757k89942j0956P09006J115311Q20089J30827n43419j001553
$$ 2743289 3118909 3150666 2860724 2849768 3558774 4674085 5494174 5625001 5081582 4080029
40112D080029r34998q6959J000027J199881K64554o73688p03333m63800r47794
$$ 4080029 3145031 3058072 4058099 5257980 5522534 4848846 4145513 3681713 2733919
40103B733919j678077j403747k63444K89552j86102m35444L43389J138755Q18265
$$ 2733919 1055842 -347905 -611349 -321797 -507899 -943343 -599954 538801 1357066
40094A357066m8557k45978J25945Q6746m11153m80393J56203Q63973J206981J222092
$$ 1357066 1308509 1062531 1188476 1275222 864069 383676 539879 1403852 2610833 3832925
40084C832925P37348l46985j162640o47078O15591P75496o07671j705120j018617
$$ 3832925 4570273 4223288 3060648 2413570 3029161 3804657 3196986 1491866 473249
40075D73249M59186P98800j41113q59752n08781K67005N84562L08318k25897o07440
$$ 473249 932435 1731235 1590122 730370 221589 488594 1073156 1381474 1155577 548137
40065E48137m31469L14391R39362P54520N4290k33028J54209N21520K94657k45267
$$ 548137 116668 431059 1370421 2124941 2179231 1946203 2100412 2621932 2916589 2671322
40055B671322m97025l26946q3011j02183l48475m13990N2171P82155J017891M68040
$$ 2671322 2174297 1847351 1764340 1662157 1313682 899692 951863 1734018 2751909 3219949
40045C219949k13591l20237p6547j41277m75343m91039j50183k9218k48131j98083
$$ 3219949 3006358 2686121 2609574 2468297 1992954 1501915 1351732 1322514 1074383 876300
40035H76300M16827J000814Q96915K50332l21257n08363m38532l30772k85170
$$ 876300 1293127 2293941 3190856 3441188 3119931 2611568 2173036 1842264 1557094
40026A557094k37420k7942L23880N16339M08101L40944N84215P33650L01948l30488
$$ 1557094 1319674 1291732 1615612 2131951 2540052 2880996 3465211 4198861 4500809 4170321
40016D170321l84817J4838j4944o05342q16617j26073P50991R60992N45821p3247
$$ 4170321 3785504 3800342 3785398 3180056 2363439 2237366 2988357 3949349 4495170 4421923
40006D421923p38684j151861p62749K42032P06354M9820p52268n85841J94464
$$ 4421923 3683239 2531378 1768629 2010661 2717015 2766835 2014567 1428726 1623190
39997A623190N58845M59702N25511O78389L50960k64253m60355l04630m28608
$$ 1623190 2182035 2641737 3167248 3845637 4196597 3932344 3471989 3167359 2738751
39988B738751o66514k36447O75536Q80617L8085p04601l96181M67067R16986P94168
$$ 2738751 2072237 1835790 2511326 3391943 3430028 2725427 2329246 2796313 3713299 4507467
39978D507467M44291o2913p46449j311674j465996j203800n20213N46196J381333
$$ 4507467 4951758 4888845 4142396 2830722 1364726 160926 -359287 186909 1568242
39969A568242J149678P2868n09832J08721J025055J112440N34220P8148k28142
$$ 1568242 2717920 2790788 2280956 2389677 3414732 4527172 5061392 5139540 4911398
39960D911398q16256j434073j393398p28326j79994j22235k29266r2510M39838
$$ 4911398 4095142 2661069 1267671 539345 359351 237116 7850 -84660 355178
39951C55178J324053K131625K099664J018892k35058p09944n39740l92897k71433
$$ 355178 1679231 3810856 5910520 6929412 6694354 5984410 5444670 5051773 4780340
39942D780340J54901M32047k23899j448964j912238j102111J13788Q49046J082986
$$ 4780340 4935241 5367288 5143389 3694425 1782187 680076 793864 1642910 2725896
39933B725896J003560N36324j28492m75321m69243n67614p08024k90783N42378
$$ 2725896 3729456 4265780 4137288 3661967 3192724 2625110 1917086 1626303 2168681
39924B168681P61478Q8386l42675L33372J381393J632181J106037O11896M78549
$$ 2168681 2930159 3018545 2675870 3009242 4390635 6022816 7128853 7740749 8219298
39915H219298N45685P68121J020846R03267M46788L53079Q77301J295233J185997
$$ 8219298 8764983 9533104 10553950 11457217 11904005 12257084 13134385 14429618 15615615
39906A5615615J255244K022869K811456L113704L767371N506155P719026J0176869
$$ 15615615 16870859 18893728 21705184 24818888 28586259 34092414 41811440 51988309
39898E1988309J4073161J8633434J8401959Q298479q291780k0644553k1721868
$$ 51988309 66061470 84694904 103096863 111395342 103103562 82459009 60737141
39891F0737141j5076922q941358o568500n374119l156340r39148k8049J39035
$$ 60737141 45660219 36718861 30150361 24776242 21619902 20680754 20652705 20791740
39883B0791740L80454M72178L95573R85404K303003K841856J471045q72310k433743
$$ 20791740 21172194 21644372 22039945 23025349 25328352 28170208 29641253 28768943 26335200
39874B6335200k730551k403114j733929n23353R33905J983458K707068L764426
$$ 26335200 23604649 21201535 19467606 18944253 19878158 21861616 24568684 28333110
39866B8333110N040699N819963O844098J0394214J6372144J9392989J3036537
$$ 28333110 33373809 39193772 46037870 56432084 72804228 92197217 105233754
39859A05233754j955045j6299920k1124152j6747390j0417037p012017n427820
$$ 105233754 103278709 86978789 65854637 49107247 38690210 31678193 26250373
39852B6250373l497093k021869k298790l060015k511942j335440j135737j453974
$$ 26250373 22753280 20731411 18432621 15372606 12860664 11525224 10389487 8935513
39844H935513q53042J82915M9660j007229j307690p36333p54481j456988j200035
$$ 8935513 8082471 8265386 8315046 7307817 6000127 5263794 4509313 3052325 1852290
39835A852290L91976J437609O89591n79940o79647J13181M62315Q1200k52988
$$ 1852290 2244266 3681875 4371466 3791526 3111879 3225060 3687375 3768575 3515587
39826C515587n3131M37699P16606M33919k17028l97210M16979J437462J520982
$$ 3515587 3462456 3900155 4616761 5050680 4833652 4436442 4853421 6290883 7811865
39817G811865J039750J447511K821200L390570K062645n2576j397760j884534
$$ 7811865 8851615 10299126 13120326 16510896 18573541 18520965 17123205 15238671
39809A5238671k130651k066575j498646j092915j523739k236810k140816j099012
$$ 15238671 13108020 11041445 9542799 8449884 6926145 4689335 2548519 1449507
39801A449507J19438R12540J114302O97522l6499m10365j60169J77953J81787
$$ 1449507 1568945 2481485 3595787 4293309 4256810 3846445 3686276 3864229 4046016
39792D046016K19229O38385R92837P80982L10719J07818Q8457J7718R8106L38322
$$ 4046016 4265245 4903630 5896467 6677449 6988168 7095986 7184443 7202161 7300267 7638589
39782G638589Q5900q96894j601218j078781K306K66539l26158n68994N2545P01539
$$ 7638589 7724489 6827595 5226377 4147596 4149902 4416441 4090283 3521289 3573834 4275373
39772D275373N49368j78279p29363p08116k44177K52248M19090L10515L40417
$$ 4275373 4824741 4646462 3917099 3208983 2964806 3217054 3636144 3946659 4287076
39763D287076O78590J033612J228151J435307J540984J011518q8433p57791m89259
$$ 4287076 4965666 5999278 7227429 8662736 10203720 11215238 11126805 10369014 9879755
39754I879755k55233j077299k255004k218509q01723N47337P59366K59219m2098
$$ 9879755 9624522 8547223 6292219 4073710 3271987 3819324 4578690 4837909 4795811
39745D795811M1803Q5968k01513o60163q77781o31354j79995M8213K6026k2290
$$ 4795811 4837614 4923582 4722069 4061906 3184125 2552771 2372776 2420989 2447015 2424725
39735B424725k24136p52492r58581M5969J676794K098831P94005m77680k25982
$$ 2424725 2200589 1448097 489516 535485 2212279 4311110 5105115 4627435 4401453
39726D401453O34244M65309n38876j074646j003027j102642j209778m59161R09236
$$ 4401453 5035697 5501006 4962130 3887484 2884457 1781815 572037 112876 1022112
39717A022112J661243J379409P37129J42140m94831q22474l20152N44473P32649
$$ 1022112 2683355 4062764 4799893 4942033 4447202 3624728 3304576 3849049 4581698
39708D581698J60001l57813m90805n41260m90886j61706j7289m97787r19581m24881
$$ 4581698 4741699 4383886 3893081 3351821 2860935 2699229 2681940 2184153 1264572 839691
39698H39691L94548L59289k37689j50911N72462P31847J73365q1044J48579K7701
$$ 839691 1234239 1593528 1355839 1204928 1777390 2509237 2682602 2601558 2750137 2777838
39688B777838l88611j11814P08084P16328k59107p48964p3516O84817P01941N36089
$$ 2777838 2389227 2277413 2985497 3701825 3442718 2693754 2620238 3305055 4006996 4543085
39678D543085O19293M62696L9319J68589Q19013P87251k18267r36870p15041m90577
$$ 4543085 5162378 5625074 5664393 5832982 6651995 7439246 7220979 6284109 5569068 5078491
39668E078491q38408r04772k15198K86340K7776j23891L57218N54095q4485n36042
$$ 5078491 4240083 3335311 3120113 3406453 3434229 3310338 3667556 4221651 4137166 3601124
39658C601124j1224O38075N19409J55757J79078J40886k21187j67302M03104K28804
$$ 3601124 3589900 4227975 4747384 4903141 5082219 5223105 5001918 4834616 5237720 5466524
39648E466524j058737j722570n00643J256587J680597J073386P63667P01011N8039
$$ 5466524 4407787 2685217 2184574 3441161 5121758 6195144 6958811 7659822 7717861
39639G717861q94743j277258j072268o84460n429Q45274J007317L05386j05562
$$ 7717861 6823118 5545860 4473592 3789132 3783703 4628977 5636294 5941680 5836118
39630E836118L37402N60839n3522l03157O22624J371038N97994p76127j274537
$$ 5836118 6173520 6734359 6680837 6377680 7000304 8371342 8969336 8193209 6918672
39621F918672j177654j305981j174493k82790M03699J87277J42949R68213J246760
$$ 6918672 5741018 4435037 3260544 2977754 3381453 3568730 3711679 4679892 5926652
39612E926652q180j099347l40077R88409R72173L77871Q16975J521957R90723
$$ 5926652 5918472 4819125 4479048 5467457 6439630 6817501 7634476 9156433 10147156
39603A0147156O6562K48869O65669n1358o64346M55428J789400J053137n51914
$$ 10147156 10213718 10462587 11128256 11076898 10412552 10867980 12657380 13710517 13158603
39594A3158603l64371J032516J204611M57380P57919J501103Q34263j48306P99562
$$ 13158603 12794232 13826748 15031359 15488739 16246658 17747761 18582024 18433718 19233280
39585A9233280K458684K227584J341600K664979M811351M446824L025367M565478
$$ 19233280 21691964 23919548 25261148 27926127 32737478 37184302 40209669 44775147
39577D4775147P973226R033193Q982765J2607658J8676128K2571960K8267005
$$ 44775147 52748373 61781566 70764331 83371989 102048117 124620077 152887082
39570A52887082M3936277O1589591N6199933J6182596l5427237o3237099n7445706
$$ 152887082 196823359 258412950 314612883 330795479 295368242 232131143 174685437
39563A74685437l7915444k5048517k0460629j6428156j0840350o814542n197769
$$ 174685437 136769993 111721476 91260847 74832691 63992341 57177799 51980030
39556E1980030l939711k120675p31408m92387o91270J20616K387703M455458M530746
$$ 51980030 48040319 45919644 45188236 44695849 44004579 44125195 46512898 50968356 55499102
39547E5499102L781941M902223P507378Q992981J0273321J4880493K1545611K5994974
$$ 55499102 59281043 64183266 71690644 80683625 90956946 105837439 127383050 153378024
39539A53378024L2419966N0843010P4875469P5125458L1470342l3990728p4498467
$$ 153378024 185797990 236641000 311516469 386641927 418112269 384121541 309623074
39532C09623074o9396871m1542210k2690749j9353193j9853293j8314004j7554090
$$ 309623074 240226203 198683993 175993244 156640051 136786758 118472754 100918664
39525A00918664j7354760j4091940r067564o950714p570090p023796n106339m631309
$$ 100918664 83563904 69471964 60404400 53453686 45883596 38859800 33753461 29122152
39517B9122152n055968l454513o66232k65752k113660k617330j026938k09639
$$ 29122152 24066184 20611671 19945439 19679687 17566027 14948697 13921759 13712120
39509A3712120j218060j908176j213465n48506o12538n00937k15002o86410j276687
$$ 13712120 12494060 10585884 9372419 8823913 8211375 7710438 7495436 6809026 5532339
39500E532339m92170R20898Q53559l26747j75571J531142K273398R36413o89927
$$ 5532339 5040169 5961067 6814626 6487879 6312308 7843450 10116848 11053261 10363334
39491A0363334j145748j110289j259971r98734j78905K23019p0128j60350J35123
$$ 10363334 9217586 8107297 6847326 5848592 5669687 5892706 5822578 5662228 5797351
39482E797351q1082q12356q63164O646O10655N13005O88089J424041J528722L91263
$$ 5797351 5716269 4903913 4040749 4047395 4658050 5171055 5859144 7283185 8811907 9203170
39472I203170r15375j385585j371033j375748j043520j57391O12583P19245M72897
$$ 9203170 8287795 6902210 5531177 4155429 3111909 2954518 3567101 4286346 4759243
39463D759243K44683o4116l81577l22382M476N3670r2766K12275Q98519J086964
$$ 4759243 5003926 4939810 4558233 4235851 4240327 4293997 4201231 4413506 5312025 6398989
39453F398989M79134k25210m31988j64798M72727J215032J188399r4027j425774
$$ 6398989 6878123 6652913 6220925 6056127 6528854 7743886 8932285 8838258 7412484
39444G412484j132280M46785J387349J126082J036850J756498K083688J398280
$$ 7412484 6280204 6726989 8114338 9240420 10277270 12033768 14117456 15515736
39436A5515736J170844K682201M711839M994033L029628J93270k166848l556169
$$ 15515736 16686580 19368781 24080620 29074653 32104281 32297551 30130703 26574534
39428B6574534l884640l351590k550694j959884j540224j189531j086069j231337
$$ 26574534 22689894 19338304 16787610 14827726 13287502 12097971 11011902 9780565
39420I780565j256050j032882q53879p28886k68585M38069O84490K51860k09339
$$ 9780565 8524515 7491633 6637754 5908868 5640283 6078352 6762842 7014702 6805363
39411F805363k67161k45964l07179p8194K91384j02210j340690k046215j302807
$$ 6805363 6538202 6292238 5985059 5906865 6198249 6096039 4755349 2709134 1406327
39402A406327j56194k3961n29093l05217O94898J223463P88393K08716Q3901K9211
$$ 1406327 1250133 1226172 697079 391862 1086760 2310223 3098616 3307332 3391233 3420444
39392C420444k71311l63334J29317P58946Q97399N93743L16215K16708R6656j21266
$$ 3420444 3149133 2785799 2915116 3674062 4571461 5165204 5481419 5698127 5794783 5673517
39382E673517k95966l82951n36735q32642j065011r52030m93273rK48724K59498
$$ 5673517 5377551 4994600 4457865 3625223 2560212 1608182 1114909 1114900 1363624 1623122
39372A623122J89300J15193M1224k8289j43522l43269m16550l7237O48878R53533
$$ 1623122 1812422 1927615 1968839 1940550 1797028 1453759 1037209 999972 1648850 2602383
39362B602383N28462m6697l0773M57708P33331N42876J45045l04754p14934o68226
$$ 2602383 3130845 3084148 3053375 3511083 4244414 4787290 4932335 4627581 3912647 3244421
39352C244421O4385P74007N15314m75068j022088p15375l34422l98077l98363
$$ 3244421 3308806 4082813 4598127 4123059 3100971 2385596 2051174 1653097 1254734
39343A254734R0267N55173M35570P4214R1875L97234M59984J40929k75141n21270
$$ 1254734 1345001 1900174 2335744 2409958 2501833 2899067 3359051 3499980 3224839 2703569
39333B703569m41150j7523L99464L18008k06836n91333n90215n17926m27244J08176
$$ 2703569 2262419 2244896 2644360 2962368 2755532 2164199 1573984 1056058 628814 736990
39323G36990J004495J321307N37325n23979p57705k22063J91365P7816k23077
$$ 736990 1741485 3062792 3600117 3076138 2318433 2096370 2287735 2365551 2142474
39314B142474l71185l33406j25091J98695M22841M45313M83778O88869Q16453
$$ 2142474 1771289 1437883 1312792 1511487 1934328 2379641 2863419 3552288 4368741
39305D368741N93226J15179l80247p76929q77988m21815L70823P55725L65607
$$ 4368741 4961967 5077146 4696899 3919970 3041982 2620167 2990990 3746715 4112322
39296D112322k89297n84868n70869o07711p10172o91570n25476j81054M34611
$$ 4112322 3823025 3238157 2667288 2059577 1349405 657835 132359 -48695 385916
39287C85916J027959R74447K15433m80956n41657k24967J29928O45286J160925
$$ 385916 1413875 2388322 2603755 2122799 1581142 1356175 1486103 2131389 3292314
39278C292314R06628k56843j130042p08492K96755N52653P6494r5728K81219N00568
$$ 3292314 4198942 3942099 2812057 2103565 2400320 2952973 3029467 2933739 3214958 3715526
39268C715526K93593R9833K7586k74156o87889o55171j97236P0168k8800j29555
$$ 3715526 4009119 4108952 4136538 3862382 3174493 2519322 2322086 2392254 2363454 2233899
39258B233899k21072n94157q99345m20447N56642Q36590J00357n43772k66390
$$ 2233899 2012827 1418670 519325 98878 655520 1492110 1592467 1048695 782305
39249G82305L02836K45118k25539l00921J26808M95629M83197K44827K9177J8662
$$ 782305 1085141 1330259 1104720 803799 930607 1426236 1909433 2154260 2183437 2202099
39239B202099K72899M94885J95549o00239j176200r55243j74042N02007O72593
$$ 2202099 2474998 2969883 3165432 2565193 1388993 433750 259708 761715 1434308
39230A434308L40255j96452m04767K7997O13168N02514k76475p09022k45942L89056
$$ 1434308 1774563 1578111 1173344 1201341 1814509 2317023 2040548 1331526 1085584 1474640
39220A474640L66290j5745k229L14553K69738j61557l65822j60116K3831K5008
$$ 1474640 1840930 1825185 1822956 2137509 2407247 2245690 1879868 1719752 1743583 1768591
39210A768591J83252N28074N06756j39010q17368q35177l10138Q7721N4351j08834
$$ 1768591 1951843 2479917 2986673 2847663 2030295 1195118 884980 972701 1027052 918218
39200I18218q5788m361j92637o38118q51109l61003O38370J299496R78659J0452
$$ 918218 832430 828069 635432 -2686 -853795 -1214798 -576428 723068 1701727 1712179
39190A712179o50135n56739j78656n3280J1806M61971J038633R77482J84242m79375
$$ 1712179 1062044 505305 326649 273369 285175 747146 1785779 2763261 2947503 2468128
39180B468128l95963p7624l03292q29004p47415K8901N24275J15797n90948p15000
$$ 2468128 2072165 1994541 1691249 862245 114830 143731 668006 783803 192855 -522145
39170e22145l07101l4571q2563k6043L69598Q07191R28573P08379L43256O4240
$$ -522145 -829246 -863817 -946380 -972423 -602825 204366 1132939 1841318 2184574 2248814
39160B248814P9015M25001Q23822Q58440L43823n14915j250638j419451r73579
$$ 2248814 2327829 2752830 3576652 4435092 4778915 4264000 3013362 1593911 620332
39151F20332l92084j70484j68761J16739N95330N49024j59734n78047L6135R83500
$$ 620332 228248 57764 -110997 5742 601072 1150096 990362 412315 448450 1431950
39141A431950R78574j22085j242932j520540j034405k47273M85142Q36084O53204
$$ 1431950 2410524 2288439 1045507 -475033 -1509438 -1756711 -1271569 -435485 217719
39132B17719K82489K04753L39636K16016k53512p18553r62912r13414k91829R48232
$$ 217719 500208 704961 1044597 1260613 1007101 288548 -674364 -1587778 -1879607 -931375
39122i31375J972679J773128N53400m67714o87305o14020o53486n05904j06695
$$ -931375 1041304 2814432 3367832 2900118 2212813 1598793 945307 439403 332708
39113C32708p4958o41530j029615n57834L64371R34722R60444O07903r9001q72428
$$ 332708 257750 -383780 -1413395 -1971229 -1606858 -672136 288308 896211 797210 -75218
39103g5218r73073j93349N75446N08328j2204j92156j16638k97818n07970j98959
$$ -75218 -1048291 -1241640 -666194 -157866 -170070 -362226 -478864 -776682 -1284652 -1483611
39093a483611K87235J51901l75634k54020N84640R29011J52222p52753o57292
$$ -1483611 -1196376 -1044475 -1420109 -1674129 -1089489 -160478 -8256 -761009 -1418301
39084a418301P8383L17783r2431k36604L58317R84994P44989k53092j023229q17767
$$ -1418301 -1339918 -1022135 -1114566 -1351170 -992853 -7859 737130 484038 -539191 -1356958
39074a356958J52005J048951J247938P84211J24764l18418m29641k97383k9977
$$ -1356958 -1204953 -156002 1091936 1876147 2000911 1682493 1252852 955469 925492
39065I25492K85411M65627K19059n05474j131460q07660N17501J667897J425564
$$ 925492 1210903 1676530 1895589 1390115 258655 -549005 -31504 1636393 3061957
39056C061957N7943r19760n72267M48350R19652N15187r7357j99498L47805J158011
$$ 3061957 3119900 2200140 1627873 2076223 2995875 3511062 3413705 3214207 3562012 4720023
39046D720023J650710J472948Q00300R8212m30015q72298j137672r73829n43942
$$ 4720023 6370733 7843681 8643981 8742193 8312178 7439880 6302208 5328379 4784437
39037D784437m03674o95629r42208q74630q13810q95317o41707J71976Q89089
$$ 4784437 4380763 3685134 2742926 1868296 1054486 159169 -482538 -310562 578527
39028E78527Q53599L78068J63471K37174J57267j63199n21838q77176j052361
$$ 578527 1432126 1810194 1973665 2210839 2368106 2204907 1683069 805893 -246468
39019b46468n26304O46877J266971M07219r96652j195214o4246Q09307N05487
$$ -246468 -772772 -125895 1141076 1548295 551643 -643571 -707817 101490 606977
39010F06977j36971j68101K5408l34808r58769q96379K9703R40985R30632j4132
$$ 606977 470006 301905 327313 -7495 -966264 -1862643 -1832940 -891955 38677 24545
39000B4545j013036j081600j23557Q66206Q97209J64357l40232k27320o677l1410
$$ 24545 -988491 -2070091 -2193648 -1327442 -430233 -265876 -606108 -833428 -840105 -871515
38990h71515l0284J17008K3441l97476n56265j23733L34705K21707j82639k82775
$$ -871515 -901799 -784791 -761350 -1158826 -1715091 -1838824 -1504119 -1282412 -1465051 -1747826
38980a747826j35976j81447l55316j72840M49177J014384J058839N78874p4460
$$ -1747826 -1883802 -2065249 -2420565 -2593405 -2144228 -1129844 -71005 507869 433409
38971D33409m70882m09367j45472j15736l19304l07777P4631M08121L91352K81106
$$ 433409 -37473 -446840 -592312 -708048 -1027352 -1335129 -1260498 -852377 -461025 -179919
38961a79919K69953j410p39848j288432q65655K22358Q47380M98448j73456l17751
$$ -179919 90034 88624 -651224 -1939656 -2805311 -2582953 -1735573 -1237125 -1410581 -1728332
38951a728332J27981N67369N07335K3776l71632k77805J35455L44090J90579O9705
$$ -1728332 -1600351 -1032982 -525647 -501871 -873503 -1151308 -1015853 -671763 -481184 -411479
38941d11479K30795L25199R764m01628m00344r4848J8328j15895j33475J9379
$$ -411479 -180684 144515 154279 -247349 -647693 -742541 -724213 -840108 -973583 -954204
38931i54204L6998q0276K4871L57309M56664K01958J18643N44991J013755R12801
$$ -954204 -917206 -997482 -972611 -615302 -158638 43320 161963 706954 1720709 2633510
38921B633510L71529l0336j88315n16979j101393j388210r62225k25110R2831
$$ 2633510 3005039 2974703 2786388 2269409 1168016 -220194 -1182419 -1407529 -1314698
38912a314698r3298j87509J50418N25815N03501L30785M80866P61355N35124k24154
$$ -1314698 -1407996 -1595505 -1445087 -919272 -415771 -84986 395880 1157235 1692359 1468205
38902A468205p97123p71169n29618m15498j40039M79200Q65246M83738j94717
$$ 1468205 671082 -100087 -629705 -1045203 -1185242 -706042 159204 642942 448225
38893D48225l37437j144J23004l2301J19624O40928Q60526N06047J18075N5833
$$ 448225 110788 109644 232648 200347 319971 960899 1821425 2327472 2445547 2501380
38883B501380j4982k42366r7454O10785J007359K71650j027768j593544j104425
$$ 2501380 2486398 2244032 2146578 2757363 3764722 4036372 3008604 1415060 310635
38874C10635m23706k43902l44355k53740O8928M24895P10073Q20012O09180J52912
$$ 310635 -113071 -356973 -701328 -955068 -886140 -461245 248828 1068840 1678020 1830932
38864A830932k32854l62829l24148k06889r621J33833K65l25773m41083j65129
$$ 1830932 1598078 1235249 911101 704212 694591 828424 828689 502916 61833 -103296
38854a03296K19757M20311M85183N07894L36769j11881n33103n75023l07531l3799
$$ -103296 116461 536772 1021955 1529849 1866618 1754737 1221634 646611 339080 305281
38844C05281J66096L46619L37804p6043o76181r35218o52879j21356L38322O31183
$$ 305281 471377 817996 1155800 1079757 403576 -531642 -1184521 -1305877 -967555 -336372
38834c36372O83350M32563J13378J00375L17135K66587j45828l51131l2518K41315
$$ -336372 346978 779541 892919 993294 1310429 1577016 1431188 1080057 1047539 1288854
38824A288854j29080p14318o12483J42824N85485K80839o8976J84361N88339L37495
$$ 1288854 1159774 445456 -167027 -24203 561282 842121 773145 957506 1545845 1883340
38814A883340m14184p24842j96381N44580P85920N89907M37935M08287J45135
$$ 1883340 1469156 744314 547933 1092513 1878433 2468340 2906275 3314562 3459697
38805C459697m48147q94706o97025q388M86324L40325k02651n77317n23644j99361
$$ 3459697 3011550 2116844 1419819 1411431 1897755 2238080 2035429 1458112 934468 735107
38795G35107J74318N20032P67224P47827L54182k74950p94238q77675m64481J45737
$$ 735107 909425 1429457 2196681 2944508 3298690 3023740 2229502 1351827 887346 1033083
38785A033083N11730M78664L33950M17808O49267O05649N8219p05534j108918
$$ 1033083 1544813 2023477 2357427 2775235 3424502 4030151 4088370 3382836 2273918
38776B273918q11286r9754K54299k09933r24327p85523L74660J308834Q77970
$$ 2273918 1462632 1362878 1617177 1407244 482917 -302606 72054 1380888 2258858
38767B258858l66875r12062l61882J74621j53507p95893q21061k26293L71715
$$ 2258858 1891983 979921 618039 792660 639153 -156740 -977801 -1204094 -832379
38758h32379P07674Q58939P48662L50564M7092J10609R6781n42376j409102j478433
$$ -832379 -124705 734234 1482896 1833460 1880552 1991161 2087942 1545566 136464 -1341969
38748a341969n07062N48431P39152K50389M336M19184R13318O64757l11349j057400
$$ -1341969 -1849031 -1300600 -561448 -311059 -306723 112461 1025779 1690536 1379187 321787
38738C21787p63617K44187R42673Q71164M10469j00343o94541j056724m84562
$$ 321787 -441830 -197643 745030 1616194 2026663 1926320 1231779 175055 -309507
38729c09507Q45101J504660O06053p70262r86800r7824N21812L58138J60229L04575
$$ -309507 535594 2040254 2646307 1876045 889245 791421 1313233 1671371 1831600 2136175
38719B136175K41481k21411m55230k46064k60745p41502q83172j86532N91721
$$ 2136175 2377656 2156245 1701015 1454951 1194206 452704 -430468 -617000 -25279
38710b5279O10087J76292J4157J03033Q6181R5823K75288J45036o05980j284110
$$ -25279 584808 761100 775257 878290 964471 1060294 1335582 1480618 874638 -409472
38700d09472j124358n10566k25404l8631P03994J486951J095122l49177j260286
$$ -409472 -1533830 -2044396 -2269800 -2308431 -1604437 -117486 977636 628459 -631827
38691f31827p91498J05685K88087n0946j12148J84117L99469M74265O47130Q39486
$$ -631827 -1423325 -1317640 -1029553 -1080499 -1192647 -1008530 -609061 -134796 512334 1351820
38681A351820P38268K83967l12724q03343r17919n21807J9172R0317l07516m82137
$$ 1351820 2090088 2374055 2061331 1257988 340069 -181738 -162566 -72249 -379765 -861902
38671h61902j26783J86930M0688k3995N62715J259879J111476K18497m28584m20663
$$ -861902 -988685 -801755 -761067 -785062 -222347 1037532 2149008 2367505 1938921 1518258
38661A518258l01128m70323o16775m20903o9961J76025L14419K98228P984k92104
$$ 1518258 1217130 746807 130032 -290871 -360832 -184807 129612 427840 435824 143720
38651A43720j13599M19586N83927J94174l8549K72291M33323j50043p77532m46710
$$ 143720 30121 449707 1033634 1227808 1189259 1461550 1894873 1744830 967298 520588
38641E20588M19585M23462p03481j597491j137720J35973R54951R15617N27656
$$ 520588 940173 1363635 660154 -937337 -2075057 -1939084 -984133 -68516 459140
38632D59140J94812j43048n38446p87707o97597l05925J74779M96999N46582M55679
$$ 459140 653952 510904 -27542 -815249 -1512846 -1818771 -1643992 -1146993 -600411 -144732
38622a44732M05898L12601j2290l74670l36501J8717L0895m79190o98003K4587
$$ -144732 261166 573767 561477 186807 -149694 -130977 -100082 -579272 -1277275 -1252688
38612a252688R90254R58976r5720r63797r40786o30215p00986p46850m9757J099208
$$ -1252688 -262434 696542 600822 -362975 -1303761 -1933976 -2634962 -3381812 -3431569 -2332361
38602b332361J646068J148010K32386l00554k81006N820L06944M78132L98314
$$ -2332361 -686293 461717 694103 393549 112543 118363 425307 903439 1301753
38593A301753R8833j72166k48235l07330n91801r11489p43687L6965P96400P99342
$$ 1301753 1400586 1228420 980185 672855 81054 -830435 -1574122 -1537157 -740757 58585
38583E8585J00152n64587p31079o41270o36056n89144k41659K76428O51470Q32052
$$ 58585 158737 -405850 -1136929 -1778199 -2414255 -3003399 -3245058 -2968630 -2317160 -1485108
38573a485108Q72739O27443Q4576k81516j09898J41161j45225n47534p2371J088626
$$ -1485108 -612369 15074 99650 -181866 -291764 -150603 -295828 -843362 -915733 172893
38563A72893J417225J93454j273531j367233l10997M21572K59908q6708j27674
$$ 172893 1590118 1783572 510041 -857192 -1168189 -746617 -486709 -573417 -701091
38554g01091j93643m33728l72649J19866L50922j37282p30902n83369K19401R39330
$$ -701091 -894734 -1328462 -1701111 -1581245 -1230323 -1367605 -2098507 -2681876 -2462475 -1523145
38544a523145J235262J302919J236180R02988L82509k7301k62078n23340q40398
$$ -1523145 -287883 1015036 2251216 3154204 3536713 3509412 3247334 2723994 1883596
38535A883596r82921q36157n15435j02924L59962O18450L95744p0187j67077K09041
$$ 1883596 900675 64518 -450917 -553841 -193879 424571 820315 750128 583051 792092
38525G92092M03047k7427n57810m31977K00396N38962L41150J26461J57214K0970
$$ 792092 1195139 1167712 609902 177925 378321 917283 1258433 1384894 1542108 1563078
38515A563078m85391p93012m10632K11903L14597m6778k02497J9005J17119j75705
$$ 1563078 1077687 284675 -125957 85946 400543 353765 151268 170273 287392 111687
38505A11687n08862n45284l90920k39025r9037k1420r1110q1759L15736P85071
$$ 111687 -397175 -942459 -1333379 -1572404 -1671441 -1692861 -1783971 -1865730 -1549994 -764923
38495g64923N95428k14463o39740j73852L13628r9524q61020p33559L08891J106565
$$ -764923 -169495 -383958 -1023698 -1197550 -883922 -983446 -1844466 -2578025 -2269134 -1162569
38485a162569J111773R81411J163408J018221l5400j293944j501783m74840O80891
$$ -1162569 -50796 930615 2094023 3112244 3076844 1782900 281117 -193723 487168
38476D87168Q94218K07988m84998m83731N0024M03668K33590k7140J26687M30833
$$ 487168 1381386 1589374 1104376 620645 670669 1074337 1307927 1280787 1407474 1838307
38466A838307K19465m69847q27824m47780R8688J74433n5962j30874j14927l15379
$$ 1838307 2057772 1587925 760101 312321 411009 585442 529480 398606 283679 -31700
38456c1700n75763n11502j99558l570R1965L30004N24194K70570k32585l28255
$$ -31700 -607463 -1118965 -1318523 -1322093 -1230128 -900124 -375930 -105360 -337945 -666200
38446f66200N4480K49438m9348k88772k2729L11167J21974l57349m55539q4390
$$ -666200 -611720 -362282 -411630 -700402 -723131 -411964 -289990 -647339 -1102878 -1187268
38436a187268K50106K60441J34533R2181J76071L94932O42938O08465J98984j41734
$$ -1187268 -937162 -676721 -542188 -450007 -273936 120996 763934 1372399 1571383 1429649
38426A429649o1881O386m93231j073088o67007O33503J359340O10770p23047j323594
$$ 1429649 1367768 1374154 880923 -192165 -859172 -225669 1133671 1744441 1021394 -302200
38416c02200j159360r94814r16168m46648K84700O31536N29617M57163L89384
$$ -302200 -1461560 -2456374 -3372542 -3819190 -3534490 -2902954 -2373337 -1916174 -1526790
38407a526790j02133o85624m29861N88303J052296L20365n54809m69666R6169
$$ -1526790 -1628923 -2314547 -2744408 -2156105 -1103809 -783444 -1338253 -1807919 -1711750
38398a711750P7861l87107l79022J30940L20678K2715n6348L11180M24482j52213
$$ -1711750 -1633889 -2020996 -2400018 -2269078 -1948400 -1925685 -1982033 -1670853 -1246371 -1398584
38388a398584q55442r61623m56613K72774R77117J414975J268976O22932R6800
$$ -1398584 -2254026 -3215649 -3672262 -3399488 -2422371 -1007396 261580 884512 981312
38379I81312J29086M62449O15026M82558K01737j69751n01537m99314j43600R3806
$$ 981312 1110398 1572847 2187873 2670431 2872168 2702417 2200880 1701566 1557966 1651772
38369A651772j48346n70692o42195l41539p3238k1406J1064K08383N24735Q01303
$$ 1651772 1503426 932734 290539 -51000 -124238 -145644 -134580 73803 598538 1399841
38359A399841Q33208M21186l52110r75002r46492l67619J46733J65136j38973
$$ 1399841 2233049 2654235 2302125 1327123 380631 13012 159745 324881 185908
38350A85908k80475l0294L41670L36095k25611r01929j013796l89684M29568Q12349
$$ 185908 -94567 -124861 216809 552904 327293 -574636 -1588432 -1978116 -1548548 -736199
38340g36199O64946L18005L2720j32859j38585L5678K20241J39738k53364o36568
$$ -736199 -71253 246752 279472 146613 8028 43706 263947 403685 150321 -486247
38330d86247n80383P759O62479P00602m237o74854m34826N07651R75458L60400
$$ -486247 -1066630 -1058871 -396392 304210 299973 -374881 -809707 -302056 673402 1033802
38320A033802m75841l44285O00927J046698L04227q18107j157205o39384j40754
$$ 1033802 557961 213676 814603 1861301 2165528 1347421 190216 -449168 -589922
38311e89922k19569n16898m34764r556J42615l48562j056729j142162k56300J019312
$$ -589922 -809491 -1326389 -1761153 -1770709 -1628094 -1976656 -3033385 -4175547 -4431847 -3412535
38301c412535J688374J290874L20500l12265k09260J88655K33141j18979l47822
$$ -3412535 -1724161 -433287 -112787 -425052 -634312 -445657 -212516 -331495 -679317
38292f79317j66551J04625J12318J9682J21685K20821q9936o49796p96885k67653
$$ -679317 -845868 -741243 -628925 -609243 -487558 -266737 -356673 -1006469 -1803354 -2071007
38282b071007M26607O27903J91692n05841q70139m51754N47610J187478P36457
$$ -2071007 -1644400 -1016497 -824805 -1330646 -2200785 -2652539 -2104929 -917451 -180994
38273a80994l20562q09242l58610L34054O87981P75169N83297j44356r68342q24799
$$ -180994 -501556 -1310798 -1669408 -1335354 -647373 127796 711093 566737 -401605 -1226404
38263a226404L13086R64374K01278q70107p71469J69494O20579M17176L81005
$$ -1226404 -913318 51056 252334 -617773 -1389242 -1219748 -599169 -181993 199012
38254A99012N10448N7781p80377r30854k72399J69335K7696K5791K99801n0985
$$ 199012 709460 767241 -13136 -943990 -1216389 -1047054 -1019358 -993567 -693766 -744751
38244g44751j129703j545304m79162Q77996J019504J69057m53931m71387k91904
$$ -744751 -1874454 -3419758 -3898920 -3020924 -2001420 -1832363 -2286294 -2757681 -3049585
38235c049585J2523N67797R61992P55004L36454L23980N22176M02455J60363K94926
$$ -3049585 -3037062 -2469265 -1507273 -752269 -415815 -91835 430341 832796 993159 1288085
38225A288085N48936L39211q4924l4749K89919L2520q20004j299569r05698j73683
$$ 1288085 1837021 2176232 2091308 2056559 2346478 2378998 1558994 259425 -646273 -819956
38215h19956L29188O08446O84278L75236j21134k90041j72621l43319q06432q28035
$$ -819956 -490768 117678 801956 1177192 1056058 766017 593396 250077 -556355 -1384390
38205a384390j88432L21934J29393k39198p9462L95596N30376K56370K7462J07889
$$ -1384390 -1572822 -1250888 -1121495 -1360693 -1440155 -1044559 -514183 -257813 -230351 -122462
38195a22462M02328O44933M35179m32944j364888j313114j71533Q30991O92980
$$ -122462 279866 924799 1359978 927034 -437854 -1750968 -1922501 -1091510 -398530
38186c98530n5481l05999K046J16797j17050j31627K30898M28569J28921l59368
$$ -398530 -454011 -760010 -757964 -641167 -758217 -889844 -658946 -230377 -101456 -460824
38176d60824o43778n87158q3951Q10412J490174J278649M38042j3421K96222N87398
$$ -460824 -1104602 -1691760 -1775711 -965299 524875 1803524 2241566 2228145 2524367 3111765
38166C111765J48645o30495r46590p58503o50953q22065q25122k80096N90649
$$ 3111765 3260410 2629915 1683325 924822 273869 -548196 -1373318 -1653414 -1062765
38157a062765J198242J132308M65243l31217p66981o98763l23014R9387L69708
$$ -1062765 135477 1267785 1733028 1401811 634830 -63933 -386947 -287560 82148
38148H2148L43258R8936M0022M39898R07843P64352L15o47337p01273m53002k38105
$$ 82148 425406 524342 564364 1004262 1912105 2676457 2676772 2029435 1328162 875160 637055
38137F37055J45300Q25633J227315P25094l67337j097594j015886m89796k8984
$$ 637055 782355 1607988 2835303 3560397 3193060 2095466 1079580 589784 560800
38128E60800J65693O5873k48683n16296n48858m97929n22539l94489J04344O20627
$$ 560800 726493 792366 543683 27387 -521471 -1019400 -1541939 -1936428 -1832084 -1211457
38118a211457O59814M04629M24235O85890O44415K97983K52448N62094M42940
$$ -1211457 -551643 -147014 277221 963111 1607526 1905509 2157957 2720051 3162991
38109C162991m56976j345437j393087q34012l44773J4205M90802Q11896N33122
$$ 3162991 2706015 1360578 -32509 -866521 -1211294 -1197089 -706287 105609 638731
38100F38731p6001l21934j25627l0825k27329k62294J89314Q08118J013634N35828
$$ 638731 562730 240796 115169 84344 -142985 -405279 -215965 592153 1605787 2141615
38090B141615l78409j061201r08563j04489M05652O6147n26648n38637j21137
$$ 2141615 1763206 702005 -206558 -311047 94605 160752 -365896 -904533 -1025670
38081a025670N5212P6982N29283J130602Q72687k77579j013592n12305M12520
$$ -1025670 -970458 -893476 -364193 766409 1639096 1361517 347925 -164380 248140
38072B48140O24336K31274M6512K06836K43300N7108p0896j66119m50973p34810
$$ 248140 872476 1103750 1150262 1357098 1600398 1657506 1586610 1420491 969518 234708
38062B34708o52425l84286m26687p04893o16614m063N58873N87102K61473L0627
$$ 234708 -417717 -802003 -1228690 -1933583 -2550197 -2554260 -1995387 -1408285 -1146812 -1116185
38052a116185Q7041L87590P76699R20296N10484k39015o22641k31964M96332P64221
$$ -1116185 -1029144 -641554 135145 1055441 1565925 1326910 704269 472305 968637 1732858
38042A732858L12716l70769o68588m54117p6609J21508J35629J56084K52952L37626
$$ 1732858 2045574 1674805 1006217 552100 475491 596999 732628 888712 1141664 1479290
38032A479290L40975K34781n6933n13569q29623p03068l22407j75530l06621k24267
$$ 1479290 1820265 2055046 1998113 1484544 654921 -48147 -370554 -546084 -852705 -1076972
38022a076972K82352P24672N93415J8640n43097q21968o31980J55546J060353
$$ -1076972 -794620 -69948 523467 542107 -990 -822958 -1454938 -1299392 -239039
38013b39039J043523j76731j366892j184363L6371Q35283O70031L16217L22892
$$ -239039 804484 627753 -739139 -1923502 -1887131 -1051848 -381817 -65600 257292
38004B57292K91408n1283j95073J95844N56965L01254k39077l88543j33440O7047
$$ 257292 548700 497417 302344 498188 1055153 1356407 1117330 728787 595347 662394
37994F62394Q0469J21637K38814K76142J66624p3835l99013n29160r1015P11544
$$ 662394 742863 864500 1103314 1379456 1546080 1472245 1073232 544072 453057 1164601
37984A164601J030141M39505l46334l77410K61867O98610N17599R3880j67289
$$ 1164601 2194742 2634247 2287913 1910503 2172370 2870980 3388579 3482459 3315170
37975C315170k48737k14399j08234j85857o54897j122124r15924j20743L32877
$$ 3315170 3066433 2852034 2743800 2557943 1903046 780922 -135002 -255745 77132
37966G7132p0083o25824l55025O14700J182288O76117l83500r83119o87395J32214
$$ 77132 7049 -618775 -973800 -359100 823188 1499305 1115805 132686 -554709 -422495
37956d22495Q26594R71572N14150k61005q67766r33003n03115K4027L03883K93670
$$ -422495 404099 1375671 1889821 1628816 761050 -171953 -675068 -651041 -347158 -53488
37946e3488J08806j65980m25885n03452l52680j44502k4297P7770K39576L53402
$$ -53488 55318 -110662 -536547 -1039999 -1392679 -1537181 -1561478 -1483708 -1244132 -890730
37936h90730L47664L66469M59781L73183J0214k09134L9437L13410K2824n02690
$$ -890730 -543066 -176597 283184 656367 666581 457447 496884 810294 833118 330428
37926C30428m24142J87164L36196k96498p67475l44358L66607M36749j2278k38668
$$ 330428 -93714 93450 429646 133148 -634327 -978685 -612078 -175329 -187607 -426275
37916d26275q2117R8551K37303M70690N56619J84968l55997n41322m12163l42347
$$ -426275 -508392 -409841 -172538 298152 854771 1039739 683742 142420 -269743 -612090
37906f12090k93830n1677R8096k13197n73115k89653L79811N18796N4210j13683
$$ -612090 -905920 -957597 -859501 -1072698 -1645813 -1935466 -1555655 -1036859 -982649 -1096332
37896a096332L57810O86229L02294k37035k17807J61038K90237Q0347j91577m34566
$$ -1096332 -738522 -52293 250001 12966 -204841 -43803 246434 326781 135204 -299362
37886b99362o04981m73829j9889L53452L93827L44574L62160J52673l70650o79888
$$ -299362 -904343 -1378172 -1398061 -1044609 -650782 -306208 55952 208625 -162025 -841913
37876h41913m54483k24150n01660q13660m32606L42301N95585K63564J77597O31568
$$ -841913 -1296396 -1520546 -2022206 -2835866 -3268472 -2926171 -2330586 -2067022 -1889425 -1257857
37866a257857R00671M56438j90771l25069o3355J1656j38142N612N90739R85326
$$ -1257857 -357186 99252 -91519 -416588 -479943 -468287 -606429 -600817 -10078 975248
37856I75248N38983m59072r39461l29192N85358N25985n52450j233250m91733
$$ 975248 1514231 1055159 115698 -213494 371864 897849 345399 -887851 -1379584
37847a379584Q17085J037944o1928j063746q93706j17659J15944l33562o71417
$$ -1379584 -562499 475445 413517 -650229 -1543935 -1661594 -1545650 -1879212 -2550629
37838b550629l70775L43103R91713J232595Q34068j47169j051273r92667J27568
$$ -2550629 -2921404 -2578301 -1586588 -353993 480075 332906 -718367 -1711034 -1583466
37829a583466J276830J322400L00229o83939q13446m36521l77565p02193o61693
$$ -1583466 -306636 1015764 1315993 632054 -181392 -617913 -995478 -1697671 -2359364
37820b359364J21528R30309P94875j75474q05645l01082P15519R61334J37995
$$ -2359364 -2237836 -1307527 -512652 -688126 -1493771 -1794853 -1079334 -118000 19995
37811A9995o41026k60203R15980J451572O63433n48740r45362m72769r299J2199
$$ 19995 -621031 -881234 34746 1486318 2149751 1601011 655649 182880 173581 185780
37801A85780o4789n3191k78680p64576q77222k77103M03814M31326L9421j7123
$$ 185780 120991 67800 -210880 -975456 -1852678 -2129781 -1725967 -1294641 -1255220 -1272343
37791a272343L73671O59358N56518L30102K30382K47362L58004M64457J93002
$$ -1272343 -898672 -239314 317204 647306 877688 1125050 1483054 1947511 2140513
37782B140513o30851j389805j248233l23947M25208N48330N60171Q77213J121321
$$ 2140513 1509662 119857 -1128376 -1452323 -1027115 -478785 81386 958599 2079920
37773B079920Q66460L54467j8374l13936o50489p70135n50105l81141m47409k42216
$$ 2079920 2946380 3300847 3282473 2968537 2318048 1547913 997808 616667 169258 -72958
37763g2958M53375P37498k30854j643447j870492p50422K40474K37924M4114M50046
$$ -72958 380417 1117915 887061 -756386 -2626878 -3377300 -3136826 -2898902 -2854788 -2404742
37753b404742Q46869M45376j83446j8458O49586P13493J51243K7437O12779Q92671
$$ -2404742 -1557873 -1112497 -1295943 -1314401 -664815 48678 199921 227358 840137 1732808
37743A732808K80730m35748m51193j56081k18222l68878o0747L66414K42205j95856
$$ 1732808 2013538 1577790 1126597 970516 752294 383416 322669 689083 931288 735432
37733G35432k15795P8889l1429n03405n54686o8853K25759J33659K99040P94008
$$ 735432 519637 598526 567097 63692 -490994 -559847 -334088 -200429 98611 892619
37723H92619P03498k47725q96232l91886L18764q8507j238692j689939j086996
$$ 892619 1596117 1348392 452160 60274 379038 290531 -948161 -2638100 -3725096
37714c725096l50432l2394J84316M30759L64119O1171J01729N60172Q58845P74116
$$ -3725096 -4075528 -4107922 -3923606 -3492847 -3128728 -3067557 -2965828 -2405656 -1546811 -772695
37704g72695O53032N08451p0250q70786r76784j26625P82282R52006N57432P938
$$ -772695 -119663 388788 318538 -552248 -1529032 -1655657 -873375 78631 636063 644001
37694F44001o49089j104271o47341O27905J436396R45094k5062k67042J69750
$$ 644001 -5088 -1109359 -1756700 -1128795 307601 1252695 1227633 960591 1130341
37685A130341N12086N99838O07290J82136q73596j633781j118341M7188M21448
$$ 1130341 1642427 2242265 2849555 3031691 2158095 524314 -594027 -546839 -125391
37676a25391q0672k97597J4127j82729j106856j383699j68934J312082J434018
$$ -125391 -206063 -503660 -489533 -672262 -1779118 -3162817 -3331751 -2019669 -585651
37667e85651M37790j44673K44449O94812M40488r3990j12377L71397O07279J25880
$$ -585651 -147861 -292534 -48085 646727 1087215 993225 880848 1252245 1859524 1985404
37657A985404o82907j083614q90668n73682m76098l56790L9800M14480M12487
$$ 1985404 1302497 218883 -671785 -1245467 -1721565 -2078355 -2038555 -1624075 -1211588
37648a211588L20216O00560R83932P84700P313o34152p40544m99837l9897N80853
$$ -1211588 -891372 -290812 693120 1477820 1485133 850981 110437 -389400 -429297 151556
37638A51556Q14218J62388o59487l78185P51169R52324l84109j532905r80934
$$ 151556 965774 1128162 468675 90490 841659 1793983 1409874 -123031 -1103965
37629a103965K62919L63587m47872m98171M46823R09614K43330m27315j99776
$$ -1103965 -841046 -477459 -925331 -1423502 -976679 -67065 176265 -251050 -450826
37620d50826K75318J45221k55296k28860L8431j9892k75611k30887K3553Q706
$$ -450826 -175508 -30287 -285583 -514443 -476012 -495904 -771515 -1002402 -978849 -970143
37610i70143k41831k38718R7951K81950J1063m35163o49229n47194k34487K29860
$$ -970143 -1211974 -1450692 -1352741 -1070791 -1059728 -1494891 -2144120 -2691314 -2925801 -2695941
37600b695941P09075Q83797O01306K31851K86418O09409M12561n59122j352442
$$ -2695941 -1986866 -1103069 -501763 -269912 16506 625915 1038476 479354 -873088
37591h73088r61678J23780M92104n0409j22095R53716J790107R59545o34740r77389
$$ -873088 -1834766 -1710986 -1218882 -1269291 -1391386 -437670 1352437 2311982 1677242 699853
37581F99853M799M20841n39688j398356q20627L81464P27602K96962J72712M83262
$$ 699853 704652 1125493 585805 -812551 -1633178 -1251714 -524112 -227150 -54438 428824
37571D28824M05175k43355p06855n63016k24909m5500J85759N93334P77802M01170
$$ 428824 833999 590644 -116211 -679227 -904136 -949636 -763877 -170543 607259 1008429
37561A008429k35968n34414k74845K41675N73227N41013L21672J42896p9236n69654
$$ 1008429 772461 238047 -36798 204877 778104 1319117 1640789 1783685 1704449 1134795
37551A134795j126893j153474m96915J94329L51847K68128M51485O51167L01680
$$ 1134795 7902 -1145572 -1642487 -1448158 -1096311 -828183 -376698 274469 576149
37542E76149l50678m93634o9360J07122k84496n18018l5408N98083N38221j29952
$$ 576149 225471 -268163 -337523 -230401 -514897 -1032915 -1068323 -470240 67981 -61971
37532f1971o49845o35119k61753K32465O26696N55719q6903p17557o45467k9460
$$ -61971 -711816 -1346935 -1608688 -1376223 -749527 -193808 -280711 -998268 -1643735 -1673195
37522a673195L40399K04671J26780M93976Q88862P92241L62119M9501j29862l70057
$$ -1673195 -1332796 -1128125 -1001345 -507369 381493 1173734 1535853 1585354 1455492 1085435
37512A085435m35202L8495O77289N83825l56470j067442o56212L06873N30026
$$ 1085435 650233 688728 1366017 1949842 1593372 525930 -130282 176591 706617
37503G06617k47484r92461q81768l26694j63602l86660k63404M94640J246732
$$ 706617 459133 -533328 -1415096 -1741790 -1905392 -2292052 -2555456 -2060816 -814084
37494h14084J229406N08881j32544j91258o2851m54671j276113j562858p74819
$$ -814084 415322 924203 791659 600401 537550 82879 -1193234 -2756092 -3530911
37485c530911K66435L60310l67678n92705K66568J156205R22174n9802n48701
$$ -3530911 -3264476 -2904166 -3271844 -3864549 -3597981 -2441776 -1519602 -1579404 -2128105
37476b128105j74131L73538N52811M43777J47875l59440p22248m09457L76329
$$ -2128105 -2302236 -1928698 -1375887 -932110 -784235 -1143675 -1865923 -2275380 -1899051
37467a899051P42906L17490k56109l09404l141J44240K598k62681n17123n45665
$$ -1899051 -1156145 -838655 -1094764 -1404168 -1407309 -1263069 -1260471 -1523152 -2040275 -2585940
37457b585940j24199M58967N09311n3134l78855J00825P56687P22104K36768J92603
$$ -2585940 -2710139 -2251172 -1741861 -1794995 -2173850 -2073025 -1316338 -594234 -357466 -164863
37447a64863O74689Q63280L06267n15068r42602q16222l50897Q5003O8727m18514
$$ -164863 509826 1373106 1679373 1164305 221703 -594519 -945416 -860413 -791686 -1210200
37437a210200o55117N9302J295199J848050J289938M21980N85j67836m85188p20790
$$ -1210200 -1865317 -1806015 -510816 1337234 2627172 3049152 3049737 2881901 2396713 1675923
37427A675923n44919l05056n21091r65907r85491n39620k11958k30713j61536
$$ 1675923 1131004 825948 304857 -661050 -1646541 -2186161 -2398119 -2628832 -2790368
37418b790368K80690O69161M14026m28366j164394j165512m30503M65631R03293
$$ -2790368 -2509678 -1840517 -1426491 -1854857 -3019251 -4184763 -4615266 -4149635 -3246342
37409c246342P38092L16052J3240r1233n4221J48680M69529O32891M31111N1358
$$ -3246342 -2508250 -2192198 -2178958 -2270191 -2324412 -2175732 -1706203 -1073312 -642201 -590843
37399e90843j67370j73688j05766O5584L66001M18897j95959j121198j379613
$$ -590843 -758213 -931901 -1037667 -972083 -606082 -187185 -383144 -1504342 -2883955
37390b883955o25656L08383N28577K58229L20861P98043R65156M95536n4711j68529
$$ -2883955 -3509611 -3201228 -2672651 -2414422 -2093561 -1295518 -330362 165174 110463 -58066
37380e8066q9633k15516l21432N803M73963L28614n16934j208008j007113j82107
$$ -58066 -147699 -363215 -684647 -678844 -204881 123733 -393201 -1601209 -2608322 -2790429
37370b790429M47367N37077M42881N61719P85479O70555J6492p77056r70806k35929
$$ -2790429 -2343062 -1805985 -1363104 -801385 -15906 654649 671141 -105915 -1076721 -1312650
37360a312650Q51868J300297P87163P449k46348n8364r2235n28726q15602n21876
$$ -1312650 -460782 839515 1626678 1634127 1387779 1329415 1237180 708454 -107148 -629024
37350f29024L3104K50157M1977j62152o1434J82648K76609K10533J78286J77037
$$ -629024 -595920 -345763 -303786 -465938 -527372 -344724 -68115 142418 320704 497741
37340D97741o2052n97071r16206m30325O22954J198530O68198l14881o26703j07861
$$ 497741 435689 -161382 -1077588 -1507913 -884959 313571 981769 666888 40185 -67676
37330f7676L93304L13049R768k4698R8006P3104j5313p092j26195n64945r07832
$$ -67676 325628 638677 648445 623747 721753 794857 779544 772452 646257 81312 -826520
37319h26520n85116K25631P16283M46342k45445p93391q81496l83956N87381J410959
$$ -826520 -1411636 -1186005 -469722 -23380 -268825 -1062216 -1943712 -2327668 -1740287 -329328
37309c29328J269991R1979j148943j406653o52399K64239O54273N82164M92142
$$ -329328 940663 1032642 -116301 -1522954 -2175353 -1911114 -1256841 -674677 -182535
37300a82535N50463N01043R8845m66126p25680n10484j35805J20502M24360R45257
$$ -182535 367928 868971 967816 501690 -223990 -734474 -870279 -749777 -325417 619840
37290F19840J291041R24882L8251o03940p06558o77733p29526n43696j36294j63576
$$ 619840 1910881 2835763 2874014 2270074 1563516 885783 156257 -387439 -523733 -687309
37280f87309p36776p75183M63143J812990J460745m15916j649908r71360M06577
$$ -687309 -1424085 -2199268 -1736125 76865 1537610 1121694 -528214 -1499574 -1092997
37271a092997P01518o3690n61891k48790K19852L13147K40602K45576K31712K65384
$$ -1092997 -391479 -455169 -1017060 -1265850 -1045998 -732851 -492249 -246673 -14961 250423
37261B50423O57638J274057J426570P86713j31229p14333r55788j060466q88580
$$ 250423 908061 2182118 3608688 4395401 4264172 3549839 2594051 1533585 645005
37252F45005l14510K70196M10820K87591L77432O13744N06300k620m55693o50469
$$ 645005 330495 600691 1011511 1299102 1676534 2290278 2796578 2793958 2338265 1687796
37242A687796q08548q74981m08062N01690R27547L13698n45459m81939L85903
$$ 1687796 879248 4267 -403795 97895 1025442 1339140 793681 311742 697645
37233F97645Q00874J51333p18562p71950j84251O4121l52899o96903k47036O89109
$$ 697645 1498519 1649852 931290 159340 -24911 39210 -313689 -1010592 -1257628 -568519
37223e68519J132459O18069k89024p16758m80667j26494j04071k74592l33103
$$ -568519 563940 1182009 892985 176227 -304440 -430934 -535005 -809597 -1142700
37214a142700l18609l72964k78877K69529J015780J270071P84537P1825l07478
$$ -1142700 -1461309 -1834273 -2113150 -1843621 -827841 442230 1226767 1298592 991114
37205I91114l74034m17283m43699l05206j15818j16020k38171j99233R592R6390
$$ 991114 617080 199797 -243902 -549108 -664926 -780946 -1019117 -1218350 -1208758 -1112368
37195a112368l4980j17078K8286J83505J08900k920K27386P21828Q89862L67594
$$ -1112368 -1147348 -1264426 -1236140 -1052635 -943735 -946655 -719269 2559 892421 1260015
37185A260015m13776o73790k47010J89895l6870p53069j143993o92485K95856
$$ 1260015 846239 172449 -74561 115334 78464 -674605 -1818598 -2511083 -2215227
37176b215227J054602J079140N37141R1867K34869O90069O74965p1810q26494
$$ -2215227 -1160625 -81485 455656 547523 782392 1472461 2147426 2075616 1249122
37167A249122p95140j87231J66188M0684m3261J68536L28848K60127K09886J19384
$$ 1249122 453982 266751 432939 473623 430362 598898 927746 1187873 1397759 1517143
37157A517143m28637j142201r30325M29928J514408J102117l4808l58610J25001
$$ 1517143 1088506 -53695 -984020 -554092 960316 2062433 2027625 1669015 1794016
37148A794016J97319m13800q26314p97554r91111j265662n05922J201283J934152
$$ 1794016 1991335 1577535 751221 -46333 -1037444 -2303106 -2809028 -1607745 326407
37139C26407N79065j261773j356146J64739J346131J237923O34806L23442J33736
$$ 326407 905472 -356301 -1712447 -1547708 -201577 1036346 1671152 1994594 2128330
37130B128330j55291k40325K4599K76510K78694J99392O9466l33879q64955r60876
$$ 2128330 1973039 1732714 1757313 2033823 2312517 2511909 2581375 2247496 1382541 421665
37120D21665m78177K3613J01123k3859q706N4996k1622q7055M7752J84425O944
$$ 421665 -56512 -32899 68224 44365 35659 90655 69033 -18022 29730 214155 221099
37109B21099l95109n84905l01863K39977N48010L20666k09746m74534k29100J39835
$$ 221099 -174010 -758915 -1060778 -820801 -272791 47875 -161871 -636405 -865505 -725670
37099g25670J67217n2053j01111R6802K77309L35692L66122L22010J05246j28628
$$ -725670 -558453 -610506 -711617 -614815 -337506 -1814 364308 686318 791564 662936
37089F62936k20226l62295o67906o82720p3140M95808J74208n44568l52847P20768
$$ 662936 442710 80415 -587491 -1270211 -1343351 -847543 -673335 -1217903 -1570750 -849982
37079h49982J106331J04841r35138p20533L3219J3344l98600J13539J324429J541344
$$ -849982 256349 361190 -573948 -1294481 -1261262 -1247918 -1646518 -1532979 -208550 1332794
37069A332794J91698j239834j304684l84857K39669J75346r061R7933L40168M76267
$$ 1332794 1524492 284658 -1020026 -1404883 -1165214 -989868 -998929 -900996 -560828 -84561
37059h4561M65966K94698q7078n68280q33693o44346j43001K08107J04441k13734
$$ -84561 381405 676103 589025 20745 -812948 -1457294 -1600295 -1392188 -1287747 -1501481
37049a501481k34294J65471N93516P07515N46852K32726j84860m22828r8357N40173
$$ -1501481 -1735775 -1570304 -976788 -269273 277579 510305 325445 -97383 -195740 344433
37039C44433O81516J85562j6498N81483R96227K19501r42005q64180L99932J142404
$$ 344433 1025949 1211511 1195013 1776496 2772723 2992224 2050219 1186039 1585971 2728375
37029B728375N48290k94202k98810J22377J47562o8585N440J79882j1778l80563
$$ 2728375 3276665 2982463 2683653 2806030 2953592 2885007 2890447 3070329 3058551 2677988
37019B677988m53387l28071l90815n24267k85926L47641R30326J032542M83031
$$ 2677988 2224601 1896530 1505715 981448 695522 1043163 1973489 3006031 3489062
37010C489062m84615j093864o48587L76170O29434k63215j038371o67885J00541
$$ 3489062 3004447 1910583 1261996 1638166 2267600 2004385 966014 298129 398670
37001C98670R6549l23336q8278N07945K50721p20894q80189K38222J227089R80671
$$ 398670 495219 171883 83605 591550 842271 121377 -758812 -520590 706499 1687170
36991A687170J98900m0733R2725l7389k10477M3981K74642k59344j226779j582770
$$ 1687170 1886070 1845337 1938062 1900673 1690196 1734177 2008819 1749475 522696 -1060074
36981a060074j042987k76978J59870K32783r622l83151k61845O96458J591154
$$ -1060074 -2103061 -2380039 -2220169 -1987386 -1997008 -2380159 -2642004 -1945546 -354392
36972c54392J110896n48899j662247j178000O7294P92589Q80688Q10530M46922
$$ -354392 756504 207605 -1454642 -2632642 -2565348 -1772759 -892071 -81541 365381
36963C65381m94172j353315j130297j7827P38185N21170o3964l34563k86987k9935
$$ 365381 -128791 -1482106 -2612403 -2630230 -1892045 -1370875 -1434839 -1769402 -2056389 -2086324
36953b086324N31449J079553R23658J79349l0509P48839J340453N97405p56775
$$ -2086324 -1554875 -475322 448336 627685 597176 1346015 2686468 3283873 2527098
36944B527098j151995m89267m5273l03615l96501J26485M40781q1036p48336o73053
$$ 2527098 1375103 885836 840563 536948 140447 266932 707713 626677 -121659 -794712
36934g94712r0909K44931K53800K80126K43034j08382m87338m04889N2050M17962
$$ -794712 -885621 -640690 -386890 -106764 136270 27888 -459450 -864339 -812289 -394327
36924c94327N31766M39056j3294q06432j301124r00311M6362O69256P03877N46993
$$ -394327 137439 576495 563201 -243231 -1544355 -2444666 -2398304 -1729048 -1025171 -478178
36914d78178M42496L35813L46295O30676Q83685O66848J23404k69487m49514n91907
$$ -478178 -35682 300131 646426 1277102 2160787 2827635 2951039 2681552 2232038 1640131
36904A640131n10566q0170R6898n02421j139198o98656L96196O26186j93048n58356
$$ 1640131 1129565 1049395 1146293 643872 -495326 -1193982 -797786 -171600 -364648 -923004
36894i23004K32496R36890N14954j86739o5918L25641k2141n75331j47341R11088
$$ -923004 -690508 246382 761336 574597 508679 834320 812179 236848 89507 1000595
36884A000595J157136L55731l17576k83829k11324n39755q00383p12829o79792
$$ 1000595 2157731 2513462 2195886 1912057 1700733 1160978 360595 -352234 -1032026
36875a032026q06885n97970m5763J14271k53744k18064O79329J466808J169105
$$ -1032026 -1838911 -2436881 -2482644 -2368373 -2622117 -2840181 -2160852 -694044 475061
36866D75061K80933j48518j30773l18713n44207o7327Q99358J166425K52850q92584
$$ 475061 755994 607476 476703 157990 -386217 -453544 445814 1612239 1865089 972505
36856I72505j181757o30312N0167M45586N64673M44385J35806j45148k31823k48011
$$ 972505 -209252 -839564 -789397 -343811 220862 665247 801053 655905 424082 176071
36846A76071m00133o61968q31143p42694l15832L82199R89805J055552N85126
$$ 176071 -224062 -886030 -1717173 -2459867 -2775699 -2393500 -1403695 -348143 236983
36837B36983R6319q9466k47114o03802p22181j40671O24630N15820n69799j474571
$$ 236983 333302 243836 -3278 -607080 -1329261 -1469932 -845302 -329482 -899281 -2373852
36827b373852j250680k91108M07349N36526M84658M96279M93505N02087N97849
$$ -2373852 -3624532 -3915640 -3508291 -2971765 -2487107 -1990828 -1497323 -995236 -397387
36818c97387N19520m3728p64251q58941r8742Q18170J059533M92866l44921p84386
$$ -397387 122133 78405 -685846 -1544787 -1643529 -825359 234174 727040 382119 -402267
36808d02267n05758J75806N18587J87022k48470j03074L38465K48789l28692m37472
$$ -402267 -908025 -732219 -213632 -26610 -275080 -378154 -39689 209100 -119592 -557064
36798e57064K49537Q46703O47080J32847n5805k52631r45516j539477j073353
$$ -557064 -307527 539176 1186256 1319103 1263298 1010667 65151 -1474326 -2547679
36789b547679J93114J009526Q20598K37284j30994l43373n23150m93999k85001
$$ -2547679 -2354565 -1345039 -524441 -287157 -418151 -761524 -1284674 -1778673 -2063674
36780b063674k59099m30815k68060M97037J332511J482535P66917l31515j076249
$$ -2063674 -2322773 -2753588 -3021648 -2524611 -1192100 290435 1057352 725837 -350412
36771c50412r67753j97426M19131L35006n6870j06152M9060j40508m71073k08987
$$ -350412 -1318165 -1515591 -1096460 -761454 -818324 -924476 -875416 -1015924 -1486997 -1695984
36761a695984N54733Q88735N36413K85235M64421L08883n36060j075906m82299
$$ -1695984 -1141251 -252516 283897 569132 1033553 1342436 806376 -269530 -751829
36752g51829M60730N60706N9404M700L95019L60888j36846k50384J58287K70735
$$ -751829 -291099 269607 329011 333711 728730 1089618 952772 702388 860675 1131410
36742A131410j50770l17453Q7474K13218n05300j267250j114215l74408M1705
$$ 1131410 980640 663187 750661 963879 458579 -808671 -1922886 -2297294 -2255589
36733b255589J30545M92048R27902N66906n54884j161587m46793P02976Q84060
$$ -2255589 -2125044 -1632996 -705094 -138188 -693072 -1854659 -2301452 -1598476 -714416
36724g14416Q7214l91653J56096Q94570P10208j98819o54781j54488N59944O57167
$$ -714416 -627202 -1018855 -862759 31811 742019 543200 -111581 -266069 293875 951042
36714I51042K39083j28172l12386m94422n54864k51111J77632K42253j0493p8568
$$ 951042 1190125 1061953 749567 255145 -299719 -550830 -373198 -130945 -141438 -220006
36704b20006J14135J03005j99486j94210M14356R37152N85653l55109q61787m95679
$$ -220006 -105871 -2866 -202352 -396562 17794 954946 1540599 1185490 323703 -171976
$$ [...]
##END NTUPLES=NMR SPECTRUM
##END=
