##TITLE=31Pdec_DE-54EAK_d6
 DMSO-d6
 64 sc
 8.5.2024
##JCAMPDX= 6.0         $$ Bruker NMR JCAMP-DX V2.0
##DATA TYPE= NMR SPECTRUM
##DATA CLASS= NTUPLES
##ORIGIN= UXNMR, Bruker Analytische Messtechnik GmbH
##OWNER= root
$$ XWIN-NMR		Version 3.5
$$ Wed May  8 14:29:23 2024 Russian Standard Time (UT+4h)  she@DPX200
##.OBSERVE FREQUENCY= 81.013821
##.OBSERVE NUCLEUS= ^31P
##.ACQUISITION MODE= SIMULTANEOUS
##.ACQUISITION SCHEME= undefined
##.AVERAGES= 64
##.DIGITISER RES= 16
##SPECTROMETER/DATA SYSTEM= spect
##.PULSE SEQUENCE= zgpg30
##.SOLVENT NAME= CDCl3
##.SHIFT REFERENCE= (INTERNAL, CDCl3, 0, 248.564)
##AUDIT TRAIL= $$ (NUMBER, WHEN, WHO, WHERE, WHAT)
$$ ##TITLE= Audit trail, XWIN-NMR		Version 3.5
$$ ##JCAMPDX= 5.01
$$ ##ORIGIN= Bruker BioSpin GmbH
$$ ##OWNER= she
$$ F:/spectra/data/she/nmr/P31/1/pdata/1/auditp.txt
$$ ##AUDIT TRAIL=  $$ (NUMBER, WHEN, WHO, WHERE, WHAT)
(   1,<2024-05-08 14:28:31.20 +0400>,<she>,<DPX200>,
      <continue with go, POWCHK disabled, PULCHK disabled
       configuration hash MD5:
       00 E9 B6 7A A2 85 ED C7 34 08 36 98 17 FE 4E 26
       data hash MD5: 32K
       61 D8 07 BE A5 E6 3F 7D 39 CE 35 1E 69 3C FE 5F>)
(   2,<2024-05-08 14:28:36.60 +0400>,<she>,<DPX200>,
      <Start of raw data processing
       efp BC_mod = 2 LB = 10 FT_mod = 6 PKNL = 1 PHC0 = -13221.93 PHC1 = -4.916168 SI = 64K 
       data hash MD5: 64K
       23 9C 1D 9F 55 BF 68 DF E5 70 0E 04 BA 05 27 CC>)
(   3,<2024-05-08 14:28:52.06 +0400>,<she>,<DPX200>,
      <pk PHC0 = 27.81564 PHC1 = 0 
       data hash MD5: 64K
       0F F2 76 62 A1 30 87 FC 48 46 DE 11 60 CF 2B CA>)
$$ ##END=
$$ 
$$ hash MD5
$$ 45 17 9D C9 BE 6D 0A A9 CA 50 C4 41 20 12 84 A8
##$RELAX= 
##$RELAX= 
##$RELAX= 
##$RELAX= 
##$RELAX= 
##$RELAX= 
##$RELAX= 
##$RELAX= 
##$RELAX= 
$$ Bruker specific parameters
$$ --------------------------
##$DU= <F:/spectra>
##$EXPNO= 1
##$NAME= <P31>
##$PROCNO= 1
##$TYPE= <nmr>
##$USER= <she>
##$AMP= (0..31)
100 100 100 100 100 100 100 100 100 100 100 100 100 100 100 100 100 100 
100 100 100 100 100 100 100 100 100 100 100 100 100 100 
##$AQSEQ= 0
##$AQ_mod= 1
##$AUNM= <au_zg>
##$AUTOPOS= <>
##$BF1= 81.014009
##$BF2= 200.13
##$BF3= 200.13
##$BF4= 200.13
##$BF5= 200.13
##$BF6= 200.13
##$BF7= 200.13
##$BF8= 200.13
##$BYTORDA= 1
##$CFDGTYP= 0
##$CFRGTYP= 5
##$CHEMSTR= <none>
##$CNST= (0..31)
1 1 145 1 1 1 1 1 1 1 1 1 1 1 1 1 1 1 1 1 1 1 1 1 1 1 1 1 1 1 1 1 
##$CPDPRG= <waltz16>
##$CPDPRG1= <>
##$CPDPRG2= <waltz16>
##$CPDPRG3= <>
##$CPDPRG4= <mlev>
##$CPDPRG5= <mlev>
##$CPDPRG6= <mlev>
##$CPDPRG7= <mlev>
##$CPDPRG8= <mlev>
##$CPDPRGB= <>
##$CPDPRGT= <>
##$D= (0..31)
0 1 0 0 0 0 0 0 0 0 0 0.03 2e-05 3e-06 0 0 0 0 0 0 0 0 0 0 0 0 0 0 0 0 
0 0 
##$DATE= 1715164033
##$DBL= (0..7)
120 120 120 11 120 120 24 19 
##$DBP= (0..7)
150 150 150 150 150 150 150 150 
##$DBP07= 0
##$DBPNAM0= <>
##$DBPNAM1= <>
##$DBPNAM2= <>
##$DBPNAM3= <>
##$DBPNAM4= <>
##$DBPNAM5= <>
##$DBPNAM6= <>
##$DBPNAM7= <>
##$DBPOAL= (0..7)
0.5 0.5 0.5 0.5 0.5 0.5 0.5 0.5 
##$DBPOFFS= (0..7)
$$ [...]
##$SUBNAM2= <"">
##$SUBNAM3= <"">
##$SUBNAM4= <"">
##$SUBNAM5= <"">
##$SUBNAM6= <"">
##$SUBNAM7= <"">
##$SUBNAM8= <"">
##$SUBNAM9= <"">
##$SW= 501.771253377433
##$SWIBOX= (0..15)
0 1 3 0 0 0 0 0 0 0 0 0 0 0 0 0 
##$SW_h= 40650.406504065
##$TD= 32768
##$TD0= 1
##$TE= 0
##$TE2= 300
##$TE3= 300
##$TEG= 300
##$TL= (0..7)
0 120 53 12 22 120 120 120 
##$TP= (0..7)
150 150 150 150 150 150 150 150 
##$TP07= 0
##$TPNAME0= <>
##$TPNAME1= <>
##$TPNAME2= <>
##$TPNAME3= <>
##$TPNAME4= <>
##$TPNAME5= <>
##$TPNAME6= <>
##$TPNAME7= <>
##$TPOAL= (0..7)
0.5 0.5 0.5 0.5 0.5 0.5 0.5 0.5 
##$TPOFFS= (0..7)
0 0 0 0 0 0 0 0 
##$TUNHIN= 0
##$TUNHOUT= 0
##$TUNXOUT= 0
##$USERA1= <user>
##$USERA2= <user>
##$USERA3= <user>
##$USERA4= <user>
##$USERA5= <user>
##$V9= 5
##$VALIST= <valist>
##$VCLIST= <CCCCCCCCCCCCCCC>
##$VD= 0
##$VDLIST= <DDDDDDDDDDDDDDD>
##$VPLIST= <PPPPPPPPPPPPPPP>
##$VTLIST= <TTTTTTTTTTTTTTT>
##$WBST= 1024
##$WBSW= 4
##$XGAIN= (0..3)
0 0 0 0 
##$XL= 0
##$YL= 0
##$YMAX_a= 2438
##$YMIN_a= -2163
##$ZGOPTNS= <>
##$ZL1= 120
##$ZL2= 120
##$ZL3= 120
##$ZL4= 120
##$ABSF1= 0
##$ABSF2= 0
##$ABSG= 0
##$ABSL= 0
##$ALPHA= 0
##$AQORDER= 0
##$ASSFAC= 0
##$ASSFACI= 0
##$ASSFACX= 0
##$ASSWID= 0
##$AUNMP= <proc_1d>
##$AZFE= 0.1
##$AZFW= 0.5
##$BCFW= 0
##$BC_mod= 2
##$BYTORDP= 0
##$COROFFS= 0
##$CY= -3
##$DATMOD= 1
##$DC= 0
##$DFILT= <>
##$DTYPP= 0
##$F1P= 0
##$F2P= 0
##$FCOR= 1
##$FTSIZE= 65536
##$FT_mod= 6
##$GAMMA= 0
##$GB= 0
##$INTBC= 1
##$INTSCL= 6.047779e-11
##$ISEN= 30
##$LB= 10
##$LEV0= 0
##$LPBIN= 0
##$MAXI= 10000
##$MC2= 0
##$MEAN= 0
##$ME_mod= 0
##$MI= 50
##$NCOEF= 0
##$NC_proc= -10
##$NLEV= 6
##$NOISF1= 182.463
##$NOISF2= 159.3651
##$NSP= 0
##$NTH_PI= 0
##$NZP= 0
##$OFFSET= 248.5645
##$PC= 4
##$PHC0= -13194.11
##$PHC1= -4.916168
##$PH_mod= 1
##$PKNL= yes
##$PPARMOD= 0
##$PSCAL= 0
##$PSIGN= 0
##$REVERSE= no
##$SF= 81.0140089999694
##$SI= 65536
##$SIGF1= 159.3651
##$SIGF2= -187.1042
##$SINO= 113.3802
##$SIOLD= 16384
##$SREGLST= <1H.CDCl3>
##$SSB= 0
##$STSI= 65536
##$STSR= 0
##$SW_p= 40650.406504065
##$SYMM= 0
##$S_DEV= 0
##$TDeff= 32768
##$TDoff= 0
##$TI= <>
##$TILT= no
##$TM1= 0
##$TM2= 0
##$TOPLEV= 0
##$USERP1= <user>
##$USERP2= <user>
##$USERP3= <user>
##$USERP4= <user>
##$USERP5= <user>
##$WDW= 1
##$XDIM= 65536
##$YMAX_p= 283300913
##$YMIN_p= -43331324
$$ End of Bruker specific parameters
$$ ---------------------------------
##NTUPLES= NMR SPECTRUM
##VAR_NAME=  FREQUENCY,     SPECTRUM/REAL,   SPECTRUM/IMAG
##SYMBOL=    X,             R,               I
##VAR_TYPE=  INDEPENDENT,   DEPENDENT,       DEPENDENT
##VAR_FORM=  AFFN,          ASDF,            ASDF
##VAR_DIM=   65536,         65536,           65536
##UNITS=     HZ,            ARBITRARY UNITS, ARBITRARY UNITS
##FACTOR=    0.620285442955139, 1,           1
##FIRST=     20137.2065510682, 0,            0
##LAST=      -20513.1999529968, 0,           0
##MIN=       -20513.1999529968, -43331324,   0
##MAX=       20137.2065510682, 283300913,    0
$$ Real data points
##PAGE= N=1
##DATA TABLE= (X++(R..R)), XYDATA
$$ [...]
41281e259801j543071j535508j420119j185375q41701m25586Q334M05081P24974
$$ -5259801 -6802872 -8338380 -9758499 -10943874 -11785575 -12211161 -12202827 -11797746 -11072772
41272a1072772R47673J067074J086910J022468R03916P73294O72913O30967O51809
$$ -11072772 -10125099 -9058025 -7971115 -6948647 -6044731 -5271437 -4598524 -3967557 -3315748
41263c315748P14761P81850Q12760P81816O88018N51752M01807K63364J53388
$$ -3315748 -2600987 -1819137 -1006377 -224561 463457 1015209 1417016 1680380 1833768
41254A833768Q0485M4253L5806M4013O4876J04564J71225K62945L63431M48035
$$ 1833768 1914253 1958506 1994312 2038325 2103201 2207765 2378990 2641935 3005366 3453401
41244C453401M92217M74735L77499J89530q3129m09628p38851j016837j206133
$$ 3453401 3945618 4420353 4797852 4987382 4904253 4494625 3755774 2738937 1532804
41235A532804j294188j287622j200159j044759q34785n91233l48274j49417l2188
$$ 1532804 238616 -1049006 -2249165 -3293924 -4128709 -4719942 -5068216 -5217633 -5249821
41226e249821r277o0413j42763k12169k38470k06802j12414L9065K25439M06842
$$ -5249821 -5259098 -5319511 -5462274 -5674443 -5912913 -6119715 -6232129 -6193064 -5967625 -5560783
41216e560783N37858N87781N55709M70813L77733L14528K93745K96201K81656
$$ -5560783 -5022925 -4435144 -3879435 -3408622 -3030889 -2716361 -2422616 -2126415 -1844759
41207a844759K11182O8288j33665l61001n78393p64009r12908j029306j114805
$$ -1844759 -1633577 -1565289 -1698954 -2059955 -2638348 -3402357 -4315265 -5344571 -6459376
41198f459376j160386j146857j054340q77283o37601l87396j96837j30604k22462
$$ -6459376 -7619762 -8766619 -9820959 -10698242 -11335843 -11723239 -11920076 -12050680 -12273142
41189a2273142m58566p76685j082368j276130j280928j060801o28280m3255N95708
$$ -12273142 -12731708 -13508393 -14590761 -15866891 -17147819 -18208620 -18836900 -18880155 -18284447
41180a8284447J170364J572470J735450J653458J378399R97978O06614K80801
$$ -18284447 -17114083 -15541613 -13806163 -12152705 -10774306 -9776328 -9169714 -8888913
41172h888913O4773l1934k6109N3332J76206L11785M23380M69874M21842K82650
$$ -8888913 -8824140 -8856074 -8882183 -8828851 -8652645 -8340860 -7917480 -7447606 -7025764 -6743114
41162f743114R4653p8971j85165k03324j47232n0806N1016J37331K07750K79011
$$ -6743114 -6648461 -6727432 -6912597 -7115921 -7263153 -7313959 -7262943 -7125612 -6917862 -6638851
41152f638851L74519N13102P02129R35479J194294J449834J668689J819037J875391
$$ -6638851 -6264332 -5751230 -5049101 -4113622 -2919328 -1469494 199195 2018232 3893623
41143C893623J821361J652414J379806J033658O61249L17853N0853j17257j97917
$$ 3893623 5714984 7367398 8747204 9780862 10442111 10759964 10810817 10693560 10495643
41134A0495643k30521k63259l31506m45084n87536p22851q04883p89036o46494
$$ 10495643 10265122 10001863 9670357 9225273 8637737 7914886 7110003 6320967 5674473
41125E674473l77087j3772L84676P49165J016846J144075J114702R43282O71902
$$ 5674473 5297386 5283614 5668290 6417455 7434301 8578376 9693078 10636360 11308262
41116A1308262L60447P2982j35905k32058k08051q2793J06528L17682N16551O84787
$$ 11308262 11668709 11741691 11605786 11373728 11165677 11082884 11189412 11507094 12023645 12708432
41106A2708432Q18786R20678R87455J007638R70042Q77565P52446O26560N23918
$$ 12708432 13527218 14447896 15435351 16442989 17413031 18290596 19043042 19669602 20193520
41097B0193520M47539L76546K72126R0444j98700n92740j047405j486788j830828
$$ 20193520 20641059 21017605 21289731 21380175 21181475 20588735 19541330 18054542 16223714
41088A6223714k027168k070405j998331j868383j728956j601193j478133j338089
$$ 16223714 14196546 12126141 10127810 8259427 6530471 4929278 3451145 2113056
41080B113056j163519r54980p31241n14890l14785j21051Q2250K97895N06169
$$ 2113056 949537 -5443 -736684 -1251574 -1566359 -1687410 -1605160 -1307265 -801096
41071h01096O72634P66321P74316P01868N59650L52789Q6312k16791n06422p21125
$$ -801096 -128462 637859 1412175 2114043 2673693 3026482 3112794 2896003 2389581 1668456
41061A668456q18521p94278o75849n01300l01623r4501J13630L22039N30049P34780
$$ 1668456 849935 55657 -620192 -1121492 -1423115 -1517616 -1403986 -1081947 -551898 182882
41051A82882R33285J124576J306560J470375J600228J681662J711479J700300
$$ 182882 1116167 2240743 3547303 5017678 6617906 8299568 10011047 11711347
41043A1711347J666218J624958J582102J529444J446411J307909J097398Q18461
$$ 11711347 13377565 15002523 16584625 18114069 19560480 20868389 21965787 22784248
41035B2784248M96304J67135j36600l94201n94581p30427p96023p89284p13077
$$ 22784248 23280552 23447687 23311087 22916886 22322305 21591878 20795855 20006571 19293494
41026A9293494n73364l76793j31757J46927M33526O91860Q82936R77558R67971
$$ 19293494 18720130 18343337 18211580 18358507 18792033 19483893 20366829 21344387 22312358
41017B2312358Q72067P26954N73924M41491L35256K40763J37521J4620j22162
$$ 22312358 23184425 23911379 24485303 24926794 25262050 25502813 25640334 25654954 25532792
41008B5532792k53327l52923l95007l59909k41713n3772J72566L95607N72146
$$ 25532792 25279465 24926542 24531535 24171626 23929913 23876141 24048707 24444314 25016460
40999B5016460O64836O50539N30493L35813J19811o2587j76949k20252k16916
$$ 25016460 25681296 26331835 26862328 27198141 27317952 27255365 27078416 26858164 26641248
40990B6641248k05297k21871k87802m01659n42060o80511p97909q94588r87682
$$ 26641248 26435951 26214080 25926278 25524619 24982559 24302048 23504139 22609551 21621869
40981B1621869j097811j233006j379336j505283j580350j597769j584032j584366
$$ 21621869 20524058 19291052 17911716 16406433 14826083 13228314 11644282 10059916
40973A0059916j632357j726823j833399j907255j917969j861109j755219j630800
$$ 10059916 8427559 6700736 4867337 2960082 1042113 -818996 -2574215 -4205015
40965d205015j517351j432806j379907j350670j333128j313152j272061j187374
$$ -4205015 -5722366 -7155172 -8535079 -9885749 -11218877 -12532029 -13804090 -14991464
40957a4991464j040001q22552n42723k22286J05495M01922O35417P95908Q99599
$$ -14991464 -16031465 -16854017 -17396740 -17619026 -17513531 -17111609 -16476192 -15680284 -14780685
40948a4780685R77597J053996J127127J166296J128699R88529P58927M88905K36810
$$ -14780685 -13803088 -12749092 -11621965 -10455669 -9326970 -8338441 -7579514 -7090609 -6853799
40939f853799M3087p6288j17834q0622K8441J82172L30539M14718L90300K47557
$$ -6853799 -6810712 -6887000 -7004834 -7085456 -7057015 -6874843 -6544304 -6129586 -5739286 -5491729
40929e491729J9885k24376m06032m66518l91895k16770n970J76406K94642L51705
$$ -5491729 -5471844 -5696220 -6102252 -6568770 -6960665 -7177435 -7183405 -7006999 -6712357 -6360652
40919f360652L77407M02178M33132M48225M12863L08359J53144K195p5860l1167
$$ -6360652 -5983245 -5581067 -5147935 -4699710 -4286847 -3978488 -3825344 -3823149 -3899009 -3930176
40909c930176J42687M04075O80769R00155J015947J018204R26490P77517O16579
$$ -3930176 -3787489 -3383414 -2702645 -1802490 -786543 231661 1158151 1935668 2552247
40900B552247M90499M35300M61496N49822O64947P78182Q81599R84255J096274
$$ 2552247 3042746 3478046 3939542 4489364 5154311 5932493 6814092 7798347 8894621
40891H894621J214196J317286J375341J361354J260992J075062Q16536N05584
$$ 8894621 10108817 11426103 12801444 14162798 15423790 16498852 17315388 17820972
40883A7820972J64754j84617n23559q33918j095980j287658j386768j377491j260862
$$ 17820972 17985726 17801109 17277550 16443632 15347652 14059994 12673226 11295735 10034873
40874A0034873j064210q39905o48610n34907n10329n52086o14442o46600o13128
$$ 10034873 8970663 8130758 7482148 6947241 6436912 5884826 5270384 4623784 4010656
40865D010656n10962l72541k49389j84874j93737k59694l48564m26546m73868
$$ 4010656 3499694 3127153 2877764 2692890 2499153 2239459 1890895 1464349 990481
40856I90481m88579m80597m61459m37344m09540l80929l63307l79129m52366n89511
$$ 990481 501902 21305 -440154 -877498 -1287038 -1667967 -2031274 -2410403 -2862769 -3452280
40846c452280p62179r07276r50624q41967n80241k15584J70279M93636O95617
$$ -3452280 -4214459 -5121735 -6072359 -6914326 -7494567 -7710151 -7539872 -7046236 -6350619
40837f350619P57141O98410N65641M12677K85146K10260J91360K07107K18436
$$ -6350619 -5593478 -4895068 -4329427 -3916750 -3631604 -3421344 -3229984 -3022877 -2804441
40828b804441J85167Q6526o6668k36333l73887m37404m01155k58233j9762K89029
$$ -2804441 -2619274 -2532748 -2599416 -2835749 -3209636 -3647040 -4048195 -4306428 -4326190 -4037161
40818d037161O36140R90093J322016J602649J800143J884314J836661J659664
$$ -4037161 -3401021 -2410928 -1088912 513737 2313880 4198194 6034855 7694519
40810G694519J378159J030866O56810K84591p1159m07113p24647j020521j278729
$$ 7694519 9072678 10103544 10760354 11044945 10973786 10566673 9842026 8821505 7542776
40801G542776j471544j573392j578104j503854j381690j240321j100470r77042
$$ 7542776 6071232 4497840 2919736 1415882 34192 -1206129 -2306599 -3283641
40793c283641q78663q02482p33430o53146n50623m23593k71368r0267J21386L53789
$$ -3283641 -4162304 -4964786 -5698216 -6351362 -6901985 -7325578 -7596946 -7687213 -7565827 -7212038
40783g212038N82700P78279R20870J012406J073874J129413J189144J244767J279724
$$ -7212038 -6629338 -5851059 -4930189 -3917783 -2843909 -1714496 -525352 719415 1999139
40774A999139J281522J243989J161218J025120Q32280N92695L30147P2927j57465
$$ 1999139 3280661 4524650 5685868 6710988 7543268 8135963 8466110 8539037 8381572
40765H381572l52107n12520o42879p41957q01057q10186p66980o79830n62584
$$ 8381572 8029465 7516945 6874066 6132109 5331052 4520866 3753886 3074056 2511472
40756B511472m27566k85391j52517n8012l9369j25716l18784n86382q74049j125962
$$ 2511472 2083906 1798515 1645998 1587986 1548617 1422901 1104117 517735 -356314 -1482276
40746a482276j300899j377637j354697j250021j098841r45062q26926p64387p55294
$$ -1482276 -2783175 -4160812 -5515509 -6765530 -7864371 -8809433 -9636359 -10400746 -11156040
40737a1156040p81384q18742q45883q45878q04385p07987n45631l13131j9609
$$ -11156040 -11937424 -12756166 -13602049 -14447927 -15252312 -15960299 -16505930 -16819061 -16838670
40728a6838670L06304O16128Q53627R78625R89598R27663Q55367Q21468Q33146
$$ -16838670 -16532366 -15916238 -15062611 -14083986 -13094388 -12166725 -11311358 -10489890 -9656744
40719i656744Q52281Q17055O75364M11247N2252l41623o97911r50550j052911
$$ -9656744 -8804463 -7987408 -7312044 -6900797 -6848545 -7190168 -7888079 -8838629 -9891540
40710i891540r84659p53040l88717O2485N48091J014002J406988J680355J806713
$$ -9891540 -10876199 -11629239 -12017956 -11955471 -11407380 -10393378 -8986390 -7306035 -5499322
40701e499322J792651J683904J553870J479462J515388J676587J933150K217472
$$ -5499322 -3706671 -2022767 -468897 1010565 2525953 4202540 6135690 8353162
40693H353162K440947K516268K381136K017828J460667P85155Q2372n67197j106992
$$ 8353162 10794109 13310377 15691513 17709341 19170008 19955163 20037535 19470338 18363346
40684A8363346j503900j743412j827701j775511j618745j393875j131603q51106
$$ 18363346 16859446 15116034 13288333 11512822 9894077 8500202 7368599 6517493
40676F517493n63058k77774q224K37571M65278O88263R05708J084776J167942
$$ 6517493 5954435 5676661 5668437 5906008 6371286 7059549 7965257 9050033 10217975
40667A0217975J103622Q76200N13251O8648m01857q55121j259676j587098j808137
$$ 10217975 11321597 12197797 12711048 12779696 12377839 11522718 10263042 8675944 6867807
40658F867807j900378j862830j725067j540785j366874j240315j167555j131702
$$ 6867807 4967429 3104599 1379532 -161253 -1528127 -2768442 -3935997 -5067699
40650e067699j110049j088565j065249j044035j025930j002629r54453q52590
$$ -5067699 -6177748 -7266313 -8331562 -9375597 -10401527 -11404156 -12358609 -13211199
40642a3211199o64842l63531O6204O20003J272041J977520K677602L304756L790692
$$ -13211199 -13876041 -14239572 -14173368 -13553365 -12281324 -10303804 -7626202 -4321446 -530754
40633e30754M080576M150827M019439L739273L376381K985817K596962K212885
$$ -530754 3549822 7700649 11720088 15459361 18835742 21821559 24418521 26631406
40625B6631406J820900J407498R69934N19863Q0225l20299o52938q95289j038762
$$ 26631406 28452306 29859804 30829738 31349601 31429826 31109527 30456589 29561300 28522538
40616B8522538j094660j095492j088804j122642j226327j396568j599432j788867
$$ 28522538 27427878 26332386 25243582 24120940 22894613 21498045 19898613 18109746
40608A8109746j929630k009803k037542k027842j988908j915147j789814j595881
$$ 18109746 16180116 14170313 12132771 10104929 8116021 6200874 4411060 2815179
40600B815179j328999j004447o54176l16259k2244K13224L97095N53854P12268
$$ 2815179 1486180 481733 -172443 -488702 -510946 -297722 99373 653227 1365495
40591A365495Q88578J075249J241040J341702J336912J208474R72796O79219L91335
$$ 1365495 2254073 3329322 4570362 5912064 7248976 8457450 9430246 10109465 10500800
40582A0500800J60611Q554p3319j10584j31932j61033k12533k87764l69914m24241
$$ 10500800 10661411 10669965 10596646 10486062 10354130 10193097 9980564 9692800 9322886 8898645
40572H898645m09390k97693r2090J73458M50228O94269Q76627R83893J015834
$$ 8898645 8489255 8191562 8099472 8272930 8723158 9417427 10294054 11277947 12293781
40563A2293781R82472Q98366P75747O22942M49891K73572J15242r523r9158j65171
$$ 12293781 13276253 14174619 14950366 15573308 16023199 16296771 16412013 16402490 16303332 16138161
40553A6138161k22164k76138l19612l36595l12635k42032j28549J7950J84952
$$ 16138161 15915997 15639859 15320247 14983652 14671017 14428985 14300436 14318386 14503338
40544A4503338L59067N26046O69637P71121Q11492P75172O52298M39339J41698
$$ 14503338 14862405 15388451 16058088 16829209 17640701 18415873 19068171 19507510 19649208
40535A9649208k20554o08967r71611j257050j431136j488749j454321j369077
$$ 19649208 19428654 18819687 17848076 16591026 15159890 13671141 12216820 10847743
40527A0847743j270229j174791j079362r75778q70631p95144p99048r30279j208459
$$ 10847743 9577514 8402723 7323361 6347583 5476952 4681808 3882760 2952481 1744022
40518A744022j604800k041302k413519k626776k627049k412113k021801j517117
$$ 1744022 139222 -1902080 -4315599 -6942375 -9569424 -11981537 -14003338 -15520455
40510a5520455r59856m00263J24727N84493R46231J175063J246602J162555R53637
$$ -15520455 -16480311 -16880574 -16755847 -16171354 -15225123 -14050060 -12803458 -11640903 -10687266
40501a0687266O64945L36139p613l51122o80414r77737j220762j384786j448909
$$ -10687266 -10022321 -9686182 -9693795 -10044917 -10725331 -11703068 -12923830 -14308616 -15757525
40492a5757525j404404j258894j032662p51618m43728j38651J35098L57370N23015
$$ -15757525 -17161929 -18420823 -19453485 -20205103 -20648831 -20787482 -20652384 -20295014 -19771999
40483a9771999O41810P30376P99853Q46338Q51724P97330O82316N32113L88679
$$ -19771999 -19130189 -18399813 -17599960 -16753622 -15901898 -15104568 -14422252 -13890139 -13501460
40474a3501460K90165K57057K94480M03602N85945Q33042J111492J361774J518481
$$ -13501460 -13211295 -12954238 -12659758 -12256156 -11670211 -10837169 -9725677 -8363903 -6845422
40465f845422J540268J429279J229083J005410Q20638P11092O74278O72911O56366
$$ -6845422 -5305154 -3875875 -2646792 -1641382 -820744 -109652 564626 1237537 1893903
40456A893903N88138M61708K96125J18765m9523j97973l20746m11461m63383m74303
$$ 1893903 2482041 2943749 3239874 3358639 3309116 3111143 2790397 2378936 1915553 1441250
40446A441250m49598l97577l19127k02109k9616K01206M65197P13663Q95992R83003
$$ 1441250 991652 594075 274948 72839 43223 244429 709626 1423289 2319281 3302284
40436C302284R75690Q95480P66263O03334M15954K16868K6525j32659k44793l02533
$$ 3302284 4277974 5173454 5939717 6543051 6959005 7175873 7202398 7069739 6824946 6522413
40426F522413l02784k44046j29470K9573K15615M10391N95499P47388Q36085Q36376
$$ 6522413 6219629 5975583 5846113 5875686 6091301 6501692 7097191 7844579 8680664 9517040
40416I517040P46526N97488M39885L14686K29637J60875P8479k5956j32752k12082
$$ 9517040 10263566 10861054 11300939 11615625 11845262 12006137 12084616 12058660 11925908 11713826
40406A1713826k48260k49069k35072k21650k09309j87214j44062p7619K633Q1308
$$ 11713826 11465566 11216497 10981425 10759775 10550466 10363252 10219190 10141571 10144204 10225512
40396A0225512J48571K09445K82213L83712N10504O30554O94035O57966N08558
$$ 10225512 10374083 10583528 10865741 11249453 11759957 12390511 13084546 13742512 14251070
40387A4251070K66315k7875l32976o18672q62673j043969j142695j146424j054218
$$ 14251070 14517385 14489510 14156534 13537862 12675189 11631220 10488525 9342101 8287883
40378H287883q74737o23755l26196j8164K59507M75315O17098O88446O95670O38753
$$ 8287883 7413146 6789391 6463195 6445031 6704538 7179853 7796951 8485397 9181067 9819820
40368I819820N14382L25627Q5854j88996m92036q26768j193065j569561j910752
$$ 9819820 10334202 10659829 10745683 10556687 10064651 9237883 8044818 6475257 4564505
40359D564505k164855k299281k314390k237853k107333j954041j794558j631094
$$ 4564505 2399650 100369 -2214021 -4451874 -6559207 -8513248 -10307806 -11938900
40351a1938900j456237j257204j017547p19548l51836P9370N43870R93026J375149
$$ -11938900 -13395137 -14652341 -15669888 -16389436 -16741272 -16661902 -16118032 -15125006 -13749857
40342a3749857J652328J811702J868325J858533J824009J791748J759890J698193
$$ -13749857 -12097529 -10285827 -8417502 -6558969 -4734960 -2943212 -1183322 514871
40334E14871J562902J316854R44574M58417j01444o70741j170709j526175j687511
$$ 514871 2077773 3394627 4339201 4797618 4696174 4025433 2854724 1328549 -358962
40325c58962j645063j427445j086099o76791k47933J61592N19161P96113R69412
$$ -358962 -2004025 -3431470 -4517569 -5194360 -5442293 -5280701 -4761540 -3965427 -2996015
40316b996015J024603R55513P61316M47275L2491m41488r11444j305618j562331
$$ -2996015 -1971412 -1015899 -254583 192692 225183 -216305 -1127749 -2433367 -3995698
40307c995698j644445j544869j283823r01550m50290J3450M38666P92374J068824
$$ -3995698 -5640143 -7185012 -8468835 -9370385 -9820675 -9807225 -9368559 -8576185 -7507361
40298g507361J286235J469593J630455J758245J828166J817817J720024J545910
$$ -7507361 -6221126 -4751533 -3121078 -1362833 465333 2283150 4003174 5549084
40290E549084J321623J084311Q76686P34388O66831O44499O07145M92135K65559
$$ 5549084 6870707 7955018 8831704 9566092 10232923 10877422 11484567 11976702 12242261
40281A2242261o2370m43316q11890j110943j310515j412320j438829j414765j352215
$$ 12242261 12179891 11736575 10924685 9813742 8503227 7090907 5652078 4237313 2885098
40272B885098j247107j088157q72875o19674l65833j51766m290O8493P0641J0382
$$ 2885098 1637991 549834 -323041 -942715 -1308548 -1460314 -1464604 -1396111 -1325470 -1315088
40262a315088j01877k51149m16962n76979p13544q18712q93747r43601r71599
$$ -1315088 -1416965 -1668114 -2085076 -2662055 -3375599 -4194311 -5088058 -6031659 -7003258
40253g003258r78920r67123r38681q94676q33802p55007o60257n53093m34472
$$ -7003258 -7982178 -8949301 -9887982 -10782658 -11616460 -12371467 -13031724 -13584817 -14019289
40244a4019289l01976j55532m674J31783K36877L09370L67936M41878N56822P25613
$$ -14019289 -14321265 -14476797 -14481471 -14349688 -14112811 -13803441 -13435505 -12993627 -12436805 -11711192
40234a1711192R45833J199074J450614J653571J760268J737213J576534J298191
$$ -11711192 -10765359 -9566285 -8115671 -6462100 -4701832 -2964619 -1388085 -89894
40226h9894R41700N52225J69821j72843m47982o33131p16682p03265o13768m79582
$$ -89894 851806 1404031 1573852 1401009 953027 319896 -396786 -1100051 -1713819 -2193401
40216b193401l33558k00958r5412k3197Q425j1449r0678k25567l99605n88751
$$ -2193401 -2526959 -2727917 -2823329 -2846526 -2838101 -2849550 -2940228 -3165795 -3565400 -4154151
40206d154151p65533q98457r51261q87996o84548l41635J08007O03668J072030
$$ -4154151 -4919684 -5818141 -6769402 -7657398 -8341946 -8683581 -8575574 -7971906 -6899876
40197f899876J447266J686492J774543J718171J535362J247138Q76552M53322
$$ -6899876 -5452610 -3766118 -1991575 -273404 1261958 2509096 3385648 3838970
40189C838970J7743l81429o95918q91239r59638r25463q35887p38628o59900n97896
$$ 3838970 3856713 3475284 2779366 1888127 928489 3026 -832861 -1571489 -2231389 -2829285
40179b829285n35083m58169l70886k91917k40301k17710j99605j43145r203K14489
$$ -2829285 -3364368 -3822537 -4193423 -4485340 -4725641 -4943351 -5142956 -5286101 -5295304 -5080815
40169e080815N03288Q04101J056262J212901J252846J179805J012864P76021M93033
$$ -5080815 -4577527 -3773426 -2717164 -1504263 -251417 928388 1941252 2717273 3210306
40160C210306J87936j13805l88237o18811p99095r28501j004769j020533r67319
$$ 3210306 3398242 3284437 2896200 2277389 1478294 549793 -454976 -1475509 -2442828
40151b442828q44309o66718m69057k99012k01402j99669k87004m32114n92698
$$ -2442828 -3287137 -3953855 -4422912 -4721924 -4923326 -5122995 -5409999 -5842113 -6434811
40142f434811p26691p99496p91333p04149n60950l93319k24105n8699J07151K68827
$$ -6434811 -7161502 -7960998 -8752331 -9456480 -10017430 -10410749 -10634854 -10693553 -10586402 -10317575
40132a0317575L99839M57516M05211K34254l0025l38756o34945q65100r88457
$$ -10317575 -9917736 -9460220 -9055009 -8820755 -8850780 -9189536 -9824481 -10689581 -11678038
40123a1678038r87691q77328p00625n12134l55848k53985k11858k29291l04603
$$ -11678038 -12665729 -13543057 -14243682 -14755816 -15111664 -15365649 -15577507 -15806798 -16111401
40114a6111401m28192n75975p13050q06356q36525q01559p12297n84055m29999
$$ -16111401 -16539593 -17115568 -17828618 -18634974 -19471499 -20273058 -20985355 -21569410 -21999409
40105b1999409k60718q8862O8812J98586L02146M02063N32948P22493R73518J256681
$$ -21999409 -22260127 -22348989 -22280177 -22081591 -21779445 -21377382 -20844434 -20121941 -19148423 -17891742
40095a7891742J518304J700654J764571J702621J538251J315421J085273Q93468
$$ -17891742 -16373438 -14672784 -12908213 -11205592 -9667341 -8351920 -7266647 -6373179
40087f373179P71148P32623P78063Q94206J049659J191538J253408J176304R33964
$$ -6373179 -5602031 -4869408 -4091345 -3197139 -2147480 -955942 297466 1473770 2407734
40078B407734N49270R0785l53693p15429r71699j143577j269328j376029j467789
$$ 2407734 2957004 3047789 2694096 1978667 1006968 -136609 -1405937 -2781966 -4249755
40069d249755j530665j544071j491350j367854j185496r71986p64804o01520n07989
$$ -4249755 -5780420 -7324491 -8815841 -10183695 -11369191 -12341177 -13105981 -13707501 -14215490
40060a4215490m87431n17112n58299n75936n54563m98985m22087l33406k38124
$$ -14215490 -14702921 -15220033 -15778332 -16354268 -16908831 -17407816 -17829903 -18163309 -18401433
40051a8401433j42380n4360K1512Q9683J60951K44602L41985M44675N37463O06643
$$ -18401433 -18543813 -18598173 -18576661 -18486978 -18326027 -18081425 -17739440 -17294765 -16757302 -16150659
40041a6150659O51223O87335P36656Q04883Q70364Q95964Q53965P41473N76083
$$ -16150659 -15499436 -14812101 -14075445 -13270562 -12400198 -11504234 -10650269 -9908796 -9332713
40032i332713L82137J82057n516j68780l08938m40414n78125p19724q40205r06521
$$ -9332713 -8950576 -8768519 -8774035 -8942815 -9251753 -9692167 -10270292 -10990016 -11830221 -12736742
40022a2736742r00518q31096p27847o24218n42642m88346m52275m20745l86023
$$ -12736742 -13637260 -14468356 -15196203 -15820421 -16363063 -16851409 -17303684 -17724429 -18110452
40013a8110452l49759l16103k81480k32362j54917m8587O8278J66037K19052K17185
$$ -18110452 -18460211 -18776314 -19057794 -19290156 -19445073 -19493660 -19425382 -19259345 -19040293 -18823108
40003a8823108J66133Q0637j7987r5395r9538K6986L17081P51559J256252J728475
$$ -18823108 -18656975 -18576338 -18594325 -18689720 -18789258 -18762272 -18445191 -17693632 -16437380 -14708905
39993a4708905K076307K247779K237388K073949J803836J480443J158381Q83711
$$ -14708905 -12632598 -10384819 -8147431 -6073482 -4269646 -2789203 -1630822 -747111
39985g47111O78439N30355M00363K45323M0759k10495m84897p51038r79442j145756
$$ -747111 -68672 461683 862046 1107369 1148128 937633 452736 -298302 -1277744 -2423500
39975b423500j230734j223475j129725r76972q05249o44880m98768l47081j72753
$$ -2423500 -3654234 -4877709 -6007434 -6984406 -7789655 -8434535 -8933303 -9280384 -9453137
39966i453137J3365J69500K46327K20934J16675p522r3113j17410j02430r3823
$$ -9453137 -9439772 -9270272 -9023945 -8803011 -8686336 -8693858 -8786971 -8904381 -9006811 -9100634
39956i100634j30639k28616l81631n71361p76890r83537j189510j404241j635333
$$ -9100634 -9231273 -9459889 -9841520 -10412881 -11189771 -12173308 -13362818 -14767059 -16402392
39947a6402392j872007k078274k201929k193610k024972j698441j247018p26098
$$ -16402392 -18274399 -20352673 -22554602 -24748212 -26773184 -28471625 -29718643 -30444741
39939c0444741k00532K69622O41785R00060J058800J157381J244579J357482J506365
$$ -30444741 -30645273 -30375651 -29733866 -28833806 -27775006 -26617625 -25373046 -24015564 -22509199
39930b2509199J675247J836520J967391K056994K103475K108070K071183J990535
$$ -22509199 -20833952 -18997432 -17030041 -14973047 -12869572 -10761502 -8690319 -6699784
39922f699784J861193J679116J447558J180459Q98205O18984L53819J08969j08532
$$ -6699784 -4838591 -3159475 -1711917 -531458 366747 985731 1339550 1448519 1339987
39913A339987k87764m14882m77298m70912m08705l24378k64364k68776l51325
$$ 1339987 1052223 637341 160043 -310869 -719574 -1043952 -1308316 -1577092 -1928417
39904a928417m90070o34402p24551p13972n84306l47537l7921K99058O15649Q68480
$$ -1928417 -2418487 -3052889 -3777440 -4491412 -5075718 -5423255 -5461176 -5162118 -4546469 -3677989
39894c677989J023612J058789R63693P42994M24778O6765k51948m55745n00171
$$ -3677989 -2654377 -1595588 -631895 111099 535877 602642 350694 -105051 -605222
39885f05222l85052j47603J56216M70096P48365R58749J080847J105781J038312
$$ -605222 -990274 -1137877 -981661 -511565 236800 1195549 2276396 3382177 4420489
39876D420489Q96692P05807M87254K55201K0758k01792l93779n34701o04329n85754
$$ 4420489 5317181 6022988 6510242 6765443 6786201 6584409 6190630 5655929 5051600 4465846
39866D465846m73681k84890n9575J53482L20326M37346N28425O27620P60002R30915
$$ 4465846 3992165 3707275 3647700 3801182 4121508 4558854 5087279 5714899 6474901 7405816
39856G405816J125376J313960J461685J538179J526469J426304J251096J022736
$$ 7405816 8531192 9845152 11306837 12845016 14371485 15797789 17048885 18071621
39848A8071621P68849N20612L06020J39671J8073p3554j49090k16120k80961l54827
$$ 18071621 18840470 19361082 19667102 19806773 19824846 19751292 19602202 19386082 19105121 18750294
39838A8750294m50374n68817o89079p70082p66775o49327m13383p7596L25203
$$ 18750294 18299920 17731103 17042024 16271942 15505167 14855840 14442457 14364861 14690064
39829A4690064P54882J167070J516401J762403J875477J839738J653317J328715
$$ 14690064 15444946 16612016 18128417 19890820 21766297 23606035 25259352 26588067
39821B6588067Q92934L84504j53422o81154j168317j596490j958843k256564k492242
$$ 26588067 27481001 27865505 27712083 27030929 25862612 24266122 22307279 20050715 17558473
39812A7558473k663229k759106k764371k663301k444474k106772j669193j179449
$$ 17558473 14895244 12136138 9371767 6708466 4263992 2157220 488027 -691422
39804f91422p09626l32816r1107K4357O7714J11521K14467L98299O41768Q92843
$$ -691422 -1401048 -1733864 -1824971 -1800614 -1732900 -1621379 -1406912 -1008613 -366845 525998
39794E25998J093302J202635J208592J121900R64193P59273N30442L00214Q9383
$$ 525998 1619300 2821935 4030527 5152427 6116620 6875893 7406335 7706549 7795932
39785G795932q4820k10835k85052l13534l11406k98759k94177l08858l43904l90863
$$ 7795932 7711112 7500277 7215225 6901691 6590285 6291526 5997349 5688491 5344587 4953724
39775D953724m33429m49427m15571l17296j59707K9573K10630L48479M25925M46717
$$ 4953724 4520295 4070868 3655297 3338001 3178294 3207867 3418497 3766976 4192901 4639618
39765D639618M31970M13050M19829M64448N29031N69493N38915M17727K29117
$$ 4639618 5071588 5484638 5904467 6368915 6897946 7467439 8006354 8424081 8653198
39756H653198K6670j37520k39350k83267k80045k25792j03481R4621L44728N89174
$$ 8653198 8679868 8542348 8302998 8019731 7739686 7513894 7410413 7505034 7849762 8438936
39746H438936P56303P89432O67958M10891O4597l15183o77369r83458j212092
$$ 8438936 9195239 9984671 10652629 11063520 11128117 10812934 10135565 9152107 7940015
39737G940015j360812j441759j471330j460688j414555j338086j244716j158002
$$ 7940015 6579203 5137444 3666114 2205426 790871 -547215 -1791931 -2949933
39729b949933j105460j107234j166083j265514j377874j476730j545782j581387
$$ -2949933 -4055393 -5162627 -6328710 -7594224 -8972098 -10448828 -11994610 -13575997
39721a3575997j590176j583021j565978j531776j457546j310872j061541o95581
$$ -13575997 -15166173 -16749194 -18315172 -19846948 -21304494 -22615366 -23676907 -24372488
39713b4372488k27934K93582Q01030J233033J558818J783009J930713K027219
$$ -24372488 -24600422 -24306840 -23505810 -22272777 -20713959 -18930950 -17000237 -14973018
39705a4973018K086198K109778K095490K042617J952207J821234J638790J392321
$$ -14973018 -12886820 -10777042 -8681552 -6638935 -4686728 -2865494 -1226704 165617
39697A65617J080736P21133L40878l7747m05414p60088j095049j391260j617708
$$ 165617 1246353 1967486 2308364 2270617 1865203 1105115 10066 -1381194 -2998902
39688b998902j736940j713375j524902j177273p15248k20518K08704M89303N79197
$$ -2998902 -4735842 -6449217 -7974119 -9151392 -9866640 -10087158 -9878454 -9389151 -8809954
39679h809954M83749K42310r3328m75723q68389j243882j577919j844391k015396
$$ -8809954 -8326205 -8083895 -8177223 -8652946 -9521335 -10765217 -12343136 -14187527 -16202923
39670a6202923k067024j986864j777345j453045j035197n47731j6110N32192J066768
$$ -16202923 -18269947 -20256811 -22034156 -23487201 -24522398 -25070129 -25086239 -24554047 -23487279
39661b3487279J553893J957642K242807K378934K346228K144639J802842J377071
$$ -23487279 -21933386 -19975744 -17732937 -15354003 -13007775 -10863136 -9060294 -7683223
39653g683223R33094N19663J53216j74274m72161p31402r20611r98646r37177
$$ -7683223 -6750129 -6230466 -6077250 -6251524 -6723685 -7455087 -8375698 -9374344 -10311521
39644a0311521p42848m65885j86768J3646Q3695J5648j57219l75088n70084o82989
$$ -10311521 -11054369 -11520254 -11707022 -11693376 -11609681 -11594033 -11751252 -12126340 -12696424 -13379413
39634a3379413o75136n35499k83969L0982L43456N88809P22458P31687O37952
$$ -13379413 -14054549 -14590048 -14874017 -14843035 -14499579 -13910770 -13188312 -12456625 -11818673
39625a1818673M89647L45526K53016K31716K71197L42456M13790M62660M81250
$$ -11818673 -11329026 -10983500 -10730484 -10498768 -10227571 -9885115 -9471325 -9008665 -8527415
39616h527415M77368M71789M91550N58347O74834Q16750R39627R99265R72499
$$ -8527415 -8050047 -7578258 -7086708 -6528361 -5853527 -5036777 -4097150 -3097885 -2125386
39607b125386Q62997O89601M69088K07326r6448m37682p96607j137728j419158
$$ -2125386 -1262389 -572788 -103700 103626 7178 -430504 -1227111 -2364839 -3783997
39598c783997j604814j670967j605069j402483j067920o22310j09355M05384Q45399
$$ -3783997 -5388811 -7059778 -8664847 -10067330 -11135250 -11757560 -11866915 -11461531 -10616132
39589a0616132J140404J243420J144231Q78152N25664J95203j1395l5767J19024
$$ -10616132 -9475728 -8232308 -7088077 -6209925 -5684261 -5489058 -5500453 -5536220 -5417196
39580e417196L97941P20855J011053J216162J318146J330259J282871J207103
$$ -5417196 -5019255 -4298400 -3287347 -2071185 -753039 577220 1860091 3067194
39572C067194J125729J051991R90137R34892Q73374P91772O82840N48520L96992
$$ 3067194 4192923 5244914 6235051 7169943 8043317 8835089 9517929 10066449 10463441
39563A0463441K37738P7734q0625k39828m05780n85410p85062j010272j265508
$$ 10463441 10701179 10778913 10698288 10458460 10052680 9467270 8682208 7671936 6406428
39554F406428j551909j862665k178400k466596k688118k809583k814605k705555
$$ 6406428 4854519 2991854 813454 -1653142 -4341260 -7150843 -9965448 -12671003
39546a2671003k494112k189776j798807j336397q40267l70091J1423K64791L91167
$$ -12671003 -15165115 -17354891 -19153698 -20490095 -21330362 -21700453 -21689030 -21424239 -21033072
39537b1033072M31175M45657M87610N79388P07182Q34237R21903R44909Q95918
$$ -21033072 -20601897 -20156240 -19668630 -19089242 -18382060 -17547823 -16625920 -15681011 -14785093
39528a4785093P83597O29510M64417L22906K37415K33351L24611N08423P62159
$$ -14785093 -14001496 -13371986 -12907569 -12584663 -12347248 -12113897 -11789286 -11280863 -10518704
39519a0518704J047033J319337J542809J694843J765805J756323J675540J538092
$$ -10518704 -9471671 -8152334 -6609525 -4914682 -3148877 -1392554 282986 1821078
39511A821078J357913J142741Q95209O20778L35598O7058j54112l05747l83603
$$ 1821078 3178991 4321732 5216941 5837719 6173317 6240375 6086263 5780516 5396913
39502E396913m02892l90304l70700l56946l49347l44279l45300l68627m38322
$$ 5396913 4994021 4603717 4233017 3876071 3526724 3182445 2837145 2468518 2030196
39493B030196n72725p70073j002262j219873j364011j379092j224627q86504l85381
$$ 2030196 1457471 687398 -314864 -1534737 -2898748 -4277840 -5502467 -6388971 -6774352
39484f774352K22522Q54982J421549J843548K069095K078407J881266J513551
$$ -6774352 -6551830 -5696848 -4275299 -2431751 -362656 1715751 3597017 5110568
39476E110568J036359N32040Q9623k18228l54938l27146j79095K2230K09262L38182
$$ 5110568 6146927 6678967 6768590 6550362 6195424 5868278 5689183 5711413 5920675 6258857
39466F258857M03581M33234M65871N26406O12190O94995P36117P07310O06326
$$ 6258857 6662438 7095672 7561543 8087949 8700139 9395134 10131251 10838561 11444887
39457A1444887M56825K92721J39174M031j16939k28738l29751m12738m71906n09808
$$ 11444887 11901712 12194433 12333607 12337638 12220699 11991961 11662210 11249472 10777566 10267758
39447A0267758n38766n76162o37812p33670q66082j028341j203054j362546j473179
$$ 10267758 9728992 9152830 8515018 7781348 6915266 5886925 4683871 3321325 1848146
39438A848146j503316j432941j262005j013667p29728m58881k42595j04685m8574
$$ 1848146 344830 -1088111 -2350116 -3363783 -4093511 -4552392 -4794987 -4899672 -4948246
39429d948246o2329j27231k23841l32811m33411n04740n30128n00811m16158k81827
$$ -4948246 -5010575 -5137806 -5361647 -5694458 -6127869 -6632609 -7162737 -7663548 -8079706 -8361533
39419h361533j08001R2446L05802N17487P09567Q59694R45296R51286Q75315P27433
$$ -8361533 -8469534 -8377088 -8071286 -7553799 -6844232 -5984538 -5039242 -4087956 -3212641 -2485208
39409b485208N25893K91978M5743j95132m11653n77998o61596o33199m82744k31461
$$ -2485208 -1959315 -1667337 -1621594 -1816726 -2228379 -2806377 -3467973 -4101172 -4583916 -4815377
39399d815377O7341L40688N18010N54430M44507K19435o9542l70824o44516q63528
$$ -4815377 -4748036 -4407348 -3889338 -3334908 -2890401 -2670966 -2740508 -3111332 -3755848 -4619376
39389d619376j008823j067707j039616r44377q22175p20190o73277o92138p65531
$$ -4619376 -5628199 -6695906 -7735522 -8679899 -9502074 -10222264 -10895541 -11587679 -12353210
39380a2353210q71082r84519j082268j140148j134444j048634q82354o55039l99482
$$ -12353210 -13224292 -14208811 -15291079 -16431227 -17565671 -18614305 -19496659 -20151698 -20551180
39371b0551180j48618P6119K69023M36740N89566P30055Q43458Q97198Q53807
$$ -20551180 -20699798 -20623679 -20354656 -19917916 -19328350 -18598295 -17754837 -16857639 -16003832
39362a6003832O92959M30153J20063j58608l29362l43089j93269Q1646M08566
$$ -16003832 -15310873 -14880720 -14760657 -14919265 -15248627 -15591716 -15784985 -15703339 -15294773
39353a5294773P01770Q91389R46066Q77253P24534N34931L50173K04488J25872
$$ -15294773 -14593003 -13701614 -12755548 -11878295 -11153761 -10618830 -10268657 -10064169 -9938297
39344i938297J34670K38949M28918O73307R22197J120254J228053J241412J196922
$$ -9938297 -9803627 -9564678 -9135760 -8462453 -7540256 -6420002 -5191949 -3950537 -2753615
39335b753615J158002J185415J305168J491300J675750J781110J755030J583499
$$ -2753615 -1595613 -410198 894970 2386270 4062020 5843130 7598160 9181659
39327I181659J277963Q52947L16389l19728j020864j722566k342627k805129l062523
$$ 9181659 10459622 11312569 11628958 11309230 10288366 8565800 6223173 3418044 355521
39318C55521l106623k966970k698250k360906k003061j653676j329804j049592
$$ 355521 -2751102 -5718072 -8416322 -10777228 -12780289 -14433965 -15763769 -16813361
39310a6813361q38051p19255o99516p52578q17386q13414o69373l52589J15897
$$ -16813361 -17651412 -18370667 -19070183 -19822761 -20640147 -21453561 -22122934 -22475523 -22359626
39301b2359626O68195J214653J674918K000992K182842K236236K182486K033612
$$ -22359626 -21691431 -20476778 -18801860 -16800868 -14618026 -12381790 -10199304 -8165692
39293h165692J790894J454329J034266N57767O6955l89184p65457j028716j161038
$$ -8165692 -6374798 -4920469 -3886203 -3328436 -3261481 -3650665 -4416122 -5444838 -6605876
39284f605876j159284j033991q08663n17952k03541R1578L29201M81566N35754
$$ -6605876 -7765160 -8799151 -9607814 -10125766 -10329307 -10237729 -9908528 -9426962 -8891208
39275h891208M96143L84990K41368J16356O1306J10508K66931N00917P63193J003468
$$ -8891208 -8395065 -8010075 -7768707 -7652351 -7591045 -7480537 -7213606 -6712689 -5949496 -4946028
39265d946028J183951J284014J298763J235421J108825R35669P28001M88417K11106
$$ -4946028 -3762077 -2478063 -1179300 56121 1164946 2100615 2828616 3317033 3528139
39256C528139j09051m63554q23473j145512j386078j511338j498076j332454j014733
$$ 3528139 3419088 2955534 2132061 986549 -399529 -1910867 -3408943 -4741397 -5756130
39247e756130n66691l1525N35458J075410J526782J825967J919764J787497J454857
$$ -5756130 -6322821 -6354346 -5818888 -4743478 -3216696 -1390729 529035 2316532 3771389
39238C771389R85705M57781n9043n10553q55957j065777j124952j039796q44684
$$ 3771389 4757094 5214875 5155832 4645279 3789322 2723545 1598593 558797 -285887
39229b85887o02538l92179k81846l00381m24308n90113p23880p71118p13746n71172
$$ -285887 -888425 -1280604 -1562450 -1862831 -2287139 -2877252 -3601132 -4372250 -5085996 -5657168
39219e657168l89336k24489j28521j39024k72610n20512q50073j215876j575429
$$ -5657168 -6046504 -6270993 -6399514 -6538538 -6811148 -7331660 -8181733 -9397609 -10973038
39210a0973038j897829k160007k338140k405735k340747k134207j792942j336086
$$ -10973038 -12870867 -15030874 -17369014 -19774749 -22115496 -24249703 -26042645 -27378731
39202b7378731p90434j89328M25214J002824J493554J862934K102297K225653
$$ -27378731 -28169165 -28358493 -27933279 -26930455 -25436901 -23573967 -21471670 -19246017
39194a9246017K256899K218459K125910J984286J784554J506889J134760O71150
$$ -19246017 -16989118 -14770659 -12644749 -10660463 -8875909 -7369020 -6234260 -5563110
39186e563110J44043m00564r08503j324355j600092j709216j658562j485380j239010
$$ -5563110 -5419067 -5819631 -6728134 -8052489 -9652581 -11361797 -13020359 -14505739 -15744749
39177a5744749r60480o73357l87048j04406J73095M43659P05470R57823J201551
$$ -15744749 -16705229 -17378586 -17765634 -17870040 -17696945 -17253286 -16547816 -15589993 -14388442
39168a4388442J437552J664632J879508K078712K258377K410225K518820K565735
$$ -14388442 -12950890 -11286258 -9406750 -7328038 -5069661 -2659436 -140616 2425119
39160B425119K538147K432633K250232J989632J647826J228270P48409K40784
$$ 2425119 4963266 7395899 9646131 11635763 13283589 14511859 15260268 15501052
39152A5501052k50058o70866r64919j084338j008729p59972m01304j8448L07163
$$ 15501052 15250994 14580128 13615209 12530871 11522142 10762170 10360866 10342418 10649581
39143A0649581N19206N93893N35937L69596J30214j41950m06520o27845p79310
$$ 10649581 11168787 11762680 12298617 12668213 12798427 12656477 12249957 11622112 10842802
39134A0842802q44851q17331o97609m98149k48610M634K09259L22818L24827K21903
$$ 10842802 9997951 9180620 8483011 7984862 7736252 7740886 7950145 8272963 8597790 8819693
39124H819693M7461j45591l03185l95186m30292m45638m76935n34202o02670o63192
$$ 8819693 8867154 8721563 8418378 8023192 7592900 7147262 6670327 6136125 5533455 4870263
39114D870263p09297p46379p78974q00782p94238p37112o12680m21009j85236
$$ 4870263 4160966 3414587 2635613 1834831 1040593 303481 -309199 -730208 -915444
39105i15444N4847K60890M12593N09622N59081N61824N10635M02069K52330J03435
$$ -915444 -860597 -599707 -187114 322508 881589 1443413 1954048 2356117 2608447 2711882
39095B711882J2117K6673J66775M18405P42962J090028J406393J642690J761316
$$ 2711882 2723999 2750672 2917447 3335852 4078814 5168842 6575235 8217925 9979241
39086I979241J743875J592675J324487R61638N27603M9717m35344q81174j240686
$$ 9979241 11723116 13315791 14640278 15601916 16129519 16179236 15743892 14862718 13622032
39077A3622032j481224j596360j606597j548505j458884j362268j266592j166906
$$ 13622032 12140808 10544448 8937851 7389346 5930462 4568194 3301602 2134696
39069B134696j053444r19260p63874n91962m09737k23337m0886J24763K57354
$$ 2134696 1081252 161992 -601882 -1193844 -1603581 -1826918 -1867804 -1743041 -1485687
39060a485687L43471L79758L76563L55956L43902L58118L97668M42867M68019
$$ -1485687 -1142216 -762458 -385895 -29939 313963 672081 1069749 1512616 1980635
39051A980635M58128M17220L64334L23256L13009L41563M03848M85719N72270
$$ 1980635 2438763 2855983 3220317 3543573 3856582 4198145 4601993 5087712 5659982
39042E659982O54442P29193P95126Q49009Q86100R03201R01457Q85566Q57747
$$ 5659982 6314424 7043617 7838743 8687752 9573852 10477053 11378510 12264076 13121823
39033A3121823Q10226P24353N80994L76313J30900j15471l21236m62955n47055
$$ 13121823 13932049 14656402 15237396 15613709 15744609 15629138 15307902 14844947 14297892
39024A4297892o06875o86541q20733j020735j271998j542112j794083j998223
$$ 14297892 13691017 13004476 12183743 11163008 9891010 8348898 6554815 4556592
39016D556592k137014k203207k197410k129557k020054j893435j765527j633626
$$ 4556592 2419578 216371 -1981039 -4110596 -6130650 -8024085 -9789612 -11423238
39008a1423238j477105j267080r79790o09667j77668K70850O79837J000708J205737
$$ -11423238 -12900343 -14167423 -15147213 -15756880 -15934548 -15663698 -14983861 -13983153 -12777416
38999a2777416J293465J287333J226713J149408J071956R81484Q48451O54452
$$ -12777416 -11483951 -10196618 -8969905 -7820497 -6748541 -5767057 -4918606 -4264154
38991d264154M16164J86879L1686q071O3922K06637L69733N18677O41170P39002
$$ -4264154 -3847990 -3661111 -3629425 -3637496 -3573574 -3366937 -2997204 -2478527 -1837357 -1098355
38981a098355Q19653Q94553R78532J082830J203295J314321J377795J364625J273852
$$ -1098355 -278702 615851 1594383 2677213 3880508 5194829 6572624 7937249 9211101
38972I211101J133477R80975Q38813P03801N56274L78994J71466m7604k48461
$$ 9211101 10344578 11325553 12164366 12868167 13424441 13803435 13974901 13927297 13678836
38963A3678836m03172m96007n25529m98658m23286l05872j53922K1227K03551
$$ 13678836 13275664 12779657 12254128 11755470 11332184 11026312 10872390 10893617 11097168
38954A1097168L72088N01063N63010N36124M12660K03296o5032l57148o39939
$$ 11097168 11469256 11970319 12533329 13069453 13482113 13685409 13620377 13263229 12623290
38945A2623290q89884j094165j247201j347577j396555j394399j333996j199318
$$ 12623290 11733406 10639241 9392040 8044463 6647908 5253509 3919513 2720195
38937B720195r75127o62087k83817J19533N03710Q30064J072234J222491J294697
$$ 2720195 1745068 1082981 799164 918697 1422407 2252471 3324705 4547196 5841893
38928E841893J317943J322140J324793J326663J315688J273559J181669J027242
$$ 5841893 7159836 8481976 9806769 11133432 12449120 13722679 14904348 15931590
38920A5931590Q10562N50046K79303L4542j60198k98670l84938m20443l96549
$$ 15931590 16742152 17292198 17571501 17606043 17445845 17147175 16762237 16341794 15945245
38911A5945245k97117j08988J63811M88453Q03727J037837J135843J079580Q89375
$$ 15945245 15648128 15539140 15702951 16191404 16995131 18032968 19168811 20248391 21137766
38902B1137766O11019K97927n473k75986n14539p36578r55643j172062j374063
$$ 21137766 21748785 22046712 22041239 21765253 21250714 20514136 19558493 18386431 17012368
38893A7012368j547969j688111j799360j891383j969443k028308k052814k023415
$$ 17012368 15464399 13776288 11976928 10085545 8116102 6087794 4034980 2011565
38885B011565j923307j745292j496539j196980q69119n25533j65421K16184O15958
$$ 2011565 88258 -1657034 -3153573 -4350553 -5219672 -5745205 -5910626 -5694442 -5078484
38876e078484J018303J400456J737649K002573K163821K191320K069217J807475
$$ -5078484 -4060181 -2659725 -922076 1080497 3244318 5435638 7504855 9312330
38868I312330J442540J025579O06119K21536j02705l45671m85038m99757l81903
$$ 9312330 10754870 11780449 12386568 12608104 12505399 12159728 11674690 11174933 10793030
38859A0793030j50329J45252M36447O59393P74984P75313O77197N10878L09839
$$ 10793030 10642701 10787953 11224400 11883793 12658777 13434090 14111287 14622165 14932004
38850A4932004J02545r3139k70670m30409n73499o97164p91576q39172q20364
$$ 14932004 15034549 14941410 14670740 14240331 13666832 12969668 12178092 11338920 10518556
38841A0518556p27091n76213m09870k78993k21654k52555l68070n56261p99310
$$ 10518556 9791465 9215252 8805382 8526389 8304735 8052180 7684110 7127849 6328539
38832F328539j067936j318851j504708j593539j583968j503557j389263j262450
$$ 6328539 5260603 3941752 2437044 843505 -740463 -2244020 -3633283 -4895733
38824d895733j116358r26650o78875l92223j19368Q0412J76583J86074J63047
$$ -4895733 -6012091 -6938741 -7617616 -8009839 -8129207 -8048795 -7872212 -7686138 -7523091
38815g523091J68699K42121L88284N84091P91887R70036J078980J087604R82604
$$ -7523091 -7354392 -7112271 -6723987 -6139896 -5348009 -4377973 -3298993 -2211389 -1228785
38806a228785P76528N07645K29681l482j51057j93305j34668k802J57893K98954
$$ -1228785 -452257 55388 285069 281587 130530 -62775 -197443 -200245 -42352 256602
38796B56602L82627L90782L23461J91275J1202j89876l69808m74048m50516k69978
$$ 256602 639229 1030011 1353472 1544747 1555949 1366073 996265 522217 71701 -198277
38786a98277N9503M92936R63742J405290J766296K014384K132791K118092J979443
$$ -198277 -138774 354162 1317904 2723194 4489490 6503874 8636665 10754757 12734200
38777A2734200J733910J397744R82555N03258p890m94858q86833j119025j154928
$$ 12734200 14468110 15865854 16848409 17351667 17343777 16848919 15962086 14843061 13688133
38768A3688133r99827o98960l20933O4162M00208O50202P96506Q41778Q09637
$$ 13688133 12688306 11989346 11668413 11732575 12132783 12782985 13579491 14421269 15230906
38759A5230906P41417O88684P03659Q28074J080768J447588J879411K301330K631194
$$ 15230906 15972323 16661007 17364666 18192740 19273508 20721096 22600507 24901837 27533031
38750B7533031K802254K782574K583332K252578J859110J475514J165823R77199
$$ 27533031 30335285 33117859 35701191 37953769 39812879 41288393 42454216 43431415
38742D3431415R34008J035786J261922J583107J975932K434131K969525L599520
$$ 43431415 44365423 45401209 46663131 48246238 50222170 52656301 55625826 59225346
38734E9225346M326611N122897N931313O684840P332818P858618Q278528Q624571
$$ 59225346 63551957 68674854 74606167 81291007 88623825 96482443 104760971 113385542
38726A13385542Q925126R196512R446817R681965R905623J0114882J0299153J0444175
$$ 113385542 122310668 131507180 140953997 150635962 160541585 170656467 180955620 191399795
38718A91399795J0535513J0556390J0481810J0275481R893958R297092Q460157
$$ 191399795 201935308 212491698 222973508 233248989 243142947 252440039 260900196
38711B60900196P382281O087095M614593L008469J308279m45610k197358l867112
$$ 260900196 268282477 274369572 278984165 281992634 283300913 282855303 280657945 276790833
38703B76790833n363355o613025p587751q306520q814941r157969r361720r429197
$$ 276790833 271427478 264814453 257226702 248920182 240105241 230947272 221585552 212156355
38695B12156355r347916r105836q708732q188730p597960o992216o416094n896322
$$ 212156355 202808439 193702603 184993871 176805141 169207181 162214965 155798871 149902549
38687A49902549n441608n045019m688944m354260m031187l725223l454371l240982
$$ 149902549 144460941 139415922 134726978 130372718 126341531 122616308 119161937 115920955
38679A15920955l104502l057307l101138l223006l393840l573027l716721l784958
$$ 115920955 112816453 109759146 106658008 103435002 100041162 96468135 92751414 88966456
38671H8966456l745940l580600l289536k898800k457733k025051j647659j343347
$$ 88966456 85220516 81639916 78350380 75451580 72993847 70968796 69321137 67977790
38663F7977790j097249q72361o24925l16017Q0867N72049J136440J725778K277061
$$ 67977790 66880541 66008180 65383255 65067238 65148105 65720154 66856594 68582372 70859433
38654G0859433K733639L065466L278288L405441L485482L540913L575611L592619
$$ 70859433 73593072 76658538 79936826 83342267 86827749 90368662 93944273 97536892
38646I7536892L613657L679489L830143M082959M425385M823811N238960N639390
$$ 97536892 101150549 104830038 108660181 112743140 117168525 121992336 127231296 132870686
38638A32870686O009672O351275O674209O981205P252492P441536P485676P324389
$$ 132870686 138880358 145231633 151905842 158887047 166139539 173581075 181066751 188391140
38630A88391140O912555O222670N242111L975531K454359P45240j052055k819581
$$ 188391140 195303695 201526365 206768476 210744007 213198366 213943606 212891551 210071970
38622B10071970m443657n836212o947517p766869q313152q620935q727317q662853
$$ 210071970 205628313 199792101 192844584 185077715 176764563 168143628 159416311 150753458
38614A50753458q448452q098582p627560p053136o394151n665547m877993m045835
$$ 150753458 142305006 134206424 126578864 119525728 113131577 107466030 102588037 98542202
38606I8542202l198492k384383j659781j066530o12747k69412J5614K94666N98367
$$ 98542202 95343710 92959327 91299546 90233016 89620269 89350857 89366471 89661137 90259504
38597I0259504R21695J223792J444821J533851J471965J276813R89278O54554
$$ 90259504 91181199 92404991 93849812 95383663 96855628 98132441 99121719 99776273
38589I9776273L08253l0870l63239p03952j068870j455662j831815k139875k318807
$$ 99776273 100084526 100053656 99690417 98986465 97917595 96461933 94630118 92490243 90171436
38580I0171436k328318k161875j844365j422466r57602n22760j95802m3607j01167
$$ 90171436 87843118 85681243 83836878 82414412 81456810 80934050 80738248 80694641 80593474
38571H0593474l56626p51418j196742j600049j891118k037331k043108j937328
$$ 80593474 80236848 79485430 78288688 76688639 74797521 72760190 70717082 68779754
38563F8779754j758512j545261j331490j142018r87411q61918p47652o23596m75602
$$ 68779754 67021242 65475981 64144491 63002473 62015062 61153144 60405492 59781896 59306294
38554E9306294l04933j33111P73N3130m800j71860m15793o86549r35473j129346
$$ 59306294 59001361 58868250 58869023 58922153 58917353 58745493 58329700 57643151 56707678 55578332
38544E5578332j253656j308062j301172j248683j172437j096576j041448j019368
$$ 55578332 54324676 53016614 51715442 50466759 49294322 48197746 47156298 46136930
38536D6136930j033760j079431j143360j208719j262500j300768j325555j336025
$$ 46136930 45103170 44023739 42880379 41671660 40409160 39108392 37782837 36446812
38528C6446812j323666j277248j192911j079574r54708q34295p25579o28465n43784
$$ 36446812 35123146 33845898 32652987 31573413 30618705 29784410 29058831 28430366 27886582
38519B7886582m80293m53307m74946n42866o35513p18521p61691p59136p39515
$$ 27886582 27406289 26952982 26478036 25935170 25299657 24581136 23819445 23060309 22320794
38510B2320794p55524q55343j053793j322724j605954j846821k010098k086884
$$ 22320794 21565270 20709927 19656134 18333410 16727456 14880635 12870537 10783653
38502A0783653k083504k005265j848007j603440j272566q75050m46663k7633L48840
$$ 10783653 8700149 6694884 4846877 3243437 1970871 1095821 649158 621525 970365
38493I70365O61462Q99538J059413J141378J147810J083517R59522P98655O37478
$$ 970365 1631827 2531365 3590778 4732156 5879966 6963483 7923005 8721660 9359138
38484I359138N19129M78309N26457O45455P91936R08890R40991Q50836O31429
$$ 9359138 9878267 10356576 10883033 11528488 12320424 13229314 14170305 15021141 15652570
38475A5652570L08427p0037m49675p83049j035300j186184j232163j187079j077435
$$ 15652570 15960997 15890960 15441285 14658236 13622936 12436752 11204589 10017510 8940075
38466H940075r32619p75678o20066m73009l41735k38122j78828j80196k49321
$$ 8940075 8007456 7231778 6611712 6138703 5796968 5558846 5380018 5199822 4950501
38457D950501l74594n20914o35599o68071n96685m45426k74170j44331q3004p1064
$$ 4950501 4575907 4054993 3419394 2751323 2154638 1709212 1435042 1290711 1207707 1136643
38447A136643o0830p149J08277K68957M31476N44239N68799M93610L35079J30055
$$ 1136643 1075813 1068664 1176941 1445898 1877374 2421613 2990412 3484022 3819101 3949156
38437C949156p3520k26701k92315k57138j36207L3074K02832L28747L84552L71206
$$ 3949156 3875636 3648935 3356620 3099482 2963275 2996349 3199181 3527928 3912480 4283686
38427D283686L12167K35532J57540Q0742L423p3124j45057k08326k58813k93741
$$ 4283686 4595853 4831385 4988925 5069667 5073090 4999966 4854909 4646583 4387770 4094029
38417D094029l15827l33466l52062l64268l52263l03315k23866j37068o4806j0548
$$ 4094029 3778202 3444736 3092674 2728406 2376143 2072828 1848962 1711894 1647088 1636540
38407A636540M1319J09197J95246K79380L30129L23395K56212J48727L5904m5117
$$ 1636540 1677859 1787056 1982302 2261682 2591811 2915206 3171418 3320145 3356049 3310932
38397C310932o6566j7926R0679K31367L69593M80649N61568O28675P02056P89676
$$ 3310932 3244366 3226440 3317119 3548486 3918079 4398728 4960296 5588971 6291027 7080703
38387G080703Q83331R67496J032792J084865J143575J231901J359053J506420
$$ 7080703 7964034 8931530 9964322 11049187 12192762 13424663 14783716 16290136
38379A6290136J625022J648237J516804J206382P43278J96921l48504q25722j200965
$$ 16290136 17915158 19563395 21080199 22286581 23029859 23226780 22878276 22052554 20851589
38370B0851589j471191j650901j758383j805986j796889j729938j608828j447233
$$ 20851589 19380398 17729497 15971114 14165128 12368239 10638301 9029473 7582240
38362G582240j265123j080110r01138p28343n58245l90690k31897q9167L9553
$$ 7582240 6317117 5237007 4335869 3607526 3049281 2658591 2426694 2337527 2377080
38353B377080J70751L27953N26684P63434J014728J243994J412268J490849J472785
$$ 2377080 2547831 2875784 3402468 4165902 5180630 6424624 7836892 9327741 10800526
38344A0800526J377344J244332J121655J052469J064949J164866J332542J527435
$$ 10800526 12177870 13422202 14543857 15596326 16661275 17826141 19158683 20686118
38336B0686118J700324J807892J823932J745449J593770J408129J229573J081381
$$ 20686118 22386442 24194334 26018266 27763715 29357485 30765614 31995187 33076568
38328C3076568R60019Q44698P16793N72379M21370K81501J75354J27908J58720
$$ 33076568 34036587 34881285 35598078 36170457 36591827 36873328 37048682 37176590 37335310
38319C7335310K71688M51059O65507Q74029J030960J095617J049526R11009P31419
$$ 37335310 37606998 38058057 38723564 39597593 40628553 41724170 42773696 43684705 44416124
38310D4416124N70174M64681M17027M05697M10883M32707M89421N99512P64297
$$ 44416124 44986298 45450979 45868006 46273703 46684586 47117293 47606714 48206226 48970523
38301D8970523R66274J184561J413661J669149J975900K349692K786349L262585
$$ 48970523 49936797 51121358 52535019 54204168 56180068 58529760 61316109 64578694
38293F4578694L743047M188704M567559M867355N102633N307844N519073N757544
$$ 64578694 68321741 72510445 77078004 81945359 87047992 92355836 97874909 103632453
38285A03632453O025963O315986O615922O910057P170314P348229P375392P175197
$$ 103632453 109658416 115974402 122590324 129500381 136670695 144018924 151394316 158569513
38277A58569513O682361N863291M729960L341593J791994J86693j379768k836292
$$ 158569513 165251874 171115165 175845125 179186718 180978712 181165405 179785637 176949345
38269A76949345m134743n242111o132698o784161p177583p300693p153026o751042
$$ 176949345 172814602 167572491 161439793 154655632 147478049 140177356 133024330 126273288
38261A26273288o131251n350649m484873l624012k864045k291518j962870j887129
$$ 126273288 120142037 114791388 110306515 106682503 103818458 101526940 99564070 97676941
38253I7676941k023698k299342k634792k965167l246325l451790l568683l595771
$$ 97676941 95653243 93353901 90719109 87753942 84507617 81055827 77487144 73891373
38245G3891373l541907l424245l267695l104958k973275k905095k915615k994718
$$ 73891373 70349466 66925221 63657526 60552568 57579293 54674198 51758583 48763865
38237D8763865l108992l212487l259154l210915l041202k737114k301405j752774
$$ 48763865 45654873 42442386 39183232 35972317 32931115 30194001 27892596 26139822
38229B6139822j123851m58104J94202P82573J265052J615428J825607J903076
$$ 26139822 25015971 24557867 24752069 25534642 26799694 28415122 30240729 32143805
38221C2143805J864101J723342J484900J144707P08474K12902k70844o60214q97058
$$ 32143805 34007906 35731248 37216148 38360855 39069329 39282231 39011387 38351173 37454115
38212C7454115r72518r27554q32057p53647p27883p41150p35783o39197m05433
$$ 37454115 36481597 35554043 34721986 33968339 33240456 32499306 31763523 31124326 30718893
38203C0718893m7699L57027O95801Q66110Q16811N63900J76871k52530o41504
$$ 30718893 30671194 31028221 31724022 32590132 33406943 33970843 34147714 33895184 33253680
38194C3253680r35640j114976j190854j197576j180511j181928j227011j314359
$$ 33253680 32318040 31203064 30012210 28814634 27634123 26452195 25225184 23910825
38186B3910825j416155j491255j506897j456554j361499j255672j166364j103631
$$ 23910825 22494670 21003415 19496518 18039964 16678465 15422793 14256429 13152798
38178A3152798j060195j015547r40835q06997n97112l17342R71L09841N59310
$$ 13152798 12092603 11077056 10136221 9329224 8732112 8414770 8415741 8725582 9284892
38169I284892P11736P51045O85487N45507L78781K41445J82798K25686L53027
$$ 9284892 9996628 10747673 11433160 11978667 12357448 12598893 12781691 13007377 13360404
38160A3360404N11304O31324O54937N55046L43547O7466k05283m07784m96284
$$ 13360404 13871708 14503032 15157969 15713015 16056562 16124028 15918745 15510961 15014677
38151A5014677m62797l33178j54214K2504J54182K15523K01309J22643p42j47797
$$ 15014677 14551880 14218702 14064488 14086992 14241174 14456697 14658006 14780649 14779907 14632110
38141A4632110l00812m47831n82900p02486p98807q56484q58744p99689o90556
$$ 14632110 14331298 13883467 13300567 12598081 11799274 10942790 10084046 9284357 8593801
38132H593801n51668l95475k14760J4798L19887P12450J180209J689698K199218
$$ 8593801 8042133 7646658 7431898 7446696 7766583 8479033 9659242 11348940 13548158
38123A3548158K673035L088734L436733L716133L929708M077813M153963M148576
$$ 13548158 16221193 19309927 22746660 26462793 30392501 34470314 38624277 42772853
38115D2772853M062196L917538L755975L616093L508460L404757L248657K981201
$$ 42772853 46835049 50752587 54508562 58124655 61633115 65037872 68286529 71267730
38107G1267730K565856K001365J320004N77693j56544q10532j321926j654392
$$ 71267730 73833586 75834951 77154955 77732648 77576104 76765572 75443646 73789254
38099G3789254j810253j831709j788330j754695j785524j898289k072801k268695
$$ 73789254 71979001 70147292 68358962 66604267 64818743 62920454 60847653 58578958
38091E8578958k448761k591877k690155k739397k734559k672950k559162k405613
$$ 58578958 56130197 53538320 50848165 48108768 45374209 42701259 40142097 37736484
38083C7736484k227652k036650j836171j624281j399769j165746r26423o80641
$$ 37736484 35508832 33472182 31636011 30011730 28611961 27446215 26519792 25839151
38075B5839151m19961j34569J77389N03932Q19768J092364J291255J397540J409131
$$ 25839151 25419190 25284621 25462010 25965942 26785710 27878074 29169329 30566869 31976000
38066C1976000J338516J205061J027896Q23031O02406L71374J26932j37154m17855
$$ 31976000 33314516 34519577 35547473 36370504 36972910 37344284 37471216 37334062 36916207
38057C6916207o92675r22704j069042j111078j054806r28570p71212o18941m95072
$$ 36916207 36223532 35300828 34231786 33120708 32065902 31137332 30366120 29747179 29252107
38048B9252107m05458l40661k82978k14640j24772j4650R9445J88413K20014J74260
$$ 29252107 28846649 28505988 28223010 28008370 27883598 27868948 27968393 28156806 28376820 28551080
38038B8551080N6578j01290k56170l75841m53703n06608n60278o34533p36271
$$ 28551080 28607658 28506368 28250198 27874357 27420654 26914046 26353768 25719235 24982964
38029B4982964q59018r84198j082650j119235j062990r00452o45122l35840k3075
$$ 24982964 24123946 23139748 22057098 20937863 19874873 18974421 18329299 17993459 17970384
38020A7970384K50003M61614O13983P24242Q08936Q70906Q97239Q70079P81404
$$ 17970384 18220387 18682001 19295984 20020226 20829162 21700068 22597307 23467386 24248790
38011B4248790O39094M60373K61564N5620j41246l03076l97279l97843l00394
$$ 24248790 24887884 25348257 25609821 25665441 25524195 25221119 24823840 24425997 24125603
38002B4125603j29031O9911K44136L53167L79119L26681K14574O5202j00455k61101
$$ 24125603 23996572 24066483 24310619 24663786 25042905 25369586 25584160 25649362 25548907 25287806
37992B5287806l92442m71133m84936m39595l54322k48840j32808m738J41255L06614
$$ 25287806 24895364 24424231 23939295 23499700 23145378 22896538 22763730 22758992 22900247 23206861
37982B3206861M81391O41330P50732P71638O77561M68116J79188j18800l40122
$$ 23206861 23688252 24329582 25080314 25851952 26529513 26997629 27176817 27058017 26717895
37973B6717895m16442l26665j05336J76088M42628O43385P60514Q01499P86179
$$ 26717895 26301453 25974788 25869452 26045540 26488168 27131553 27892067 28693566 29479745
37964B9479745P38275O82589O42422O33256O55389O92192P17262P06483O47427
$$ 29479745 30218020 30900609 31543031 32176287 32831676 33523868 34241130 34947613 35595040
37955C5595040N41456L99814K38130P2722q0656k06637k90335l19341k88430k05051
$$ 35595040 36136496 36536310 36774440 36847162 36766506 36559869 36269534 35950193 35661763 35456712
37945C5456712r0858K4491J15868J74177K09157K41526K89667L58668M36698M99272
$$ 35456712 35365854 35390345 35506213 35680390 35889547 36131073 36420740 36779408 37216106 37715378
37935C7715378N18644M74242L59869J85117k8256k52177m58795o28274p55991
$$ 37715378 38234022 38708264 39068133 39253250 39224994 38972817 38514022 37885748 37129757
37926C7129757q53099r35941j009941j061168j063195r92858q42149o20478l50542
$$ 37129757 36276658 35340717 34330776 33269608 32206413 31213555 30371406 29750928 29400386
37917B9400386o1632K19441M78331P17712R51230J189959J430593J652402J823538
$$ 29400386 29338754 29558195 30036526 30754238 31705468 32895427 34326020 35978422 37801960
37908C7801960J912836J901388J788048J586024J313879R88545O24961K39770
$$ 37801960 39714796 41616184 43404232 44990256 46304135 47292680 47917641 48157411
37900D8157411j46952n14148q42903j116527j319142j437680j467846j417276
$$ 48157411 48010459 47496311 46653408 45536881 44217739 42780059 41312213 39894937
37892C9894937j299534j123200q88314n96293k64216P0989L62388N67784O59991
$$ 39894937 38595403 37472203 36583889 35987596 35723380 35794369 36156757 36724541 37384532
37883C7384532O32189N01719L10304J14661l3053j05542j08449p0692k4537R185
$$ 37384532 38016721 38518440 38828744 38943405 38910352 38804810 38696361 38625669 38601132 38610317
37873C8610317K0483q64p1236k04355l95032o11994q07935r39774r85793r51815
$$ 38610317 38630800 38629936 38558700 38354345 37959313 37347319 36539384 35599610 34613817 33662002
37863C3662002q66175p67008o86764o39837o18573n99302n55638m72412l52459
$$ 33662002 32795827 32028819 31342055 30702218 30083645 29484343 28928705 28456293 28103834
37854B8103834k12307p1421N4534J51018J98345J71515M7825j84401n20710r36960
$$ 28103834 27891527 27820106 27874640 28025658 28224003 28395518 28443343 28258942 27738232 26801272
37844B6801272j385673j797767k096421k220739k146951j895281j519739j088237
$$ 26801272 25415599 23617832 21521411 19300672 17153721 15258440 13738701 12650464
37836A2650464o64529k99828l2327J14529J40054P3239l4521j32683j95679k29482
$$ 12650464 11985935 11686107 11653780 11768309 11908363 11981602 11947081 11814398 11618719 11389237
37826A1389237k56978k95486l43445l83568l96986l76570l29746k69802k03054
$$ 11389237 11132259 10836773 10493328 10109760 9712774 9336204 9006458 8736656 8533602
37817H533602j21503o053J61330L82492O32933Q63722J016935J047552R40167
$$ 8533602 8412099 8406046 8567376 8949868 9582801 10446523 11463458 12511010 13451177
37808A3451177P12828M08887Q3115k11774m34522n59209n74460m80860k89487
$$ 13451177 14164005 14572892 14656007 14444233 14009711 13450502 12876042 12395182 12105695
37799A2105695k2060K89597O07618Q95986J128549J291861J381477J396207J336205
$$ 12105695 12083635 12373232 12980850 13876836 15005385 16297246 17678723 19074930 20411135
37790B0411135J205463J014414P79803N23644K73316O0822q2303j33699q7394
$$ 20411135 21616598 22631012 23410815 23934459 24207775 24268597 24186294 24052595 23965201
37781B3965201M4869K37814M58270O68452Q26954Q91978Q31216O35838L28651
$$ 23965201 24010070 24247884 24706154 25374606 26201560 27093538 27924754 28560592 28889243
37772B8889243m1752m17747p49321j003410j167774j252816j289063j316715j370861
$$ 28889243 28847491 28429744 27680423 26677013 25509239 24256423 22967360 21650645 20279784
37763B0279784j471848j625234j825473k055452k283079k463883k554596k530560
$$ 20279784 18807936 17182702 15357229 13301777 11018698 8554815 6000219 3469659
37755C469659k393855k166416j875521j543867j189053q26590m69209j23048K12407
$$ 3469659 1075804 -1090612 -2966133 -4510000 -5699053 -6525643 -6994852 -7117900 -6905493
37746f905493N37555Q44680J116015J328469J459509J491519J416840J244266
$$ -6905493 -6367938 -5523258 -4407243 -3078774 -1619265 -127746 1289094 2533360
37738B533360J001599P29201M68048K51774J06674N3944J06793K62788M98311
$$ 2533360 3534959 4264160 4732208 4983982 5090656 5144600 5251393 5514181 6012492
37729F012492P70888J029430J228136J337976J350183J270114J106604Q65683
$$ 6012492 6783380 7812810 9040946 10378922 11729105 12999219 14105823 14971506
37721A4971506N53972J88345j97644n57999q48219j039976j127108j120680j038883
$$ 14971506 15525478 15713823 15516179 14958180 14109961 13069985 11942877 10822197 9783314
37712I783314q99081p14329m92085k33112O8094M18136Q13701J228910J610355
$$ 9783314 8884233 8169904 7677819 7444707 7512801 7930937 8744638 9973548 11583903
37703A1583903J887642J997077J904424J612198J149992N59673j12079q12006
$$ 11583903 13471545 15468622 17373046 18985244 20135236 20694909 20582830 19770824
37695A9770824j476779k035618k421539k588025k524206k260725j862115j408251
$$ 19770824 18294045 16258427 13836888 11248863 8724657 6463932 4601817 3193566
37687C193566r73320o10333l44669j75390q1898l4488o854J4159K7631K7608J5135
$$ 3193566 2220246 1609913 1265244 1089854 1007956 973468 966614 980773 1008404 1036012 1051147
37676A051147K829P756L8495Q7079J32431J53599J44149J17714J00277J14272
$$ 1051147 1053976 1061732 1100227 1187306 1319737 1473336 1617485 1735199 1835476 1949748
37666A949748J65963K44628L32754M18715N02961N94314O99844Q15864R25938
$$ 1949748 2115711 2360339 2693093 3111808 3614769 4209083 4908927 5724791 6650729
37657F650729J006386J035367J001417R08393P73624O18087M54442K84194J08748
$$ 6650729 7657115 8692482 9693899 10602292 11375916 11994003 12448445 12732639 12841387
37648A2841387n5824j77240k24146j88997r7290M588P3332Q7047M7242l2342j38348
$$ 12841387 12785563 12608323 12384177 12195180 12097890 12102478 12175810 12262857 12310099 12277757 12139409
37637A2139409k62864m00950n45750o84860p99747q69932q81553q34152p38721
$$ 12139409 11876545 11475595 10929845 10244985 9445238 8575306 7693753 6859601 6120880
37628F120880o08423m51851k75267q8746R3111K57485L99981N25253O41051P48504
$$ 6120880 5512457 5060606 4785339 4696593 4789704 5047189 5447170 5972423 6613474 7361978
37618G361978Q33189Q63550Q01907O24842L40703p636l56754o45774q37734r29751
$$ 7361978 8195167 9058717 9860624 10485466 10826169 10818533 10461779 9816005 8978271 8048520
37608H048520r46761r22060q77029q13005p18200n82446m11055k32106r1193k9213
$$ 8048520 7101759 6179699 5302670 4489665 3771465 3189019 2777964 2545858 2454665 2425452
37598B425452n1788j14140j40065o5017J29375M12214P23950R97474J169163J187773
$$ 2425452 2373664 2259524 2119459 2054442 2183817 2596031 3319981 4317455 5486618 6674391
37588F674391J029088P10543K92769j37873m99338p42355q63527q97215q92354
$$ 6674391 7703479 8414022 8706791 8568918 8069580 7327225 6463698 5566483 4674129
37579D674129q88130r00477r22665r36247r25200q85385q24040p51570o73982
$$ 4674129 3785999 2885522 1962857 1026610 101410 -783975 -1608015 -2359585 -3033567
37570c033567n91567n01087l96377k67687j04342R8088L29884N62756P51295Q42370
$$ -3033567 -3625134 -4126221 -4522598 -4790285 -4894627 -4796539 -4466655 -3903899 -3152604 -2310234
37560b310234P92482N86937K50192j58349n59662q73875j037548j017218q17043
$$ -2310234 -1517752 -930815 -680623 -838972 -1398634 -2272509 -3310057 -4327275 -5144318
37551e144318m78690p3443L13043O02863P50429P58535O75329N72197N14670N40646
$$ -5144318 -5623008 -5696451 -5383408 -4780545 -4030116 -3271581 -2596252 -2024055 -1509385 -968739
37541i68739O52269Q19363R90169J107045J125067J027532Q30270N71494K93957
$$ -968739 -316470 502893 1493062 2600107 3725174 4752706 5582976 6154470 6448427
37532F448427L0869j99229l92512n58758p15975q77202j035700j161627j215171
$$ 6448427 6479296 6280067 5887555 5328797 4612822 3735620 2699920 1538293 323122
37523C23122j166691j010126p64915m70850j80626N0082J77081J84888R8276k2564
$$ 323122 -843569 -1853695 -2618610 -3089460 -3270086 -3220004 -3042923 -2858035 -2759759 -2782323
37513b782323j05913r9160J3546K15501M73565P50263J006893J204563J308945
$$ -2782323 -2888236 -2987396 -2973850 -2758349 -2284784 -1534521 -527628 676935 1985880
37504A985880J297290J164073R24048O11640K74380l8863k88927m51147n13838
$$ 1985880 3283170 4447243 5371291 5982931 6257311 6218448 5929521 5478374 4964536
37495D964536m74803l40060j26291J35398M00592O22082P65250Q17202P83939
$$ 4964536 4489733 4149673 4023382 4158780 4559372 5181454 5946704 6763906 7547845
37486G547845O81393N28704L44479J42523p1201k95336n25349p49458r51886j116808
$$ 7547845 8229238 8757942 9102421 9244944 9173743 8878407 8353058 7603600 6651714 5534906
37476E534906j226741j259830j196310j035500q09910n79682m04836l13321k89618
$$ 5534906 4308165 3048335 1852025 816525 6615 -573067 -977903 -1291224 -1580842
37467a580842k92368k84274k48950j86028r7844J5475J50440K94263M26345N25664
$$ -1580842 -1873210 -2157484 -2406434 -2592462 -2690306 -2674831 -2524391 -2230128 -1803783 -1278119
37457a278119N78583N83398N50295M96341M37287L80173L20596K45963J43581
$$ -1278119 -699536 -116138 434157 930498 1367785 1747958 2068554 2314517 2458098
37448B458098J0442j39958k78951l74224m06302l78737l13179k32868j49308o3813
$$ 2458098 2468540 2328582 2049631 1675407 1269105 890368 577189 344321 195013 131200
37438A31200K0300R0186J29305J29580R6826M4412j9273j00315k18713l95838
$$ 131200 151500 241686 370991 500571 597397 641809 622536 522221 303508 -92330
37428i2330o36273r17329j195625j425875j577140j637145j607870j500450j332374
$$ -92330 -728603 -1645932 -2841557 -4267432 -5844572 -7481717 -9089587 -10590037 -11922411
37419a1922411j124729q97429o62575m17932j45047J82343N79023J027551J470618
$$ -11922411 -13047140 -13944569 -14607144 -15025076 -15170123 -14987780 -14408757 -13381206 -11910588
37410a1910588J824851K011421J988545J769630J417564J018356O48671L54855
$$ -11910588 -10085737 -8074316 -6085771 -4316141 -2898577 -1880221 -1231550 -876695
37402h76695J52224L8900R940O0964J81763L49219N28140O80988P80344Q16709
$$ -876695 -724471 -685571 -675631 -614667 -432904 -83685 444455 1125443 1905787 2722496
37392B722496P97666P39612O57506N59291M47694L25118J95183O0299p8195k13016
$$ 2722496 3520162 4259774 4917280 5476571 5924265 6249383 6444566 6504865 6426670 6213654
37382F213654l23008l75829l44790k29203o2323R9976K02406K11819J28287j5481
$$ 6213654 5890646 5514817 5170027 4940824 4878501 4978477 5180883 5392702 5520989 5505508
37372E505508j64745k61863k68993j83893l9146J13894K25177K60592K11226J00043
$$ 5505508 5340763 5078900 4809907 4626014 4586868 4700762 4925939 5186531 5397757 5497800
37362E497800j8389p3098n057K06700N37094R26727J301688J590049J733255J695928
$$ 5497800 5479411 5406313 5401256 5607956 6145050 7071777 8373465 9963514 11696769 13392697
37352A3392697J474101J097115O19872J08559l73528p75682j064332j222988j248739
$$ 13392697 14866798 15963913 16583785 16692344 16318816 15543134 14478802 13255814 12007075
37343A2007075j148166r36234o37664k85937Q2743M36137P47150R90730J144214
$$ 12007075 10858909 9922675 9285011 8999074 9081817 9517954 10265104 11255834 12400048
37334A2400048J194643J146243J018939Q37687O21703L81978J26492j33845l84310
$$ 12400048 13594691 14740934 15759873 16597560 17219263 17601241 17727733 17593888 17209578
37325A7209578o10646q04475r65968j102164j221701j328210j415993j471456
$$ 17209578 16598932 15794457 14828489 13726325 12504624 11176414 9760421 8288965
37317H288965j480633j437962j349677j229714j092281r46937p97545o43224m80443
$$ 8288965 6808332 5370370 4020693 2790979 1698698 751761 -45784 -689008 -1169451
37308a169451l07616j31152L2377J62615K47161K88429K98091K82884K34226J31463
$$ -1169451 -1477067 -1608219 -1575842 -1413227 -1166066 -877637 -579546 -296662 -62436 69027
37298F9027m3126k89015n82565q84794j155188j362992j492650j546096j544742
$$ 69027 25901 -263114 -845679 -1730473 -2885661 -4248653 -5741303 -7287399 -8832141
37289h832141j528014j542209j620512j765674j947456k114479k209382k179654
$$ -8832141 -10360155 -11902364 -13522876 -15288550 -17236006 -19350485 -21559867 -23739521
37281b3739521j986793j617575j092701m64248J98525Q26172J361244J765020
$$ -23739521 -25726314 -27343889 -28436590 -28900838 -28702313 -27876141 -26514897 -24749877
37273b4749877K020780K133150K123067K021041J861331J676029J487613J303673
$$ -24749877 -22729097 -20595947 -18472880 -16451839 -14590508 -12914479 -11426866 -10123193
37265a0123193J120085R32592P47824N83718M58566L77669L28583K88808K40408
$$ -10123193 -9003108 -8070516 -7322692 -6738974 -6280408 -5902739 -5574156 -5285348 -5044940
37256e044940J80916J23081Q5246Q1372J18540K00912L32669N14725P37751R78040
$$ -5044940 -4864024 -4740943 -4655697 -4574325 -4455785 -4254873 -3922204 -3407479 -2669728 -1691688
37246a691688J199300J358827J415729J340896J127636P98526M03225O440l28845
$$ -1691688 -492388 866439 2282168 3623064 4750700 5549226 5952451 5958891 5630046
37237E630046n55943o53282o27770n13623l65112k41224j85044k07358k84690
$$ 5630046 5074103 4420821 3793051 3279428 2914316 2673092 2488048 2280690 1996000
37228A996000l73036m27724m17749l30822j73104L2636K51564M45853N85527O54882
$$ 1996000 1622964 1195240 777491 446669 273565 306201 557765 1003618 1589145 2244027
37218B244027O50929N76567M34413K24924n1923l93789p92274j227550j663179
$$ 2244027 2894956 3471523 3905936 4130860 4078937 3685148 2892874 1665324 2145
37209B145k046474k318157k428617k353388k101416j713673j252712p87025l76848
$$ 2145 -2044329 -4362486 -6791103 -9144491 -11245907 -12959580 -14212292 -14999317 -15376165
37200a5376165o6907J15253J60870Q2923q4559k93900m93379o33452o72029n85223
$$ -15376165 -15443072 -15327819 -15166949 -15084026 -15168585 -15462485 -15955864 -16589316 -17261345 -17846568
37190a7846568l81710j08704J59955L49747M11648L36395J52974q5240l19113
$$ -17846568 -18228278 -18336982 -18177027 -17827280 -17415632 -17079237 -16926263 -17011503 -17330616
37181a7330616m98921n91913n84058m80216l03096q7922J28256L17458M64645
$$ -17330616 -17829537 -18421450 -19005508 -19485724 -19788820 -19876742 -19748486 -19431028 -18966383
37172a8966383N62646O04181N79596M82845L19276J06118j36155l93129o57056
$$ -18966383 -18403737 -17799556 -17219960 -16737115 -16417839 -16311721 -16447876 -16841005 -17498061
37163a7498061r18983j162366j365281j507260j571901j544367j411723j170977
$$ -17498061 -18417044 -19579410 -20944691 -22451951 -24023852 -25568219 -26979942 -28150919
37155b8150919q38308m49507n0861L11552N99075P86918Q72027Q76405Q38109
$$ -28150919 -28989227 -29438734 -29489595 -29178043 -28578968 -27792050 -26920023 -26043618 -25205509
37146b5205509P91925P52294P10054O44016N38678L96321K35281P5002q0535k45569
$$ -25205509 -24413584 -23661290 -22951236 -22307220 -21768542 -21372221 -21136940 -21061938 -21142473 -21388042
37136b1388042m36833o52608q66516j041795j151630j186775j147815j035904
$$ -21388042 -21824875 -22477483 -23343999 -24385794 -25537424 -26724199 -27872014 -28907918
37128b8907918q54375o17925l56761j09565Q8779K16021K65795K48113J88071
$$ -28907918 -29762293 -30380218 -30736979 -30846544 -30757765 -30541744 -30275949 -30027836 -29839765
37119b9839765J20567Q0730R4215J72863L17074N21228P76765J070910J383425
$$ -29839765 -29719198 -29638468 -29544253 -29371390 -29054316 -28533088 -27756323 -26685413 -25301988
37110b5301988J685253J940928K114736K179958K128455J974547J748518J483289
$$ -25301988 -23616735 -21675807 -19561071 -17381113 -15252658 -13278111 -11529593 -10046304
37102a0046304J204425R29477O72372M44753K52187Q9303o1514k25515m25035
$$ -10046304 -8841879 -7912402 -7240030 -6795277 -6543090 -6453787 -6515301 -6740816 -7165851
37093g165851o67589r40831j217783j465438j648393j730031j680606j492293
$$ -7165851 -7833440 -8774271 -9992054 -11457492 -13105885 -14835916 -16516522 -18008815
37085a8008815j188825q20082m46086j21042J18067K58747L14663L18932L10890
$$ -18008815 -19197640 -20017722 -20463808 -20584850 -20466783 -20208036 -19893373 -19574441 -19263551
37076a9263551L22188L66956M38785N16498N77110O08746O15831O15563O29671
$$ -19263551 -18941363 -18574407 -18135622 -17619124 -17042014 -16433268 -15817437 -15201874 -14572203
37067a4572203O74668P52880Q48359R31088R67158R29770Q08904O18861L98436
$$ -14572203 -13897535 -13144655 -12296296 -11365208 -10398050 -9468280 -8659376 -8040515 -7642079
37058g642079J98556O2633J3547N4024J73122L48587N45538P18961Q23386Q25760
$$ -7642079 -7443523 -7380890 -7367343 -7313319 -7140197 -6791610 -6246072 -5527111 -4703725 -3877965
37048c877965P15829N09840K45016l3554k86291m85150o12255o57939o23027n22615
$$ -3877965 -3162136 -2652296 -2407280 -2440834 -2727125 -3212275 -3824530 -4482469 -5105496 -5628111
37038e628111l84951k42008j15043l660J12810K60034M48646O63489Q69261J027375
$$ -5628111 -6013062 -6255070 -6370113 -6373773 -6260963 -6000929 -5552283 -4888794 -4019533 -2992158
37028b992158J111975J116629J051548R36651P95669O52709N29146M37871L75363
$$ -2992158 -1880183 -763554 287994 1224645 2020314 2673023 3202169 3640040 4015403
37019D015403L17484K26907P3292j45502l99045o43441q49578j016833j162156
$$ 4015403 4332887 4559794 4633086 4487584 4088539 3445098 2595520 1578687 416531
37010D16531j297015j412672j482894j477755j376784j174110q75137m90096l2142
$$ 416531 -880484 -2293156 -3776050 -5253805 -6630589 -7804699 -8679836 -9169932 -9202074
37001i202074M76985R99754J483752J873052K122526K206362K119291J874412
$$ -9202074 -8725089 -7725335 -6241583 -4368531 -2246005 -39643 2079648 3954060
36993C954060J500154J035768N25014R760m74371q99345j242920j485064j606226
$$ 3954060 5454214 6489982 7014996 7024756 6550385 5651040 4408120 2923056 1316830
36984A316830j591520j439969j171261q22665m37303n2813L03190O12896Q67761
$$ 1316830 -274690 -1714659 -2885920 -3708585 -4145888 -4198701 -3895511 -3282615 -2414854
36975b414854J066206J206348J278407J267298J167194R95478P91831O02181M59232
$$ -2414854 -1348648 -142300 1136107 2403405 3570599 4566077 5357908 5960089 6419321
36966F419321L70430L17486K67307J90214P5184o8038k19060l58179m71094n49507
$$ 6419321 6789751 7107237 7374544 7564758 7639942 7571904 7352844 6994665 6523571 5974064
36956E974064n92168o04684n95053n67927n22813m55695l60029k27930n5641J48149
$$ 5974064 5381896 4777212 4182159 3614232 3091419 2635724 2275695 2047765 1992124 2140273
36946B140273L59479N46381O80976P48117P48017O95165O14622N34759M78022
$$ 2140273 2499752 3046133 3727109 4475226 5223243 5918408 6533030 7067789 7545811
36937G545811M54354M60646M84877N11031N22172N01960M36474L17880J49509
$$ 7545811 8000165 8460811 8945688 9456719 9978891 10480851 10917325 11235205 11384714
36928A1384714n0873k54187m31171n65799o60658p29026p80796q15901q30936
$$ 11384714 11333841 11079654 10648483 10082684 9422026 8693000 7912204 7096303 6265367
36919F265367q30638q31825q56485r20933j028681j169094j320172j453297j538519
$$ 6265367 5434729 4602904 3746419 2825486 1796805 627711 -692461 -2145758 -3684277
36910c684277j550578j477200j328609j141160r67691q56938q34104q92346r95030
$$ -3684277 -5234855 -6712055 -8040664 -9181824 -10149515 -11006453 -11840557 -12732903 -13727933
36901a3727933j084747j099017r91896p52652m09329j4731L75310P19958J003225
$$ -13727933 -14812680 -15911697 -16903593 -17656245 -18065574 -18080305 -17704995 -16985037 -15981812
36892a5981812J235018J442149J650883J869659K082986K259656K368414K391370
$$ -15981812 -14746794 -13304645 -11653762 -9784103 -7701117 -5441461 -3073047 -681677
36884f81677K330032K203464K039726J862953J681646J485681J256336R85127
$$ -681677 1648355 3851819 5891545 7754498 9436144 10921825 12178161 13163288
36876A3163288O89956M16287K18971J32777J49413K17456K67346K46056J40136
$$ 13163288 13853244 14269531 14488502 14621279 14770692 14988148 15255494 15501550 15641686
36867A5641686k3456j93487l15584l50279k84756j36632N1025K22310L26278L35999
$$ 15641686 15618230 15424743 15109159 14758880 14474124 14337492 14388517 14610827 14937105 15273104
36857A5273104K60099J36019M590j16801k40303l88676n69185p61803r27916j030530
$$ 15273104 15533203 15669222 15673812 15557011 15316708 14928032 14358847 13597044 12669128 11638598
36847A1638598j052723j004675r16284q21628p46960p08298p13130p57843q22138
$$ 11638598 10585875 9581200 8664916 7843288 7096328 6388030 5674900 4917057 4094919
36838D094919q69709q60432p68543n96128l74148j49825L3549J53001K09259K17542
$$ 4094919 3225210 2364778 1596235 1000107 625959 476134 509683 662684 871943 1089485
36828A089485J94847J52121R3000J6228q0783j98603l33510m76751o15051p32566
$$ 1089485 1284332 1436453 1529453 1545681 1464898 1266295 932785 456034 -159017 -891583
36818h91583q14336q50026q35369p69919o52039m74856k28596Q6894M44836P84753
$$ -891583 -1705919 -2555945 -3391314 -4161233 -4813272 -5288128 -5516724 -5429830 -4984994 -4200241
36808d200241J029253J118586J039880Q31409N62622L05887J13861P282k6557
$$ -4200241 -3170988 -2052402 -1012522 -181113 381509 687396 801257 808539 781982
36799G81982k4757l2341q5727k02255l76462n80524p68527q86616q89596p59419
$$ 781982 757225 724884 639157 436902 60440 -520084 -1288611 -2175227 -3064823 -3824242
36789c824242n17314k21662N0865K34335K98494K55525J45424J1696j15094k17492
$$ -3824242 -4341556 -4563218 -4512353 -4278018 -3979524 -3723999 -3578575 -3566879 -3681973 -3899465
36779c899465k81604k90413k25873p6696J53326M39517P36342R87051J142057
$$ -3899465 -4181069 -4471482 -4697355 -4774051 -4620725 -4181208 -3444866 -2457815 -1315758
36770a315758J177466J103702R61041Q05994O93924O61542P13155Q15798R07325
$$ -1315758 -138292 965410 1926451 2732445 3426369 4087911 4801066 5616864 6524189
36761F524189R17317P95158N34495J81314j81281m65641o12698o09720m88188
$$ 6524189 7441506 8236664 8771159 8952473 8771192 8305551 7692853 7083133 6594945
36752F594945l08092j36909k8118l599m7386j17020j68567j80629j62953j47468
$$ 6594945 6286853 6149944 6121826 6118227 6070841 5953821 5785254 5604625 5441672 5294204
36742E294204j71329k62528m31975o70385r47932j216564j416750j490455j398784
$$ 5294204 5122875 4860347 4428372 3757987 2810055 1593491 176741 -1313714 -2712498
36733b712498j136712p35846k53238K46122P03313J072375J322316J437351J417460
$$ -2712498 -3849210 -4585056 -4838294 -4592172 -3888859 -2816484 -1494168 -56817 1360643
36724A360643J280336J062822Q16541N94516M34147L47326L23719L42833L85516
$$ 1360643 2640979 3703801 4520342 5114858 5549005 5896331 6220050 6562883 6948399
36715F948399M38521M92629N39301N70476N81815N75545N60079N47561N51644
$$ 6948399 7386920 7879549 8418850 8989326 9571141 10146686 10706765 11254326 11805970
36706A1805970N84469O51486P47616Q60304R78142J095481J206742J296191J335374
$$ 11805970 12390439 13041925 13789541 14649845 15627987 16723468 17930210 19226401 20561775
36697B0561775J293357J153137R22960O35434L34549N6685j85164m05442o35383
$$ 20561775 21855132 23008269 23931229 24566663 24901212 24957897 24772733 24367291 23731908
36688B3731908r02793j213024j540972j836545k038674k091826j962834j656035
$$ 23731908 22829115 21616091 20075119 18238574 16199900 14108074 12145240 10489205
36680A0489205j218847p28549k62951J26637M21793O23359P35278P60348P05798
$$ 10489205 9270358 8541809 8278858 8405495 8827288 9450647 10185925 10946273 11652071
36671A1652071N87740M28911K52921P9953p4759k00633k91102l44096l63830l61140
$$ 11652071 12239811 12668722 12921643 13001596 12926837 12726204 12435102 12091006 11727176 11366036
36661A1366036l49523l38856l32848l32165l37350l45132l41041k98604j90634
$$ 11366036 11016513 10677657 10344809 10012644 9675294 9330162 8989121 8690517 8499883
36652H499883o591K35665M91468P04385Q28627Q48054P80556O64550N37323M20456
$$ 8499883 8493292 8728957 9220425 9924810 10753437 11601491 12382047 13046597 13583920 14004376
36642A4004376L19584K33289J61145J05227O5415L2900j1322q8266k06813l55342
$$ 14004376 14323960 14557249 14718394 14823621 14889036 14921936 14910614 14822348 14615535 14260193
36632A4260193n07582o38085p33970p94833q24510q24219p93232p36269o70906
$$ 14260193 13752611 13114526 12380556 11585723 10761213 9936994 9143762 8407493 7736587
36623G736587o26308o29278o84623p65017q21168q07954p09842n49779l77482
$$ 7736587 7110279 6481001 5796378 5031361 4210193 3402239 2692397 2142618 1765136
36614A765136k46145j92003k26429l39343n05085o85296q32774r02915q70340
$$ 1765136 1518991 1326988 1100559 761216 256131 -429165 -1261939 -2164854 -3035194
36605c035194p38990n37425l03686p1353J36121L04613M27135N02916N37231N39915
$$ -3035194 -3774184 -4311609 -4615295 -4686648 -4550527 -4245914 -3818779 -3315863 -2778632 -2238717
36595b238717N20991M84901M28621L47692K46961J46827P8550P1054J37481K68481
$$ -2238717 -1717726 -1232825 -804204 -456512 -209551 -62724 15826 86880 224361 492842
36585D92842M34686N96664P17445P71558P47573O46062M76849K57019Q763k43125
$$ 492842 927528 1524192 2241637 3013195 3760768 4406830 4883679 5140698 5149461 4906336
36575D906336m73836o61916p94229q70413r02670r09429r06283q99022q80937
$$ 4906336 4432500 3770584 2976355 2105942 1203272 293843 -612440 -1511462 -2392399
36566b392399q34005p32967n51958k73273J02983N51303J019461J436725J730239
$$ -2392399 -3226404 -3959371 -4511329 -4784602 -4681619 -4130316 -3110855 -1674130 56109
36557E6109J843568J750279J459141J011404M72559q0015n72247r48373j179931
$$ 56109 1899677 3649956 5109097 6120501 6593060 6513045 5940798 4992425 3812494
36548C812494j264267j214980j053203q06559n12790k18928K8219J94705K66754
$$ 3812494 2548227 1333247 280044 -526515 -1039305 -1258233 -1230014 -1035309 -768555
36539g68555K50423J67867N3850m9039j00124p4600K5883J74629L33614M69536
$$ -768555 -518132 -350265 -296415 -345454 -445578 -520178 -494295 -319666 13948 483484
36529D83484N61191N97399N74247M98603L94626L03664K71837L28915M70066O52714
$$ 483484 1044675 1642074 2216321 2714924 3109550 3413214 3685051 4013966 4484032 5136746
36519E136746Q12569Q89801Q49332O86044M18448P9970k87503o38161r25383j104627
$$ 5136746 5949315 6839116 7688448 8374492 8792940 8872910 8585407 7947246 7021863 5917236
36509E917236j139911j016018p49521l87673O722L73083O61864Q35206Q68580
$$ 5917236 4777325 3761307 3011786 2624113 2630835 3003918 3665782 4500988 5369568
36500E369568P57242N21355K02404j48750m85428p73995r96319j147720j233227
$$ 5369568 6126810 6648165 6850569 6701819 6216391 5442396 4446077 3298357 2065130
36491B065130j264266j256127j224871j182275j129859j056514r44278p81376
$$ 2065130 800864 -455263 -1680134 -2862409 -3992268 -5048782 -5993060 -6774436
36483f774436n74526l51390j51352j1317M5466J5289q3573k11845l16825l47304
$$ -6774436 -7348962 -7700352 -7851704 -7863021 -7817555 -7802266 -7885839 -8097684 -8414509 -8761813
36473h761813k70512q2971J88985M97524P86620J007026J129488J151347J092526
$$ -8761813 -9032325 -9115296 -8926311 -8428787 -7642167 -6635141 -5505653 -4354306 -3261780
36464c261780R82200Q43966O88894N19682L40190J60475p903j62201l14671m86916
$$ -3261780 -2279580 -1435614 -746720 -227038 113152 273627 265724 103523 -211148 -698064
36454f98064o93280r23292j136397j275912j295325j179845r49855o48207l24299
$$ -698064 -1391344 -2314636 -3451033 -4726945 -6022270 -7202115 -8151970 -8800177 -9124476
36445i124476k3719K18937L89115N00073N90288P06914Q82866J120428J390439
$$ -9124476 -9148195 -8929258 -8540143 -8040070 -7449782 -6742868 -5860002 -4739574 -3349135
36436c349135J646741J846082J960299J975430J885706J694789J424781J119703
$$ -3349135 -1702394 143688 2103987 4079417 5965123 7659912 9084693 10204396
36428A0204396Q32810O05128M54132L81675L89287M80675O45467Q40539R91847
$$ 10204396 11037206 11642334 12096466 12478141 12867428 13348103 13993570 14834109 15825956
36419A5825956J022048Q84934N81710J51966l46864q54362j312105j666225j875016
$$ 15825956 16848004 17732938 18314648 18466614 18119750 17265388 15953283 14287058 12412042
36410A2412042j921202j821305j622546j384407j154123r51634p71344n93781
$$ 12412042 10490840 8669535 7046989 5662582 4508459 3556825 2785481 2191700
36402B191700l96930j65538R8703L69782O01990P47956P78615O91820N06762K51775
$$ 2191700 1794770 1629232 1727935 2097717 2699707 3447663 4226278 4918098 5424860 5676635
36392E676635m4983l57229o56982r12931j096339j191523j201841j145726j046715
$$ 5676635 5631652 5274423 4617441 3704510 2608171 1416648 214807 -930919 -1977634
36383a977634r25061p94406o62239n32453m08680k96199k00451j23492o1806p273
$$ -1977634 -2902695 -3697101 -4359340 -4891793 -5300473 -5596672 -5797123 -5920615 -5982421 -5989694
36373e989694N0062J19758K10492L30952M90113O93750R36081J190646J408942
$$ -5989694 -5939632 -5819874 -5609382 -5278430 -4788317 -4094567 -3158486 -1967840 -558898
36364e58898J532754J516843J349920J061714P12824L74068J05157o0304j19582
$$ -558898 973856 2490699 3840619 4902333 5615157 5989225 6094382 6034078 5914496
36355E914496r3360q906J15892K75861M67233O72360Q54366R66393R68865Q44221
$$ 5914496 5821136 5812230 5928122 6203983 6671216 7343576 8197942 9164335 10133200 10977421
36345A0977421O02564K77900q1848m27997p24869r59249j138528j275290j367468
$$ 10977421 11579985 11857885 11776037 11348040 10623171 9663922 8525394 7250104 5882636
36336E882636j389439j301521j070822o89939j85735L82186R31475J374144J637212
$$ 5882636 4493197 3191676 2120854 1430915 1245180 1627366 2558841 3932985 5570197
36327E570197J681315J512150J181055P72278L78258P1492j14482j86779j79429
$$ 5570197 7251512 8763662 9944717 10716995 11095253 11166745 11052263 10865484 10686055
36318A0686055j33432q1055m0535k0140k4519n6781j16853k01495l07495m32825
$$ 10686055 10552623 10471568 10431033 10410893 10386374 10329593 10212740 10011245 9703750 9270925
36308I270925n71821p09479q23511q95058r18864r04317q68062q25116p83200
$$ 9270925 8699104 7989625 7166114 6271056 5352192 4447875 3579813 2754697 1971497
36299A971497p40957o90530o25191n47979m72778m13916l72115l30060k62073
$$ 1971497 1230540 540010 -85181 -633160 -1105938 -1519854 -1891969 -2222029 -2484102
36290b484102j48808J4699K19785M46958O66439Q40323R32081R21099Q12072O31383
$$ -2484102 -2632910 -2618211 -2398426 -1951468 -1285029 -444706 487375 1408474 2220546 2851929
36280B851929M13506J88269k3559k08279l57060m66018n36491n73891n85618n77775
$$ 2851929 3265435 3453704 3430145 3221866 2864806 2398788 1862297 1288406 702788 125013
36270A25013n49378m86423l62382j48942J68415N79845J050433J526892J947836
$$ 125013 -424365 -910788 -1273170 -1422112 -1253697 -673852 376581 1903473 3851309
36261C851309K256613K414415K407928K246628J952472J551025J070375N45381
$$ 3851309 6107922 8522337 10930265 13176893 15129365 16680390 17750765 18296146
36253A8296146J8995m64425q70897j185781j414074j572545j679402j747381j782268
$$ 18296146 18315141 17850716 16979819 15794038 14379964 12807419 11128017 9380636 7598368
36244G598368j784382j749596j669388j531958j325090j038941o68579k20404
$$ 7598368 5813986 4064390 2395002 863044 -462046 -1500987 -2169566 -2389970
36236b389970K75882P58761J145141J362892J387416J255026J042227Q26454O55295
$$ -2389970 -2114088 -1355327 -210186 1152706 2540122 3795148 4837375 5663829 6319124
36227F319124N40040M68933M24998L96903L80964L78001L88365M07059M21236
$$ 6319124 6859164 7328097 7753095 8149998 8530962 8908963 9297328 9704387 10125623
36218A0125623M12417L62946K62803J12548p8441k95884n22621p36347r05346
$$ 10125623 10538040 10900986 11163789 11276337 11197896 10902012 10379391 9643044 8737698
36209H737698r89862r55266p92822n33088k38733K1565K02665K98834L38854L65379
$$ 8737698 7747836 6792570 5999748 5466660 5227927 5249492 5452157 5750991 6089845 6455224
36199F455224M11191M85194N73585O51484O95423O89738O25415M93691K80271
$$ 6455224 6866415 7351609 7925194 8576678 9272101 9961839 10587254 11080945 11361216
36190A1361216l1406m43809r24715j400807j776969j972762j953393j737064j378704
$$ 11361216 11329810 10886001 9961286 8560479 6783510 4810748 2857355 1120291 -258413
36181b58413r45408m99767r5401K23745M30228N24711N39988N27516N31709N69166
$$ -258413 -1203821 -1703588 -1798989 -1575244 -1145016 -620305 -80317 447199 978908 1548074
36171A548074O26220O72301O76049O15002M80970K86168O6299j29538k63109l29286
$$ 1548074 2174294 2846595 3522644 4137646 4618616 4904784 4971083 4841545 4578436 4249150
36161D249150l56569l84072m34314n03058n70203o18291o43022o50515o47140
$$ 4249150 3892581 3508509 3074195 2571137 2000934 1382643 739621 89106 -558034
36152e58034o31951n97887n40046m62979l79321k99186k18199j15087L6339K47599
$$ -558034 -1189985 -1787872 -2327918 -2790897 -3170218 -3469404 -3687603 -3802690 -3766351 -3518752
36142c518752N02277P58413R63662J073116J062977R39145P39129N22825L50996
$$ -3518752 -3016475 -2258062 -1294400 -221284 841693 1780838 2519967 3042792 3393788
36133C393788K60051K46559K69838K70674J97077K6065k26869n13671p72100r49005
$$ 3393788 3653839 3900398 4170236 4440910 4637987 4664052 4437183 3923512 3151412 2202407
36123B202407j018633r87160q81773p33145n64142l89462k19343n9868Q8658K29174
$$ 2202407 1183774 196614 -685159 -1418304 -1982446 -2371908 -2591251 -2651119 -2562461 -2333287
36113b333287L61590M79709N75242O44371O90127P18769P33369P28790O90702
$$ -2333287 -1971697 -1491988 -916746 -272375 417752 1136521 1869890 2598680 3289382
36104C289382N99661M39817K09774o9442l56386o04990p86940r03708r76363j021137
$$ 3289382 3889043 4328860 4538634 4469192 4112806 3507816 2720876 1817168 840805 -180332
$$ [...]
##END NTUPLES=NMR SPECTRUM
##END=
