##TITLE=31Pdec_DE-54EAK_TFA
 CDCl3
 24 sc
 3.5.2024
##JCAMPDX= 6.0         $$ Bruker NMR JCAMP-DX V2.0
##DATA TYPE= NMR SPECTRUM
##DATA CLASS= NTUPLES
##ORIGIN= UXNMR, Bruker Analytische Messtechnik GmbH
##OWNER= root
$$ XWIN-NMR		Version 3.5
$$ Fri May  3 13:44:54 2024 Russian Standard Time (UT+4h)  she@DPX200
##.OBSERVE FREQUENCY= 81.013821
##.OBSERVE NUCLEUS= ^31P
##.ACQUISITION MODE= SIMULTANEOUS
##.ACQUISITION SCHEME= undefined
##.AVERAGES= 24
##.DIGITISER RES= 16
##SPECTROMETER/DATA SYSTEM= spect
##.PULSE SEQUENCE= zgpg30
##.SOLVENT NAME= CDCl3
##.SHIFT REFERENCE= (INTERNAL, CDCl3, 0, 248.564)
##AUDIT TRAIL= $$ (NUMBER, WHEN, WHO, WHERE, WHAT)
$$ ##TITLE= Audit trail, XWIN-NMR		Version 3.5
$$ ##JCAMPDX= 5.01
$$ ##ORIGIN= Bruker BioSpin GmbH
$$ ##OWNER= she
$$ F:/spectra/data/she/nmr/P31/1/pdata/1/auditp.txt
$$ ##AUDIT TRAIL=  $$ (NUMBER, WHEN, WHO, WHERE, WHAT)
(   1,<2024-05-03 13:43:10.01 +0400>,<she>,<DPX200>,
      <created by zg, POWCHK disabled, PULCHK disabled
       configuration hash MD5:
       00 E9 B6 7A A2 85 ED C7 34 08 36 98 17 FE 4E 26
       data hash MD5: 32K
       03 D5 C0 8E 34 55 99 0E F9 0B 18 A2 AC E7 3A 69>)
(   2,<2024-05-03 13:43:12.98 +0400>,<she>,<DPX200>,
      <Start of raw data processing
       efp BC_mod = 2 LB = 10 FT_mod = 6 PKNL = 1 PHC0 = -13248.74 PHC1 = 82.08328 SI = 64K 
       data hash MD5: 64K
       FE A8 13 66 AF 6E A7 AA 96 F0 2E C4 83 28 65 75>)
(   3,<2024-05-03 13:43:29.70 +0400>,<she>,<DPX200>,
      <pk PHC0 = 13.27094 PHC1 = 0 
       data hash MD5: 64K
       63 C5 2D 6C 95 AE 3C BA 11 9C A1 15 DC 07 46 28>)
(   4,<2024-05-03 13:43:36.75 +0400>,<she>,<DPX200>,
      <abs ABSG = 5 
       data hash MD5: 64K
       E0 34 30 6C 9F 33 B6 D5 D4 DD 80 4D 08 D6 E2 E1>)
$$ ##END=
$$ 
$$ hash MD5
$$ 8F 0F 09 EA 4F E3 C3 02 15 68 2D A2 EC 2F F1 4E
##$RELAX= 
##$RELAX= 
##$RELAX= 
##$RELAX= 
##$RELAX= 
##$RELAX= 
##$RELAX= 
##$RELAX= 
##$RELAX= 
$$ Bruker specific parameters
$$ --------------------------
##$DU= <F:/spectra>
##$EXPNO= 1
##$NAME= <P31>
##$PROCNO= 1
##$TYPE= <nmr>
##$USER= <she>
##$AMP= (0..31)
100 100 100 100 100 100 100 100 100 100 100 100 100 100 100 100 100 100 
100 100 100 100 100 100 100 100 100 100 100 100 100 100 
##$AQSEQ= 0
##$AQ_mod= 1
##$AUNM= <au_zg>
##$AUTOPOS= <>
##$BF1= 81.014009
##$BF2= 200.13
##$BF3= 200.13
##$BF4= 200.13
##$BF5= 200.13
##$BF6= 200.13
##$BF7= 200.13
##$BF8= 200.13
##$BYTORDA= 1
##$CFDGTYP= 0
##$CFRGTYP= 5
##$CHEMSTR= <none>
##$CNST= (0..31)
1 1 145 1 1 1 1 1 1 1 1 1 1 1 1 1 1 1 1 1 1 1 1 1 1 1 1 1 1 1 1 1 
##$CPDPRG= <waltz16>
##$CPDPRG1= <>
##$CPDPRG2= <waltz16>
##$CPDPRG3= <>
##$CPDPRG4= <mlev>
##$CPDPRG5= <mlev>
##$CPDPRG6= <mlev>
##$CPDPRG7= <mlev>
##$CPDPRG8= <mlev>
##$CPDPRGB= <>
##$CPDPRGT= <>
##$D= (0..31)
0 1 0 0 0 0 0 0 0 0 0 0.03 2e-05 3e-06 0 0 0 0 0 0 0 0 0 0 0 0 0 0 0 0 
0 0 
##$DATE= 1714729389
##$DBL= (0..7)
120 120 120 11 120 120 24 19 
##$DBP= (0..7)
150 150 150 150 150 150 150 150 
##$DBP07= 0
##$DBPNAM0= <>
##$DBPNAM1= <>
$$ [...]
##$SUBNAM3= <"">
##$SUBNAM4= <"">
##$SUBNAM5= <"">
##$SUBNAM6= <"">
##$SUBNAM7= <"">
##$SUBNAM8= <"">
##$SUBNAM9= <"">
##$SW= 501.771253377433
##$SWIBOX= (0..15)
0 1 3 0 0 0 0 0 0 0 0 0 0 0 0 0 
##$SW_h= 40650.406504065
##$TD= 32768
##$TD0= 1
##$TE= 0
##$TE2= 300
##$TE3= 300
##$TEG= 300
##$TL= (0..7)
0 120 53 12 22 120 120 120 
##$TP= (0..7)
150 150 150 150 150 150 150 150 
##$TP07= 0
##$TPNAME0= <>
##$TPNAME1= <>
##$TPNAME2= <>
##$TPNAME3= <>
##$TPNAME4= <>
##$TPNAME5= <>
##$TPNAME6= <>
##$TPNAME7= <>
##$TPOAL= (0..7)
0.5 0.5 0.5 0.5 0.5 0.5 0.5 0.5 
##$TPOFFS= (0..7)
0 0 0 0 0 0 0 0 
##$TUNHIN= 0
##$TUNHOUT= 0
##$TUNXOUT= 0
##$USERA1= <user>
##$USERA2= <user>
##$USERA3= <user>
##$USERA4= <user>
##$USERA5= <user>
##$V9= 5
##$VALIST= <valist>
##$VCLIST= <CCCCCCCCCCCCCCC>
##$VD= 0
##$VDLIST= <DDDDDDDDDDDDDDD>
##$VPLIST= <PPPPPPPPPPPPPPP>
##$VTLIST= <TTTTTTTTTTTTTTT>
##$WBST= 1024
##$WBSW= 4
##$XGAIN= (0..3)
0 0 0 0 
##$XL= 0
##$YL= 0
##$YMAX_a= 1104
##$YMIN_a= -1590
##$ZGOPTNS= <>
##$ZL1= 120
##$ZL2= 120
##$ZL3= 120
##$ZL4= 120
##$ABSF1= 248.5645
##$ABSF2= -253.2056
##$ABSG= 5
##$ABSL= 3
##$ALPHA= 0
##$AQORDER= 0
##$ASSFAC= 0
##$ASSFACI= 0
##$ASSFACX= 0
##$ASSWID= 0
##$AUNMP= <proc_1d>
##$AZFE= 0.1
##$AZFW= 0.5
##$BCFW= 0
##$BC_mod= 2
##$BYTORDP= 0
##$COROFFS= 0
##$CY= -3
##$DATMOD= 1
##$DC= 0
##$DFILT= <>
##$DTYPP= 0
##$F1P= 0
##$F2P= 0
##$FCOR= 1
##$FTSIZE= 65536
##$FT_mod= 6
##$GAMMA= 0
##$GB= 0
##$INTBC= 1
##$INTSCL= 6.047779e-11
##$ISEN= 30
##$LB= 10
##$LEV0= 0
##$LPBIN= 0
##$MAXI= 10000
##$MC2= 0
##$MEAN= 0
##$ME_mod= 0
##$MI= 50
##$NCOEF= 0
##$NC_proc= -12
##$NLEV= 6
##$NOISF1= 182.463
##$NOISF2= 159.3651
##$NSP= 0
##$NTH_PI= 0
##$NZP= 0
##$OFFSET= 248.5645
##$PC= 4
##$PHC0= -13235.47
##$PHC1= 82.08328
##$PH_mod= 1
##$PKNL= yes
##$PPARMOD= 0
##$PSCAL= 0
##$PSIGN= 0
##$REVERSE= no
##$SF= 81.0140089999694
##$SI= 65536
##$SIGF1= 159.3651
##$SIGF2= -187.1042
##$SINO= 113.3802
##$SIOLD= 16384
##$SREGLST= <1H.CDCl3>
##$SSB= 0
##$STSI= 65536
##$STSR= 0
##$SW_p= 40650.406504065
##$SYMM= 0
##$S_DEV= 0
##$TDeff= 32768
##$TDoff= 0
##$TI= <>
##$TILT= no
##$TM1= 0
##$TM2= 0
##$TOPLEV= 0
##$USERP1= <user>
##$USERP2= <user>
##$USERP3= <user>
##$USERP4= <user>
##$USERP5= <user>
##$WDW= 1
##$XDIM= 65536
##$YMAX_p= 392474578
##$YMIN_p= -389009591
$$ End of Bruker specific parameters
$$ ---------------------------------
##NTUPLES= NMR SPECTRUM
##VAR_NAME=  FREQUENCY,     SPECTRUM/REAL,   SPECTRUM/IMAG
##SYMBOL=    X,             R,               I
##VAR_TYPE=  INDEPENDENT,   DEPENDENT,       DEPENDENT
##VAR_FORM=  AFFN,          ASDF,            ASDF
##VAR_DIM=   65536,         65536,           65536
##UNITS=     HZ,            ARBITRARY UNITS, ARBITRARY UNITS
##FACTOR=    0.620285442955139, 1,           1
##FIRST=     20137.2065510682, 0,            0
##LAST=      -20513.1999529968, 0,           0
##MIN=       -20513.1999529968, -389009591,  0
##MAX=       20137.2065510682, 392474578,    0
$$ Real data points
##PAGE= N=1
##DATA TABLE= (X++(R..R)), XYDATA
$$ [...]
42398A9991444N64026J88674k89401p07072r41435r52253p68310m45322m3873
42389A6596478L58825O57891P47469N76152J83476l17446p99360j180548j451266
42380A5371671j661333j883438k172484k538759k945006l324888l608888l741866
42372f504991l685205l409554k892518k132114j171297j11930R02439J731787
42364a7273383K284215K532699K502905K251437J848335J362774Q50232L48778
42356c292008j10997m93201p56536q67760q16220o20878l31177k1112K30637L74709
42346f704543M21285M42768N41700Q00507J239762J803874K377614K823319L021908
42337F768194K902436K454136J725123Q15518j33532r61116j522013j726930j567465
$$ y = [19991444, 20555470, 20744144, 20454743, 19747671, 18806236, 17853983, 17085673, 16640351, 16596478, 16955303, 17613194, 18360663, 18936815, 19120291, 18802845, 18003485, 16822937, 15371671, 13710338, 11826900, 9654416, 7115657, 4170651, 845763, -2763125, -6504991, -10190196, -13599750, -16492268, -18624382, -19795679, -19907609, -19005170, -17273383, -14989168, -12456469, -9953564, -7702127, -5853792, -4491018, -3640786, -3292008, -3403005, -3896206, -4652742, -5520502, -6336722, -6957600, -7288777, -7309889, -7079252, -6704543, -6283258, -5840490, -5298790, -4498283, -3258521, -1454647, 922967, 3746286, 6768194, 9670630, 12124766, 13849889, 14665407, 14531875, 13570759, 12048746, 10321816, 8754351]
42328H754351j110603m65792K56338R70756J617636K141638K475656K552716K343384
42319A9536080J887362J288675O73920J39298k86773o51142j048773j568377k237322
42310A7732948k999291l736266m314861m628578m623365m307150l744276l036084
42302a3656923k295413j624573j098565p51203n67800m93181m57619m10946l45737
42293b1701960k91835k81440l10401l31586k90419j72495k2833P5874M8303j29128
42283b3407920m02971o51785p31693n33238j2772Q12417J881807L099148M334118
42274a5612889N434362O250341O664609O620886O146134N346475M363500L312275
42266B8525693K246919J178143J20219q76248j729190k360036k735229k889389
$$ y = [8754351, 7643748, 7177956, 7434294, 8405050, 10022686, 12164324, 14639980, 17192696, 19536080, 21423442, 22712117, 23386037, 23525335, 23238562, 22587420, 21538647, 19970270, 17732948, 14733657, 10997391, 6682530, 2053952, -2569413, -6876563, -10620839, -13656923, -15952336, -17576909, -18675474, -19426677, -19994477, -20487658, -20945277, -21356223, -21701960, -21993795, -22275235, -22585636, -22917222, -23207641, -23380136, -23402969, -23327095, -23278792, -23407920, -23810891, -24462676, -25194369, -25727607, -25740379, -24927962, -23046155, -19947007, -15612889, -10178527, -3928186, 2736423, 9357309, 15503443, 20849918, 25213418, 28525693, 30772612, 31950755, 32070974, 31194726, 29465536, 27105500, 24370271, 21480882]
42258B1480882k911632k895566k881193k829787k652442k273029j681973r47202
42250B408058j81124N09284J056151J432930J636700J675512J573307J380692
42242A1491510J171409J020768R81187J069079J263433J511699J744370J897915
42234B2151370J934069J842371J629567J311601R13211M64333j2466n11582j037836
42225B8684638j588927k142128k650982l048512l259466l228108k952846k501234
42217G312435j988125j530922j213099j072502j106530j281230j542769j835216
42209d257958k119139k378293k610053k810938k971589l083457l147750l178847
42201b6558024l201978l246709l334527l462554l594445l669645l627221l427115
$$ y = [21480882, 18569250, 15673684, 12792491, 9962704, 7310262, 5037233, 3355260, 2408058, 2226934, 2736218, 3792369, 5225299, 6861999, 8537511, 10110818, 11491510, 12662919, 13683687, 14664874, 15733953, 16997386, 18509085, 20253455, 22151370, 24085439, 25927810, 27557377, 28868978, 29782189, 30246522, 30234056, 29722474, 28684638, 27095711, 24953583, 22302601, 19254089, 15994623, 12766515, 9813669, 7312435, 5324310, 3793388, 2580289, 1507787, 401257, -879973, -2422742, -4257958, -6377097, -8755390, -11365443, -14176381, -17147970, -20231427, -23379177, -26558024, -29760002, -33006711, -36341238, -39803792, -43398237, -47067882, -50695103, -54122218]
42193e4122218l056566k525537j861065j101911k89220N43609J370702K161179
42185e8881027K868933L440860L840757M070249M172342M218269M284300M422868
42177b7562449M635957M868079N032473N060558M942290M729357M501865M323823
42169A0531953M214394M144217M050177L857100L499159K937896K175064J258798
42161C6668758K81730o32583j360178j821311k018232k036311j998931k003300
42153B5079642k080333k199336k302674k342786k304923k211076k104111k018237
42145G516166j954836j884207j774135j622894j471431j387634j434810j642396
42137e656177j991237k418193k838065l173910l381531l456000l419804l304429
$$ y = [-54122218, -57178784, -59704321, -61565386, -62667297, -62956517, -62412908, -61042206, -58881027, -56012094, -52571234, -48730477, -44660228, -40487886, -36269617, -31985317, -27562449, -22926492, -18058413, -13025940, -7965382, -3023092, 1706265, 6208130, 10531953, 14746347, 18890564, 22940741, 26797841, 30297000, 33234896, 35409960, 36668758, 36950488, 36317905, 34957727, 33136416, 31118184, 29081873, 27082942, 25079642, 22999309, 20799973, 18497299, 16154513, 13849590, 11638514, 9534403, 7516166, 5561330, 3677123, 1902988, 280094, -1191337, -2578971, -4013781, -5656177, -7647414, -10065607, -12903672, -16077582, -19459113, -22915113, -26334917, -29639346]
42129b9639346l138174k941855k725100k479398k174023j765483j224789n73935
42121d6662103R0760O13684Q38977O84833J87385n10395j210866j724379j922294
42112d9614398j771293j338814p62095j89828K79046O33627R47589J327683J834578
42103d8653905K426370K970322L317129L380794L169689K761457K252279J713711
42095b6662154J175898O41058J13430l82705q15079j172673j481504j792812k156396
42086c2532937k597995l107124l632631m084746m346028m294501l839141k958669
42078f1393772j722856k77914J199914K555599L684681M534682N091054N363913
42070d0964699N384912N211143M921654M594915M276886L967049L637026L264323
$$ y = [-29639346, -32777520, -35719375, -38444475, -40923873, -43097896, -44863379, -46088168, -46662103, -46571343, -45957659, -45118682, -44433849, -44246464, -44756859, -45967725, -47692104, -49614398, -51385691, -52724505, -53486600, -53676428, -53397382, -52763755, -51816166, -50488483, -48653905, -46227535, -43257213, -39940084, -36559290, -33389601, -30628144, -28375865, -26662154, -25486256, -24845198, -24731768, -25114473, -25929552, -27102225, -28583729, -30376541, -32532937, -35130932, -38238056, -41870687, -45955433, -50301461, -54595962, -58435103, -61393772, -63116628, -63394542, -62194628, -59639029, -55954348, -51419666, -46328612, -40964699, -35579787, -30368644, -25446990, -20852075, -16575189, -12608140, -8971114, -5706791]
42062e706791K851560K423568K018492J682867J460173J363887J350287J318729
42054H762772J148007P48068R7771p46082j665800k516319l165510l531262l604071
42045d472426l445410l160140k854206k598490k416090k293482k200885k107184
42037b5548313j985261j811193j561331j211477p43136j57820N08704J182984
42029c1326843J765502K154169K275054K113640J733325J266289Q74331O94949
42021a8449584P95673J155028J678111K240820K740553L125524L390216L549902
42013B26243L617813L597670L489426L300890L057447K800527K568591K368270
42005B5026877K157095J856886J396108P55933j1739q07257j529167k108879k515058
$$ y = [-5706791, -2855231, -431663, 1586829, 3269696, 4729869, 6093756, 7444043, 8762772, 9910779, 10658847, 10756618, 10010536, 8344736, 5828417, 2662907, -868355, -4472426, -7917836, -11077976, -13932182, -16530672, -18946762, -21240244, -23441129, -25548313, -27533574, -29344767, -30906098, -32117575, -32860711, -33018531, -32509827, -31326843, -29561341, -27407172, -25132118, -23018478, -21285153, -20018864, -19144533, -18449584, -17653911, -16498883, -14820772, -12579952, -9839399, -6713875, -3323659, 226243, 3844056, 7441726, 10931152, 14232042, 17289489, 20090016, 22658607, 25026877, 27183972, 29040858, 30436966, 31192899, 31181160, 30373903, 28844736, 26735857, 24220799]
41996B4220799k739352k788335k690956k508216k328138k243703k324806k595494
41988D001799l020893l506233l914035m103249l977743l514975k755660j770270
41980b2561259o38767N44296J665921K618238L335996L812198M080583M186709
41972b956085M168852M049539L834044L519546L112872K641599K148397J677363
41964B2196127J264609R32442O83215N00431L64962K75849K54938L29771N09881
41955B7312225P73627J070212J330984J481686J451378J183243O56284q8001r39303
41946C4232335j749851k385035k755089k813291k541440j945424j058708N8833
41938A9042330J325225K633237L842609M785760N298442N265113M655714L535673
$$ y = [24220799, 21481447, 18693112, 16002156, 13493940, 11165802, 8922099, 6597293, 4001799, 980906, -2525327, -6439362, -10542611, -14520354, -18035329, -20790989, -22561259, -23200026, -22655730, -20989809, -18371571, -15035575, -11223377, -7142794, -2956085, 1212767, 5262306, 9096350, 12615896, 15728768, 18370367, 20518764, 22196127, 23460736, 24393178, 25076393, 25576824, 25941786, 26217635, 26472573, 26802344, 27312225, 28085852, 29156064, 30487048, 31968734, 33420112, 34603355, 35259639, 35171638, 34232335, 32482484, 30097449, 27342360, 24529069, 21987629, 20042205, 18983497, 19042330, 20367555, 23000792, 26843401, 31629161, 36927603, 42192716, 46848430, 50384103]
41930E0384103K047807L79886j265429k692898l737592m295880m355299m000572
41922C2464126l382367k661678j961178j345962q30665l95601m544L69570P12832
41913B2964533R56762J007262Q05099L71612j98055p85285j298087j687331j932933
41904B0203577k026445j967285j767570j452812j056739o18630j84608J98839
41896A1328327N06587P56780J005285J304758J655366J987311K191819K179450
41888B2915683J924613J467392Q77893K17175m72855j149273j746108k177140
41880B1857380k363369k263881j891679j310074o14027R5787P34751J241065J567758
41871A7053711J674129J531616J143995N65495j00258p22852j177307j372502
$$ y = [50384103, 52431910, 52811796, 51546367, 48853469, 45115877, 40819997, 36464698, 32464126, 29081759, 26420081, 24458903, 23112941, 22282276, 21886675, 21882131, 22251701, 22964533, 23921295, 24928557, 25733656, 26105268, 25907213, 25121928, 23823841, 22136510, 20203577, 18177132, 16209847, 14442277, 12989465, 11932726, 11314096, 11129488, 11328327, 11834914, 12591694, 13596979, 14901737, 16557103, 18544414, 20736233, 22915683, 24840296, 26307688, 27185581, 27402756, 26929901, 25780628, 24034520, 21857380, 19494011, 17230130, 15338451, 14028377, 13414350, 13510137, 14244888, 15485953, 17053711, 18727840, 20259456, 21403451, 21968946, 21868688, 21145836, 19968529, 18596027]
41863A8596027j270891q99106l45867K57787P73197J091203J157848R81711O23785
41854B0965694J76536k58102n85821p35093o74133m20891l0277M39464R53463
41845A9830840J495233K040071K541021K944155L214362L343897L338996L201948
41837D1950523K924670K495801J914572J203210M09902m01457j168799j843668
41829D7484754k389654k772868k956306k904550k596270k038409j276261l93438
41821C0156998N01578J296823J894359K219649K233133J951773J464455R11143
41813D2629911M21123M9614k37543n21491q68267j292101j758587k211970k603225
41804C3607464k903258l097494l172106l109831k903778k576798k184997j797938
$$ y = [18596027, 17325136, 16426030, 16080163, 16337950, 17111147, 18202350, 19360198, 20341909, 20965694, 21142230, 20884128, 20298307, 19563214, 18889081, 18468190, 18437913, 18877377, 19830840, 21326073, 23366144, 25907165, 28851320, 32065682, 35409579, 38748575, 41950523, 44875193, 47370994, 49285566, 50488776, 50898678, 50497221, 49328422, 47484754, 45095100, 42322232, 39365926, 36461376, 33865106, 31826697, 30550436, 30156998, 30658576, 31955399, 33849758, 36069407, 38302540, 40254313, 41718768, 42629911, 43051034, 43100648, 42863105, 42341614, 41473347, 40181246, 38422659, 36210689, 33607464, 30704206, 27606712, 24434606, 21324775, 18420997, 15844199, 13659202, 11861264]
41796A1861264j468149j209140r93553p72346n05920j90643J34621M04716N56945
41787G817795N59289M27733K22755K1099j22351j93706k06095j72168r3916K5191
41777H285626J68364L09983M26558M98272N03472M20276K38656k7853l41611o53358
41767I828385r22706j135399j302500j437895j534370j565829j517042j408540
41759i95896j286201j183829j098540j006326r02670q25650q36307r73838j226927
41750a0336184j541852j849463k083318k186754k126600j914962j614565j309893
41742b4963591j060514q70867o93532m57042r9989M03847J039751J766467K537399
41733b2398071L313333M065367M775847N435968O030218O511953O794621O778255
$$ y = [11861264, 10393115, 9183975, 8190422, 7418076, 6912156, 6721513, 6856134, 7260850, 7817795, 8377084, 8804817, 9027572, 9048671, 8926320, 8732614, 8526519, 8354351, 8260435, 8285626, 8453990, 8763973, 9190531, 9688803, 10192275, 10612551, 10851207, 10823354, 10481743, 9828385, 8905679, 7770280, 6467780, 5029885, 3495515, 1929686, 412644, -995896, -2282097, -3465926, -4564466, -5570792, -6473462, -7299112, -8135419, -9109257, -10336184, -11878036, -13727499, -15810817, -17997571, -20124171, -22039133, -23653698, -24963591, -26024105, -26894972, -27588504, -28045546, -28145535, -27741688, -26701937, -24935470, -22398071, -19084738, -15019371, -10243524, -4807556, 1222662, 7734615, 14529236, 21307491]
41725B1307491O399935N673971M694357L597538K507306J494379N74924k55866
41717D5994035r88594j596162k060078k391809k622548k774173k846252k832986
41709B7881433k748972k636749k554448k560286k700926k993782l400206l808985
41701D477079m055030l974078l465443k529785j267446J54242J545067K731040
41693f384354L582139M029274M068985L752042L158889K375210J479593N42363
41685A6604141l72098j201143j876204k319258k456716k249836j720953r54743
41677C453190p4751P87851J517499K025194K251742K170696J795076J182690M28647
41668A5537834l59256j090550j708848k187802k515350k681125k673508k481949
$$ y = [21307491, 27707426, 33381397, 38075754, 41673292, 44180598, 45674977, 46249901, 45994035, 45005441, 43409279, 41349201, 38957392, 36334844, 33560671, 30714419, 27881433, 25132461, 22495712, 19941264, 17380978, 14680052, 11686270, 8286064, 4477079, 422049, -3552029, -7017472, -9547257, -10814703, -10660461, -9115394, -6384354, -2802215, 1227059, 5296044, 9048086, 12206975, 14582185, 16061778, 16604141, 16232043, 15030900, 13154696, 10835438, 8378722, 6128886, 4407933, 3453190, 3378439, 4166290, 5683789, 7708983, 9960725, 12131421, 13926497, 15109187, 15537834, 15178578, 14088028, 12379180, 10191378, 7676028, 4994903, 2321395, -160554]
41660a60554k097960j516146p43818J79329J166407K094095K841504L335231L574332
41651H672420L626142L599250L601843L694329L854299L976252L912195L531904
41643C8468634K769396J637222K16166j359785k914430m247115n171597n570600
41635B3827891n437222m875478m059124l174148k372306j746971j329344j100652
41627b67354j015097j023019j081740j150791j183495j131216r63929o92742l76387
41618h885770j06670J8188p7617m20939r71193j620889k220955k620532k702432
41609a9608809k405676j740243p96532K63073J246192K000674K479218K756868
41601a5805235K984116L298144L741956M236900M622521M739827M513088L991003
$$ y = [-160554, -2258514, -3774660, -4518478, -4339149, -3172742, -1078647, 1762857, 5098088, 8672420, 12298562, 15897812, 19499655, 23193984, 27048283, 31024535, 34936730, 38468634, 41238030, 42875252, 43091418, 41731633, 38817203, 34570088, 29398491, 23827891, 18390669, 13515191, 9456067, 6281919, 3909613, 2162642, 833298, -267354, -1282451, -2305470, -3387210, -4538001, -5721496, -6852712, -7816641, -8509383, -8885770, -8992440, -8974252, -9051869, -9472808, -10444001, -12064890, -14285845, -16906377, -19608809, -22014485, -23754728, -24551260, -24288187, -23041995, -21041321, -18562103, -15805235, -12821119, -9522975, -5781019, -1544119, 3078402, 7818229, 12331317, 16322320]
41593A6322320L332456K747510K417545K421309K694555L046945L239063L086395
41585C9308098K533880J662013O32790l80324j238903j854313k186607k243170
41577C6233464k078396j785370j472860j231745j105153j077643j090027j072904
41569B5319366r82185q19602o31063m87718m59340n86951q61129j217180j556103
41560A7718095j783473j842612j723886j453445j076198o41019j89130K50157
41552I258489O51604R81481J196981J263748J178420R78395P33034N20939M00101
41543A7163192L80356M12887M07957K75109l5642n12936j091260j680282k203144
41534A3116237k627044k969321l270985l550334l769368l843288l691618l293937
$$ y = [16322320, 19654776, 22402286, 24819831, 27241140, 29935695, 32982640, 36221703, 39308098, 41841978, 43503991, 44136781, 43756457, 42517554, 40663241, 38476634, 36233464, 34155068, 32369698, 30896838, 29665093, 28559940, 27482297, 26392270, 25319366, 24337181, 23517579, 22886516, 22398798, 21939458, 21352507, 20491378, 19274198, 17718095, 15934622, 14092010, 12368124, 10914679, 9838481, 9197462, 9008332, 9258489, 9910093, 10891574, 12088555, 13352303, 14530723, 15509118, 16242152, 16763091, 17163192, 17543548, 17956435, 18364392, 18639501, 18603859, 18090923, 16999663, 15319381, 13116237, 10489193, 7519872, 4248887, 698553, -3070815, -6914103, -10605721, -13899658]
41526a3899658k709588k052022j440441r55782o14656l67223j23339K00397O37849
41517b1324463J161348J704979K203549K621139K953245L203231L351017L340308
41509g85647L098263K574036J767302P30681m46200j655369k786010l738634m436993
41500e678571m833723m910663m679615m185404l504322k729108j941266j184694
41492c3647366m58750K62428R97056J732963K430557L046317L556408L962693
41484a8117694M279451M514142M658052M692810M606568M408457M133790L838144
41476A7013720L581786L408194L324137L291542L237428L078425K748471K219451
41468D1903154J511726O95209j22085q23028j322373j598001j690999j676524
$$ y = [-13899658, -16609246, -18661268, -20101709, -21057491, -21672147, -22039370, -22162709, -21962312, -21324463, -20163115, -18458136, -16254587, -13633448, -10680203, -7476972, -4125955, -785647, 2312616, 4886652, 6653954, 7384635, 6938435, 5283066, 2497056, -1241578, -5678571, -10512294, -15422957, -20102572, -24287976, -27792298, -30521406, -32462672, -33647366, -34106116, -33843688, -32846632, -31113669, -28683112, -25636795, -22080387, -18117694, -13838243, -9324101, -4666049, 26761, 4633329, 9041786, 13175576, 17013720, 20595506, 24003700, 27327837, 30619379, 33856807, 36935232, 39683703, 41903154, 43414880, 44110089, 43988004, 43164976, 41842603, 40244602, 38553603, 36877079]
41460C6877079j631251j618670j687592j866003k147126k483100k797400l008487
41452A9637450l051058k891056k535776k032921j450831q48358k58984K95186
41444F863652P73539J102650J194220R80657M39186m09115j513603k802581m182312
41435B446293n538666o751200p714263q352408q624500q521089q061342p291517
41427e8408692o284035n134893l954864k850529j898809j127896n16858j3523
41419h0190099M41742Q98735J389830J928841K513732L132269L766733M392636
41411f1725581M973098N459475N806285N992734O032014N957920N798732N559770
41403a6145553N227945M794820M282347L753204L295517K987048K860208K892166
$$ y = [36877079, 35245828, 33627158, 31939566, 30073563, 27926437, 25443337, 22645937, 19637450, 16586392, 13695336, 11159560, 9126639, 7675808, 6827450, 6568466, 6863652, 7637191, 8739841, 9934061, 10914718, 11353904, 10944789, 9431186, 6628605, 2446293, -3092373, -9843573, -17557836, -25910244, -34534744, -43055833, -51117175, -58408692, -64692727, -69827620, -73782484, -76633013, -78531822, -79659718, -80176576, -80190099, -79748357, -78849622, -77459792, -75530951, -73017219, -69884950, -66118217, -61725581, -56752483, -51293008, -45486723, -39493989, -33461975, -27504055, -21705323, -16145553, -10917608, -6122788, -1840441, 1912763, 5208280, 8195328, 11055536, 13947702]
41395A3947702L027868L218464L444440L704971L983856M223700M332214M214140
41387D4097355L801043L061737K002869O75804q14317k317787l675859m765430
41379D2065415n528536n975473o164252o165165o025479n754004n335346m761229
41371c644069m052969l259125k433031j608502p91959K2041Q22597J564554K176730
41362a1203733K589881K764360K703671K452032K077144J642564J186096P26090
41354D938105K94976l4139j66052m5454K85442O86441R84874J062763R05649N87650
41344I500255K18047j05610l16164l78457k90946q7766J67300L94695N13213M53292
41334A0067859J75948l03769r04286j493772j935904k142976k104721j876659
$$ y = [13947702, 16975570, 20194034, 23638474, 27343445, 31327301, 35551001, 39883215, 44097355, 47898398, 50960135, 52963004, 53638808, 52824491, 50506704, 46830845, 42065415, 36536879, 30561406, 24397154, 18231989, 12206510, 6452506, 1117160, -3644069, -7697038, -10956163, -13389194, -14997696, -15789655, -15767614, -14945017, -13380463, -11203733, -8613852, -5849492, -3145821, -693789, 1383355, 3025919, 4212015, 4938105, 5233081, 5198942, 5032890, 4987436, 5272878, 5959319, 6944193, 8006956, 8912605, 9500255, 9718302, 9612692, 9296528, 8918071, 8627125, 8539359, 8706659, 9101354, 9614567, 10067859, 10243807, 9940038, 9035752, 7541980, 5606076, 3463100, 1358379, -518280]
41326e18280j541286j172627q21954n17090k60524k6858K29349N54096R75167
41317c100007J493164K079293K674914L196524L552648L671541L528978L161909
41309B0258964K657779K122281J643649J273656J027585Q88158Q04443O98164
41301C1374679M93586J61875k54397o62937r77810j167515j259210j301569j321927
41292B5084775j312154j247096j113069r23285p13209n21403l66342k33529q5460
41283A8569228J08219L41769N67570P15597P22301N52821K11051k60768p89669
41274B0738119j283855j647496j799226j693148j335582p89208j60760M26285
41266A2455129Q69358J123571J219765J250438J327186J528848J862315K253179
$$ y = [-518280, -2059566, -3232193, -4054147, -4571237, -4831761, -4858619, -4629270, -4075174, -3100007, -1606843, 472450, 3147364, 6343888, 9896536, 13568077, 17097055, 20258964, 22916743, 25039024, 26682673, 27956329, 28983914, 29872072, 30676515, 31374679, 31868265, 32030140, 31775743, 31112806, 30134996, 28967481, 27708271, 26406702, 25084775, 23772621, 22525525, 21412456, 20489171, 19775962, 19254559, 18888217, 18654688, 18569228, 18677447, 19019216, 19586786, 20302383, 21024684, 21577505, 21788556, 21527788, 20738119, 19454264, 17806768, 16007542, 14314394, 12978812, 12189604, 12028844, 12455129, 13324487, 14448058, 15667823, 16918261, 18245447, 19774295, 21636610, 23889789]
41258B3889789K574841K706593K588177K235312J711373J087062M22030k29865
41250C6985312q16387j300757j682678k001988k313460k648005k990470l292249
41242A9939318l506164l611371l609483l504813l294493k975901k556127k050399
41234e169433j476646q61486k57754K46533N48735N79771L51267l3372m17017
41225f489402o55710o76588m99068k15592N2512K02817J86844K5501j95091l47862
41215h611639l10890k5844M60797J007081J439751J636467J575679J329348J012537
41206d86713P24582N12179L66318K45530J06763p2803k89268n18753p32131r09485
41196a053781j044474j136262j180448j172525j120928j051854r96045r68856
$$ y = [23889789, 26464630, 29171223, 31759400, 33994712, 35706085, 36793147, 37215177, 36985312, 36168925, 34868168, 33185490, 31183502, 28870042, 26222037, 23231567, 19939318, 16433154, 12821783, 9212300, 5707487, 2412994, -562907, -3119034, -5169433, -6646079, -7507565, -7765319, -7518786, -6970051, -6390280, -6039013, -6072385, -6489402, -7145112, -7821700, -8320768, -8536360, -8483848, -8281031, -8094187, -8068686, -8263777, -8611639, -8922529, -8948373, -8487576, -7480495, -6040744, -4404277, -2828598, -1499250, -486713, 237869, 750048, 1116366, 1361896, 1468659, 1395856, 1106588, 587835, -144296, -1053781, -2098255, -3234517, -4414965, -5587490, -6708418, -7760272, -8756317, -9725173]
41188i725173r61561r48420r00791q00728o52038m84494l43859k67767k61721
41179a5346552k94204l18233l06833k76499k77706l55605n10213o88257q12175
41170a9186277q20674o91246m38235j01439K61991N85521Q09894R06516Q93682
41161a7780267Q33678Q11710R06886J165559J584294K109554K657444L144564
41153d566578L509638L712572L720579L504991L060303K431100J720772J067282
41145A8160659N93955L60412L41784M49312N79333O60413O75418O56834O65402
41136B3143522P59078R58702J226454J475776J612646J583309J398105J119459
41128C3277051Q25282N71739L76972K32269J26284N8444L0486K8014J2193p0859
$$ y = [-9725173, -10686734, -11635154, -12535945, -13336673, -13988711, -14473205, -14817064, -15084831, -15346552, -15640756, -15958989, -16265822, -16542321, -16820027, -17175632, -17685845, -18374102, -19186277, -20006951, -20698197, -21136432, -21237871, -20975880, -20390359, -19580465, -18673949, -17780267, -16946589, -16134879, -15227993, -14062434, -12478140, -10368586, -7711142, -4566578, -1056940, 2655632, 6376211, 9881202, 12941505, 15372605, 17093377, 18160659, 18754614, 19115026, 19456810, 19906122, 20485455, 21145868, 21821286, 22478120, 23143522, 23902600, 24861302, 26087756, 27563532, 29176178, 30759487, 32157592, 33277051, 34102333, 34674072, 35051044, 35283313, 35409597, 35468041, 35498527, 35526541, 35538734, 35467875]
41118C5467875k70162o08145j060782j545232j927487k060077j841853j270705
41110B4883432m55984M19932J167507J644116J775368J554472J039927L51360
41102C2380130l55183r38565j326081j534323j645162j755438j929379k173474
41094B0722525k441046k663670k794071k833632k823015k800931k763668k660125
41086a057633k428871k049157j565732j067505o35808l01401m1402J85188L95179
41077h567142N66935O63632O73270O34060O27318P42232J032324J486142K027533
41068a13696K546299K943252L164136L204387L088566K846423K504572K092869
41060B2276808J650199J219815Q38376N27255K88533J05107n2014k07551l65799
$$ y = [35467875, 35197713, 34589568, 33528786, 31983554, 30056067, 27995990, 26154137, 24883432, 24427448, 24847380, 26014887, 27659003, 29434371, 30988843, 32028770, 32380130, 32024947, 31086382, 29760301, 28225978, 26580816, 24825378, 22895999, 20722525, 18281479, 15617809, 12823738, 9990106, 7167091, 4366160, 1602492, -1057633, -3486504, -5535661, -7101393, -8168898, -8804706, -9106107, -9147509, -8962321, -8567142, -8000207, -7336575, -6663305, -6029245, -5401927, -4659695, -3627371, -2141229, -113696, 2432603, 5375855, 8539991, 11744378, 14832944, 17679367, 20183939, 22276808, 23927007, 25146822, 25985198, 26512453, 26800986, 26906093, 26854079, 26646528, 26280729]
41051B6280729n09072o15108o80720p32288q12283r47740j122677j280404j361604
41042A8218833j348974j275397j184162j079670r18354o47287k49475K47355P99805
41033A2562674J380187J977983K573413L113443L516528L702690L621712L259214
41025C5707844K627528J761814P27398l76148j428267k314324k951086l301010
41017C0453749l376370l237484k984887k740116k611680k654318k842491l077249
41009F929154l225396l169459k844960k253731j452118n19055M79998J508019
41001d547548K536533L508698M323401M862712N046591M874650M426220L823765
40993B8855022L189428K619704K178051J890269J738630J668173J612806J525505
$$ y = [26280729, 25771657, 25156549, 24475829, 23743541, 22931258, 21983518, 20860841, 19580437, 18218833, 16869859, 15594462, 14410300, 13330630, 12412276, 11764989, 11515514, 11762869, 12562674, 13942861, 15920844, 18494257, 21607700, 25124228, 28826918, 32448630, 35707844, 38335372, 40097186, 40824584, 40448436, 39020169, 36705845, 33754759, 30453749, 27077379, 23839895, 20855008, 18114892, 15503212, 12848894, 10006403, 6929154, 3703758, 534299, -2310661, -4564392, -6016510, -6535565, -6055567, -4547548, -2011015, 1497683, 5821084, 10683796, 15730387, 20605037, 25031257, 28855022, 32044450, 34664154, 36842205, 38732474, 40471104, 42139277, 43752083, 45277588]
40985D5277588J389850J211397J006175P95818O01553M32751K81966J37208N30
40976E1134836j09041j74255k03581k40219l49532n91085r87119j501572k042578
40967D4935854k492806k757055k804799k684847k503401k378500k397777k598794
40959B4317875k969825l456289l966157m382408m590767m516307m150112l549598
40951g263588k810000k021052j233592m57271L09993J044476J680327K124249
40943h626458K287243K114876J609594Q44416m0844q72290j496752j828703j862008
40934g870926j648260j266025p98701l19735J19535M94183P96912J025113J178090
40925h289814J264112J302203J310676J293728J242581J152010J036441R29706
$$ y = [45277588, 46667438, 47878835, 48885010, 49680828, 50282381, 50715132, 50997098, 51134306, 51134836, 51025795, 50851540, 50647959, 50407740, 50058208, 49467123, 48480004, 46978432, 44935854, 42443048, 39685993, 36881194, 34196347, 31692946, 29314446, 26916669, 24317875, 21348050, 17891761, 13925604, 9543196, 4952429, 436122, -3713990, -7263588, -10073588, -12094640, -13328232, -13785503, -13475510, -12431034, -10750707, -8626458, -6339215, -4224339, -2614745, -1770329, -1811173, -2683463, -4180215, -6008918, -7870926, -9519186, -10785211, -11583912, -11903647, -11784112, -11289929, -10493017, -9467904, -8289814, -7025702, -5723499, -4412823, -3119095, -1876514, -724504, 311937, 1241643]
40917A241643Q66613Q58678Q80214Q72826P62862M80421k4198p61400j680366
40908C497293k659366l525912m104438m267638l969057l252735k245302j128399
40900b1655554q7396P49520J347847J753710K042483K268019K443169K550538
40892h587664K562125K452346K204565J815499J295815O64531n6290q35644j617292
40883a02009k311700k816295l061724l055123k886931k691223k581745k602614
40875b2109364k722388k870037k981376l018747k954238k744615k335568j700218
40867d3436551q75423M3495R49185J770060K482743L090305L596628M000202M301861
40858b4077495M506101M608116M580668M379828L972533L370275K648785J941275
$$ y = [1241643, 2108256, 2966934, 3847148, 4719974, 5482836, 5963257, 5939059, 5177659, 3497293, 837927, -2687985, -6792423, -11060061, -15029118, -18281853, -20527155, -21655554, -21742950, -20993430, -19645583, -17891873, -15849390, -13581371, -11138202, -8587664, -6025539, -3573193, -1368628, 446871, 1742686, 2407217, 2350927, 1515283, -102009, -2413709, -5230004, -8291728, -11346851, -14233782, -16925005, -19506750, -22109364, -24831752, -27701789, -30683165, -33701912, -36656150, -39400765, -41736333, -43436551, -44311974, -44268479, -43319294, -41549234, -39066491, -35976186, -32379558, -28379356, -24077495, -19571394, -14963278, -10382610, -6002782, -2030249, 1340026, 3988811, 5930086]
40850E930086J403005J155316J231366J554360J967273K301267K442976K363972
40842B0349621K106237J747205J371147J053877Q50686P82250Q28872R43510J073682
40833C1107087J170227J178523J034933O88340J33923n72966j334505k040386
40825C1365176k590381k914281l001237k926678k843953k924961l277469l891967
40817F994249m650740n385923n944189o225890o195718n876614n332432m641424
40809c7258681l873005l084061k331325j675316j162275q01747n66542m14881
40801e1167833l09720k19450j11259M3506K50477M77512O62710P47217P13429
40792d8913411N99943M80170M22469M64159O13321Q63887J205433J626737K119630
$$ y = [5930086, 7333091, 8488407, 9719773, 11274133, 13241406, 15542673, 17985649, 20349621, 22455858, 24203063, 25574210, 26628087, 27478773, 28261023, 29089895, 30033405, 31107087, 32277314, 33455837, 34490770, 35179110, 35313033, 34740067, 33405562, 31365176, 28774795, 25860514, 22859277, 19932599, 17088646, 14163685, 10886216, 6994249, 2343509, -3042414, -8986603, -15212493, -21408211, -27284825, -32617257, -37258681, -41131686, -44215747, -46547072, -48222388, -49384663, -50186410, -50752952, -51167833, -51477553, -51697003, -51808262, -51764756, -51514279, -51036767, -50374057, -49626840, -48913411, -48313468, -47833298, -47410829, -46946670, -46333349, -45469462, -44264029, -42637292, -40517662]
40783d0517662K678452L285030L885422M381700M653685M600921M182430L438508
40775i411514K488775J504678O61375Q7382j64025j12127J72846N91858J034876
40766c145876J401540J626493J697814J655659J570815J514943J534952J639673
40758I496013J803489J985029K147611K264043K302711K214501J944958J473997
40750B5632352Q56112K25933k44779m19141k56232J71974P13452J195865J480184
40741B9355720J487488J200290O54102o8430q44031j530072k006038k218141k198018
40732B3832870k041141j858529j729110j671796j643923j567945j381833j091221
40724A0847372p88362o16833o97348j058160j609771k175551k559646k617443
$$ y = [-40517662, -37839210, -34554180, -30668758, -26287058, -21633373, -17032452, -12850022, -9411514, -6922739, -5418061, -4756686, -4669304, -4833329, -4945456, -4772610, -4180752, -3145876, -1744336, -117843, 1579971, 3235630, 4806445, 6321388, 7856340, 9496013, 11299502, 13284531, 15432142, 17696185, 19998896, 22213397, 24158355, 25632352, 26488464, 26714397, 26469618, 26050477, 25794245, 25966219, 26679671, 27875536, 29355720, 30843208, 32043498, 32697600, 32629170, 31785139, 30255067, 28249029, 26030888, 23832870, 21791729, 19933200, 18204090, 16532294, 14888371, 13320426, 11938593, 10847372, 10059010, 9442177, 8744829, 7686669, 6076898, 3901347, 1341701, -1275742]
40716a275742k296202j632466p19231L29485J398325K378659L179151L739870
40708E101849M035088M056499L792884L232185K389209J330556J66745r85229
40700B3119786k035123k921156l586809l962783l976233l584314k810734j761414
40692a518780o05401M74139J333893J899064K156043K127963J861289J429805
40684I158015R36094M91139J78924L1505L0043J23454K47565L39114L50509K67925
40674A2154287J24048o804l5380J02990M15244Q43210J287907J649769J858328
40665A8393599J876789J690406J298559P19938L184p70474j499325k084983k458467
40656A7169226k597369k527255k308892k019033j730492j492898j317821j178452
$$ y = [-1275742, -3571944, -5204410, -5923641, -5594156, -4195831, -1817172, 1361979, 5101849, 9136937, 13193436, 16986320, 20218505, 22607714, 23938270, 24105015, 23119786, 21084663, 18163507, 14576698, 10613915, 6637682, 3053368, 242634, -1518780, -2124181, -1650042, -316149, 1582915, 3738958, 5866921, 7728210, 9158015, 10094109, 10585248, 10764172, 10795677, 10825720, 10949174, 11196739, 11535853, 11886362, 12154287, 12278335, 12271531, 12236151, 12339141, 12754385, 13597595, 14885502, 16535271, 18393599, 20270388, 21960794, 23259353, 23979291, 23982475, 23212001, 21712676, 19627693, 17169226, 14571857, 12044602, 9735710, 7716677, 5986185, 4493287, 3175466, 1997014]
40648A997014j031308q50867o52731m86193m01326m16065n05702o16943o93163
40639c657284o97821o29928n26792m48287m44589n22875o33154o82556n72580
40630h815866k45649K76542Q83779J411501J708086J697705J400667R04512L13801
40621d64922k86393q38673j302068j638754j811046j791173j577329j203863p34980
40612a1649201k41665K24368O39100R87261J230474J294886J100498O19183q1750
40603e876846q47980j498096j897263k000949j850849j537515j158281p89924
40595a7457703m78328k38956o4618O1266J52923K22039K88723L87704N53916P92655
40585a5780379J060829J282923J398668J412445J409106J520791J859855K455351
$$ y = [1997014, 965706, 114839, -537892, -1024085, -1425411, -1841476, -2347178, -2964121, -3657284, -4355105, -4985033, -5511825, -5960112, -6404701, -6927576, -7560730, -8243286, -8815866, -9061515, -8784973, -7901194, -6489693, -4781607, -3083902, -1683235, -778723, -464922, -751315, -1589988, -2892056, -4530810, -6341856, -8133029, -9710358, -10914221, -11649201, -11890866, -11666498, -11027398, -10040137, -8809663, -7514777, -6414279, -5795096, -5876846, -6724826, -8222922, -10120185, -12121134, -13971983, -15509498, -16667779, -17457703, -17936031, -18174987, -18239605, -18178339, -18025416, -17803377, -17514654, -17126950, -16573034, -15780379, -14719550, -13436627, -12037959, -10625514, -9216408, -7695617, -5835762, -3380411]
40577c380411L230541M035496M715441N173860N395237N421563N307272N085667
40569C4984666M763208M335152L806119L202802K573093J972460J447410J029585
40561E8114495P41896N98497N82790O19642N82134L50097j15671p41981j375996
40552E9355903j850159k034623j862324j338056n39179L97349J304036K017602
40544E5450549K407350K395025J968844J188786J76002r15361j936172k776451
40536E7958572l382447l749898l899483l852684l626544l251398k796875k381954
40528C1017289k151351k221254k622475l277827m030151m701914n150531n298505
40520A563281n140402m733971m176235l569358k991922k489182k078730j759208
$$ y = [-3380411, -149870, 3885626, 8601067, 13774927, 19170164, 24591727, 29898999, 34984666, 39747874, 44083026, 47889145, 51091947, 53665040, 55637500, 57084910, 58114495, 58856391, 59454888, 60037678, 60657320, 61239454, 61589551, 61473880, 60731899, 59355903, 57505744, 55471121, 53608797, 52270741, 51731562, 52128911, 53432947, 55450549, 57857899, 60252924, 62221768, 63410554, 63586556, 62671195, 60735023, 57958572, 54576125, 50826227, 46926744, 43074060, 39447516, 36196118, 33399243, 31017289, 28865938, 26644684, 24022209, 20744382, 16714231, 12012317, 6861786, 1563281, -3577121, -8311092, -12487327, -16056685, -19048607, -21537789, -23616519, -25375727]
40512b5375727j518265j343202j229746j177448j172682j178822j150445j062723
40504c5209060r28617p86409o66943n66367m43465k40975Q4420N40315J094859
40495c7122242J692407K280984K835362L359624L868856M368192M846347N279377
40487h591093N628249N829808N801508N472609M823960L904615K814314J669976
40479B7353946N80374l62696j083980j526004j658673j495561j105533o04367
40471B0097506j21129K47179M66844N64902N94874N94518N63959M75951L06420
40462B3791024O2440k09021m36234n55805n47069m45041l19840k36312k22882
40453B0881260k65310l17188l14002j90347R5576N38415J079259J621684K060102
$$ y = [-25375727, -26893992, -28237194, -29466940, -30644388, -31817070, -32995892, -34146337, -35209060, -36137677, -36924086, -37591029, -38157396, -38600861, -38841836, -38757416, -38217101, -37122242, -35429835, -33148851, -30313489, -26953865, -23085009, -18716817, -13870470, -8591093, -2962844, 2866964, 8668472, 14141081, 18965041, 22869656, 25683970, 27353946, 27934320, 27571624, 26487644, 24961640, 23302967, 21807406, 20701873, 20097506, 19976377, 20223556, 20690400, 21255302, 21850176, 22444694, 23008653, 23484604, 23791024, 23853464, 23644443, 23208209, 22652404, 22105335, 21660294, 21340454, 21104142, 20881260, 20615950, 20298762, 19984760, 19794413, 19889989, 20428404, 21507663, 23129347, 25189449]
40444B5189449K308039K319764K100130J697578J184312O37982J34397k55887
40436C5315764m80632n28090m41003l06553k24537k71128m75666q17705j241885
40427C0528565j681848k080632k395685k587656k608039k404580j945735j243582
40419A3580808l54968O35494J630280K522835L203918L585345L634542L396267
40411C1834521K983073K535064K166572J925182J783839J666119J482805J157216
40403D7534391O38779q0923r49062j849796k634691l170931l377262l233792k776890
40394C0099823k093603j311656n69571L4633M88478Q64602J261945J723783K193373
40385C2691807K542556K653621K498674K168501J837704J686605J819313K218036
$$ y = [25189449, 27497488, 29817252, 31917382, 33614960, 34799272, 35437254, 35571651, 35315764, 34835132, 34307042, 33866039, 33559486, 33334949, 33063821, 32588155, 31770450, 30528565, 28846717, 26766085, 24370400, 21782744, 19174705, 16770125, 14824390, 13580808, 13225840, 13861334, 15491614, 18014449, 21218367, 24803712, 28438254, 31834521, 34817594, 37352658, 39519230, 41444412, 43228251, 44894370, 46377175, 47534391, 48173170, 48092247, 47143185, 45293389, 42658698, 39487767, 36110505, 32876713, 30099823, 28006220, 26694564, 26124993, 26159626, 26648104, 27512706, 28774651, 30498434, 32691807, 35234363, 37887984, 40386658, 42555159, 44392863, 46079468, 47898781, 50116817]
40377E0116817K753281L237359L488714L381707K876524K031914R96826k5791
40369F8857351q37722j305292j395432j175694p83245l77866r3973l585j01111
40360F2783431l17950n63076p69675r23292j059480j237251j504301j871190k308639
40351E2228577k771459l232551l696807m177928m655476n051697n253292n165238
40343A8224129m758985m086761l263109k432677j737303j282326j104569j158068
40335a599669j334189j511429j607923j608644j555832j509350j498257j495022
40327a3720315j435278j271423j015057p30950m91583l36248k65732k64265l19192
40318a9850043m19048n33056n90456m82918j03269N92465J537877K560710L444040
$$ y = [50116817, 52870098, 56107457, 59596171, 62977878, 65854402, 67886316, 68883142, 68857351, 68019629, 66714337, 65318905, 64143211, 63359966, 62982100, 62888127, 62884542, 62783431, 62465481, 61902405, 61132730, 60209438, 59149958, 57912707, 56408406, 54537216, 52228577, 49457118, 46224567, 42527760, 38349832, 33694356, 28642659, 23389367, 18224129, 13465144, 9378383, 6115274, 3682597, 1945294, 662968, -441601, -1599669, -2933858, -4445287, -6053210, -7661854, -9217686, -10727036, -12225293, -13720315, -15155593, -16427016, -17442073, -18173023, -18664606, -19000854, -19266586, -19530851, -19850043, -20269091, -20802147, -21392603, -21875521, -21978790, -21386325, -19848448, -17287738, -13843698]
40309a3843698M013832M210478M113371L907650L804164L945596M343308M875439
40301A9370140N341562N539805N331159M674959L634456K353943J013233k21607
40293D7037650j227424j927311k286290k316790k085972j701918j273816q71086
40285C3347043n11488j84149J13976L56594M97324N03429L88748K17847P4655
40276C4803979J9950P2013K21507M59245P88423J215116J733194K318615K931193
40267D4563235L514078L991112M273330M281298L973859L365527K523889J553818
40259G2040146N79181k76931r19439j312732j495926j560747j596670j639257
40251F3817625j660575j608037j458902j248214j052989r50398r84110j162516
$$ y = [-13843698, -9829866, -5619388, -1506017, 2401633, 6205797, 10151393, 14494701, 19370140, 24711702, 30251507, 35582666, 40257625, 43892081, 46246024, 47259257, 47037650, 45810226, 43882915, 41596625, 39279835, 37193863, 35491945, 34218129, 33347043, 32835555, 32651406, 32765382, 33121976, 33619300, 34122729, 34511477, 34729324, 34803979, 34823929, 34895942, 35117449, 35576694, 36365117, 37580233, 39313427, 41632042, 44563235, 48077313, 52068425, 56341755, 60623053, 64596912, 67962439, 70486328, 72040146, 72619327, 72342396, 71422957, 70110225, 68614299, 67053552, 65456882, 63817625, 62157050, 60549013, 59090111, 57841897, 56788908, 55838510, 54854400, 53691884]
40243E3691884j484940j967699k640309l507374m503453n478345o230334o573718
40235B1305712o407312n750993m732725l532680k313664j174714j49088P60902
40227a994562J541939K150053K522330K604103K367008J808205R43990j83571
40219A1759495j487172k823729m013610m887542n336612n338021m946421m261303
40211b1334915l390411k423116j417385m01033O11001J588595K466410L152302
40203b1148552L565280L680367L552171L302337L074820K978893L048604L239501
40195E293421L457703L596546L563757L304618K828139K221452J629094J198436
40187B7093166J022423J110644J396210J768787K120523K386775K559527K665316
$$ y = [53691884, 52206944, 50239245, 47598936, 44091562, 39588109, 34109764, 27879430, 21305712, 14898400, 9147407, 4414682, 882002, -1431662, -2606376, -2755464, -1994562, -452623, 1697430, 4219760, 6823863, 9190871, 10999076, 11943066, 11759495, 10272323, 7448594, 3434984, -1452558, -6789170, -12127191, -17073612, -21334915, -24725326, -27148442, -28565827, -28966860, -28355859, -26767264, -24300854, -21148552, -17583272, -13902905, -10350734, -7048397, -3973577, -994684, 2053920, 5293421, 8751124, 12347670, 15911427, 19216045, 22044184, 24265636, 25894730, 27093166, 28115589, 29226233, 30622443, 32391230, 34511753, 36898528, 39458055, 42123371]
40179D2123371K727408K743262K689339K540835K290777J963084J615535J325199
40171F0018810J159768J157264J332199J693905K242815K936475L661585M253345
40163G8456166M558266M494152M068848L360709K486793J572702P21491j5514
40155I9703613o49902j238770j849319k526313l271900m034209m705865n145951
40147G6281384n232467m923761m287666l474160k648733j928474j352021q87789
40139E1546313m68534l5302M30859R08429J363107J774087K131785K414585K579901
40130F2645230K590073K452684K234660K032056J918287J912866J993741K137749
40122G9917346K350046K655370L060181L521004L948212M244431M350581M269471
$$ y = [42123371, 44850779, 47594041, 50283380, 52824215, 55114992, 57078076, 58693611, 60018810, 61178578, 62335842, 63668041, 65361946, 67604761, 70541236, 74202821, 78456166, 83014432, 87508584, 91577432, 94938141, 97424934, 98997636, 99719127, 99703613, 99053711, 97814941, 95965622, 93439309, 90167409, 86133200, 81427335, 76281384, 71048917, 66125156, 61837490, 58363330, 55714597, 53786123, 52434102, 51546313, 51077779, 51042477, 51473336, 52381765, 53744872, 55518959, 57650744, 60065329, 62645230, 65235303, 67687987, 69922647, 71954703, 73872990, 75785856, 77779597, 79917346, 82267392, 84922762, 87982943, 91503947, 95452159, 99696590, 104047171, 108316642]
40114A08316642M055625L783792L518161L293611L105409K904835K610837K146412
40106A33735324J484366O69139k02646j025406j719629k243625k588413k766738
40098A25342372k802178k723466k567897k388504k251483k217116k315130k533724
40090A05542874k829397l144678l415330l565553l510271l180519k560367j704511
40082H1632248p21062K64005J135078J802136K212718K362300K293313K080101
40074I3060837J809555J563962J402817J344893J363988J407450J426876J401229
40066A04781607J343559J294999J310460J437578J693791K050612K433327K740978
40058A19086911K884426K826084K594063K257248J881086J501222J130977P84352
$$ y = [108316642, 112372267, 116156059, 119674220, 122967831, 126073240, 128978075, 131588912, 133735324, 135219690, 135888829, 135686183, 134660777, 132941148, 130697523, 128109110, 125342372, 122540194, 119816728, 117248831, 114860327, 112608844, 110391728, 108076598, 105542874, 102713477, 99568799, 96153469, 92587916, 89077645, 85897126, 83336759, 81632248, 80911186, 81175191, 82310269, 84112405, 86325123, 88687423, 90980736, 93060837, 94870392, 96434354, 97837171, 99182064, 100546052, 101953502, 103380378, 104781607, 106125166, 107420165, 108730625, 110168203, 111861994, 113912606, 116345933, 119086911, 121971337, 124797421, 127391484, 129648732, 131529818, 133031040, 134162017, 134946369]
40050A34946369M87973K76016J80075K23255M17107P58564J229854J805331K461625
40041A42786169L181111L942547M705871N406550N967399O319652O419066O251955
40033A84980320N835674N216427M463790L663867K913398K307939J914003J733345
40025B13028763J688915J653607J507243J185240O96028J11470m56156q82691
40017B18532419j060598r20474m43227L32563J308038K336016L254111L928852
40009B27267700M291166M352630M203062L988209L862519L926009M178170M523923
40001B60593388M833401N016823N067003N050367N062252N175261N402451N687066
39993C01888012N922947N998762N844577N455318M880526M195122L478406K814837
$$ y = [134946369, 135434342, 135710358, 135890433, 136113688, 136530795, 137289359, 138519213, 140324544, 142786169, 145967280, 149909827, 154615698, 160022248, 165989647, 172309299, 178728365, 184980320, 190815994, 196032421, 200496211, 204160078, 207073476, 209381415, 211295418, 213028763, 214717678, 216371285, 217878528, 219063768, 219759796, 219871266, 219415110, 218532419, 217471821, 216551347, 216108120, 216440683, 217748721, 220084737, 223338848, 227267700, 231558866, 235911496, 240114558, 244102767, 247965286, 251891295, 256069465, 260593388, 265426789, 270443612, 275510615, 280560982, 285623234, 290798495, 296200946, 301888012, 307810959, 313809721, 319654298, 325109616, 329990142, 334185264, 337663670, 340478507]
39985C40478507K300796K027966K036497K271555K589939K827184K883171K767502
39977C60183117K579009K440466K431368K552236K731394K864778K866739K707091
39969C81356198K416976K061695J697837J345478R97703O57732L65569J84171
39961C91083359J53849K51297L81594M06561J97918l03289j049528j899758k682478
39952C86539525l271994l633494l819582l930841m063235m264092m516171m757727
39944C54282389m923740m980354m936667m839485m762217m790132n000022n438694
39936C14611078o108103o960051p900365q805437r551949j0047495j0241573j0110558
39928B44885547r636431q806349p636144o191764m582561k928474j327212J57466
$$ y = [340478507, 342779303, 344807269, 346843766, 349115321, 351705260, 354532444, 357415615, 360183117, 362762126, 365202592, 367633960, 370186196, 372917590, 375782368, 378649107, 381356198, 383773174, 385834869, 387532706, 388878184, 389875887, 390533619, 390899188, 391083359, 391237208, 391488505, 391870099, 392276660, 392474578, 392171289, 391121761, 389222003, 386539525, 383267531, 379634037, 375814455, 371883614, 367820379, 363556287, 359040116, 354282389, 349358649, 344378295, 339441628, 334602143, 329839926, 325049794, 320049772, 314611078, 308502975, 301542924, 293642559, 284837122, 275285173, 265237678, 254996105, 244885547, 235249116, 226442767, 218806623, 212614859, 208032298, 205103824, 203776612, 203934078]
39920B03934078J487447K636534L582445M307413M804936N086753N180893N115338
39912B36135837M893933M482318L820613K863522J626191K02903j259137k613238
39904B50152942l752957m613786n153814n349005n213609m819296m282544l720901
39896B13247030l208681k763265k368633k014967j721392j523071j435972j434323
39888A96776726j463058j472361j442577j383099j315405j257420j216083j187104
39880A86039619j161195j134074j112341j109424j135278j188271j253876j311456
39872A76633704j349491j382074j448970j587697j793787k004492k124666k077322
39864A62865205j844721j480803j095704q18699p47188r00559j206198j530400
$$ y = [203934078, 205421525, 208058059, 211640504, 215947917, 220752853, 225839606, 231020499, 236135837, 241029770, 245512088, 249332701, 252196223, 253822414, 254025317, 252766180, 250152942, 246399985, 241786199, 236632385, 231283380, 226069771, 221250475, 216967931, 213247030, 210038349, 207275084, 204906451, 202891484, 201170092, 199647021, 198211049, 196776726, 195313668, 193841307, 192398730, 191015631, 189700226, 188442806, 187226723, 186039619, 184878424, 183744350, 182632009, 181522585, 180387307, 179199036, 177945160, 176633704, 175284213, 173902139, 172453169, 170865472, 169071685, 167067193, 164942527, 162865205, 161020484, 159539681, 158443977, 157625278, 156878090, 155977531, 154771333, 153240933]
39856A53240933j735350j726101j466917r76616l23120L81268J002981J438111
39848A49835189J666216J764297J863441K074422K426993K849848L192528L278500
39840A68951434K974300K250973J209272N2343r84167j711327k037068j968045
39832A68737715j576600r65588k50231M52260J040322J446271J637073J599429
39824A72120651J332942Q63077K55869l89395r69120j405666j663301j748900
39816A68396157j703183j587542j469023j402507j410440j470213j525395j522500
39808A56305354j450031j351317j304647j387397j643228k062481k580469l095588
39800A41430196l501082l717656l715947l523693l214698k879791k590000k371832
$$ y = [153240933, 151505583, 149779482, 148312565, 147335949, 147012829, 147394097, 148397078, 149835189, 151501405, 153265702, 155129143, 157203565, 159630558, 162480406, 165672934, 168951434, 171925734, 174176707, 175385979, 175438322, 174454155, 172742828, 170705760, 168737715, 167161115, 166195527, 165945296, 166397556, 167437878, 168884149, 170521222, 172120651, 173453593, 174316670, 174572539, 174183144, 173214024, 171808358, 170145057, 168396157, 166692974, 165105432, 163636409, 162233902, 160823462, 159353249, 157827854, 156305354, 154855323, 153504006, 152199359, 150811962, 149168734, 147106253, 144525784, 141430196, 137929114, 134211458, 130495511, 126971818, 123757120, 120877329, 118287329, 115915497]
39792A15915497k211530k086609k001505j997055k121334k382283k720606l025003
39784I7369572l177437l099256k778699k274631j695827j160388p51075m85745
39776H1946514l09865j08272K63112R24365J913760L158517M496826N739480O734099
39767A04758536P397399P705664P662227P275042O562848N575836M401313L145299
39759A54484164J909526P82156j64008q80636j357183j620750j716908j687323
39751A49749038j563422j379442j190497j074841j107746j314758j633262j914597
39743A38570473j977043j687751j031432j27834Q14569J586483K059817K218726
39735A40426008K126788J859485J453086R05123K18800n52642j303884j921929
$$ y = [115915497, 113703967, 111617358, 109615853, 107618798, 105497464, 103115181, 100394575, 97369572, 94192135, 91092879, 88314180, 86039549, 84343722, 83183334, 82432259, 81946514, 81636649, 81528377, 81791489, 82715854, 84629614, 87788131, 92284957, 98024437, 104758536, 112155935, 119861599, 127523826, 134798868, 141361716, 146937552, 151338865, 154484164, 156393690, 157175846, 157011838, 156131202, 154774019, 153153269, 151436361, 149749038, 148185616, 146806174, 145615677, 144540836, 143433090, 142118332, 140485070, 138570473, 136593430, 134905679, 133874247, 133746413, 134560982, 136147465, 138207282, 140426008, 142552796, 144412281, 145865367, 146770490, 146989290, 146436648, 145132764, 143210835]
39727A43210835k341590k571187k675364k733095k798224k878201k930866k874220
39719A21408088k609465k059445j212482j46012R90223K022670K802649L232889
39711A24429115L275345K953090K347051J579312P82979P0320m87073q58814j039284
39702A33052041j028390q28479m62344O180M73864Q26808R78556Q96977O11275
39693A34526488K00488k30905n82278p83642q15584p16382n66478m49685m12742
39684A30169280m52803n37517o31348p04511p32052p05244o54574o57001q08668
39675A24285562j178402j774633k541872l378374m162478m785370n187513n380539
39667I5896381n431914n413716n350418n206173m919964m457005l834661l107628
$$ y = [143210835, 140869245, 138298058, 135622694, 132889599, 130091375, 127213174, 124282308, 121408088, 118798623, 116739178, 115526696, 115380684, 116370907, 118393577, 121196226, 124429115, 127704460, 130657550, 133004601, 134583913, 135366892, 135437212, 134950139, 134091325, 133052041, 132023651, 131195172, 130732828, 130739008, 131212872, 132039680, 133018236, 133915213, 134526488, 134726976, 134496071, 133913793, 133130151, 132314567, 131598185, 131031707, 130582022, 130169280, 129716477, 129178960, 128547612, 127843101, 127111049, 126405805, 125751231, 125094230, 124285562, 123107160, 121332527, 118790655, 115412281, 111249803, 106464433, 101276920, 95896381, 90464467, 85050751, 79700333, 74494160, 69574196, 65117191, 61282530, 58174902]
39659E8174902k333867j555879q10772j48740L70360P06684Q67317R01355Q67090
39650E7038450Q02230P20007O26538N41047N07014N91345Q71117J409785K229679
39641F5337212L289373M471988N591510O427208O787991O585659N878125M853244
39633A09222310L758323K812124K140946J759120J588919J503407J376633J126202
39625A25287984P32080K23589l52509r55373j549376k092872k541894k872452
39617A15879177l094819l234131l287822l202977k906430k372521j673636r66783
39609I5140058m20903j38099j23860l15170o26710r72228j260588j401519j340948
39600H8540033j098902p66318m54089k33688j11173m1732L4086J51857K98026
$$ y = [58174902, 55841035, 54285156, 53474384, 53325644, 53696004, 54402688, 55270005, 56171360, 57038450, 57840680, 58560687, 59187225, 59728272, 60235286, 60826631, 61697748, 63107533, 65337212, 68626585, 73098573, 78690083, 85117291, 91905282, 98490941, 104369066, 109222310, 112980633, 115792757, 117933703, 119692823, 121281742, 122785149, 124161782, 125287984, 126020064, 126243653, 125891144, 124935771, 123386395, 121293523, 118751629, 115879177, 112784358, 109550227, 106262405, 103059428, 100152998, 97780477, 96106841, 95140058, 94719155, 94581056, 94457196, 94142026, 93515316, 92543088, 91282500, 89880981, 88540033, 87441131, 86674813, 86220724, 85987036, 85875863, 85834131, 85868217, 86020074, 86318100]
39591H6318100M13947M31478L14479P2752k55847o28641j007030j358686j664726
39582H2635826j922473k128541k252500k232501k008814j573922r98747m10347
39574F9107981O8448L78525N42747O32584P13111Q10941R23460J048349J199311
39565G5425457J395605J641022J914587K180075K403940K567223K666762K710784
39557I2905455K713881K689444K637426K534769K341266K022415J573623J027502
39549A10445781M41646j21226o10846j003405j310968j578163j860472k193296
39541A02209051k572151k956808l293428l537312l663391l663944l542502l314266
39533G5665249l014981k706513k462701k334930k321755k370417k409517k381784
$$ y = [86318100, 86732047, 87163525, 87478004, 87550756, 87294909, 86666268, 85659238, 84300552, 82635826, 80713353, 78584812, 76332312, 74099811, 72090997, 70517075, 69518328, 69107981, 69176429, 69554954, 70097701, 70730285, 71443396, 72254337, 73177797, 74226146, 75425457, 76821062, 78462084, 80376671, 82556746, 84960686, 87527909, 90194671, 92905455, 95619336, 98308780, 100946206, 103480975, 105822241, 107844656, 109418279, 110445781, 110887427, 110766201, 110155355, 109151950, 107840982, 106262819, 104402347, 102209051, 99636900, 96680092, 93386664, 89849352, 86185961, 82522017, 78979515, 75665249, 72650268, 69943755, 67481054, 65146124, 62824369, 60453952, 58044435, 55662651]
39525E5662651k250841j989783j579377j025516l76432K82035Q50363J239005
39517E0812105J381997J248252Q57851K93296l13621q25295j152347j286803j296454
39508D9718981j288395j363335j576122j909057k267627k512811k526422k272849
39500C4002363j810841j246279o68249j20716L78778Q06357J121014J282260J278632
39491C5023319J147858R76317Q72127R17757J124963J419777J668590J730714
39483D4881422J509916R82786J96799p53625j755788k698383l482350m032260
39475C4848517m310980m326767m121248l743071l227752k600554j897380j178532
39467I442233n13158N9540N58458J047906J590145K199949K830158L386051L751662
$$ y = [55662651, 53411810, 51422027, 49842650, 48817134, 48440702, 48722737, 49573100, 50812105, 52194102, 53442354, 54300205, 54593501, 54279880, 53454585, 52302238, 51015435, 49718981, 48430586, 47067251, 45491129, 43582072, 41314445, 38801634, 36275212, 34002363, 32191522, 30945243, 30276994, 30156278, 30535056, 31341413, 32462427, 33744687, 35023319, 36171177, 37147494, 38019621, 38937378, 40062341, 41482118, 43150708, 44881422, 46391338, 47374124, 47570923, 46817298, 45061510, 42363127, 38880777, 34848517, 30537537, 26210770, 22089522, 18346451, 15118699, 12518145, 10620765, 9442233, 8929075, 8988615, 9547073, 10594979, 12185124, 14385073, 17215231, 20601282, 24352944]
39458B4352944L822388L543921K941717K115182J192703K77820n77267j360529
39450C6308879k067133k667184l092919l256116l089333k584985j807526q77369
39442A6866314N8400Q61356J444321J806628K030085K222606K444041K670778
39434C0404529K824555K837767K702083K465006K180232J853086J427677Q29963
39426D7524898L4129q98908j836294k626797l162123l421471l481711l481410
39418B8650313l547651l724299l945568m067272l930483l423262k521589j303347
39410B186842O8130J387133K456525L123973L297832K955433K153375J030601
39402A8659844k12316j359449k233093k731028k834040k585254k056342j322967
$$ y = [24352944, 28175332, 31719253, 34660970, 36776152, 37968855, 38246675, 37669408, 36308879, 34241746, 31574562, 28481643, 25225527, 22136194, 19551209, 17743683, 16866314, 16924714, 17786070, 19230391, 21037019, 23067104, 25289710, 27733751, 30404529, 33229084, 36066851, 38768934, 41233940, 43414172, 45267258, 46694935, 47524898, 47559027, 46660119, 44823825, 42197028, 39034905, 35613434, 32131723, 28650313, 25102662, 21378363, 17432795, 13365523, 9435040, 6011778, 3490189, 2186842, 2254972, 3642105, 6098630, 9222603, 12520435, 15475868, 17629243, 18659844, 18447528, 17088079, 14854986, 12123958, 9289918, 6704664, 4648322, 3325355]
39394C325355m64159M22144J212993J782508K044955J991748J696043J275598
39386A3287185Q29435L86424r6100o81262j391185k182512k965544l636587m099049
39377e49195m275276m116561l607175k760525j620083k72928J140159K441073
39369a3620511L456794M064549M219890L962440L398353K660793J862539J065248
39361A1070095K79827n09447j314489k119539k871477l488960l886929m002014
39353f842933l804051l292851k493135j459828k89715Q80225J902993K668960
39345a2730335L136249L320427L256958K973261K491698J851574J122538L92011
39337E814381k70159q47474j382645j940087k549329l176655l748444m200233
$$ y = [3325355, 2861196, 3283340, 4496333, 6278841, 8323796, 10315544, 12011587, 13287185, 14116620, 14503044, 14406944, 13725682, 12334497, 10151985, 7186441, 3549854, -549195, -4824471, -8941032, -12548207, -15308732, -16928815, -17201743, -16061584, -13620511, -10163717, -6099168, -1879278, 2083162, 5481515, 8142308, 10004847, 11070095, 11349922, 10840475, 9525986, 7406447, 4534970, 1046010, -2840919, -6842933, -10646984, -13939835, -16432970, -17892798, -18182513, -17302288, -15399295, -12730335, -9594086, -6273659, -3016701, -43440, 2448258, 4299832, 5422370, 5814381, 5544222, 4696748, 3314103, 1374016, -1175313, -4351968, -8100412, -12300645]
39329a2300645m504644m659951m662149m493500m137345l602137k930403k181930
39321d3472704j401383n93446K75466J246486K324140L444762M481841N294366
39313b8400472N794894N994330N990944N907326N813468N683282N411507M881306
39305A7076585M040583K940042J713145N16676n30092j376877k034549k538013
39297A9807500k905349l121598l157341l003498k690373k275534j814554j343330
39289e04077q87135m82362j79098r499N2021Q9623J91327L78259N77051O55731
39279a18159M91064K2059p29601j664989k627959l436375l922098l970130l541264
39270a9497452k668700j436668L7320J603800L079045M264638M995082N189215
$$ y = [-12300645, -16805289, -21465240, -26127389, -30620889, -34758234, -38360371, -41290774, -43472704, -44874087, -45467533, -45192067, -43945581, -41621441, -38176679, -33694838, -28400472, -22605578, -16611248, -10620304, -4712978, 1100490, 6783772, 12195279, 17076585, 21117168, 24057210, 25770355, 26287031, 25756939, 24380062, 22345513, 19807500, 16902151, 13780553, 10623212, 7619714, 4929341, 2653807, 839253, -504077, -1391212, -1873574, -2052672, -2062171, -2010150, -1920527, -1729200, -1350941, -773890, -118159, 372905, 394964, -334637, -1999626, -4627585, -8063960, -11986058, -15956188, -19497452, -22166152, -23602820, -23565500, -21961700, -18882655, -14618017, -9622935, -4433720]
39262d433720M873639M167553L241389K267502J377183O36291M7977m21908q15088
39253A0940818j163770j487364j792148k067221k281328k387192k332764k074429
39245d645398j590846q97606n7072Q26243J627454K231807K563020K603513K401936
39236E063051K060886J702197J421756J257344J187618J160669J131464J084272
39228A6069257J031885J003211J033816J157826J388734J690976J967739K088287
39220B7431731J945345J504414Q13805k2334q80166j638151k187215k449073k409951
39211B2108405k144751j795878j505422j346431j302836j301546j258134j102741
39203A0350666p87263k92185L60800J102600J831417K447663K887668L128450
$$ y = [-4433720, 439919, 4607472, 7848861, 10116363, 11493546, 12129837, 12177814, 11755906, 10940818, 9777048, 8289684, 6497536, 4430315, 2148987, -238205, -2570969, -4645398, -6236244, -7133850, -7190922, -6364679, -4737225, -2505418, 57602, 2661115, 5063051, 7123937, 8826134, 10247890, 11505234, 12692852, 13853521, 14984985, 16069257, 17101142, 18104353, 19138169, 20295995, 21684729, 23375705, 25343444, 27431731, 29377076, 30881490, 31695295, 31672961, 30792795, 29154644, 26967429, 24518356, 22108405, 19963654, 18167776, 16662354, 15315923, 14013087, 12711541, 11453407, 10350666, 9563403, 9271218, 9632018, 10734618, 12566035, 15013698, 17901366, 21029816]
39195B1029816L158126K942569K427870J583432M48987q53158k146320l247864
39187B5343458m017941m396083m412724m166259l773664l320338k834346k293211
39179c871108j653518q85627J615R52778J873857K653691L193623L434881L371513
39170I071705L045641K531774J917304J282140O84295J62950k41583m74302m83000
39161A7496924k60064J29573N65592R25404J133099J172160J065024Q47389N58585
39152B3633686K44493m3963k64246l99145m65331n09125n91403p67122j070488
39143A9767356j516022k110158k852429l714522m614963n419620n976030o160051
39135a2596439n910701n247493m273310l157222k088312j210570n72888j27713
$$ y = [21029816, 24187942, 27130511, 29558381, 31141813, 31590800, 30737642, 28591322, 25343458, 21325517, 16929434, 12516710, 8350451, 4576787, 1256449, -1577897, -3871108, -5524626, -6410253, -6408638, -5455860, -3582003, -928312, 2265311, 5700192, 9071705, 12117346, 14649120, 16566424, 17848564, 18532859, 18695809, 18454226, 17979924, 17496924, 17236860, 17366433, 17932025, 18857429, 19990528, 21162688, 22227712, 23075101, 23633686, 23878179, 23834216, 23569970, 23170825, 22705494, 22196369, 21604966, 20837844, 19767356, 18251334, 16141176, 13288747, 9574225, 4959262, -460358, -6436388, -12596439, -18507140, -23754633, -28027943, -31185165, -33273477, -34484047, -35056935, -35184648]
39127c5184648K20784N55339R13842J299177J705751K130798K562791K964252
39119b2831914L269053L400620L303215K970151K451204J832790J204607O36925
39111c763349J79171j33191k83146k90565k26189j99220l14577o20574j079542
39102f731182j581393j992416k211596k208367k029452j774290j548667j419311
39094b1496674j397555j461366j592383j791564k060772k373174k664087k849394
39086c7686969k852257k619399k128644j399978n09412M11452J201966J715416
39078d3867825J857101J606130J022115K36307n79268j262260j708409j890456
39070d4586565j839062j604927j232816p63820k54237K17292N70979P62420Q05365
$$ y = [-35184648, -34963864, -34408525, -33494683, -32195506, -30489755, -28358957, -25796166, -22831914, -19562861, -16162241, -12859026, -9888875, -7437671, -5604881, -4400274, -3763349, -3584178, -3717369, -4000515, -4291080, -4517269, -4716489, -5031066, -5651640, -6731182, -8312575, -10304991, -12516587, -14724954, -16754406, -18528696, -20077363, -21496674, -22894229, -24355595, -25947978, -27739542, -29800314, -32173488, -34837575, -37686969, -40539226, -43158625, -45287269, -46687247, -47196659, -46785207, -45583241, -43867825, -42010724, -40404594, -39382479, -39146172, -39725440, -40987700, -42696109, -44586565, -46425627, -48030554, -49263370, -50027190, -50281427, -50064135, -49493156, -48730736, -47925371]
39061d7925371P65417P33601P95446J002177J349120J774223K185825K505880
39053c6813682K698538K766108K722594K570307K297408J895711J383236Q13481
39045a9666299K64428j84461m74709n86193n48369m36719l44872l41484m39727
39036b2758405n99522p55208q45919q33655p07003m74930j59469K03178N56697
39027b6374236Q33334R86010J018929R80376R18390Q42361P25725N38104K71541
39018a9259466n2239l81167o34738p23575n90978k48534K30043P57877J286798
39009a9615979J819736K379212K965618L541812M051563M451514M732433M918798
39001I244707N048235N140935N178018N107794M878491M470711L903902L220878
$$ y = [-47925371, -47159954, -46426353, -45630907, -44628730, -43279610, -41505387, -39319562, -36813682, -34115144, -31349036, -28626442, -26056135, -23758727, -21863016, -20479780, -19666299, -19401871, -19586332, -20061041, -20647234, -21195603, -21632322, -21977194, -22318678, -22758405, -23357927, -24113135, -24959054, -25792709, -26499712, -26974642, -27134111, -26930933, -26374236, -25540902, -24554892, -23535963, -22555587, -21637197, -20794836, -20069111, -19531007, -19259466, -19311705, -19692872, -20327610, -21051185, -21642163, -21890697, -21660654, -20902777, -19615979, -17796243, -15417031, -12451413, -8909601, -4858038, -406524, 4325909, 9244707, 14292942, 19433877, 24611895, 29719689, 34598180, 39068891, 42972793, 46193671]
38993D6193671K474795J728052J047803M86139N9030k53394m85217o64965q15558
38984D9770356r67662j166609j460679j875843k392903k942409l422352l731435
38976C1810464l803483l629456l258929k781251k294991j879655j580917j411901
38968A1169881j364145j417112j537001j666416j720527j605914j257327o65748
38960f4309J22466J024566J931769K705986L189298L248737K839518K039549J023773
38951A8061353o957q96417j565300k000602k223285k258996k125692j838928j425797
38942C719379r33782m25274L9131M16311O86085Q47414R12195R02709Q54733Q21732
38932G840633Q68029J041911J339621J689684J977297K095146J986341J658663
$$ y = [46193671, 48668466, 50396518, 51444321, 51930460, 51989490, 51736096, 51250879, 50585914, 49770356, 48802694, 47636085, 46175406, 44299563, 41906660, 38964251, 35541899, 31810464, 28006981, 24377525, 21118596, 18337345, 16042354, 14162699, 12581782, 11169881, 9805736, 8388624, 6851623, 5185207, 3464680, 1858766, 601439, -64309, 58157, 1082723, 3014492, 5720478, 8909776, 12158513, 14998031, 17037580, 18061353, 18054396, 17157979, 15592679, 13592077, 11368792, 9109796, 6984104, 5145176, 3719379, 2785597, 2360323, 2399454, 2815765, 3501850, 4349264, 5261459, 6164168, 7018901, 7840633, 8708662, 9750573, 11090194, 12779878, 14757175, 16852321, 18838662, 20497325]
38924B0497325J176183O42740J80849r8348j31326P0454M19616P83435J031242
38915B4572170J074447Q86124N05122L0614m01225o65005o96674n07863j53532
38906B4644178L10227Q34807J355010J772856J979211J901018J538265R67517
38898C5303089L14742k85770p29942r68981j013903r17045p37347n07526k23651
38889C0233666J36282N78725J069137J530466J866731K000022J901017J595473
38881D0911519J146219O29748J25180k88355n43445o08998n09324l19478j39890
38872D0403176o6925j69150m67705r22350j435087j880827k155157k212658k075312
38863B9018005j814429j524748j301601j217430j296370j500706j744248j927841
$$ y = [20497325, 21673508, 22316248, 22497097, 22398749, 22267423, 22337877, 22757493, 23540928, 24572170, 25646617, 26532741, 27037863, 27068477, 26667252, 26002247, 25305573, 24797710, 24644178, 24954405, 25789212, 27144222, 28917078, 30896289, 32797307, 34335572, 35303089, 35617831, 35332061, 34602119, 33633138, 32619235, 31702190, 30964843, 30457317, 30233666, 30369948, 30948673, 32017810, 33548276, 35415007, 37415029, 39316046, 40911519, 42057738, 42687486, 42812666, 42524311, 41980866, 41371868, 40862544, 40543066, 40403176, 40336251, 40167101, 39699396, 38777046, 37341959, 35461132, 33305975, 31093317, 29018005, 27203576, 25678828, 24377227, 23159797, 21863427, 20362721, 18618473, 16690632]
38855A6690632j976185j861752j615064j319226j080117r75969j014835j132423
38847E715061j233315j245458j152599r91732q26585p17239p00899p87988r68705
38838b909459j222818j528915j871149k240036k624865l002872l335998l580596
38830b2316708l703248l691853l558799l340001l089559k863339k691852k560123
38822d7815482k415964k204641j900322j506488j030335m63153K10863R86761
38814e6138761J819811K633913L353463L938940M403418M797606N170959N532542
38806b4488109N835147N991189N913786N565926M992531M311750L663849L148082
38798A4934151K787235K534979K310044K034335J664187J210046P36354L36933
$$ y = [16690632, 14714447, 12852695, 11237631, 9918405, 8838288, 7862319, 6847484, 5715061, 4481746, 3236288, 2083689, 1091957, 265372, -451867, -1152766, -1940754, -2909459, -4132277, -5661192, -7532341, -9772377, -12397242, -15400114, -18736112, -22316708, -26019956, -29711809, -33270608, -36610609, -39700168, -42563507, -45255359, -47815482, -50231446, -52436087, -54336409, -55842897, -56873232, -57336385, -57125522, -56138761, -54318950, -51685037, -48331574, -44392634, -39989216, -35191610, -30020651, -24488109, -18652962, -12661773, -6747987, -1182061, 3810470, 8122220, 11786069, 14934151, 17721386, 20256365, 22566409, 24600744, 26264931, 27474977, 28211331, 28548264]
38790B8548264R5586N1729J85816M27717O82278Q60248R00259P74340M82531M8306
38780C3057074m81548j039106j544350j916346k079917j970573j547279q14990
38772B1662965J57436J242961K288875L156422L743036L981918L835876L302515
38764D3372004K428395J315331J08880j025035j924743k456928k543286k184881
38756C7089737j469552n52695L81530J161977J665015J839991J719641J402034
38748D3237678J000930N87370J57489l56025j040456j951868l076194m316992
38740C4241932n517607o508321p151530p362313p107671o403058n313471l948661
38732a5070700k444720r39998M42068J600969K463100K984283L150669K980781
$$ y = [28548264, 28643850, 28695579, 28881395, 29309112, 29991390, 30851638, 31751897, 32526237, 33008768, 33057074, 32575526, 31536420, 29992070, 28075724, 25995807, 24025234, 22477955, 21662965, 21820401, 23063362, 25352237, 28508659, 32251695, 36233613, 40069489, 43372004, 45800399, 47115730, 47224610, 46199575, 44274832, 41817904, 39274618, 37089737, 35620185, 35067490, 35449020, 36610997, 38276012, 40116003, 41835644, 43237678, 44238608, 44825978, 44983467, 44627442, 43586986, 41635118, 38558924, 34241932, 28724325, 22216004, 15064474, 7702161, 594490, -5808568, -11122039, -15070700, -17515420, -18455418, -18013350, -16412381, -13949281, -10964998, -7814329, -4833548]
38724d833548K530485J894944J198085N69282J17938q5720k5458K49322O27518
38715B242848R71613J176774J215580J132130R90544Q22936O18431L53666L1834
38706I556356l02254n80847p53463q22819q48711r10709j053423j255964j448114
38697A580052j558197j557747j477410j388595j361960j425982j552491j680005
38689a0422335j757039j772545j754636j744997j769748j823195j869886j861252
38681b4775633j756144j532735j186085p16604j21575O00650J433847K326006
38673b5728273L186223L903051M373821M526481M325232L766621K876856J713407
38665B943419L67644j035089k341876l390758m042390m214024l898574l160348
$$ y = [-4833548, -2303063, -408119, 789966, 1359248, 1477186, 1391466, 1366008, 1615330, 2242848, 3214461, 4391235, 5606815, 6738945, 7729489, 8552425, 9170856, 9524522, 9556356, 9254102, 8673255, 7919792, 7096973, 6248262, 5337553, 4284130, 3028166, 1580052, 21855, -1535892, -3013302, -4401897, -5763857, -7189839, -8742330, -10422335, -12179374, -13951919, -15706555, -17451552, -19221300, -21044495, -22914381, -24775633, -26531777, -28064512, -29250597, -29967201, -30088776, -29488126, -28054279, -25728273, -22542050, -18638999, -14265178, -9738697, -5413465, -1646844, 1230012, 2943419, 3311063, 2275974, -65902, -3456660, -7499050, -11713074, -15611648, -18771996]
38657a8771996k114065q99685L38993J469698K381591K993577L266058L213370
38649h122459K902873K429662J876586J286611O66968J9809o24072j191757j586141
38640b341920j728637j601822j262813q18615l83560m5776J48693J99631J44766
38631g690053L6468q6838k12756l43217m76692o03415p12297p96922q56030q90329
38621a2632081q93642q39118o74882l44683J73648Q40745J561112K217411K711870
38612g879620K992936L054526K911409K572871K040335J331945N08239l28743
38604G203898j064407j606077j900392j927070j678641j145400l23607P51800
38596a689896J973854L162518M108765M642625M686582M268372L495617K514828
$$ y = [-18771996, -20886061, -21785746, -21446753, -19977055, -17595464, -14601887, -11335829, -8122459, -5219586, -2789924, -913338, 373273, 1040241, 1060050, 435978, -755779, -2341920, -4070557, -5672379, -6935192, -7753807, -8137367, -8183143, -8034450, -7834819, -7690053, -7653585, -7740423, -7953179, -8296396, -8773088, -9376503, -10088800, -10885722, -11741752, -12632081, -13525723, -14364841, -15039723, -15384406, -15210758, -14370013, -12808901, -10591490, -7879620, -4886684, -1832158, 1079251, 3652122, 5692457, 7024402, 7532641, 7203898, 6139491, 4533414, 2633022, 705952, -972689, -2118089, -2441696, -1689896, 283958, 3446476, 7555241, 12197866, 16884448, 21152820, 24648437, 27163265]
38588B7163265J476064N09441k90586q74649j236480j397736j389095j240492
38580B2719732r83153o54291k95300N6053L70840O24470P85055Q08707O56998
38571B4089111L33762q7700m81032p28378p85212o98419n66649m78786m74848
38562B0121849n44414o47528p37249p73230p25474n74293l16039K2603L75368
38553A6201593O50076P63029O68951L66998j08468o91676j281266j746011j952155
38544A2871071j802358j266129l87672P32697J975707L236567M429620N462962
38536B5252465O214576O545216O348450N602218M385530K853681J191458m32794
38528E7960800j898891l145096m152286m906764n364641n449121n091734m289803
$$ y = [27163265, 28639329, 29148770, 28858184, 27983535, 26747055, 25349319, 23960224, 22719732, 21736579, 21082288, 20786988, 20843041, 21213881, 21838351, 22623406, 23432113, 24089111, 24422873, 24335173, 23854141, 23125763, 22340551, 21642132, 21075483, 20596697, 20121849, 19577435, 18929907, 18192658, 17419428, 16693954, 16119661, 15803622, 15826225, 16201593, 16851669, 17614698, 18283649, 18650647, 18542179, 17850503, 16569237, 14823226, 12871071, 11068713, 9802584, 9414912, 10147609, 12123316, 15359883, 19789503, 25252465, 31467041, 38012257, 44360707, 49962925, 54348455, 57202136, 58393594, 57960800, 56061909, 52916813, 48764527, 43857763, 38493122, 33044001, 27952267, 23662464]
38520B3662464l134211j787553m36356P46085J616301K073281K077495J663931
38512B6481437R32596J8501r41275j829401k557948l072333l354708l425402l335371
38503H916096l145997k906607k648774k402603k213809k134900k191354k354539
38495a1082487k550169k697340k745988k685424k523204k256167j858126j293884
38487b9692789n47965L53551J340462K309796L141061L716935L956171L849899
38479a1572879L473921K958063K427773J957928J566742J241788R67178P30866
38471C751380N19009L18381J33484M12k4367J02226L81177P71799J217726J673725
38461H844952K112603K511502K833705L025494L035555K843532K472729J975339
$$ y = [23662464, 20528253, 18740700, 18304344, 19050429, 20666730, 22740011, 24817506, 26481437, 27414033, 27432534, 26491259, 24661858, 22103910, 19031577, 15676869, 12251467, 8916096, 5770099, 2863492, 214718, -2187885, -4401694, -6536594, -8727948, -11082487, -13632656, -16329996, -19075984, -21761408, -24284612, -26540779, -28398905, -29692789, -30240754, -29887203, -28546741, -26236945, -23095884, -19378949, -15422778, -11572879, -8098958, -5140895, -2713122, -755194, 811548, 2053336, 3020514, 3751380, 4270389, 4588770, 4722254, 4722666, 4698299, 4800525, 5181702, 5953501, 7171227, 8844952, 10957555, 13469057, 16302762, 19328256, 22363811, 25207343, 27680072, 29655411]
38453B9655411J405294Q03197J99807l75211q90529j315516j625986j816543j914950
38444B4124974j980149k073385k221408k406185k592444k765691k943051l147683
38436C994978l373540l574377l685884l659714l481919l166779k739172k223936
38428b1910343j650326j065245n40166j57609K2439m505j80788m11737o01448
38419b6499728o75809n89695l29229Q7378O17179J209040J818581K412037K961888
38410a8988358L443328L835761M127786M321808M431956M469025M417468M225975
38402A4284749L832171L214175K431848J622246R49506N43888M66426P08491J210498
38393B9263998J880853K609580L282917L804933M121050M226806M147820L899072
$$ y = [29655411, 31060705, 31863902, 32063709, 31688498, 30797969, 29482453, 27856467, 26039924, 24124974, 22144825, 20071440, 17850032, 15443847, 12851403, 10085712, 7142661, 3994978, 621438, -2952939, -6638823, -10298537, -13780456, -16947235, -19686407, -21910343, -23560669, -24625914, -25166080, -25323689, -25301250, -25305755, -25486543, -25898280, -26499728, -27175537, -27765232, -28094461, -28007083, -27389904, -26180864, -24362283, -21950246, -18988358, -15545030, -11709269, -7581483, -3259675, 1172281, 5641306, 10058774, 14284749, 18116920, 21331095, 23762943, 25385189, 26334695, 26878583, 27345009, 28053500, 29263998, 31144851, 33754431, 37037348, 40842281, 44963331, 49190137, 53337957, 57237029]
38385E7237029L455688K765358J799258O03231o92562j916870k926911l659888
38377E6664333m134822m408473m522442m481323m270591l889967l374337k794333
38369B4788045k242576j810104j556981j488398j549778j643911j662156j519526
38361A1314615j183269o82846r4960M86733R78536J319864J476191J437747J214866
38352A6267477Q30917L17719k83825r22418j541604k093485k554259k928941l235020
38343C856561l470009l586894l502683l140602k478767j574632n55924M09817
38335a4043133J150953J526207J459877R75336K09494o14945j261403j561579
38327a2159193j461432j012357l26457M73828J292735K074164K784628L377102
$$ y = [57237029, 60692717, 63458075, 65257333, 65860564, 65168002, 63251132, 60324221, 56664333, 52529511, 48121038, 43598596, 39117273, 34846682, 30956715, 27582378, 24788045, 22545469, 20735365, 19178384, 17689986, 16140208, 14496297, 12834141, 11314615, 10131346, 9448500, 9353540, 9840273, 10818809, 12138673, 13614864, 15052611, 16267477, 17098394, 17416113, 17132288, 16209870, 14668266, 12574781, 10020522, 7091581, 3856561, 386552, -3200342, -6703025, -9843627, -12322394, -13897026, -14452950, -14043133, -12892180, -11365973, -9906096, -8930760, -8721266, -9336211, -10597614, -12159193, -13620625, -14632982, -14959439, -14485611, -13192876, -11118712, -8334084, -4956982]
38319d956982L767553L849894L540971K822530J756319M72928q54529k044457
38311H354227k943799l459977l577883l353461k882882k261771j562200q44645
38303a2532391j88276K99815N17412M21307O1505m27651q70895j105656j025612
38294a4850442o04983R8070R56947J807602K489620K888748K970397K793316K494139
38285A043414K239630K159127K288823K560599K841092K992205K915777K568483
38277B1609150J959240J144287K20205o93521j483626k073554k442536k626377
38269A5613268k699545k741752k798148k851623k828216k640809k247194j682569
38261d876588j043213m34952P6577M86894Q43451J218102J669095K199248K729642
$$ y = [-4956982, -1189429, 2660465, 6201436, 9023966, 10780285, 11253213, 10398684, 8354227, 5410428, 1950451, -1627432, -4980893, -7863775, -10125546, -11687746, -12532391, -12720667, -12420852, -11903440, -11482133, -11420628, -11848279, -12719174, -13824830, -14850442, -15455425, -15357355, -14400408, -12592806, -10103186, -7214438, -4244041, -1450725, 1043414, 3283044, 5442171, 7730994, 10291593, 13132685, 16124890, 19040667, 21609150, 23568390, 24712677, 24932882, 24239361, 22755735, 20682181, 18239645, 15613268, 12913723, 10171971, 7373823, 4522200, 1693984, -946825, -3194019, -4876588, -5919801, -6354753, -6278176, -5791282, -4947831, -3729729, -2060634, 138614, 2868256]
38252B868256L116020L213997K957741K396563J662303Q94724J79478m67913j077980
38243A5743189j687482k303118k883810l356618l665753l821476l902930m003929
38235i881927m164398m343654m450593m396983m132976l653263k986687k181930
38227d0192411j292191l61156N83616J526518K453079L339661M148181M828337
38219b4966366N328809N614597N681590N559289N300944M968710M621320M305033
38211A6413926M044706L834942L637294L390400L034244K540132J930571J273505
38203D0099720O47860R8243l89806q73137j403500j986315k577488l115823l557410
38194B6942344l879857m055831m026573l707352l028768j987384o72910P43463
$$ y = [2868256, 5984276, 9198273, 12156014, 14552577, 16214880, 17109604, 17289082, 16821169, 15743189, 14055707, 11752589, 8868779, 5512161, 1846408, -1975068, -5877998, -9881927, -14046325, -18389979, -22840572, -27237555, -31370531, -35023794, -38010481, -40192411, -41484602, -41845758, -41262142, -39735624, -37282545, -33942884, -29794703, -24966366, -19637557, -14022960, -8341370, -2782081, 2518863, 7487573, 12108893, 16413926, 20458632, 24293574, 27930868, 31321268, 34355512, 36895644, 38826215, 40099720, 40747580, 40845823, 40456017, 39582880, 38179380, 36193065, 33615577, 30499754, 26942344, 23062487, 19006656, 14980083, 11272731, 8243963, 6256579, 5583669, 6327132]
38186F327132K053486L071575L687378L887989L738868L339585K787883K170903
38178C1064799J569746J052977O56395L68433J33746j31872n24526j129616j987994
38169C1072088l061851m222723n274588o004553o241484n903000n017972l719949
38161h374032k215177p33781N24886J438098J980402K210239K231278K150522
38153g87565K052288J992039K001067K091329K255783K466166K672655K808828
38145A7552590K804808K609818K218941J688821J126181O50027L49762K63253
38137B9264201L78488O45369R88537J324787J585804J733914J759699J669811
38129C9350610J483906J243958J017245Q77347Q72636J006896J244424J530428
$$ y = [6327132, 8380618, 11452193, 15139571, 19027560, 22766428, 26106013, 28893896, 31064799, 32634545, 33687522, 34343917, 34712350, 34846096, 34714224, 34189698, 33060082, 31072088, 28010237, 23787514, 18512926, 12508373, 6266889, 363889, -4654083, -8374032, -10589209, -11322990, -10798104, -9360006, -7379604, -5169365, -2938087, -787565, 1264723, 3256762, 5257829, 7349158, 9604941, 12071107, 14743762, 17552590, 20357398, 22967216, 25186157, 26874978, 28001159, 28651186, 29000948, 29264201, 29642689, 30288058, 31276595, 32601382, 34187186, 35921100, 37680799, 39350610, 40834516, 42078474, 43095719, 43973066, 44845702, 45852598, 47097022, 48627450]
38121D8627450J809856K034984K160980K135849J897960J393202O07647m05844
38113F0262084j526537k590287l428014l910803l994545l742031l295423k801250
38105C4973194k333552j869893j334882o75281Q5838Q45262J460964J811967J846814
38096C4810431J599853J170842O81146K30676j24318l68793n13773n82474o02501
38087C6301089o01582o03956o25526o64970o92857o50429m69086j04649M34688
38078C2322722J082409J729728K257756K580010K679374K611991K465492K296747
38070E0026229K094291J788131J292062N48851m40405j608636k836301l979595
38062D6884627m901439n496508n708397n537426n034047m278481l359242k364531
$$ y = [48627450, 50437306, 52472290, 54633270, 56769119, 58667079, 60060281, 60667928, 60262084, 58735547, 56145260, 52717246, 48806443, 44811898, 41069867, 37774444, 34973194, 32639642, 30769749, 29434867, 28759586, 28845424, 29690686, 31151650, 32963617, 34810431, 36410284, 37581126, 38262272, 38492948, 38368630, 37999837, 37486064, 36903590, 36301089, 35699507, 35095551, 34470025, 33805055, 33112198, 32461769, 31992683, 31888034, 32322722, 33405131, 35134859, 37392615, 39972625, 42651999, 45263990, 47729482, 50026229, 52120520, 53908651, 55200713, 55749564, 55309159, 53700523, 50864222, 46884627, 41983188, 36486680, 30778283, 25240857, 20206810, 15928329, 12569087, 10204556]
38054A0204556j385606n17236J56066N82907P60400P29692N54019K93469r772
38045A1368495l32414o62882r91649j300873j555734j705238j699211j516588
38037A603906j186119p80860l85923o0473J81603L65596N35743P33110R74598
38028A981181J236883J457129J558063J484561J225693Q08080K69787l64875j093518
38019H562984j920480k824010l725978m490065m959789n020887m654745l952246
38011b2985216l077743k201332j438521q29965l60986P417L18352O06397Q82058
38002b9079539J120305J270152J285796J157635R21299O41457L83865J92716Q3040
37993b2023274M5220N0223N1344n870j54198l69392n62949o20578m62311p9731
$$ y = [10204556, 8818950, 8301714, 8457780, 9040687, 9801087, 10530779, 11084798, 11378267, 11368495, 11036081, 10373199, 9381550, 8080677, 6524943, 4819705, 3120494, 1603906, 417787, -363073, -748996, -809469, -627866, -262270, 273473, 1006583, 1981181, 3218064, 4675193, 6233256, 7717817, 8943510, 9751590, 10021377, 9656502, 8562984, 6642504, 3818494, 92516, -4397549, -9357338, -14378225, -19032970, -22985216, -26062959, -28264291, -29702812, -30532777, -30893763, -30886346, -30567994, -29961597, -29079539, -27959234, -26689082, -25403286, -24245651, -23324352, -22682895, -22299030, -22106314, -22023274, -21978054, -21927831, -21876487, -21882357, -22036555, -22405947, -22968896, -23589474, -24051785, -24131516]
37983b4131516M70820J100330J712823K214750K524052K592543K429483K099696
37975h987019J689276J265723Q65658N11801K28941L4372q7657j97683l82754
37966e059342p18467j233879j895713k616377l278934l764633l971625l827794
37958b6366764l309584k467415j436642m09492M30365R75817J223036J238544
37950c0122135J090682P98436L40219k84151r95673j641111k062708k175983j997814
37941c7050238j618127j150194o91114l00706J036K17846L55281M17857M30862
37932c9387497M55436N61590P69807J016162J183114J178033R97725P30444M98254
37923c1996932L83902L90106M51677M86064M45571L36341J94882M7066j11156
$$ y = [-24131516, -23660696, -22560366, -20847543, -18632793, -16108741, -13516198, -11086715, -8987019, -7297743, -6032020, -5166362, -4654561, -4425620, -4391248, -4478905, -4676588, -5059342, -5777809, -7011688, -8907401, -11523778, -14802712, -18567345, -22538970, -26366764, -29676348, -32143763, -33580405, -33989897, -33559532, -32583715, -31360679, -30122135, -29031453, -28233017, -27892798, -28176949, -29172622, -30813733, -32876441, -35052424, -37050238, -38668365, -39818559, -40509673, -40810379, -40809343, -40591497, -40236216, -39818359, -39387497, -38932061, -38370471, -37600664, -36584502, -35401388, -34223355, -33225630, -32495186, -31996932, -31613030, -31222924, -30771247, -30285183, -29839612, -29503271, -29308389, -29261323, -29372479]
37914b9372479k93980m88756o39437o65139m96233j04098M83975J185020J880096
37905b8511031K452963K828857K988641K953633K759527K438215K011820J495527
37897h581848R06335K72219l66288r62989j473298j857923k089091k162112k101465
37888a8416460j950347j749884j525023j284284j027422p55471m82595k44101
37880b7435587q9443n9388j63780l76233o43972q99571j069841j088340r14142
37871c2740297n48252l9064N22253J013368J304160J296750R69893L99990k59890
37862b8081089q33124j176097j214867r54299m60721J75481Q79047J605032K319797
37853b7740840K969589L472272L744676L742286L478476L012616K421774J775317
$$ y = [-29372479, -29666459, -30155215, -30794652, -31459791, -31956024, -32060122, -31576147, -30391127, -28511031, -26058068, -23229211, -20240570, -17286937, -14527410, -12089195, -10077375, -8581848, -7675513, -7403294, -7769582, -8732571, -10205869, -12063792, -14152883, -16314995, -18416460, -20366807, -22116691, -23641714, -24925998, -25953420, -26708891, -27191486, -27435587, -27525030, -27584418, -27748198, -28124431, -28768403, -29667974, -30737815, -31826155, -32740297, -33288549, -33327613, -32805360, -31791992, -30487832, -29191082, -28221189, -27821199, -28081089, -28914213, -30090310, -31305177, -32259476, -32720197, -32544716, -31665669, -30060637, -27740840, -24771251, -21298979, -17554303, -13812017, -10333541, -7320925, -4899151, -3123834]
37845c123834J121271M85163j19577o73808j138721j458748j584436j501445j242908
37836i237043q72106m46325Q913M92615R93837J461627J809826J960037J894721
37827a933898J681155J443798J298829J294242J397477J536058J656469J757420
37819A0131550J879810K066615K318458K568563K694578K570170K133427J430969
37811B7794140O09056j41750o56104q45922p19097l63547R3479N31745Q69695
37802B7171695J071138J130387J049213Q23491M52894l1607n49238r86392j245841
37793B8885740j295334j183796j019683r27145r97818j252518j627445j995143
37785A8586858k214959k191068j911741j453329r49567n43473l45277m10740p38082
$$ y = [-3123834, -2002563, -1517400, -1636977, -2310785, -3449506, -4908254, -6492690, -7994135, -9237043, -10109149, -10555474, -10546561, -10053946, -9060109, -7598482, -5788656, -3828619, -1933898, -252743, 1191055, 2489884, 3784126, 5181603, 6717661, 8374130, 10131550, 12011360, 14077975, 16396433, 18964996, 21659574, 24229744, 26363171, 27794140, 28403196, 28261446, 27605342, 26759420, 26040323, 25676776, 25770255, 26302000, 27171695, 28242833, 29373220, 30422433, 31245924, 31698818, 31667211, 31117973, 30131581, 28885740, 27590406, 26406610, 25386927, 24459782, 23461964, 22209446, 20582001, 18586858, 16371899, 14180831, 12269090, 10815761, 9866194, 9322721, 8977444, 8566704, 7828622]
37776G828622j276011j940500k638247l285095l806793m128545m176656l902901
37768a7326126l312714k471480j488425m98597L48496R07694J074070Q18516J96139
37759b1752427o75513j645893k551512l234110l571845l518918l127871k532130
37751d2610219j892061j333564r13478o26278m36589l07575k08761j11931P537
37742d8432919J59771L30999M86621N88196O19047O08705O40703Q29365J268057
37733d2901455J974368K865948L786368M572666N130762N474534N701162N916946
37725g478701O164827O402407O537140O483462O201806N705454N046626M298430
37717C9361451L540392K845734K265997J814563J460432J143948Q10448M38261
$$ y = [7828622, 6552611, 4612111, 1973864, -1311231, -5118024, -9246569, -13423225, -17326126, -20638840, -23110320, -24598745, -25097342, -24748846, -23841152, -22767082, -21948566, -21752427, -22427940, -24073833, -26625345, -29859455, -33431300, -36950218, -40078089, -42610219, -44502280, -45835844, -46749322, -47375600, -47812189, -48119764, -48328525, -48440456, -48432919, -48273148, -47942149, -47455528, -46867332, -46248285, -45639580, -44998877, -44169512, -42901455, -40927087, -38061139, -34274771, -29702105, -24571343, -19096809, -13395647, -7478701, -1313874, 5088533, 11625673, 18109135, 24310941, 30016395, 35063021, 39361451, 42901843, 45747577, 48013574, 49828137, 51288569, 52432517, 53242965, 53681226]
37709E3681226L8006l76019q16644j329664j967649k746863l612451m433205n033620
37700C3403117n251726m996074m275402l190488j897519n63928O63846J673300
37692A5565126K388054K774198K853288K704532K437530K142721J852674J541751
37684C4259874J159554O70216P4812n86623j247326j834962k296406k616976k823917
37675B4758246k969680l100229l225075l311030l310095l203881l026918k844778
37667b33440k703432k594707k469055k283667k043488j802322j627534j557841
37659a7315486j578926j621733j579588j343405q48277j06193Q02507J774459
37651b1816642K725348L594927M325778M854731N133371N152233M936878M518796
$$ y = [53681226, 53719232, 53343213, 52526569, 51196905, 49229256, 46482393, 42869942, 38436737, 33403117, 28151391, 23155317, 18879915, 15689427, 13791908, 13227980, 13891826, 15565126, 17953180, 20727378, 23580666, 26285198, 28722728, 30865449, 32718123, 34259874, 35419428, 36089644, 36164456, 35577833, 34330507, 32495545, 30199139, 27582163, 24758246, 21788566, 18688337, 15463262, 12152232, 8842137, 5638256, 2611338, -233440, -2936872, -5531579, -8000634, -10284301, -12327789, -14130111, -15757645, -17315486, -18894412, -20516145, -22095733, -23439138, -24287415, -24393608, -23591101, -21816642, -19091294, -15496367, -11170589, -6315858, -1182487, 3969746, 8906624, 13425420]
37643A3425420L915257L142040K246303J324437N02588j10505m67810n99351n93403
37634B2784976n57925n83112p19865r77347j333524j749234k178941k576153k895206
37625I213669l092636l130919k985747k656400k177048j623346j104805p36581
37617h293813n99830p15066j046730j529714k089527k640627l077520l283865
37609b3276692l166496k697712j942094j050875k19085L82874O74757O98311O02275
37600b9994737N89577Q45768J469118K424731L542569M563628N217028N300929
37592f041389M743670L627888K166890O37547p04872j693168k268802k454305
37584a986541k300343j843117j099065r4798J098147K356115L528990M476492
$$ y = [13425420, 17340677, 20482717, 22729020, 24053457, 24556045, 24445540, 23977730, 23378379, 22784976, 22227051, 21643939, 20924074, 19946727, 18613203, 16863969, 14685028, 12108875, 9213669, 6121033, 2990114, 4367, -2652033, -4829081, -6452427, -7557232, -8293813, -8893643, -9608709, -10655439, -12185153, -14274680, -16915307, -19992827, -23276692, -26443188, -29140900, -31082994, -32133869, -32352954, -31970080, -31295323, -30597012, -29994737, -29405160, -28559392, -27090274, -24665543, -21122974, -16559346, -11342318, -6041389, -1297719, 2330169, 4497059, 5134606, 4429734, 2736566, 467764, -1986541, -4286884, -6130001, -7229066, -7323864, -6225717, -3869602, -340612, 4135880]
37576D135880N091055N303462N083992M449541L472647K279221J027672j22501
37568C0720969j037032j621940j836400j711281j361438r66822p14051p24134
37560B0747871j008306j475660j982171k390528k613948k632543k483677k234561
37552C926477j949488j666921j398141j146463r30402p89243p62914q59795j037111
37543f614001j209294j279689j177149q80140m23456J06921N86963Q82111Q95417
37534i112317O21186J66460k86055n54530n21682j52041N23646J425586K437738
37525e452009L432735M310097N022019N565792N952699O179783O220193O033255
$$ y = [4135880, 9226935, 14530397, 19614389, 24063930, 27536577, 29815798, 30843470, 30720969, 29683937, 28061997, 26225597, 24514316, 23152878, 22186056, 21472005, 20747871, 19739565, 18263905, 16281734, 13891206, 11277258, 8644715, 6161038, 3926477, 1976989, 310068, -1088073, -2234536, -3164938, -3954181, -4717095, -5576890, -6614001, -7823295, -9102984, -10280133, -11160273, -11583729, -11476808, -10889845, -10007734, -9112317, -8491131, -8324671, -8610726, -9165256, -9686938, -9838979, -9315333, -7889747, -5452009, -2019274, 2290823, 7312842, 12878634, 18831333, 25011116, 31231309, 37264564]
$$ [...]
##END NTUPLES=NMR SPECTRUM
##END=
