##TITLE=31Pdec_DE-47rm2
 
 24 sc
 11.4.2024
##JCAMPDX= 6.0         $$ Bruker NMR JCAMP-DX V2.0
##DATA TYPE= NMR SPECTRUM
##DATA CLASS= NTUPLES
##ORIGIN= UXNMR, Bruker Analytische Messtechnik GmbH
##OWNER= root
$$ XWIN-NMR		Version 3.5
$$ Thu Apr 11 16:07:36 2024 Russian Standard Time (UT+4h)  she@DPX200
##.OBSERVE FREQUENCY= 81.013821
##.OBSERVE NUCLEUS= ^31P
##.ACQUISITION MODE= SIMULTANEOUS
##.ACQUISITION SCHEME= undefined
##.AVERAGES= 24
##.DIGITISER RES= 16
##SPECTROMETER/DATA SYSTEM= spect
##.PULSE SEQUENCE= zgpg30
##.SOLVENT NAME= CDCl3
##.SHIFT REFERENCE= (INTERNAL, CDCl3, 0, 248.564)
##AUDIT TRAIL= $$ (NUMBER, WHEN, WHO, WHERE, WHAT)
$$ ##TITLE= Audit trail, XWIN-NMR		Version 3.5
$$ ##JCAMPDX= 5.01
$$ ##ORIGIN= Bruker BioSpin GmbH
$$ ##OWNER= she
$$ F:/spectra/data/she/nmr/P31/1/pdata/1/auditp.txt
$$ ##AUDIT TRAIL=  $$ (NUMBER, WHEN, WHO, WHERE, WHAT)
(   1,<2024-04-11 16:06:29.03 +0400>,<she>,<DPX200>,
      <created by zg, POWCHK disabled, PULCHK disabled
       configuration hash MD5:
       00 E9 B6 7A A2 85 ED C7 34 08 36 98 17 FE 4E 26
       data hash MD5: 32K
       60 88 ED 5F 54 58 B4 16 1B C1 FF C8 38 A5 B3 D3>)
(   2,<2024-04-11 16:06:34.43 +0400>,<she>,<DPX200>,
      <Start of raw data processing
       efp BC_mod = 2 LB = 10 FT_mod = 6 PKNL = 1 PHC0 = -13259.2 PHC1 = 179.683 SI = 64K 
       data hash MD5: 64K
       3F C1 C6 20 31 6D AB DC FA FF F5 9F 95 09 4F FB>)
(   3,<2024-04-11 16:06:56.50 +0400>,<she>,<DPX200>,
      <pk PHC0 = 17.24705 PHC1 = -40.19999 
       data hash MD5: 64K
       A6 64 C2 F7 DF CD BB A0 71 C7 FF 49 21 5C FA D4>)
(   4,<2024-04-11 16:07:00.14 +0400>,<she>,<DPX200>,
      <abs ABSG = 5 
       data hash MD5: 64K
       DE 02 36 93 7F F5 C8 83 4E D8 F5 B2 CF E4 06 17>)
$$ ##END=
$$ 
$$ hash MD5
$$ 30 6D A1 CC 8A 8A F9 4D A2 83 96 12 8D 34 C0 E3
##$RELAX= 
##$RELAX= 
##$RELAX= 
##$RELAX= 
##$RELAX= 
##$RELAX= 
##$RELAX= 
##$RELAX= 
##$RELAX= 
$$ Bruker specific parameters
$$ --------------------------
##$DU= <F:/spectra>
##$EXPNO= 1
##$NAME= <P31>
##$PROCNO= 1
##$TYPE= <nmr>
##$USER= <she>
##$AMP= (0..31)
100 100 100 100 100 100 100 100 100 100 100 100 100 100 100 100 100 100 
100 100 100 100 100 100 100 100 100 100 100 100 100 100 
##$AQSEQ= 0
##$AQ_mod= 1
##$AUNM= <au_zg>
##$AUTOPOS= <>
##$BF1= 81.014009
##$BF2= 200.13
##$BF3= 200.13
##$BF4= 200.13
##$BF5= 200.13
##$BF6= 200.13
##$BF7= 200.13
##$BF8= 200.13
##$BYTORDA= 1
##$CFDGTYP= 0
##$CFRGTYP= 5
##$CHEMSTR= <none>
##$CNST= (0..31)
1 1 145 1 1 1 1 1 1 1 1 1 1 1 1 1 1 1 1 1 1 1 1 1 1 1 1 1 1 1 1 1 
##$CPDPRG= <waltz16>
##$CPDPRG1= <>
##$CPDPRG2= <waltz16>
##$CPDPRG3= <>
##$CPDPRG4= <mlev>
##$CPDPRG5= <mlev>
##$CPDPRG6= <mlev>
##$CPDPRG7= <mlev>
##$CPDPRG8= <mlev>
##$CPDPRGB= <>
##$CPDPRGT= <>
##$D= (0..31)
0 1 0 0 0 0 0 0 0 0 0 0.03 2e-05 3e-06 0 0 0 0 0 0 0 0 0 0 0 0 0 0 0 0 
0 0 
##$DATE= 1712837188
##$DBL= (0..7)
120 120 120 11 120 120 24 19 
##$DBP= (0..7)
150 150 150 150 150 150 150 150 
##$DBP07= 0
##$DBPNAM0= <>
##$DBPNAM1= <>
$$ [...]
##$SUBNAM3= <"">
##$SUBNAM4= <"">
##$SUBNAM5= <"">
##$SUBNAM6= <"">
##$SUBNAM7= <"">
##$SUBNAM8= <"">
##$SUBNAM9= <"">
##$SW= 501.771253377433
##$SWIBOX= (0..15)
0 1 3 0 0 0 0 0 0 0 0 0 0 0 0 0 
##$SW_h= 40650.406504065
##$TD= 32768
##$TD0= 1
##$TE= 0
##$TE2= 300
##$TE3= 300
##$TEG= 300
##$TL= (0..7)
0 120 53 12 22 120 120 120 
##$TP= (0..7)
150 150 150 150 150 150 150 150 
##$TP07= 0
##$TPNAME0= <>
##$TPNAME1= <>
##$TPNAME2= <>
##$TPNAME3= <>
##$TPNAME4= <>
##$TPNAME5= <>
##$TPNAME6= <>
##$TPNAME7= <>
##$TPOAL= (0..7)
0.5 0.5 0.5 0.5 0.5 0.5 0.5 0.5 
##$TPOFFS= (0..7)
0 0 0 0 0 0 0 0 
##$TUNHIN= 0
##$TUNHOUT= 0
##$TUNXOUT= 0
##$USERA1= <user>
##$USERA2= <user>
##$USERA3= <user>
##$USERA4= <user>
##$USERA5= <user>
##$V9= 5
##$VALIST= <valist>
##$VCLIST= <CCCCCCCCCCCCCCC>
##$VD= 0
##$VDLIST= <DDDDDDDDDDDDDDD>
##$VPLIST= <PPPPPPPPPPPPPPP>
##$VTLIST= <TTTTTTTTTTTTTTT>
##$WBST= 1024
##$WBSW= 4
##$XGAIN= (0..3)
0 0 0 0 
##$XL= 0
##$YL= 0
##$YMAX_a= 11938
##$YMIN_a= -9458
##$ZGOPTNS= <>
##$ZL1= 120
##$ZL2= 120
##$ZL3= 120
##$ZL4= 120
##$ABSF1= 248.5645
##$ABSF2= -253.2056
##$ABSG= 5
##$ABSL= 3
##$ALPHA= 0
##$AQORDER= 0
##$ASSFAC= 0
##$ASSFACI= 0
##$ASSFACX= 0
##$ASSWID= 0
##$AUNMP= <proc_1d>
##$AZFE= 0.1
##$AZFW= 0.5
##$BCFW= 0
##$BC_mod= 2
##$BYTORDP= 0
##$COROFFS= 0
##$CY= -3
##$DATMOD= 1
##$DC= 0
##$DFILT= <>
##$DTYPP= 0
##$F1P= 0
##$F2P= 0
##$FCOR= 1
##$FTSIZE= 65536
##$FT_mod= 6
##$GAMMA= 0
##$GB= 0
##$INTBC= 1
##$INTSCL= 6.047779e-11
##$ISEN= 30
##$LB= 10
##$LEV0= 0
##$LPBIN= 0
##$MAXI= 10000
##$MC2= 0
##$MEAN= 0
##$ME_mod= 0
##$MI= 50
##$NCOEF= 0
##$NC_proc= -7
##$NLEV= 6
##$NOISF1= 182.463
##$NOISF2= 159.3651
##$NSP= 0
##$NTH_PI= 0
##$NZP= 0
##$OFFSET= 248.5645
##$PC= 4
##$PHC0= -13241.95
##$PHC1= 139.483
##$PH_mod= 1
##$PKNL= yes
##$PPARMOD= 0
##$PSCAL= 0
##$PSIGN= 0
##$REVERSE= no
##$SF= 81.0140089999694
##$SI= 65536
##$SIGF1= 159.3651
##$SIGF2= -187.1042
##$SINO= 113.3802
##$SIOLD= 16384
##$SREGLST= <1H.CDCl3>
##$SSB= 0
##$STSI= 65536
##$STSR= 0
##$SW_p= 40650.406504065
##$SYMM= 0
##$S_DEV= 0
##$TDeff= 32768
##$TDoff= 0
##$TI= <>
##$TILT= no
##$TM1= 0
##$TM2= 0
##$TOPLEV= 0
##$USERP1= <user>
##$USERP2= <user>
##$USERP3= <user>
##$USERP4= <user>
##$USERP5= <user>
##$WDW= 1
##$XDIM= 65536
##$YMAX_p= 293310680
##$YMIN_p= -5867041
$$ End of Bruker specific parameters
$$ ---------------------------------
##NTUPLES= NMR SPECTRUM
##VAR_NAME=  FREQUENCY,     SPECTRUM/REAL,   SPECTRUM/IMAG
##SYMBOL=    X,             R,               I
##VAR_TYPE=  INDEPENDENT,   DEPENDENT,       DEPENDENT
##VAR_FORM=  AFFN,          ASDF,            ASDF
##VAR_DIM=   65536,         65536,           65536
##UNITS=     HZ,            ARBITRARY UNITS, ARBITRARY UNITS
##FACTOR=    0.620285442955139, 1,           1
##FIRST=     20137.2065510682, 0,            0
##LAST=      -20513.1999529968, 0,           0
##MIN=       -20513.1999529968, -5867041,    0
##MAX=       20137.2065510682, 293310680,    0
$$ Real data points
##PAGE= N=1
##DATA TABLE= (X++(R..R)), XYDATA
$$ [...]
41756h3275n8311l7593j2308J2848L3650M7730N5256N8655O1606O7606P8590R3951
$$ -83275 -141586 -179179 -191487 -178639 -144989 -97259 -42003 16652 78258 145864 224454 318405
41744C18405J10652J24496J31961J31513J23573J09432R0123O6151L8123P451
$$ 318405 429057 553553 685514 817027 940600 1050032 1140155 1206306 1244429 1251880
41734A251880k3595n2262p5626r0595r4066q3629n8701k1546K2474O5902J01406
$$ 1251880 1228285 1176023 1100397 1009802 915736 832107 773406 751860 774334 840236 941642
41723I41642J24166J33122J30315J18960J01616P9419N2543K1337j2703m6755
$$ 941642 1065808 1198930 1329245 1448205 1549821 1629240 1681783 1703120 1690417 1643662
41713A643662p7384j01513j17004j22716j18456j05045q4370n9216l2718p651
$$ 1643662 1566278 1464765 1347761 1225045 1106589 1001544 917174 857958 825240 817589
41703H17589J4171L2045M5963N5857O0881N9193M8413K6870m882m3200q1916j14107
$$ 817589 831760 863805 909768 965625 1026506 1085699 1134112 1160982 1156100 1112900 1030984 916877
41691I16877j34077j38574j27229j02419o8777l2255J136K6535M0931M3311L4530
$$ 916877 782800 644226 516997 414578 345801 313546 314682 341217 382148 425459 459989
41680D59989J7216m491k5717m2115n1057n1989m6037l5338k2595j0641j821K582
$$ 459989 477205 472714 446997 404882 353825 301836 255799 220461 197866 187225 185404 187986
41668A87986K628l55l866m485J301J5646L7923O4247Q8414J03926J06216R4098
$$ 187986 190614 190259 186393 181908 183209 198855 236778 301025 389439 493365 599581 693679
41656F93679O9953L8732O320k2095m3230n6093o1415o0530n4455m3779k9133j1686
$$ 693679 763632 802364 808684 786589 743359 687266 625851 565321 510866 467087 437954 426268
41644D26268O641K3209L4897L8873L3738K0219P02k2189m6649p1709r6430j19204
$$ 426268 432909 456118 491015 529888 563626 583845 584547 562358 515709 444000 347570 228366
41632B28366j37692j49424j52631j47088j34438j17800j00710q6051p5433o9172
$$ 228366 90674 -58750 -211381 -358469 -492907 -610707 -711417 -797468 -872901 -942073
41622i42073o6553o6138o6186o5267o2856n9424n5860n2572m8934m3386l4070
$$ -942073 -1008626 -1074764 -1140950 -1206217 -1269073 -1328497 -1384357 -1436929 -1485863 -1529249 -1563319
41611a563319j9522Q33K6537N6277Q8147J19860J48910J72834J89599J97909J97208
$$ -1563319 -1582841 -1582008 -1555471 -1499194 -1411047 -1291187 -1142277 -969443 -779844 -581935 -384727
41600c84727J87458J68866J41928J07891O9226K9422q138m1372o9568r2236j08024
$$ -384727 -197269 -28403 113525 221416 290642 320064 311926 270554 200986 108750 726
41589G26j14846j11107r6956p4687m8272k2234k86J5747K6094L2290L5948L7770
$$ 726 -114120 -225227 -322183 -396870 -445142 -467376 -467662 -451915 -425821 -393531 -357583 -319813
41577c19813L7382L4135K8361K2055J8133J8748K3947L1590L8375M1201L8319
$$ -319813 -282431 -248296 -219935 -197880 -179747 -160999 -137052 -105462 -67087 -25886 12433
41566A2433L0037J8716Q061J996L469J3533L0925N2382P3680R0877J01287J03840
$$ 12433 42470 61186 69247 71243 74712 88245 119170 171552 245232 336109 437396 541236
41554E41236R8909Q7710P1616N1765K9141M845j9803m3420o4705q2489r5702j03297
$$ 541236 640145 727855 799471 851236 880377 885222 865419 821999 757294 674805 579103 475806
41542D75806j04219r7559q3093o1887l6508j0591J1888K7310L3076K8445J5220
$$ 475806 371587 274028 190935 129048 92540 81949 93837 121147 154223 182668 197888
41531A97888k484j9586l1813l6692l3448k2540n658J4051L2477M6013N3136N4924
$$ 197888 195404 175818 144005 107313 73865 51325 45667 59718 92195 138208 191344 246268
41519B46268N4141N3678N5137N8278O1317O1832N7632M7222K9937O076k2749n3390
$$ 246268 300409 354087 409224 467502 528819 590651 648283 695505 725442 731518 708769 655379
41507F55379q1580j02991j14403j14191j02096p8929m6915j0305K4754N1692O5636
$$ 655379 573799 470808 356405 242214 140118 61189 14274 3969 28723 80415 146051
41496A46051O5024N2090L2280J2649n01l872J957J3539K6579L7686M5117M8675
$$ 146051 211075 263165 295445 308094 307593 303721 305678 319217 345796 383482 428599 477274
41484D77274M9188M7821M5521M2645L8836L3151K4610J3135L09j0731j6357j3718
$$ 477274 526462 574283 619804 662449 701285 734436 759046 772181 772490 761759 745402 731684
41472G31684j519J9696M7362P6931J02623J19036J22902J14025R4989P0056M3767
$$ 731684 730165 749861 797223 874154 976777 1095813 1218715 1332740 1427729 1497785 1541552
41461A541552J9707j59j5313k5984l2586l5827l7088l8332m1292m6568n3252n9359
$$ 1541552 1561259 1561100 1545787 1519803 1487217 1451390 1414302 1375970 1334678 1288110 1234858 1175499
41449A175499o2639o1500n5709m6665l7109l0237k8674l3605m4433n8927p3895
$$ 1175499 1112860 1051360 995651 948986 911877 881640 852966 819361 774928 716001 642106
41438F42106q6033r2592r1691q2541o5862m4202k1495j583J3375K3459L0241L5496
$$ 642106 556073 463481 371790 289249 223387 179185 157690 156107 169482 192941 223182 258678
41426B58678M0320M4847M8341M9613M7725M2640L5303K7068J8871J0659J345j0667
$$ 258678 298998 343845 392186 441799 489524 532164 567467 594535 613406 624065 625410 614743
41414F14743k6555m6289o8409r0562j10257j25572j35692j41153j43399j43588
$$ 614743 588188 541899 473490 382928 272671 147099 11407 -129746 -273145 -416733
41404d16733j41386j34711j20799r7895o6639l0627M117L0828M4473M3741L1350
$$ -416733 -558119 -692830 -813629 -911524 -978163 -1008790 -1004673 -973845 -929372 -885631 -854281
41393h54281J2551p013k2749l1549l1911k4162j0565N284J9720L0219L5687L5893
$$ -854281 -841730 -848743 -871492 -903041 -934952 -959114 -969679 -964395 -944675 -914456 -878769 -842876
41381h42876L0792K0534O056j0620k7014m1376n3442o4129p4443q4450r3045r8519
$$ -842876 -812084 -791550 -785494 -796114 -823128 -864504 -917946 -982075 -1056518 -1140968 -1234013 -1332532
41369a332532r9472r5273q5846p1149n0886k4662P485M4377Q3028J18599J45485
$$ -1332532 -1432004 -1527277 -1613123 -1684272 -1735158 -1759820 -1752335 -1707958 -1624930 -1506331 -1360846
41358a360846J59261J58404J44843J23238R9489P8785O3899N4377M7329L9349
$$ -1360846 -1201585 -1043181 -898338 -775100 -675611 -596826 -532927 -478550 -431221 -391872
41348c91872K8261J3880k314j8089l1568m2100n0282n6979o2027o3747n9631m7692
$$ -391872 -363611 -349731 -352045 -370134 -401702 -443802 -494084 -551063 -613090 -676837 -736468 -784160
41336g84160k7665j496K6889N2490P0568P7979P3940O0049L9831J8110J58r768
$$ -784160 -811825 -813321 -786432 -733942 -663374 -585395 -511455 -451406 -411575 -393465 -393307 -403075
41324d03075j0197l526M716Q325L288j0718l0821n2784p2697q7510r4684r2063
$$ -403075 -413272 -416798 -412082 -403757 -400469 -411187 -442008 -494792 -567489 -654999 -749683 -841746
41312h41746p8655n5786k7300J773K7257M7211O1763P1731P7119P6692O8986N3923
$$ -841746 -920401 -976187 -1003487 -1001714 -974457 -927246 -865483 -793752 -716633 -639941 -570955 -517032
41300e17032L3467J0561j2557l5059n6612p6171r1864j02078j06514j06323j03264
$$ -517032 -483565 -473004 -485561 -520620 -577232 -653403 -745267 -847345 -953859 -1060182 -1163446
41289a163446r8636r2440q3285o9179m8869k2880O402L5583O1587Q2908J00365
$$ -1163446 -1262082 -1354522 -1437807 -1506986 -1555855 -1578735 -1572333 -1536750 -1475163 -1392255 -1291890
41278a291890J16650J34655J55469J77499J97215K10653K14632K07416J89292
$$ -1291890 -1175240 -1040585 -885116 -707617 -510402 -299749 -85117 122299 311591
41269C11591J62872J32691J03685P9355O0689M6352L3900K1154P063q125k3186
$$ 311591 474463 607154 710839 790194 850883 897235 931135 952289 959352 951227 928041
41258I28041l6374m5948n0724n0597m6793m1659l8031l8375m3993n4709o9062
$$ 928041 891667 845719 794995 744398 697605 655946 617915 579540 535547 480838 411776
41247D11776q4777r9136j09113j11734j04744q7522o1609l0472J449K9854N1315
$$ 411776 326999 227863 118750 7016 -97728 -185250 -246859 -277331 -275882 -246028 -194713
41236a94713O3441O4896N5689L7609J4257r730k9941m3242m8132m4487l3066j5268
$$ -194713 -131272 -66376 -10687 26922 41179 31449 1508 -41734 -89866 -134353 -167419 -182687
41224a82687O797L0127N0928O5161O9527O2467M4742J9167j0315l9688o5505q4957
$$ -182687 -175890 -145763 -94835 -29674 39853 102320 147062 166229 155914 116226 50721 -34236
41212c4236r5822r6691q7495o9984m7670k4893n458Q446J6430J9386J8860J6573
$$ -34236 -130058 -226749 -314244 -384228 -431898 -456791 -462249 -453803 -437373 -417987 -399127 -382554
41200c82554J4080J2429J2038J2915J5014J8452K3538L0717M0326N2150O4929
$$ -382554 -368474 -356045 -344007 -331092 -316078 -297626 -274088 -243371 -203045 -150895 -85966
41189h5966P6329Q3631Q5063Q0986P4061O7987O5574O7375P1703P5543P5642O9281
$$ -85966 -9637 73994 159057 240043 314104 382091 447665 515040 586743 662286 737928 807209
41177H07209N4912L2704M844k4723n1219p0398p9891p9935p3228o4101n7396n7298
$$ 807209 862121 894825 899669 874946 823727 753329 673438 593503 520275 456174 398778 341480
41165C41480o6255q4155j08140j33107j52808j61387j55045j33368r9609n9697
$$ 341480 275225 191070 82930 -50177 -202985 -364372 -519417 -652785 -752394 -812091
41155h12091k0488J2029L3964M4089M3736L6105K4972J3401L104n170j0819j3145
$$ -812091 -832579 -820550 -786586 -742497 -698761 -662656 -637684 -624283 -621179 -626349 -637168 -650313
41143f50313j2031q811o129o721j2045k1918l5176n0518o6835q2979r7496j08669
$$ -650313 -662344 -671155 -677284 -684005 -696050 -717968 -753144 -803662 -870497 -953476 -1050972 -1159641
41131a159641j14870j14977j08585r5944p7798n5482l1308q801P911J5645J3803
$$ -1159641 -1274511 -1389488 -1498073 -1594017 -1671815 -1727297 -1758605 -1767406 -1759495 -1743850 -1730047
41120a730047M983n973j3988j5835j1341l122N093J0596J3027J4069J5861J9419
$$ -1730047 -1725064 -1731037 -1745025 -1760860 -1772201 -1775323 -1770230 -1759634 -1746607 -1732538 -1716677 -1697258
41108a697258K4118K8351L0721L0937L0084L0174L3234M0191N0131O0439O7907
$$ -1697258 -1673140 -1644789 -1614068 -1583131 -1553047 -1522873 -1489639 -1449448 -1399317 -1338878 -1270971
41097a270971P0153O6365N7053M3217K5776N590j5949l6320n1792n8362n3335
$$ -1270971 -1200818 -1134453 -1077400 -1034183 -1008407 -1002817 -1018766 -1055086 -1106878 -1165240 -1218575
41086a218575l6530j0170K2398N8058R4429J29472J60868J85853K01623K06139
$$ -1218575 -1255105 -1265275 -1242877 -1184819 -1090390 -960918 -800050 -614197 -412574 -206435
41076b06435J98849J80927J54849J23475Q9319N4300K0025j1785l9165o0146p3212
$$ -206435 -7586 173341 328190 451665 540984 595284 615309 603524 564359 504213 431001
41065D31001p7671p3670o1873m3069j8244J0834M1059O8073Q7166R4611Q8964
$$ 431001 353330 279660 217787 174718 156474 167308 208367 276440 363606 458217 547181
41054E47181P1935M8270K4224N267n606q132l977M098J3030K0510K5987L0676
$$ 547181 619116 667386 691610 696877 691271 683139 679162 683260 696290 716800 742787 773463
41042G73463L6253M3294N0771N6815N9888N9447N5877M9937M2139L2361J9924
$$ 773463 809716 853010 903781 960596 1020484 1079931 1135808 1185745 1227884 1260245 1280169
41031A280169M022j5700l8704o3268q6501j04853j15235j16434j10012r9939r0915
$$ 1280169 1284191 1268491 1229787 1166519 1080018 975165 859930 743496 633484 533545 442630
41020D42630q6366q7269r2359r9181j05219j08488j07667j02025r1517p6967o0064
$$ 442630 356264 268995 176636 77455 -27764 -136252 -243919 -345944 -437461 -514428 -574492
41009e74492m2931k7542j5420p601m456n254p957r666p533L43J4227L2367N1069
$$ -574492 -617423 -644965 -660385 -667986 -672442 -677696 -685653 -695319 -702852 -702509 -688282 -655915 -604846
40996f04846O5637P1946O7869N3767L1997O022k0316m3226n9479o7225o6787o0646
$$ -604846 -539209 -467263 -399394 -345627 -313630 -307608 -327924 -371150 -430629 -497854 -564641 -625287
40984f25287n2206m3976l6428k8268j7817m413J0972K5959L7561M3137M1204L1910
$$ -625287 -677493 -721469 -757897 -786165 -803982 -808395 -797423 -771464 -733903 -690766 -649562 -617652
40972f17652J7105Rj5445k5626k8438k4219j5669o687p41L65l011q646j3274j3912
$$ -617652 -600547 -600538 -615983 -641609 -670047 -694266 -709935 -716622 -717363 -716998 -720009 -728655 -741929 -755841
40958g55841r127M34J2513K4464L4500M2483M9764N8077O8198P9343Q9820R8130
$$ -755841 -764968 -764534 -752021 -727557 -693057 -650574 -600810 -542733 -474535 -395192 -305372 -207242
40946b07242J03544J05901J05180J01302R4077Q3138O7998M8417K4898j088k7412
$$ -207242 -103698 2203 107383 208685 302762 385900 453898 502315 527213 526125 498713
40935D98713n2085p4068r3436j10626j25374j36286j41371j38995j28418j09825
$$ 498713 446628 372560 279124 168498 43124 -93162 -234533 -373528 -501946 -611771
40925f11771q4046n2322j6084K3040O2984J01009J33981J59140J74861J80806
$$ -611771 -695817 -748139 -764223 -741183 -678199 -577190 -443209 -284069 -109208 71598
40915G1598J77559J66241J48395J26080J01737P7746N5807L6589J9851M912q774
$$ 71598 249157 415398 563793 689873 791610 869356 925163 961752 981603 986515 977741
40904I77741k1191l1899m0773m8999n9351p5045r7509j24647j50860j69069j73615
$$ 977741 956550 924651 883878 834879 775528 700483 602974 478327 327467 158398 -15217
40893a5217j62566j38324j06478p3468m4368k1747n815M750J2047J8545K6684
$$ -15217 -177783 -316107 -422585 -496053 -540421 -562168 -567983 -563233 -551186 -532641 -505957
40882e05957L8091N2653O8140Q0959Q7831Q7237P9708O6841N0048L0161Q056j4513
$$ -505957 -467866 -415213 -347073 -266114 -178283 -91046 -11338 55503 105551 135712 143768 129255
40870A29255l4865n0302n9187o1441n8347n1875m3866l5185k5382j3215K205K0554
$$ 129255 94390 44088 -15099 -76540 -134887 -186762 -230628 -265813 -291195 -304410 -302205 -281651
40858b81651M0447O0286P8972R6057J11423J24881J35713J42431J43086J36199
$$ -281651 -241204 -180918 -101946 -5889 105534 230415 366128 508559 651645 787844
40848G87844J21811J01830P9471N8063M0006K6206J5976P338k447j5904l4231
$$ 787844 909655 1011485 1090956 1149019 1189025 1215231 1231207 1238545 1236098 1220194 1185963
40837A185963n6475p9712j00206j14782j21586j20078j10857r5535p6578n6496
$$ 1185963 1129488 1049776 949570 834788 713202 593124 482267 386732 310154 253658
40827B53658l6774j7328K909K4817M8451P3476R9861J27881J57263J86517K13153
$$ 253658 216884 199556 202465 227282 275733 349209 449070 576951 734214 920731 1133884
40816A133884K34568K48701K54162K50031K35857K11817J78952J39131R4662M7589
$$ 1133884 1368452 1617153 1871315 2121346 2357203 2569020 2747972 2887103 2981765 3029354
40806C029354o52m8836r4914j35494j66598j85427j91668j87304j75166j57545
$$ 3029354 3028702 2979866 2884952 2749458 2582860 2397433 2205765 2018461 1843295 1685750
40796A685750j35972j12080q8428o8274n4288m7073m4636m3241l9303l1225k0191
$$ 1685750 1549778 1437698 1349270 1280996 1226708 1179635 1134999 1091758 1052455 1021230 1001039
40785A001039r405k333r73n004j2177j9550k4956k7845k9123l0090l1164l1306
$$ 1001039 991634 989301 988328 983324 971147 951597 926641 898796 869673 839583 808419 777113
40773G77113k8446k0713p611R501K7732M3439N3041N3967M5635K9781R526j2449
$$ 777113 748667 727954 720343 729844 757576 801015 854056 908023 953658 983439 992965 980516
40761I80516l5107n8466q1863j02836j17756j23537j18930j04819q3812n9877
$$ 980516 945409 886943 805080 702244 584488 460951 342021 237202 153390 93513
40751I3513l7762k1837j4618j6029k4010l5881m9239o2045p2516p9435q2564q2444
$$ 93513 55751 33914 19296 3267 -20743 -56624 -105863 -167908 -240424 -319859 -402423 -484867
40739d84867p9539p3675o4301n1279l5259j7424R14J8337L3109M3338M7614M5633
$$ -484867 -564406 -638081 -702382 -753661 -788920 -806344 -805430 -787093 -753984 -710646 -663032 -617399
40727f17399L8249K6972J3421r13j4586k6117l3962l6749l3895k6194j5852n500
$$ -617399 -579150 -552178 -538757 -539670 -554256 -580373 -614335 -651084 -684979 -711173 -727025 -732525
40715g32525L270J0741J8727K9377M3939O1892Q0589R5634J02233R7095P9815
$$ -732525 -729255 -718514 -699787 -670410 -626471 -564579 -483990 -388356 -286123 -189028 -109213
40704a09213N2822K0042j4560m7656p6526r8967j13455j19373j17060j07548r2167
$$ -109213 -56391 -36349 -50909 -98565 -175091 -274058 -387513 -506886 -623946 -731494 -823661
40693h23661p2154m8568k2627L805K8133M7642O0440O5996O4893N7927M5418K7406
$$ -823661 -895815 -944383 -967010 -963205 -935072 -887430 -826990 -760994 -696101 -638174 -592756 -565350
40681e65350M712k0063m2675n8620o4998o1761n1829l9944l0689k6499k6855k9167
$$ -565350 -560638 -580701 -623376 -681996 -746994 -808755 -860584 -900528 -931217 -957716 -984571 -1013738
40669a013738l0574k9497k6133k1937j8528j6650j6000j6130j7512k1455k8683
$$ -1013738 -1044312 -1073809 -1099942 -1121879 -1140407 -1157057 -1173057 -1189187 -1206699 -1228154 -1256837
40658a256837l8029m6694n1965n2816n0110m5504m0173l4328k7619j9717j0407
$$ -1256837 -1294866 -1341560 -1393525 -1446341 -1496451 -1541955 -1582128 -1616456 -1644075 -1663792 -1674199
40647a674199P85J4740L2286N3332P6333R8558J17060J29808J36404J37904J35929
$$ -1674199 -1673414 -1658674 -1626388 -1573056 -1496723 -1398165 -1281105 -1151297 -1014893 -876989 -741060
40636g41060J31670J25413J16678J04677Q8746O8656M4803J8397q434l2819n1817
$$ -741060 -609390 -483977 -367299 -262622 -173876 -105220 -60417 -42020 -50454 -83273 -135090
40625a35090o3452o7329o4333n5618m1889k3576j557K2468M6259O7694Q5236R7998
$$ -135090 -198542 -265871 -330204 -385822 -427711 -451287 -452844 -430376 -384117 -316423 -231187 -133189
40613a33189J05480J07111J01868Q8285O5240L3335l959m0525o9557q6296q9770
$$ -133189 -27709 79402 181270 269555 334795 368130 364171 323646 254089 167793 78023
40602G8023q2549o8862n2498l5801j9884n530O010J2925J3597P792k495j3258
$$ 78023 -4526 -73388 -125886 -161687 -181571 -187101 -181091 -168166 -154569 -146777 -149272 -162530
40590a62530j9955j9453j1452J653J6267K9475L9978M7608N2218N3185M9930M2850
$$ -162530 -182485 -201938 -213390 -211737 -195470 -165995 -126017 -78409 -26191 26994 76924 119774
40578A19774L3667K4907J8843J6602J7824K1016K4361K6558K7231K6841K6167
$$ 119774 153441 178348 197191 213793 231617 252633 276994 303552 330783 357624 383791
40567C83791K5677K4886K2210J5558L599j3124l2034m9367o1384o5209n9248m3559
$$ 383791 409468 434354 456564 472122 475721 462597 430563 381196 319812 254603 195355 151796
40555A51796k0175P013L3156N3866O6470P0645O8328O2981N8376N7313O0821O8170
$$ 151796 131621 138634 171790 225656 292126 362771 431099 494080 552456 609769 670590 738760
40543G38760P7560Q7004R4952J00359J02333R9865R2164P9461O3416M6592L1432
$$ 738760 816320 903324 998276 1098635 1200968 1300833 1392997 1472458 1535874 1582466 1613898
40532A613898J9604J1933Q516Q634J0827J3257J4223J2341O459m309k0195m0270
$$ 1613898 1633502 1645435 1653951 1662585 1673412 1686669 1700892 1713233 1719692 1715383 1695188 1654918
40520A654918o2157q2322r7045j03734j01985r3640q1912p0157o1000n5979n5476
$$ 1654918 1592761 1510439 1413394 1309660 1207675 1114035 1032123 961966 900966 844987 789511
40509G89511n8715o3829o8330o9905o7197o0028m9107l5748k2010j0804n295p587
$$ 789511 730796 666967 598637 528732 461535 401507 352400 316652 294642 283838 278543 270956
40497B70956j7608l3023n0095o4818p3902p5603p0159n9321m5075k8480r866R869
$$ 270956 253348 220325 170230 105412 31510 -44093 -114252 -173573 -218648 -247128 -256994 -247125
40485b47125K8224M1740M7960M7152M2492L8635L9693M7812O2763Q2335J03056
$$ -247125 -218901 -177161 -129201 -82049 -39557 -922 38771 86583 149346 231681 334737
40474C34737J20833J31776J33267J24951J08931Q8847O8278M9421L2711J7350
$$ 334737 455570 587346 720613 845564 954495 1043342 1111620 1161041 1193752 1211102
40464A211102K278j3091k8674m3963n8125o9912p7721q0282p7703p1803o5236
$$ 1211102 1213380 1200289 1171615 1127652 1069527 999615 921894 841612 763909 692106 626870
40453F26870n9840n5572n0984m4924l7972l2397l0577l3296l9267m6031n1257
$$ 626870 567030 511458 460474 415550 377578 345181 314604 281308 242041 196010 144753
40442A44753n3627n3197n1413n0633n3008n9305o8434p8130q6281r1860r4927
$$ 144753 91126 37929 -13484 -64117 -117125 -176430 -244864 -322994 -409275 -501135 -596062
40431e96062r5936r5062r2099q6820p9211o9316n6897m1486k2823j303K1996M5478
$$ -596062 -691998 -787060 -879159 -965979 -1045190 -1114506 -1171403 -1212889 -1235712 -1237015 -1215019 -1169541
40419a169541O7177Q4882R6506J00527R6270Q3786O3679L7318P324k2236m6645
$$ -1169541 -1102364 -1017482 -920976 -820449 -724179 -640393 -576714 -539396 -532072 -554308 -600953
40408f00953o2134o7311o3384n3020l8827k2598n579J0890K5140L5686M2084M5447
$$ -600953 -663087 -730398 -793782 -846802 -885629 -908227 -913806 -902916 -877776 -842090 -800006 -754559
40396g54559M8128N2632O0335P0784Q1841R0409R3492Q9408P8815O4846N1927
$$ -754559 -706431 -653799 -593464 -522680 -440839 -350430 -256938 -167530 -88715 -23869 28058
40385B8058M3778M1878M5329N1993N9993O8507P7496Q6681R4818J00080J01316
$$ 28058 71836 113714 159043 211036 271029 339536 417032 503713 598531 698611 799927
40374G99927R8975R4698Q9988Q5164P9349P1155N9376M3467K3938K459j8544l6560
$$ 799927 898902 993600 1083588 1168752 1248101 1319256 1378632 1422099 1446037 1448496 1429952 1393392
40362A393392m9556n6223n6328n1242m4052l8737l8656m5281n7796p3534q8919
$$ 1393392 1343836 1287613 1231285 1180043 1135991 1097254 1058598 1013317 955521 881987 793068
40351G93068j00606j06641j07074j03751r9244r5455r2497q8659q1687p0602n6818
$$ 793068 692462 585821 478747 374996 275752 180297 87800 -859 -82546 -153148 -209966
40340b09966m3657l4860l3063l8721m9454o0234o5023n9541m3497k0704K818K1327
$$ -209966 -253623 -288483 -321546 -360267 -409721 -469955 -534978 -594519 -638016 -658720 -655902 -634575
40328f34575L1086L1089K2911R917m041j5838k3625k6644k4799j8616r547o3P030
$$ -634575 -603489 -572400 -549489 -539572 -543613 -559451 -583076 -609720 -634519 -653135 -662682 -662745 -655715
40315f55715J0016R366P592P675J1181J7289K3437K7029K7246K5790K6217L2109
$$ -655715 -645699 -636333 -628741 -621066 -609885 -592596 -569159 -542130 -514884 -489094 -462877 -430768
40303d30768M5168O4149Q5179J03147J13484J13663J03955Q7147O7278M7853L0442
$$ -430768 -385600 -321451 -236272 -133125 -19641 94022 197977 285124 352402 400255 430697
40292D30697J4508j588j9128l8104n7117p3885q6094r2286r2381q7384p8452o6313
$$ 430697 445205 443617 424489 386385 329268 255383 169289 77003 -15378 -102762 -181214 -247527
40280b47527n1565l5492k0174p567J652Q319J3956J9657K5330K9507K9752K3743
$$ -247527 -299092 -334584 -354758 -362325 -360673 -352354 -338398 -318741 -293411 -263904 -234152 -210409
40268b10409J0682p824k7986m4947n4250n3144m1517k1854K081K7013N1062P3133
$$ -210409 -199727 -207551 -235537 -280484 -334734 -387878 -429395 -451249 -449168 -422155 -371093 -297960
40256b97960R1945J05897J13781J15417J11479J02945R0796P5931N9166M1252
$$ -297960 -206015 -100118 13663 129080 240559 343504 434300 510231 569397 610649
40246F10649K3077N947q486j8810k4415k5481k2325j4792k467J4333L3712N2274
$$ 610649 633726 639673 631187 612377 587962 562481 540156 525364 522897 537230 570942 623216
40234F23216O6205P2575P0246O0102M4659K7144J0401l807j4858k2881k8332l1550
$$ 623216 689421 761996 832242 892344 937003 964147 974548 970741 955883 933002 904670 873120
40222H73120l2334k9570k1481o740J4043L7509N8230P0727P1739O1515M3529K3024
$$ 873120 840786 811216 789735 782995 797038 834547 892777 963504 1035243 1096758 1140287 1163311
40210A163311N046p285j3597j5868j7008j9183k2705k5980k6452k2113j2776m57
$$ 1163311 1168357 1161072 1147475 1131607 1114599 1095416 1072711 1046731 1020279 998166 985390 984933
40198I84933J1291J8554J8112Q032j2040m0650p4405j08267j36642j55129j62177
$$ 984933 996224 1014778 1032890 1040922 1028882 988232 913827 805560 668918 513789 351612
40187C51612j59423j50367j38256j24608j09226r1207p0112m6633k2655o65J7195
$$ 351612 192189 41822 -96434 -221042 -330268 -421475 -491587 -538220 -560875 -561540 -544345
40176e44345K9940L7854M1868M2801M1115L7317L2427K7865K4734K3269K3095
$$ -544345 -514405 -476551 -434683 -391882 -350767 -313450 -281023 -253158 -228424 -205155 -182060
40165a82060K3988K6247L0232L5705M1872M8049N4230O0949O8720P7437Q6006
$$ -182060 -158072 -131825 -101593 -65888 -24016 24033 78263 139212 207932 285369 371375
40154C71375R2409R4442R1099Q3694P5697P1007P1665P6547Q2025Q4152Q0869
$$ 371375 463784 558226 649325 733019 808716 879723 951388 1027935 1109960 1194112 1274981
40143A274981P2738O1812M9778L6798K1683L052j9223m3054o4367p8848q4281
$$ 1274981 1347719 1409531 1459309 1496107 1517790 1520842 1501619 1458565 1394198 1315350 1231069
40132A231069q1816p5044o7610o1223n5391m8692m0362l0962k1762j3697o998
$$ 1231069 1149253 1074209 1006599 945376 889985 841293 800931 769969 748207 734510 727512
40121G27512j823R48j36o007j6093k8351m0176m9388n4688n5551n1876m3882l2356
$$ 727512 725689 726637 726501 720494 704401 676050 635874 586486 531798 476247 424371 380489 348133
40108C48133j8967o139L620Q535Q043K776n813j5926k5837l4113l9728m2145m1312
$$ 348133 329166 323027 326647 335182 343225 346001 340188 324262 298425 264312 224584 182439 141127
40095A41127l7466l0854k1748j0868J56Q775J1942O847q330l3679o7129j04688
$$ 141127 103661 72807 51059 40191 40347 49122 61064 67911 59581 25902 -41227 -145915
40083a45915j41418j72774j95722k09168k13559k09994j99391j82168j58480j28742
$$ -145915 -287333 -460107 -655829 -864997 -1078556 -1288550 -1487941 -1670109 -1828589 -1957331
40073a957331r4071n6441j8488J6933M7232P0484Q5791R3494R5064R2658Q8526
$$ -1957331 -2051402 -2107843 -2126331 -2109398 -2062166 -1991682 -1905891 -1812397 -1717333 -1624675 -1536149
40062a536149Q4529Q1636P9550P6844P1889O3902N3206M0546K6371J0998m480
$$ -1536149 -1451620 -1369984 -1290434 -1213590 -1141701 -1077799 -1024593 -984047 -957676 -946678 -951158
40051i51158j7612k5073k4121j4076L166K3915M4124O0631P1639P6612P5908P0401
$$ -951158 -968770 -993843 -1017964 -1032040 -1028874 -1004959 -960835 -900204 -828565 -751953 -676045 -605644
40039f05644O1230M9892L8485K9609K5611K7572L4877M5743N8276P1260Q4170
$$ -605644 -544414 -494522 -456037 -426428 -400817 -373245 -338368 -292625 -234349 -163089 -78919
40028g8919R6699J08212J17472J22604J21241J11046R0703O0961K4879j3092m8669
$$ -78919 17780 125992 243464 366068 487309 598355 689058 750019 774898 761806 713137
40017G13137p8869j02178j17883j25252j23158j10504q7205n4996j7357K1467
$$ 713137 634268 532090 414207 288955 165797 55293 -31912 -86908 -104265 -82798
40007h2798N7712Q8927J14076J32986J45513J51047J48860J39092J23442J04704
$$ -82798 -25086 63841 177917 310903 456416 607463 756323 895415 1018857 1123561
39997A123561Q5296O5915M5408K2005m782l2863n7772p4525q0141p5348o4301
$$ 1123561 1208857 1274772 1320180 1342185 1337403 1304540 1246768 1172243 1092102 1016754 952453
39986I52453n2591m4871m3403m8018n6845o7146p5837p9853p6561o4405m3678
$$ 952453 899862 854991 811588 763570 706725 639579 563742 483889 407328 342923 299245
39975B99245j6994J0986L4822N0197N5589N2681M5073L5962K6264J4584r66k0431
$$ 299245 282251 293237 328059 378256 433845 486526 531599 567561 593825 608409 607443 587012
39963E87012m0986n7995o7397o7923o1713n3214m7031m5869m9609n5799o1303
$$ 587012 546026 488031 420634 352711 290998 237784 190753 144884 95275 39476 -21827
39952b1827o4024o3487o0008n3394m2604k6620n506J9346M5763P1356R3892J11586
$$ -21827 -85851 -149338 -209346 -262740 -305344 -331964 -337470 -318124 -272361 -201005 -107113 4473
39940D473J23359J28847J28281J22609J13825J04822R8525R6652R8999J03565
$$ 4473 127832 256679 384960 507569 621394 726216 824741 921393 1020392 1123957
39930A123957J07431J07914J03585R4548Q1895O6819N0129L2434J4572k267j6981
$$ 1123957 1231388 1339302 1442887 1537435 1619330 1686149 1736278 1768712 1783284 1781017 1764036
39919A764036k9206l9550m9119n8652o8031p6587q3863r0130r6307j03446j12009
$$ 1764036 1734830 1695280 1646161 1587509 1519478 1442891 1359028 1268898 1172591 1069145 957136
39908I57136j21150j28481j30736j25159j10836q8978o2204l3532n650J9467M0786
$$ 957136 835986 707505 576769 451610 340774 251796 189592 156060 150410 169877 210663
39897B10663N8142P1666Q1014Q5267Q4003P8701P2903P0463P2929P8226Q1759
$$ 210663 268805 340471 421485 506752 590755 669456 742359 812822 885751 963977 1045736
39886A045736P9132O8565N1488L1244J1049p371k3779l8409n1010o0615o6064
$$ 1045736 1124868 1193433 1244921 1276165 1287214 1279843 1256064 1217655 1166645 1106030 1039966
39875A039966o6598o2156n3421m2118l1360k5461k8581m2459o4737q9070j07293
$$ 1039966 973368 911212 857791 815673 784313 758852 730271 687812 623075 534005 426712
39864D26712j12400j00802p2997l2771J4342O2458J06177J40860J62882J70371
$$ 426712 314312 213510 140513 107742 122084 184542 290719 431579 594461 764832
39854G64832J64343J49462J33270J23667J25830J40496J64493J92764K20334K43459
$$ 764832 929175 1078637 1211907 1335574 1461404 1601900 1766393 1959157 2179491 2422950
39844B422950K60117K69999K73931K72823K66963K56014K39496K17055J88506
$$ 2422950 2683067 2953066 3226997 3499820 3766783 4022797 4262293 4479348 4667854
39835D667854J53928J13865O9363K1835k6889p4331j17295j52347j76535j87951
$$ 4667854 4821782 4935647 5005010 5026845 4999956 4925625 4808330 4655983 4479448 4291497
39825D291497j86019j71734j47667j17449q4594n1376j8591J3510M3779O9440
$$ 4291497 4105478 3933744 3786077 3668628 3584034 3532658 3514067 3527577 3571356 3640796
39815C640796Q6608R1721Q3026O1524L1162j849l0694n0146n8173n6040m6939
$$ 3640796 3727404 3819125 3902151 3963675 3994837 3992988 3962294 3912148 3853975 3797935 3750996
39804C750996l4250k0525p483L438J0602J2212O912n182k1785l8772n1775n8198
$$ 3750996 3716746 3696221 3688738 3692176 3702778 3714990 3721902 3716720 3694935 3656163 3604388 3546190
39792C546190n8379n5056n1550m9876m9775m9109m5155l6113k2055m883J2602
$$ 3546190 3487811 3432755 3381205 3331329 3281554 3232445 3187290 3151177 3129122 3124239 3136841
39781C136841K7978M0071M9053N5782O1012O4919O7274O7824O6499O3250N7615
$$ 3136841 3164819 3204890 3253943 3309725 3370737 3435656 3502930 3570754 3637253 3700503 3758118
39770C758118M8468L4227J3579j3574m5721q0136j13769j43896j68215j84896
$$ 3758118 3806586 3840813 3854392 3840818 3795097 3714961 3601192 3457296 3289081 3104185
39760C104185j92855j92114j83848j70041j53064j35274j18616j04335r2953q4641
$$ 3104185 2911330 2719216 2535368 2365327 2212263 2076989 1958373 1854038 1761085 1676444
39750A676444p9588p8113q0515q6725r6009j06884j17434j25905j31042j31788
$$ 1676444 1596856 1518743 1438228 1351503 1255494 1148610 1031176 905271 774229 642441
39740F42441j26819j14742r5169o9839m2558j7750J382J3948K1184K5405K8812
$$ 642441 515622 400880 305711 235872 193314 175564 176946 190894 212078 237483 266295
39729B66295L2650L6996M1094M3899M4524M2539L8250L2739K7511K3731K1813
$$ 266295 298945 335941 377035 420934 465458 507997 546247 578986 606497 630228 652041
39718F52041K1848K4468L1109M3209O0966Q2631J04681J22621J32039J29928J15936
$$ 652041 673889 698357 729466 772675 833641 916272 1020953 1143574 1275613 1405541 1521477
39707A521477R2906O6067M1061K1845R386J772m457j2265k2321l2438l8572l6855
$$ 1521477 1614383 1680450 1721511 1743356 1752742 1754514 1750057 1737792 1715471 1683033 1644461 1607606
39695A607606k5391n005K1129M8463P2221Q8438R4702R0428P6714N5884L0874
$$ 1607606 1582215 1577210 1598339 1646802 1719023 1807461 1902163 1992591 2069305 2125189 2156063
39684B156063M444k1419m5706o8093q8498j06681j21875j32522j36446j31643
$$ 2156063 2160507 2139088 2093382 2025289 1936791 1830110 1708235 1575713 1439267 1307624
39674A307624j17386r4927o7402l9080j4375K978J0550P581m861k3946m5539o5159
$$ 1307624 1190238 1095311 1027909 988829 974454 977432 987982 995563 990702 966756 921217 856058
39662H56058p9284q6376q7044q3248p7068o9844o2096n3997m5686l7090k7589
$$ 856058 776774 690398 603354 520106 443038 373194 311098 257101 211415 174325 146736
39651A46736j6210k459J2903K7907M0294M8541N2394N2744N1124M9150M8057M8374
$$ 146736 130526 128067 140970 168877 209171 257712 310106 362850 413974 463124 511181 559555
39639E59555M9668N0401M8197M0790K7459R983p659k0725k5437k0209o148J3161
$$ 559555 609223 659624 707821 748611 776070 786053 778394 757669 732232 712023 705875 719036
39627G19036L2515M6370N0202M1726K1844n107l2600n4600o8312p5067p8736q3103
$$ 719036 751551 797921 848123 889849 911693 906586 873986 819386 751074 676007 597271 514168
39615E14168r0101r9613j10134j19482j25311j25775j20160j09105r4016p6125
$$ 514168 424067 324454 214320 94838 -30473 -156248 -276408 -385513 -479529 -555654
39605e55654n6037l4113j1190J1252L1640M8918O2515P1835P6080P4702O8177
$$ -555654 -611691 -645804 -656994 -645742 -614102 -565184 -502669 -430834 -354754 -280052 -211875
39594b11875N8341M8059M0375L7590M0713M9528O3051P9924R8418J16232J30504
$$ -211875 -153534 -105475 -65100 -27510 13203 62731 125782 205706 304124 420356 550860
39583E50860J38233J37018J25874J05845Q0045N2881K8658J0302j246o767q106
$$ 550860 689093 826111 951985 1057830 1137875 1190756 1219414 1229716 1228470 1221703 1213597
39572A213597p443o696p166r601j4737k3817l8412n9292q5203j12690j37390j55942
$$ 1213597 1206154 1199458 1192292 1182691 1167954 1144137 1105725 1046433 961230 848540 711150 555208
39560E55208j67139j71657j70650j64275j51135j29165r7385n7395j3513K8567
$$ 555208 388069 216412 45762 -118513 -269648 -398813 -496198 -553593 -567106 -538539
39550e38539O3793Q9405J05596J14986J21224J27365J34801J43131J50736J55483
$$ -538539 -474746 -385341 -279745 -164759 -43535 83830 218631 361762 512498 667981
39540F67981J55348J48966J36156J18216R7739P7836O1096M8789M0839L6379L4384
$$ 667981 823329 972295 1108451 1226667 1324406 1402242 1463338 1512127 1552966 1589345 1623729
39529A623729L3804L3333L1335K6185J6803K953j4841l5417n6896p6612r1534
$$ 1623729 1657533 1690866 1722201 1748386 1765189 1768142 1753301 1717884 1660988 1584376 1492842
39518A492842r9567j01018r9113r8843j04623j18196j37859j59269j77272j87868
$$ 1492842 1393275 1292257 1193144 1094301 989678 871482 733623 574354 397082 209214
39508B09214j89371j82268j68104j48379j24188r6608o7168l7912j1079J1432
$$ 209214 19843 -162425 -330529 -478908 -603096 -699704 -766872 -804784 -815863 -804431
39498h04431K8518M0238M7863N3631O0167O9748Q3486J00759J19192J35448J46497
$$ -804431 -775913 -735675 -687812 -634181 -574014 -504266 -420780 -320021 -200829 -65381 81116
39487H1116J50786J48594J41573J31879J21381J11286J02024R3306Q4208P3408
$$ 81116 231902 380496 522069 653948 775329 886615 988639 1081945 1166153 1239561
39477A239561N9599M2067K1105j929k4859m5007n9751o7407o8207o4602o0444
$$ 1239561 1299160 1341227 1362332 1360403 1335544 1290537 1230786 1163379 1095172 1030570 970126
39466I70126n9442o3856p3894q7852j02818j15787j24728j28890j28224j22657
$$ 970126 910684 846828 772934 685082 582264 466477 341749 212859 84635 -38022
39456c8022j12056r6950p9201o1832m7893l9020l4530l1698k7078j8193m789J0930
$$ -38022 -150078 -247028 -326229 -388061 -435954 -474974 -509504 -541202 -568280 -586473 -591262 -580332
39444e80332K5114L3693L3730K4102N515j9692m7882p4778r6498j10355j14956
$$ -580332 -555218 -521525 -487795 -463693 -458178 -477870 -525752 -600530 -697028 -807383 -922339
39433i22339j09831r5176p1864m1293n111L4962P6876J18054J55603J87045K11085
$$ -922339 -1032170 -1127346 -1199210 -1240503 -1245614 -1210652 -1133776 -1015722 -860119 -673074 -461989
39422d61989K27959K39089K46065K49583K49012K42899K29845K08999J80069J43480
$$ -461989 -234030 5059 251124 500707 749719 992618 1222463 1431462 1611531 1755011
39412A755011J00862N5458J1629k6627n7200q0373r8025j12304j24803j36441
$$ 1755011 1855873 1911331 1922960 1896333 1839133 1758760 1660735 1548431 1423628 1287187
39402A287187j47417j56885j62662j61717j51501j31413j03286p0452l5887n65
$$ 1287187 1139770 982885 820223 658506 507005 375592 272306 201854 165967 165402
39392A65402L6858P8668J25898J76678K26002K66941K92390K96677K76707K32725
$$ 165402 202260 280928 406826 583504 809506 1076447 1368837 1665514 1942221 2174946
39382B174946J68513R0864Q321p0414j37802j88348k19083k29758k22643k01842
$$ 2174946 2343459 2434323 2442644 2372230 2234428 2046080 1826997 1597239 1374596 1172754
39372A172754j72367j39261j06850p8011n3650l2723j3062P313K9246N2399P5937
$$ 1172754 1000387 861126 754276 676265 622615 589892 576830 584143 613389 665788 741725
39361G41725R9202J21710J42623J60201J71757J74266J65389J44590J13789P7084
$$ 741725 840927 962637 1105260 1265461 1437218 1611484 1776873 1921463 2035252 2112336
39351B112336L9617O105k0175l7699m6501m7858m3809l6420k6999j5778k519J2351
$$ 2112336 2151953 2158058 2137883 2100184 2053683 2005825 1962016 1925596 1898597 1882819 1880300 1892651
39339A892651K6942L8098M2547L8251K5238N605j7151l9135n6998o8561p3026
$$ 1892651 1919593 1957691 2000238 2038489 2063727 2069332 2052181 2013046 1956048 1887487 1814461
39328A814461p0772o2874n0517l4700j6302L561K3397M1587N6920O8865P7386
$$ 1814461 1743689 1680815 1630298 1595598 1579296 1582857 1606254 1647841 1704761 1773626 1851012
39317A851012Q2469Q3898Q1610P6230O9148O1994N6067N2207N0903N2088N4764
$$ 1851012 1933481 2017379 2098989 2175219 2244367 2306361 2362428 2414635 2465538 2517626 2572390
39306B572390N7066N7079N3719M6988L7581K6527J5159N246j312l244p43M517
$$ 2572390 2629456 2686535 2740254 2787242 2824823 2851350 2866509 2871755 2870443 2867199 2866456 2870973
39294B870973J0402J5719K0629K5682L0283L2128K8054J5668n276l2460o1624
$$ 2870973 2881375 2897094 2917723 2943405 2973688 3005816 3033870 3049538 3044262 3011802 2950178
39283B950178q8069j08178j20238j24172j20756j10943r5739p6454n4977l3786
$$ 2950178 2862109 2753931 2633693 2509521 2388765 2277822 2182083 2105629 2050652 2016866
39273B016866j5513k443L874K680n877k0551l8907n7573p2827q1282q0511o9549
$$ 2016866 2001353 1998910 2002784 2005464 1999587 1979036 1940129 1882556 1809729 1728447 1647936 1578387
39261A578387m9172k1880Q527L7569O0839P4698P6852O6735M5605J6417j6464
$$ 1578387 1529215 1507335 1515862 1553431 1614270 1688968 1765820 1832555 1878160 1894577 1878113
39250A878113m7824p2415q6255q7826p8495o1532m0274j6909P257L0510M9984
$$ 1878113 1830289 1757874 1671619 1583793 1505298 1443766 1403492 1386583 1393840 1424350 1474334
39239A474334O2378O5488N9215M5458K7286Q150q705k0717k6313k4866j6477j811
$$ 1474334 1536712 1602200 1661415 1706873 1734159 1742309 1733604 1712887 1686574 1661708 1645231 1643420
39227A643420J7850M0674O4611Q7715J08271J24893J36709J43437J45021J41117
$$ 1643420 1661270 1701944 1766555 1854270 1962541 2087434 2224143 2367580 2512601 2653718
39217B653718J31079J14638R2704O7542M2298K0078K981q546j5768k1034k6873
$$ 2653718 2784797 2899435 2992139 3059681 3101979 3122057 3125038 3116492 3100724 3079690 3052817
39206C052817l5220m7021o2115p9502r7894j16314j34261j51453j67491j81861
$$ 3052817 3017597 2970576 2908461 2828959 2731065 2614751 2480490 2329037 2161546 1979685
39196A979685j94273k04949k14320k22276k27410k27058k18066j97795j64717
$$ 1979685 1785412 1580463 1366143 1143867 916457 689399 471333 273538 108821
39187A08821j18642o1000M802P3390J38332J93759K35958K64141K80031K86489
$$ 108821 -9821 -70821 -66019 7371 145703 339462 575420 839561 1119592 1406081
39177A406081K86053K80112K68909K52043K28995J99497J63769J22686P8019L2589
$$ 1406081 1692134 1972246 2241155 2493198 2722193 2921690 3085459 3208145 3286164 3318753
39167C318753r971m6099p3468r1631j01650j05285j04442j01115r7403r5165r5467
$$ 3318753 3308782 3262683 3189215 3097584 2995934 2890649 2786207 2685092 2587689 2492524 2397057
39156B397057r8241j02310j05722j06276j02127r2294p6939n7272l5262j3167
$$ 2397057 2298816 2196506 2090784 1984508 1882381 1790087 1713148 1655876 1620614 1607447
39146A607447P033K4145L7973M9066N8169O5831P2404P8229Q3624Q8533R2246
$$ 1607447 1614480 1638625 1676598 1725664 1783833 1849664 1922068 2000297 2083921 2172454 2264700
39135B264700R3578R1489Q5663P6673O5608N3462M0761K7643J4330J668q775j5111
$$ 2264700 2358278 2449767 2535430 2612103 2677711 2731173 2771934 2799577 2813907 2815575 2806800 2791689
39123B791689j5737r708L320K3174M8768P7292J03862J22561J28696J20859J01314
$$ 2791689 2775952 2766244 2769564 2792738 2841506 2918798 3022660 3145221 3273917 3394776 3496090
39112C496090P4683M6009J9374k544j8316k7288k9239k4409j3924j38J3713K4674
$$ 3496090 3570773 3616782 3636156 3633612 3615296 3588008 3558769 3534360 3520436 3520298 3534011 3558685
39100C558685L1372L4624L6870M0817M8152N9117P2955Q8548J04566J19219J30199
$$ 3558685 3590057 3624681 3661551 3702368 3750520 3809637 3882592 3971140 4075706 4194925 4325124
39089D325124J35104J32142J20637J01245P5864M7317J8815o620k6671m0176m7392
$$ 4325124 4460228 4592370 4713007 4814252 4890116 4937433 4956248 4949628 4922957 4882781 4835389
39078D835389m9868m9687m8616m7791m8183n1102n7833o8516q1184r2044r6997
$$ 4835389 4785521 4735834 4687218 4639427 4591244 4540142 4482309 4413793 4332609 4240565 4143568
39067D143568r3520q1631o3382m1300j6969R288L7556O7192R6389J22682J43873
$$ 4143568 4050048 3968417 3905035 3863735 3846766 3856054 3893610 3960802 4057191 4179873 4323746
39056D323746J58726J67151J70027J69003J66352J64602J65764J70412J77337
$$ 4323746 4482472 4649623 4819650 4988653 5155005 5319607 5485371 5655783 5833120
39047E833120J84198J88719J89455J85860J78126J67398J56067J47466J44884
$$ 5833120 6017318 6206037 6395492 6581352 6759478 6926876 7082943 7230409 7375293
39038G375293J50528J64979J86979K13281K38719K56944K61771K48576K15063
$$ 7375293 7525821 7690800 7877779 8091060 8329779 8586723 8848494 9097070 9312133
39029I312133J61384Q9873M734q8325j82494k70443l45166m01174m35672m49036
$$ 9312133 9473517 9563390 9568124 9479799 9297305 9026862 8681696 8280522 7844850 7395814
39019G395814m44082m24399l92817l50998l00239k42516j80894j19189o1454j1686
$$ 7395814 6951732 6527333 6134516 5783518 5483279 5240763 5059869 4940680 4879226 4867540
39009D867540K6478N0354N9107N4385M0147K1654L882j0045j9662k6742l3725
$$ 4867540 4894018 4944372 5003479 5057864 5098011 5119665 5123547 5113502 5093840 5067098 5033373
38998E033373m1971n0922n8642o3071o3039n8464m9920l8056k3204n217J6435
$$ 5033373 4991402 4940480 4881838 4818767 4755728 4697264 4647344 4609288 4586084 4580867 4597302
38987D597302M2328P2473J05751J39749J71195J96760K13718K20260K15632K00323
$$ 4597302 4639630 4712103 4817854 4957603 5128798 5325558 5539276 5759536 5975168 6175491
38977F175491J76244J46706J15966Q8223O6187M9949L7058K4152R178p366k2831
$$ 6175491 6351735 6498441 6614407 6702630 6768817 6818766 6855824 6879976 6889154 6881788 6858957
38966F858957l3867l7831l3561k1308j988K3658N5259R2152J32516J73259K10699
$$ 6858957 6825090 6787259 6753698 6732390 6730402 6754060 6809319 6901471 7033987 7207246 7417945
38955G417945K41333K62253K71430K68321K54548K33954K11490J91178J74187
$$ 7417945 7659278 7921531 8192961 8461282 8715830 8949784 9161274 9352452 9526639
38946I526639J58256J38932J12096P6401L4376q372m5415p1947q6084q8604q1955
$$ 9526639 9684895 9823827 9935923 10012324 10046700 10038328 9992913 9920966 9834882 9746278 9664323
38935I664323o9682n6436m7760m9037o4085r4139j37536j89776k43998k92142
$$ 9664323 9594641 9538205 9490445 9441408 9377323 9283184 9145648 8955872 8711874 8419732
38925H419732l26821l43109l39502l17808k82322k38605j92075j46626j03798
$$ 8419732 8092911 7749802 7410300 7092492 6810170 6571565 6379490 6232864 6129066
38916F129066o2938k2278J9679O3069J06202J45741J77546J97937K05032J99456
$$ 6129066 6066128 6043850 6063529 6126598 6232800 6378541 6556087 6754024 6959056 7158512
38906G158512J84094J63041J40442J19761J03644R3995R1911R7591J10470J29601
$$ 7158512 7342606 7505647 7646089 7765850 7869494 7963489 8055400 8152991 8263461 8393062
38896H393062J54026J82768K14460K46774K76129K97970L07668L01590K77812
$$ 8393062 8547088 8729856 8944316 9191090 9467219 9765189 10072857 10374447 10652259
38887A0652259K36385J79483J11754M0335k6128p9502j14262j28681j24680j06837
$$ 10652259 10888644 11068127 11179881 11220216 11194088 11114586 11000324 10871643 10746963 10640126
38877A0640126q1196n4204l1600j7179j1713j2805j6201j7998j6477j2596r080
$$ 10640126 10558930 10504726 10473126 10455947 10444234 10431429 10415228 10397230 10380753 10368157 10359077
38866A0359077q895j3861k3881l6917m9858n9919o5752o7353o4676n6221l9172
$$ 10359077 10350182 10336321 10312440 10275523 10225665 10165746 10099994 10032641 9967965 9911744 9872572
38855I872572j1294K6882P1375J16091J55091J84520K03269K12209K12645K05144
$$ 9872572 9861278 9888160 9959535 10075626 10230717 10415237 10618506 10830715 11043360 11248504
38845A1248504J89679J66731J38086J06552P5076M6115K1591K949q845j3296j0275
$$ 11248504 11438183 11604914 11743000 11849552 11924628 11970743 11992334 11995283 11986438 11973142 11962867
38834A1962867M9J7198M0334O8315R9628J32109J62650J87459K03182K08324K03936
$$ 11962867 11962916 11980114 12020448 12088763 12188391 12320500 12483150 12670609 12873791 13082115 13286051
38823A3286051J92775J77656J60153J40455J18141R3199O6792M1233J9181K583
$$ 13286051 13478826 13656482 13816635 13957090 14075231 14168430 14235222 14276455 14295636 14298219
38813A4298219p681j1307q040K224J9072M1549O8322R7623J27015J53671J75218
$$ 14298219 14290538 14279231 14271191 14273415 14292487 14334036 14402358 14499981 14626996 14780667 14955885
38802A4955885J90543J99931K04670K06498K07167K08211K10955K16457K25174
$$ 14955885 15146428 15346359 15551029 15757527 15964694 16172905 16383860 16600317 16825491
38793A6825491K36476K48675K59879K69258K77831K88130L02825L23051L47656
$$ 16825491 17061967 17310642 17570521 17839779 18117610 18405740 18708565 19031616 19379272
38784A9379272L73989L99757M24466M49483M76907N08303N44050N83306O24290
$$ 19379272 19753261 20153018 20577484 21026967 21503874 22012177 22556227 23139533 23763823
38775B3763823O64597P01566P32739P56552P72959P83763P92257Q02323Q17261
$$ 23763823 24428420 25129986 25862725 26619277 27392236 28175999 28968256 29770579 30587840
38766C0587840Q38908Q67427R01924R41608R86836J039424J101992J176935J265735
$$ 30587840 31426748 32294175 33196099 34137707 35124543 36163967 37265959 38442894 39708629
38757C9708629J369206J488374J625242J782873J964986K175372K417553K694822
$$ 39708629 41077835 42566209 44191451 45974324 47939310 50114682 52532235 55227057
38749E5227057L010583L368606L772614M225251M727043N276310N870043O505096
$$ 55227057 58237640 61606246 65378860 69604111 74331154 79607464 85477507 91982603
38741I1982603P178595P886723Q621722R368078J0098673J0770986J1322519J1666026
$$ 91982603 99161198 107047921 115669643 125037721 135136394 145907380 157229899 168895925
38733A68895925J1687685J1253942J0234095Q542527O192669L337272K62485k677764
$$ 168895925 180583610 191837552 202071647 210614174 216806843 220144115 220406600 217728836
38725B17728836n162449o988667q101410q565503q508706q069169p364350o481407
$$ 217728836 212566387 205577720 197476310 188910807 180402101 172332932 164968582 158487175
38717A58487175n480840m404334l280829k129338r60107K24090J425909K650867
$$ 158487175 153006335 148602001 145321172 143191834 142231727 142455817 143881726 146532593
38709A46532593L904446N189509O504332P840361R178909J0487160J1714095J2785629
$$ 146532593 150437039 155626548 162130880 169971241 179150150 189637310 201351405 214137034
38701B14137034J3598149J4012795J3857509J2946566J1126085Q343666M718775
$$ 214137034 227735183 241747978 255605487 268552053 279678138 288021804 292740579
38694B92740579N70101l636702p413543j0388328j2387365j3431459j3670161
$$ 292740579 293310680 289673978 282260435 271872107 259484742 246053283 232383122
38687B32383122j3303049j2523122j1490475j0327992r127487p957407o867107
$$ 232383122 219080073 206556951 195066476 184738484 175610997 167653590 160786483
38680A60786483n887075n027208m275893l602539k965294k322666j643984r13568
$$ 160786483 154899408 149872200 145596307 141993768 139028474 136705808 135061824 134148256
38672A34148256j27973P09652J593910K518992L478671M465327N468422O472620
$$ 134148256 134020283 134729935 136323845 138842837 142321508 146786835 152255257 158727877
38664A58727877P455671Q386635R226229R930273J0454049J0752189J0770716
$$ 158727877 166183548 174570183 183796412 193726685 204180734 214932923 225703639
38657B25703639J0435054R645544Q293743O304914L695236O15170k652985n755411
$$ 225703639 236138693 245784237 254077980 260382894 264078130 264693300 262040315 256284904
38649B56284904q362867j0256703j1366049j1748722j1538968j0893161r952761
$$ 256284904 247922037 237665334 226299285 214550563 203011595 192118434 182165673
38642A82165673q827860p595734o307040m993282l672283k352029j034994K76913
$$ 182165673 173337813 165742079 159435039 154441757 150769474 148417445 147382451 147659364
38634A47659364J578492K859555M104594N292761O397633P385408Q209560Q802293
$$ 147659364 149237856 152097411 156202005 161494766 167892399 175277807 183487367 192289660
38626A92289660R067469Q882923Q120476O688221M587766J960416r13247l677815
$$ 192289660 201357129 210240052 218360528 225048749 229636515 231596931 230683684 227005869
38618B27005869o008108p701031q709479r113896r062657q717633q222563p691612
$$ 227005869 220997761 213296730 204587251 195473355 186410698 177693065 169470502 161778890
38610A61778890p207041o817322o534458o335329o172267n991817n753945n443402
$$ 161778890 154571849 147754527 141220069 134884740 128712473 122720656 116966711 111523309
38602A11523309n070288m662747m256626l886248l578364l349195l202743l129307
$$ 111523309 106453021 101790274 97533648 93647400 90069036 86719841 83517098 80387791
38594H0387791l105479l098258l073802l007353k889137k723316k521570k295957
$$ 80387791 77282312 74184054 71110252 68102899 65213762 62490446 59968876 57672919
38586E7672919k054829j802467j540750j271193r96755p23105m59039k16083p861
$$ 57672919 55618090 53815623 52274873 51003680 50006925 49283820 48824781 48608698 48600837
38577D8600837J50492K43120K54978J74457k411k66776n93614r44204j275588
$$ 48600837 48751329 48994449 49249427 49423884 49421473 49154697 48561083 47616879 46341291
38568D6341291j552799j756977j885626j946819j952324j913379j839898j741601
$$ 46341291 44788492 43031515 41145889 39199070 37246746 35333367 33493469 31751868
38560C1751868j629083j513539j405200j311443j235541j176409j129356j087754
$$ 31751868 30122785 28609246 27204046 25892603 24657062 23480653 22351297 21263543
38552B1263543j045153r97155r42406q82572q21494p63806p13368o72002o38931
$$ 21263543 20218390 19221235 18278829 17396257 16574763 15810957 15097589 14425587 13786656
38543A3786656o11093n84222n54394n19505m79868m37584l95132l54123l14909
$$ 13786656 13175563 12591341 12036947 11517442 11037574 10599990 10204858 9850735 9535826
38534I535826k76994k39619k02129j64154j25940q8839n5432k8798j1276l578
$$ 9535826 9258832 9019213 8817084 8652930 8526990 8438151 8382719 8353921 8342645 8339067
38524H339067m824j3188k6534m2688n9432p4326q4716q8184q3505p1431n4505
$$ 8339067 8334243 8321055 8294521 8251833 8192401 8118075 8033359 7945175 7861670 7790239 7735734
38513G735734l6070j9200o207J477L514P77n124j2879k2330l4310m9581o7613
$$ 7735734 7699664 7680464 7674257 7675734 7679248 7680025 7674901 7662022 7639692 7605382 7555801 7488188
38501G488188q6100j01642j11284j14069j11487j06629j02829j02753j08075j19034
$$ 7488188 7402088 7300446 7189162 7075093 6963606 6856977 6754148 6651395 6543320 6424286
38491F424286j33664j47538j54822j50389j31834j00349o0315j7888K0843N1545
$$ 6424286 6290622 6143084 5988262 5837873 5706039 5605690 5545375 5527487 5548330 5599875
38481E599875P2417Q3908Q7664Q5537P9053O9309N7004M2300K4547K283k6215
$$ 5599875 5672292 5756200 5843864 5929401 6008454 6077763 6134767 6177067 6201614 6203897 6177682
38470F177682o1809j03412j47494j88590k20725k39302k42644k32475k13018j89372
$$ 6177682 6115873 6012461 5864967 5676377 5455652 5216350 4973706 4741231 4528213 4338841
38460D338841j65986j45829j30212j18886j10235j01712r0662p5460n6365l5461
$$ 4338841 4172855 4027026 3896814 3777928 3667693 3565981 3475319 3399859 3343494 3308033
38450C308033j5702K76J0761J4815J1904J956j4136l4058n4223p0642q0125q1299
$$ 3308033 3292331 3292607 3303368 3318183 3330087 3332043 3317907 3283849 3229626 3158984 3078859 2997560
38438B997560p5099o4422n2956m3605l7254l2674k7503j9745q835M118J6925K7340
$$ 2997560 2922461 2858039 2805083 2761478 2724224 2691550 2664047 2644302 2635467 2639585 2656510 2683850
38426B683850L4054L7152L7757L7154L5966L3950L0280K4001J4409J361j4570
$$ 2683850 2717904 2755056 2792813 2829967 2865933 2899883 2930163 2954164 2968573 2969934 2955364
38415B955364l2395n1430p1701r3259j14729j32511j41741j38578j22276r5631
$$ 2955364 2922969 2871539 2799838 2706579 2591850 2459339 2317598 2179020 2056744 1961113
38405A961113o3833l2607o654J1204K0317K2179K0064J7911J8551K2221K6579
$$ 1961113 1897280 1864673 1858019 1869223 1889540 1911719 1931783 1949694 1968245 1990466 2017045
38394B017045K8377K5631J8656R587R70n483r443j1703j3297j4606j5072j3825
$$ 2017045 2045422 2071053 2089709 2099296 2100266 2094783 2085340 2073637 2060340 2045734 2030662 2016837
38382B016837j0680o531k727M7K364N568J0643J7334K4215K9502L1925L1036K6975
$$ 2016837 2006157 1999626 1996899 1996946 1999310 2004878 2015521 2032855 2057070 2086572 2118497 2149533 2176508
38369B176508K0131J1086P64r515j8294k4319k6715k5053j9633j1836l978J663
$$ 2176508 2196639 2207725 2208489 2198974 2180680 2156361 2129646 2104593 2084960 2073124 2069146 2070809
38357B070809M139M411M619O656J1062J6758K1435K2218J6581L391j6329l9531
$$ 2070809 2074948 2079359 2083978 2090634 2101696 2118454 2139889 2162107 2178688 2182079 2165750 2126219
38345B126219o2343q1661r6168j06197j12587j15313j12920j03166q4467n7150
$$ 2126219 2063876 1982215 1886047 1779850 1667263 1551950 1439030 1335864 1251397 1194247
38335A194247k3694J2003M5928P5220R8786J17072J31201J42162J50532J56440
$$ 1194247 1170553 1182556 1228484 1303704 1402490 1519562 1650763 1792925 1943457 2099897
38325B099897J59380J57948J50180J34668J11724Q3592N3510K4382k110k5536
$$ 2099897 2259277 2417225 2567405 2702073 2813797 2897389 2950899 2975281 2973171 2947635
38315B947635m6154o4069p8533q7683q8858p9537n8617k7537R358M5720P5196
$$ 2947635 2901481 2837412 2758879 2671196 2582338 2502801 2444184 2416647 2426005 2471725 2546921
38304B546921R3794J01279J00878R7572R6105R9857J10793J29817J56981J91383
$$ 2546921 2640715 2741994 2842872 2940444 3036549 3136406 3247199 3377016 3533997 3725380
38294C725380K31111K73509L15899L56485L95141M33566M74646N21253N75130
$$ 3725380 3956491 4230000 4545899 4902384 5297525 5731091 6205737 6726990 7302120
38285G302120O36567P04691P77559Q51182R17896R65439R78019R39430Q37369
$$ 7302120 7938687 8643378 9420937 10272119 11190015 12155454 13133473 14072903 14910272
38276A4910272O68175M40658J76947r1641l33156n24196o55050p29000p57396
$$ 14910272 15578447 16019105 16196052 16104411 15771255 15247059 14592009 13863009 13105613
38267A3105613p54038p31053o96952o56428o11371n62469n10589m57271m04184
$$ 13105613 12351575 11620522 10923570 10267142 9655771 9093302 8582713 8125442 7721258
38258G721258l52209l00952k49017j94782j36989p4965q565O1781J34971K09192
$$ 7721258 7369049 7068097 6819080 6624298 6487309 6412344 6403779 6465560 6600531 6809723
38248F809723K82238L51939M16572M75055N27005N72561O11769O43425O64009
$$ 6809723 7091961 7443900 7860472 8335527 8862532 9435093 10046862 10690287 11354296
38239A1354296O67282O44941N88188M90251L49724J73496k2780k18005l91505
$$ 11354296 12021578 12666519 13254707 13744958 14094682 14268178 14245398 14027393 13635888
38230A3635888n28366o21713o71914o84266o66810o28783n79418n26942m77859
$$ 13635888 13107522 12485809 11813895 11129629 10462819 9834036 9254618 8727676 8249817
38221H249817m36666m05769l85359l73259l65262l56389l42594l21972k94820
$$ 8249817 7813151 7407382 7022023 6648764 6283502 5927113 5584519 5262547 4967727
38212D967727k62866k28614j95273j66952j48122j42131j49446j66788j87810
$$ 4967727 4704861 4476247 4280974 4114022 3965900 3823769 3674323 3507535 3319725
38203C319725k04964k11750k04630j84016j53856j19851q7217n9294l7555k2431
$$ 3319725 3114761 2903011 2698381 2514365 2360509 2240658 2153441 2094147 2056592 2034161
38193B034161j3908j1472j3739j8359k2470k3551k0217j2562j929R629J9884K6778
$$ 2034161 2020253 2008781 1995042 1976683 1954213 1930662 1910445 1897883 1895954 1905583 1925467 1952245
38181A952245K8674K4695J5108J498j3696k8123m0290m9616n5822n8570n7737
$$ 1952245 1980919 2005614 2020722 2022220 2008524 1980401 1940111 1890495 1834673 1776103 1718366
38170A718366n3892m8187m1461l3350k2285o533J4543L9927O7339R4057J17350
$$ 1718366 1664474 1616287 1574826 1541476 1519191 1512658 1527201 1567128 1634467 1728524 1845874
38159A845874J34450J42588J39570J24637R9124O6474L1574l55k5087m0298m5859
$$ 1845874 1980324 2122912 2262482 2387119 2486243 2552717 2584291 2583936 2558849 2518551 2472692
38148B472692m3507l6487k9071k5658k9416m1001n8187p6539r0956r7566r5487
$$ 2472692 2429185 2392698 2363627 2337969 2308553 2267552 2209365 2132826 2041870 1944304 1848817
38137A848817q7480p8836p4910p8778r0404j07251j25346j40142j47270j43499
$$ 1848817 1761337 1682501 1607591 1528813 1438409 1331158 1205812 1065670 918400 774901
38127G74901j27650j01066o7443l2136r03K1739L3913L6645L2819K5515J6731
$$ 774901 647251 546185 478742 446606 445703 467442 501355 538000 570819 596334 613065
38116F13065O944m579j8839l5901n4043o9894p9453p9316o7570m4531j3213K1059
$$ 613065 620009 615430 596591 560690 506647 436753 357300 277984 210414 165883 152670 173729
38104A73729N2396P6710R2884J02007J05510J04002R7666Q7485P5988O6605O1928
$$ 173729 226125 302835 395719 497726 603236 707238 804904 892389 968377 1034982 1096910
38093A096910O2040O4165O4131N8665M7041L1104J4003j328j3172k1336k7044
$$ 1096910 1158950 1223115 1287246 1345911 1392952 1424056 1438059 1436731 1423559 1402223 1375179
38082A375179l2383l9341m8647n9219o8842p5714p9495q0961q0764p8632p3683
$$ 1375179 1342796 1303455 1254808 1195589 1126747 1051033 971538 890577 809813 731181 657498
38071F57498o5215n3065l7524j9286K61J8829L3541M1990M3500L9800L4298L0290
$$ 657498 592283 539218 501694 482408 482669 501498 535039 577029 620529 660329 694627 724917
38059G24917K9184L0173L1349L1260K9638K7105K4470K2388K1366K1813K3847
$$ 724917 754101 784274 815623 846883 876521 903626 928096 950484 971850 993663 1017510
38048A017510K7193L1473L6655M2940M9956N6165N9450N8650N4455M8795M3229
$$ 1017510 1044703 1076176 1112831 1155771 1205727 1261892 1321342 1379992 1434447 1483242 1526471
38037A526471L7927L1900K3975J3521N39j4560l1123m8220o4454p7836q5858q5945
$$ 1526471 1564398 1596298 1620273 1633794 1634333 1619773 1588650 1540430 1475976 1398140 1312282 1226337
38025A226337p6277n6680k9201K003L1522N4085O5992O6036N5653L8282J8393
$$ 1226337 1150060 1093380 1064179 1066182 1097704 1151789 1217781 1283817 1339470 1377752 1396145
38014A396145M03j2378j8675j9769j9193k1442l0106m6122o7077q8042j03629
$$ 1396145 1396548 1384170 1365495 1345726 1326533 1305091 1274985 1228863 1161786 1073744 970115
38003I70115j10280j07731r9031q9080q2331q0663q2673q4740q3006p4827n9068
$$ 970115 859835 752104 653073 563993 481662 400999 318326 233586 150580 75753 16685
37992A6685l5899o854K4973N5235P9533R4970J01105R9718R3488Q4397P2889N8184
$$ 16685 -19214 -26068 -1095 54140 133673 228643 329748 429466 522954 607351 680240 738424
37980G38424L9312J6034j0838l9667o8506r5656j19872j40034j54522j61106j57825
$$ 738424 777736 793770 782932 743265 674759 579103 459231 319197 164675 3569 -154256
37969a54256j44386j22965r7630p2581n0374l1166j3375M874K4429M4710O4122
$$ -154256 -298642 -421607 -519237 -591818 -642192 -673358 -686733 -681859 -657430 -612720 -548598
37958e48598Q0731R2785R9019R8835R2336Q0075O2818M1614J8116n263k5793m1141
$$ -548598 -467867 -375082 -276063 -177228 -84892 -4817 58001 99615 117731 112468 86675 45534
37946D5534m9806n1099m4943l1861j3215Q637L0677N0044O4916P4691P9371P8699
$$ 45534 -4272 -55371 -100314 -132175 -145390 -136753 -106076 -56032 8884 83575 162946 241645
37934B41645P1914N8472L9146J6641m997k1983l2404l6735l6819l4305k9705k2623
$$ 241645 313559 372031 411177 427818 422821 400838 368434 331699 294880 260575 230870 208247
37922B08247j2543P01J7179L7420O2533R3409J29547J68502K06479K39393K63479
$$ 208247 195704 196405 213584 251004 313537 406946 536493 704995 911474 1150867 1414346
37911A414346K75417K72537K53396K18178J68632J08015M1288k4858q2914j26240
$$ 1414346 1689763 1962300 2215696 2433874 2602506 2710521 2751809 2726951 2644037 2517797
37901B517797j50701j55635j43893j21010r3689o8041m8207l5729k9776k8212
$$ 2517797 2367096 2211461 2067568 1946558 1852869 1784828 1736621 1700892 1671116 1642904
37891A642904k9086l1661l6134m2412m9014n3119n1712m3173k8452j1052M385
$$ 1642904 1613818 1582157 1546023 1503611 1454597 1401478 1349766 1306593 1278141 1267089 1271474
37880A271474J4220J7232J4486Q204P70n503q324n674L501J8554L6989N5188O9834
$$ 1271474 1285694 1302926 1317412 1325616 1326386 1320883 1312559 1306885 1310386 1328940 1365929 1421117 1490951
37867A490951P9256Q3800Q5003Q4223Q1782P7095O9443N8652M5410L1182J7875
$$ 1490951 1570207 1654007 1739010 1823233 1905015 1982110 2051553 2110205 2155615 2186797 2204672
37856B204672P037j110q020j5892k5903l7077m6764n2379n2952m9564m4626m0640
$$ 2204672 2211709 2210599 2202579 2186687 2160784 2123707 2076943 2024564 1971612 1922048 1877422 1836782
37844A836782l9025l9544m0629m0441l7935l3248k7402k1916j8654j9565k5843
$$ 1836782 1797757 1758213 1717584 1677143 1639208 1605960 1578558 1556642 1537988 1518423 1492580
37833A492580l6874n0029o1705o8934p0310o5838n6238m2490k5827p770R995K5845
$$ 1492580 1455706 1405677 1343972 1275038 1204728 1138890 1082652 1040162 1014335 1006565 1016560 1042405
37821A042405L8328M6404M9868M9811M8417M7936M9491N2786N6887O1126O5226
$$ 1042405 1080733 1127137 1177005 1226816 1275233 1323169 1372660 1425446 1482333 1543459 1608685
37810A608685O8671P0106O7399N8456M2301J9869o037l1764n4119p1077q1569
$$ 1608685 1677356 1747462 1814861 1873317 1915618 1935487 1929450 1897686 1843567 1772490 1690921
37799A690921q4847q0302o7860m8620k5100p96K0698L6445M4390M3298L2826J3947
$$ 1690921 1606074 1525772 1457912 1409292 1384192 1383396 1404094 1440539 1484929 1528227 1561053 1575000
37787A575000j0714l7026o0066p5240p9491p2116n4817l0860m019K2162M4779
$$ 1575000 1564286 1527260 1467194 1391954 1312463 1240347 1185530 1154670 1150651 1172813 1217592
37776A217592O1884P2769P7916P8586P6339P2566O8067O2738N5816M6623L5249
$$ 1217592 1279476 1352245 1430161 1508747 1585086 1657652 1725719 1788457 1844273 1890896 1926145
37765A926145K2605R817k480j4398k6550l9395n2660o5228p5717q3310q8198r1302
$$ 1926145 1948750 1958567 1956087 1941689 1915139 1875744 1823084 1757856 1682139 1598829 1510631 1419329
37753A419329r3482r4850r4559r1172q3458p1196n5684l9531k5900j7386j5157
$$ 1419329 1325847 1230997 1136438 1045266 961808 890612 834928 795397 769497 752111 736954
37742G36954j8702k6397l6344m6933n6823o4654o9104o9221o4800n6423m5325
$$ 736954 718252 691855 655511 608578 551755 487101 417997 348776 283976 227553 182228
37731A82228l3104k1326j1067k796L276O656O493K121o255j7375k9412m0825n0868
$$ 182228 149124 127798 116731 113935 117211 123867 130360 132481 126226 108851 79439 38614 -12254
37718a2254n9462o6403p0783p1174o6597n7469m5745l4073k4507j7442j1459m245
$$ -12254 -71716 -138119 -208902 -280076 -346673 -404142 -449887 -483960 -508467 -525909 -537368 -541613
37706e41613N835J8576L1949M3254N0446N2937N1678M8747M6588M6971N0170N4911
$$ -541613 -535778 -517202 -485253 -441999 -391553 -338616 -286938 -238191 -191603 -144632 -94462 -39551
37694c9551N9276O1880O2550O2013O1128O0182N8685N5617M9976M1394L0446J8397
$$ -39551 19725 81605 144155 206168 267296 327478 386163 441780 491756 533150 563596 581993
37682E81993O536m430j4621k4897l6521n0604o7398q5914j04225j20428j33536
$$ 581993 588529 584099 569478 544581 508060 457456 390058 304144 199919 79491 -54045
37671e4045j43647j51318j56697j59105j57467j51345j41765j31094j21916j15549
$$ -54045 -197692 -349010 -505707 -664812 -822279 -973624 -1115389 -1246483 -1368399 -1483948
37661a483948j11183j06189r7337q2256o0468l3546m328K4525N1875P8326J05059
$$ -1483948 -1595131 -1701320 -1798657 -1880913 -1941381 -1974927 -1979255 -1954730 -1902855 -1824529 -1719470
37650a719470J32146J57838J79451J94851K03180K04406J98525J85365J65059
$$ -1719470 -1587324 -1429486 -1250035 -1055184 -852004 -647598 -449073 -263708 -98649
37641i8649J38620J08156P6474M6153J8532o828l1658n7794q6080j15907j45281
$$ -98649 39971 148127 224601 270754 289286 282458 250800 193006 106926 -8981 -154262
37630a54262j71116j89760j97804j93066j75290j46387j10303p2504l8902j4390
$$ -154262 -325378 -515138 -712942 -906008 -1081298 -1227685 -1337988 -1410492 -1449394 -1463784
37620a463784j628p04r596k4820m2020n6607o4521o2956n0859k9362j995K5798
$$ -1463784 -1465412 -1466116 -1475712 -1500532 -1542552 -1599159 -1663680 -1726636 -1777495 -1806857 -1808852 -1783054
37608a783054M8149O0758O2468N5724M5874L9295M0841N1628O8482Q5317R5552
$$ -1783054 -1734905 -1674147 -1611679 -1555955 -1510081 -1470786 -1429945 -1378317 -1309835 -1224518 -1128966
37597a128966R4173P8892N0544J3018k7447o3723q9715j02211j01818r2524p9878
$$ -1128966 -1034793 -955901 -905357 -892339 -919786 -983509 -1073224 -1175435 -1277253 -1369777 -1449655
37586a449655o8647o1153n7079n4527n1330m5769l6655k3243n359J6347M0328
$$ -1449655 -1518302 -1579455 -1636534 -1691061 -1742391 -1788160 -1824815 -1848058 -1853417 -1837070 -1796742
37575a796742O4334Q5832J02606J13362J18060J17617J13154J05378R4576Q1105
$$ -1796742 -1732408 -1646576 -1543970 -1430608 -1312548 -1194931 -1081777 -976399 -881823 -800718
37565h00718O5827N0199L6061K5348J9582J9195K2941K7914L0526K7954J9306
$$ -800718 -734891 -684692 -648631 -623283 -603701 -584506 -561565 -533651 -503125 -475171 -455865
37554d55865N797j0010k5176l6971m3025m1513l1637j4222Q088L1264N0750O2409
$$ -455865 -450068 -460078 -485254 -522225 -565250 -606763 -638400 -652622 -644534 -613270 -562520 -500111
37542e00111O3316N2263L0022p05l5584o9279r6457j12956j16615j07249q5889
$$ -500111 -436795 -384532 -354510 -355215 -390799 -460078 -556535 -669491 -786106 -893355 -979244
37531i79244n3992j3273L3841Q3709J31500J71820J99897K12895K10801J96175
$$ -979244 -1033236 -1046509 -1012668 -928959 -797459 -625639 -425742 -212847 -2046 194129
37521A94129J72808J44041J11950P7591M1736N256l0922o5888r8506j27068j49286
$$ 194129 366937 510978 622928 700519 742255 747511 716589 650701 552195 425127 275841
37510B75841j62825j66211j59585j44748j24372j00790p5122m7289j6805J6246
$$ 275841 113016 -53195 -212780 -357528 -481900 -582690 -657812 -705101 -721906 -705660
37500g05660N0474Q3009J09973J27605J33546J27634J11899Q9898O5818M3621
$$ -705660 -655186 -572177 -462204 -334599 -201053 -73419 38480 128378 194196 237817
37490B37817K6349J5792J2503J5951K4462L5242M4921N0707N1384M7468M0426
$$ 237817 264166 279958 292461 308412 332874 368116 413037 463744 515128 562596 603022
37479F03022L1727K2314J2674L055o517j6324k6737l7515m7101n2763n1695m2355
$$ 603022 634749 657063 669737 672792 666275 649951 623214 585699 538598 485835 434140 391785
37467C91785k5031j518K5549N3149P8133R7470J08542J09434R9147P7915M7553
$$ 391785 366754 365236 390785 443934 522067 619537 728079 837513 936660 1014575 1062128
37456A062128J1550k5349n8075q2269r5040r5382q4352o4918m1254j7622K547
$$ 1062128 1073678 1048329 990254 907985 812945 717563 633211 568293 527039 509417 511964
37445E11964J6917K4261K4739K0285J4290J0154R544J1571J3416J1901N130o544
$$ 511964 528881 553142 577881 598166 612456 622610 632154 643725 657141 669042 674172 667628
37433F67628k0577l3232m0932m1405l4188k0563l108J4893K9997L9050L9737L1343
$$ 667628 647051 613819 572887 531482 497294 476731 473623 488516 518513 557563 597300 628643
37421F28643J5383m447k3378l7255m3928m3711l8770l1927k5586k1230j9464k0154
$$ 628643 644026 639579 616201 578946 535018 491307 452537 420610 395024 373794 354330 334176
37409C34176k2491k5220k7262k8412k9441l1401l4727l8817m2290m3535m1082
$$ 334176 311685 286465 259203 230791 201350 169949 135222 96405 54115 10580 -30502
37398c0502l3866k1384m063J6400L7030N4325O5590P0098O9247O5660O1759N8689
$$ -30502 -64368 -85752 -89815 -73415 -36385 17940 83530 153628 222875 288535 350294 408983
37386D08983N6018N2402M6930M0281L4667L2477L4645M0017M5905M9016M6284
$$ 408983 465001 517403 564333 604614 639281 671758 706403 746420 792325 841341 887625
37375H87625L5566J6476r204l7946o5707q9298j07141j19089j25455j26124j20559
$$ 887625 923191 939667 930463 892517 826810 737512 630371 511282 385827 259703 139144
37364A39144j08815r2593p5079n9676m8709m3053m2595m6671n4111o3079p1148
$$ 139144 30329 -62264 -137343 -197019 -245728 -288781 -331376 -378047 -432158 -495237 -566385
37353e66385p5736p4809o7474n4223l6550j6012O730L2182O1254R3927J28395
$$ -566385 -642121 -716930 -784404 -838627 -875177 -891189 -884459 -852277 -791023 -697096 -568701
37342e68701J61347J89025K08263K16950K14165K00229J76770J46647J13723Q2340
$$ -568701 -407354 -218329 -10066 206884 421049 621278 798048 944695 1058418 1140758
37332A140758N6207L6935K3177J1337k367j9873m0564o1968q0982r4803j01407
$$ 1140758 1196965 1233900 1257077 1268414 1266047 1246174 1205610 1143642 1062660 967857 866450
37321H66450r9930r1174p7915o4441n5058n2180n5165o0758o4892o4766o0043
$$ 866450 766520 675346 597431 532990 477932 425752 370587 309829 244937 180171 120128
37310A20128n2568m4968l9066l5001l1519k7052k1019j4561j0277j0859j7421
$$ 120128 67560 22592 -16474 -51475 -82994 -110046 -131065 -145626 -155903 -166762 -184183
37299a84183k8579m0883n0149n2751m6529l1381r528J5070L8181N6808O9646P6484
$$ -184183 -212762 -253645 -303794 -356545 -403074 -434455 -443983 -428913 -390732 -333924 -264278 -187794
37287a87794P7262P1738N9838M2376K1638J389j3866k0206j5410N90K5809N6555
$$ -187794 -110532 -38794 21044 63420 85058 86447 72581 52375 36965 37555 63364 119919
37275A19919Q7925J14839J33273J40934J36946J21238R4527N9097J9396j8530
$$ 119919 207844 322683 455956 596890 733836 855074 949601 1008698 1028094 1009564
37265A009564m8598o6420p0315o1510m3674k2032k202J1050J4840Q667n741k5121
$$ 1009564 960966 894546 824231 762721 719047 697015 694813 705863 720703 729370 723629 698508
37253F98508m5683o3981p7480q4717q5321q0081p0930o0597n1835m6564m5458
$$ 698508 652825 588844 511364 426647 341326 261245 190315 129718 77883 31319 -14139
37242a4139m8140n3663o0852o8453p5086p9191p9056p3107o0493m1640j8339O675
$$ -14139 -62279 -115942 -176794 -245247 -320333 -399524 -478580 -551687 -612180 -653820 -672159 -665484
37230f65484L0443N0402O4797P2808P4396P0096O1016M8948L6157K4485J4306
$$ -665484 -635041 -584639 -519842 -447034 -372638 -302542 -241526 -192578 -156421 -131936 -117630
37219a17630M262p809k3269m1585o0308p6078q5856q7749q1325o7598m8913k8660
$$ -117630 -113368 -121177 -144446 -186031 -246339 -322417 -408273 -496022 -577347 -644945 -693858 -722518
37207g22518j0554K292Q159O883m68j2079k5706l8961m9711n6610n9398n8596
$$ -722518 -733072 -730780 -722621 -715738 -716206 -728285 -753991 -792952 -842663 -899273 -958671 -1017267
37195a017267n4709m7618l6721k1678l071J7512L7687N4454O4698O6270N9291
$$ -1017267 -1071976 -1119594 -1156315 -1177993 -1181064 -1163552 -1125865 -1071411 -1006713 -940443 -881152
37184h81152M6381L1397J7535O441j281m982l637L454J5582L0293M4238N4745
$$ -881152 -834771 -803374 -785839 -779398 -780679 -785661 -789298 -785844 -770262 -739969 -695731 -640986
37172f40986O1081O4441O6816O9519P2371P3770P1459O3451M8755K7651J613k7083
$$ -640986 -579905 -515464 -448648 -379129 -306758 -232988 -161529 -98078 -49323 -21672 -20059 -47142
37160d7142n5894q2767j06704j27685j45855j60547j70103j72522j66494j52075
$$ -47142 -103036 -185803 -292507 -420192 -566047 -726594 -896697 -1069219 -1235713 -1387788
37150a387788j30843j05451p8641n2041k5494K545L3765O8678J05781J41358J70061
$$ -1387788 -1518631 -1624082 -1702723 -1754764 -1780258 -1777713 -1743948 -1675270 -1569489 -1428131 -1258070
37139a258070J86361J86656J70960J43122J09215P5041M3989J6368r616l5836
$$ -1258070 -1071709 -885053 -714093 -570971 -461756 -386715 -342726 -326358 -335974 -371810
37129c71810o2306q6503j04340j12184j08648r5185p5390n3560l3461j7596p021
$$ -371810 -434116 -520619 -624959 -737143 -845791 -940976 -1016366 -1069926 -1103387 -1120983 -1128004
37118a128004j354J070K680N807J1782K0590L1226M2391N3106O2982P2230Q1396
$$ -1128004 -1129358 -1128288 -1125608 -1119801 -1108019 -1087429 -1056203 -1013812 -960706 -897724 -825494 -744098
37106g44098R0876J00493J09444J16731J21661J24007J23909J21821J18653J15742
$$ -744098 -653222 -552729 -443285 -326554 -204893 -80886 43023 164844 283497 399239
37096C99239J14269J14354J14647J12926J07312R7114Q2719O4972M4643K2292
$$ 399239 513508 627862 742509 855435 962747 1059861 1142580 1207552 1252195 1274487
37086A274487j703k7064n3280p9109j02371j20416j31130j33780j29129j18864
$$ 1274487 1272784 1245720 1192440 1113331 1010960 890544 759414 625634 496505 377641
37076C77641j04809q8465p1136n4395m0150l0121k5007k4045k5144k5369k1445
$$ 377641 272832 184367 113231 58836 18686 -11435 -36442 -60487 -85631 -111000 -132445
37065a32445j0497Q952L6075O7475R7882J21651J34490J34895J24554J07553Q8730
$$ -132445 -142942 -133990 -97915 -30440 67442 189093 323583 458478 583032 690585 779315
37054G79315P1960N9158N0361M4561M0770L8530L7752L8289L9782M1757M3575
$$ 779315 851275 910433 960794 1005355 1046125 1084655 1122407 1160696 1200478 1242235 1285810
37043A285810M4232M2440L7324K9326K0379J2901Q128N009N48q444k3458m3512
$$ 1285810 1330042 1372482 1409806 1439132 1459511 1472412 1480540 1485549 1486097 1477653 1454195 1410683
37031A410683o5850q7198j04618j15748j19104j14634j04076r0564p7573o7857
$$ 1410683 1344833 1257635 1153017 1037269 918165 803531 699455 608891 531318 463461
37021D63461o2822o2351o4843o7510o7119o1084m8315k9329n700K0446M6560O9798
$$ 463461 400639 338288 273445 205935 138816 77732 29417 88 -5612 14834 61394 131192
37009A31192Q7677R9064J04555J05698J03469R7111Q4284O2532L1207p444m8757
$$ 131192 218869 317933 422488 528186 631655 728766 813050 875582 906789 899345 850588
36998H50588q7253j18283j38958j48354j47248j37406j20629r8218p1163m0876
$$ 850588 763335 645052 506094 357740 210492 73086 -47543 -145761 -216924 -257800
36988b57800r378K1226M9467P4539R5534J10504J16486J10796R3103O6411L5852
$$ -257800 -267178 -245952 -196485 -121946 -26412 84092 200578 311374 404477 470888 506740
36977E06740N915k1591m7152p1423r3610j11780j24438j31530j33974j32441j26665
$$ 506740 512655 491064 443912 372489 278879 167099 42661 -88869 -222843 -355284 -481949
36966d81949j15883r9924q0039n8804l9193k3524j2892p253n717o656p795o726
$$ -481949 -597832 -697756 -777795 -836599 -875792 -899316 -912208 -919461 -925178 -931834 -939629 -946355
36954i46355j758P518K0459L5959N2731O8976Q2070Q9017Q7557P7264N9812L8451
$$ -946355 -948113 -940595 -920136 -884177 -831446 -762470 -680400 -591383 -503826 -426562 -366750 -328299
36942c28299J7239M32q137o052O584K6875N0123P1535Q7613R6760R9311R7142
$$ -328299 -311060 -310628 -318765 -324817 -318233 -291358 -241235 -169700 -82087 14673 113984 211126
36930B11126R2692Q7644Q2023P4537O3966N0362L5083J9863O000n550j3675j7325
$$ 211126 303818 391462 473485 548022 611988 662350 697433 717296 723296 717746 704071 686746
36918F86746j6610j3654j1919j4284k1567l2663m5959o0637p6855r4841j13586
$$ 686746 670136 656482 644563 630279 608712 576049 530090 469453 392598 297757 184171
36907A84171j30099j39975j39190j26022j01822p0241l5777k622K5863M7202N9715
$$ 184171 54072 -85903 -225093 -351115 -452937 -523178 -558955 -561577 -535714 -488512 -428797
36896d28797O2468N5359L9337J6471j0342l7932o3285q3683r6802j01122r6580
$$ -428797 -366329 -310970 -271633 -255162 -265504 -303436 -366721 -450404 -547206 -648328 -744908
36885g44908q4885o8931n1452l3754j5501M263K5616M6914O5167P7360Q1754P8502
$$ -744908 -829793 -898724 -950176 -983930 -999431 -995168 -969552 -922638 -857471 -780111 -698357 -619855
36873f19855O9442N7383M5184L4864K7015K0862J4941P942q45j1497k3524l5835
$$ -619855 -550413 -493030 -447846 -412982 -385967 -365105 -350164 -342222 -343067 -354564 -378088 -413923
36861d13923m6809n4635n7811n5475m7476l4319j6988L305K5354M7956O9680Q8701
$$ -413923 -460732 -515367 -573178 -628653 -676129 -710448 -727436 -724131 -698777 -650821 -581141 -492440
36849d92440J03042J11225J12878J08924J01250R2092Q3395P6425P1737O9268
$$ -492440 -389398 -278173 -165295 -56371 44879 136971 220366 296791 368528 437796
36839D37796O8438O8064O6463O1982N3834M2604L0022J8262R288M625N327J1890
$$ 437796 506234 574298 640761 702743 756577 799181 829203 847465 856753 861378 866705 878595
36827H78595K3995M0258N8285P5227Q8580R6717R8856R4826Q5017P0468N2628
$$ 878595 902590 942848 1001133 1076360 1164940 1261657 1360513 1455339 1540356 1610824 1663452
36816A663452L2769J1623j0369l2447n3299p1346q5257r4256r8235r7785r4086
$$ 1663452 1696221 1707844 1697475 1665028 1611729 1540383 1455126 1360870 1262635 1164850 1070764
36805A070764q8594q2571p6729p1166o5614n9846n4007m8620m4264m1144l8963
$$ 1070764 982170 899599 822870 751704 686090 626244 572237 523617 479353 438209 399246
36794C99246l7226l5787l5163l6289l9852m5730n3000o0560o7691p4012p8883
$$ 399246 362020 326233 291070 254781 214929 169199 116199 55639 -12052 -86064 -164947
36783a64947q1198q0008p5582o9673o4470o1108n8971n6293n1303m2999l1314
$$ -164947 -246145 -326153 -401735 -471408 -535878 -596986 -655957 -712250 -763553 -806552 -837866
36772h37866j6947j116J4607K8479L8793M4288M4698M1064L5451L0119K6703K5871
$$ -837866 -854813 -855929 -841322 -812843 -774050 -729762 -685064 -644000 -608549 -578430 -551727 -525856
36760e25856K7469L0910L5432M0167M3952M5209M2192L3720J9910K350j6570l4746
$$ -525856 -498387 -467477 -432045 -391878 -347926 -302717 -260525 -226805 -206895 -204545 -221115 -255861
36748b55861n1133o5744p8799q9652r6291r5969q6735o8972m5830k2173k363J1788
$$ -255861 -306994 -372738 -451537 -541189 -637480 -733449 -820184 -889156 -934986 -957159 -959522 -947734
36736i47734K1672L0525M0905N2833O3992P1821P5697P7610Q0810Q7611R7852
$$ -947734 -926062 -895537 -854632 -801799 -737807 -665986 -590289 -512679 -431869 -344258 -246406
36725b46406J09130J18427J23891J25355J23483J18559J09957R6484P7090N1348
$$ -246406 -137276 -18849 105042 230397 353880 472439 582396 678880 755970 807318
36715H07318J9737j6392n5148r4664j33354j69601k01184k25225k39070k41575
$$ 807318 827055 810663 755515 660851 527497 357896 156712 -68513 -307583 -549158
36705e49158k33770k18163j97137j71650j41156j04624o1833j4261L4639P9775
$$ -549158 -782928 -1001091 -1198228 -1369878 -1511034 -1615658 -1677491 -1691752 -1657113 -1577338
36695a577338J15465J36972J41893J30728J06475P3664L7367K509k6550m6429
$$ -1577338 -1461873 -1324901 -1183008 -1052280 -945805 -872141 -834774 -832265 -858815 -905244
36685i05244n5433n4367m6634l7139l0250k7986k9504l2039l2549k9152k1670
$$ -905244 -960677 -1015044 -1061678 -1098817 -1129067 -1157053 -1186557 -1218596 -1251145 -1280297 -1301967
36674a301967j1281K94J1563K1874L1675M2274N4970O9927Q5730J00030J10913
$$ -1301967 -1313248 -1312954 -1301391 -1279517 -1247842 -1205568 -1150598 -1080671 -994941 -894911 -783998
36663g83998J17890J21910J24516J26775J28567J28614J25327J18142J08360R8858
$$ -783998 -666108 -544198 -419682 -292907 -164340 -35726 89601 207743 316103 414961
36653D14961R2577R0824R2612R5536R7499R7850R7042R5288R1622Q4491P3268
$$ 414961 507538 598362 690974 786510 884009 981859 1078901 1174189 1265811 1350302 1423570
36642A423570N9180M4589L1281J9285P165o488k1580l5944m6130m9189m4476l4328
$$ 1423570 1482750 1527339 1558620 1577905 1585070 1578582 1557002 1521058 1474928 1425739 1381263 1346935
36630A346935k3090j5162j3309j8228k9096m4305o1770p8786r2026r8021r4303
$$ 1346935 1323845 1308683 1295374 1277146 1248050 1203745 1141975 1063189 971163 873142 778839
36619G78839q0544n9087l4314j1251N922J4709J4418N916q827k7274m7055o6508
$$ 778839 698295 639208 604894 593643 599565 614274 628692 634608 625781 598507 551452 484944
36607D84944q4900j02145j18408j33848j48696j63274j77682j91040k01004k04248
$$ 484944 400044 297899 179491 45643 -103053 -266327 -444009 -635049 -836053 -1040301
36597a040301j97979j81400j56203j25942r5004o7536m6388l2085k2491j3601
$$ -1040301 -1238280 -1419680 -1575883 -1701825 -1796829 -1864365 -1910753 -1942838 -1965329 -1978930
36587a978930j231J7273M1878O9589R5172J12777J18022J09523Q9347O2300L4447
$$ -1978930 -1980161 -1962888 -1921010 -1851421 -1756249 -1643472 -1525450 -1415927 -1326580 -1264280 -1229833
36576a229833J1174m615j3423j8448k3431l0179l7344m1317l8518k7550r697J2261
$$ -1229833 -1218659 -1223274 -1236697 -1255145 -1278576 -1308755 -1346099 -1387416 -1425934 -1453484 -1463181 -1450920
36564a450920L5815N9640Q3200J05576J24544J36763J38911J28988J06911P4370
$$ -1450920 -1415105 -1355465 -1272265 -1166689 -1042145 -905382 -766471 -637483 -530572 -456202
36554d56202L4431q735n0183q4916j08811j19421j16443j01917q0059n6403l6386
$$ -456202 -421771 -430506 -480689 -565605 -674416 -793837 -910280 -1012197 -1092256 -1148659 -1185045
36543a185045k3816j9915k3412l1517m1240n0118n6073n7112n1666l9597k2719
$$ -1185045 -1208861 -1228776 -1252188 -1283705 -1324945 -1375063 -1431136 -1488248 -1539914 -1579511 -1602230
36532a602230m123J3180K7176L6822M1642M1627L7587L1584K6824K6687L3104
$$ -1602230 -1606353 -1593173 -1565997 -1529175 -1487533 -1445906 -1408319 -1376735 -1349911 -1323224 -1290120
36521a290120M5317O0182P4083Q5045R3400J00460J06381J09053J04921R1149
$$ -1290120 -1244803 -1184621 -1110538 -1025493 -932093 -831633 -725252 -616199 -511278 -420129
36511d20129O7494L6529K269l1482o1856q6646j03872j11927j10145r9134q0687
$$ -420129 -352635 -316106 -313837 -345319 -407175 -493821 -597693 -709620 -819765 -918899 -999586
36500i99586n7542l3233j1798L170R888R136L609l549r751j2928j1090k644J2545
$$ -999586 -1057128 -1090361 -1102159 -1098989 -1089101 -1079965 -1076356 -1079905 -1089656 -1102584 -1113674 -1116318 -1103773
36487a103773L2363N2850O9779Q0674Q6071Q9287R4550J04555J18834J33904J44840
$$ -1103773 -1071410 -1018560 -948781 -868107 -782036 -692749 -598199 -493644 -374810 -240906 -96066
36476i6066J47136J37968J16695Q5014M6783P257k8363n6446p5590q6131q9114
$$ -96066 51070 189038 305733 390747 437530 444787 416424 359978 284388 198257 109143
36465A09143q5610p6507o2528m4515k4006l665J3212K4102K8579K8448K6817K6922
$$ 109143 23533 -52974 -115502 -160017 -184023 -187688 -174476 -150374 -121795 -93347 -66530 -39608
36453c9608L1256M0955N5450P2506Q8787J00604J04548R7985P9668N0465J3882
$$ -39608 -8352 32603 88053 160559 249346 349950 454498 552483 632151 682616 696498
36442F96498k4217n7047p9121q8199q5698p5441o1710m7836l5811k6477j9711
$$ 696498 672281 615234 536113 447914 362216 286775 225065 177229 141418 114941 95230
36431I5230j4513r419l226M293J2240J9026K3045K3394K0562J6801J5614K0197
$$ 95230 80717 71298 68072 72365 84605 103631 126676 150070 170632 187433 203047 223244
36419B23244L1773M8985O8694Q7398J02193J11211J13705J10030J01360Q9145
$$ 223244 255017 304002 372696 460094 562287 673498 787203 897233 998593 1087738
36409A087738P4526N7988L9425J8655l681k5488m3480n4519n7256n2947m4894
$$ 1087738 1162264 1220252 1259677 1278332 1274651 1249163 1205683 1151164 1093908 1040961 996067
36398I96067l6966l2180l2032l6549m4581n4044o2223o6410o4671n6397m2346
$$ 996067 959101 926921 894889 858340 813759 759715 697492 631082 566411 510014 467668
36387D67668k4347m876J3399K8181L7913M1698L8838K8597J0564j4673m5087p7342
$$ 467668 443321 438445 451844 480025 517938 559636 598474 627071 637635 622962 577875 500533
36375E00533j07272j30644j44033j45787j36567j19275r8446p9183o5729o0016
$$ 500533 393261 262617 118584 -27203 -163770 -283045 -381491 -460674 -526403 -586419
36365e86419o0983o5155o8192o6413n7480m0412j5477J5714N0024Q3056J10079
$$ -586419 -647402 -712557 -780749 -847162 -904642 -945054 -960531 -944817 -894793 -811737 -701658
36354g01658J27439J33828J30675J21454J10295J00592R4238R1577R1669R2536
$$ -701658 -574219 -440391 -309716 -188262 -77967 22625 116863 208440 300109 392645
36344C92645R1362Q5073P1343M9507K0851j1774m4608p3799r6384j11050j18141
$$ 392645 484007 569080 640423 689930 710781 699007 654399 580600 484216 373166 255025
36333B55025j18931j14971j08080j00668r5488r4704r8751j05762j11823j12019
$$ 255025 136094 21123 -86957 -187625 -283113 -377817 -476568 -582330 -694153 -806172
36323h06172j02055p9906m6735o491L5588P4609J06832J29524J40719J39652J27583
$$ -806172 -908227 -988133 -1034868 -1041359 -1005771 -931162 -824330 -694806 -554087 -414435 -286852
36312b86852J07982Q5567O4827M9042M0055L8249M2415M9860N7004O0334N7231
$$ -286852 -178870 -93303 -28476 20566 60621 98870 141285 191145 248149 308483 365714
36301C65714M6516K8748O284j7261l8151n3838o3442o7132o4966n6466m1383k0983
$$ 365714 412230 440978 447262 430001 391850 338012 274570 207438 142472 86006 44623 23640
36289B3640J341K0631L1736L0809J6413j0029m4668q2372j17974j47030j66105
$$ 23640 24981 45612 77348 108157 124570 114541 69873 -12499 -130473 -277503 -443608
36278d43608j72768j65670j44850j12134p1282k7595J3074M5529O6246P3986O9919
$$ -443608 -616376 -782046 -926896 -1039030 -1110312 -1137907 -1124833 -1079304 -1013058 -939072 -869153
36267h69153N7157L9913K2721R959N424J1524K8312N3085Q1155J07376J27602
$$ -869153 -811996 -772083 -749362 -739403 -733979 -722455 -694143 -641058 -559903 -452527 -324925
36256c24925J39367J41885J35634J21953J02661P9900N6054L3727J5520L528j467
$$ -324925 -185558 -43673 91961 213914 316575 396475 452529 486256 501776 505304 503837
36245E03837n06L812Q509J1624J3003J3953J6263K1250K9311L9839N1125O0303
$$ 503837 503331 507143 515652 527276 540279 554232 570495 591745 621056 660895 712020 772323
36233G72323O3696N8049M2129J7828j0207l6369n6358o8684p4635p6867p7511
$$ 772323 836019 894068 936197 954025 943818 907449 851091 782407 707772 630905 553394
36222E53394p6927p3797o6297n3501l6189j6781J456J5574K4035K7159K6786K5322
$$ 553394 476467 402670 336373 282872 246683 229902 231358 246932 270967 298126 324912 350234
36210C50234K4856K6674L1135L7727M5277N2305N7395N9367N7278N0507L9102
$$ 350234 375090 401764 432899 470626 515903 568208 625603 684970 742248 792755 831857
36199H31857K4200Q113o290j6717k2489k4695k5250k5602k6086k6346k6246k6336
$$ 831857 856057 864170 857880 841163 818674 793979 768729 743127 717041 690695 664449 638113
36187F38113k7596l0785l5999m2499m8742n2629n2033m5528l2913j5416M477K3444
$$ 638113 610517 579732 543733 501234 452492 399863 347830 302302 269389 253973 258450 281894
36175B81894L8171M6533M8655M6953M4915M5319M9074N5365O2590O9024P2758
$$ 281894 320065 366598 415253 462206 507121 552440 601514 656879 719469 788493 861251
36164H61251P1500O3028M6308K2208o889l8173o9141r7628j21704j39919j51714
$$ 861251 932751 995779 1042087 1064295 1057406 1019233 950092 852464 730760 590841 439127
36153D39127j57553j58673j56598j52382j45749j35037j18531r6441p1729m8814
$$ 439127 281574 122901 -33697 -186079 -331828 -466865 -585396 -681837 -753566 -802380
36143h02380l1257k0303j5166j4261j6177j9829k4065k7334k7692k3263j2779
$$ -802380 -833637 -853940 -869106 -883367 -899544 -919373 -943438 -970772 -998464 -1021727 -1034506
36132a034506M040K6447N2880Q1269J09426J35319J57149J73251J82079J82415
$$ -1034506 -1030466 -1004019 -951139 -869870 -760444 -625125 -467976 -294725 -112646 69769
36122F9769J73848J57188J34681J09578Q5102O3312M4633K8325J3373r15j4637
$$ 69769 243617 400805 535486 645064 730166 793478 838111 866436 879809 878894 864257
36111H64257k6948l5843l8755l4215k3431j0166J254Q150J0290R185P021O154
$$ 864257 837309 801466 762711 728496 705065 694899 696153 704303 714593 723778 730799 736953
36099G36953Q865J6747K9993M7304O6796Q7121J07693J27875J46004J59190J64020
$$ 736953 745818 762565 792558 839862 906658 993779 1101472 1229347 1375351 1534541 1698561
36088A698561J57480J37744J04917O1709J3445l3129p2128j00603j19305j31679
$$ 1698561 1856041 1993785 2098702 2160411 2173856 2140727 2068599 1967996 1848691 1717012
36078A717012j41680j51536j60635j66147j65017j55937j40101j20395r9926q0889
$$ 1717012 1575332 1423796 1263161 1097014 931997 776060 635959 515564 415638 334749
36068C34749o4164m9435l5569k1101m658J4939L8673O7028R9112J31969J61173
$$ 334749 270585 221150 185581 164480 159822 174761 213434 280462 379574 511543 672716
36057F72716J82778J95358K00379K00669J98270J93235J83951J68146J43904J10405
$$ 672716 855494 1050852 1251231 1451900 1650170 1843405 2027356 2195502 2339406 2449811
36047B449811O8609K1668k5498o7632j00829j23334j35236j37709j32657j22557
$$ 2449811 2518420 2540088 2514590 2446958 2346129 2222795 2087559 1949850 1817193 1694636
36037A694636j10079r7396q5787p5808o7662o1337n6558n2953n0346m8805m8215
$$ 1694636 1584557 1487161 1401374 1325566 1257904 1196567 1140009 1087056 1036710 987905 939690
36026I39690m7810m6203m2260l6162k9776k5710k5756k9987l7180m5931n5276
$$ 939690 891880 845677 803417 767255 737479 711769 686013 656026 618846 572915 517639
36015E17639o4433p2302p7469p8766p5805o8975n8883m5923l0388j3091M348J9962
$$ 517639 453206 380904 303435 224669 148864 79889 21006 -24917 -55305 -68396 -64048 -44086
36003d4086L2335M0962M5891M7076M4221L7093K5996J2113k450j5027k3084k5024
$$ -44086 -11751 29211 75102 122178 166399 203492 229488 241601 239151 224124 201040 176016
35991A76016k0703j1578m84R130J4498J5008J2841J2064J6364K6778M0847N3867
$$ 176016 155313 143735 143251 152381 166879 181887 194728 206792 223156 249934 290781 344648
35979C44648O1440O1709N6055M8110M2026M0915M5948N6031O8050P7920Q2192
$$ 344648 406088 467797 523852 571962 613988 654903 700851 756882 824932 902852 985044
35968I85044P9683P2086O3150N6788N5063N7066N9159N6568M5563K5236k122l2164
$$ 985044 1064727 1136813 1199963 1256751 1311814 1368880 1428039 1484607 1530170 1555406 1553284 1521120
35956A521120o0392q3667j00639j11318j16520j17564j16017j13064j08683j01408
$$ 1521120 1460728 1377061 1276422 1165104 1048584 931020 815003 701939 593256 491848
35946D91848q9276p1510m9592k6859o956P676J6289J9395J8052J3268N619m974
$$ 491848 402572 331062 281470 254611 247655 255331 271620 291015 309067 322335 327954 322980
35934C22980j9119l7332n9144q2481j03696j18342j22454j13830r2859o2371k6589
$$ 322980 303861 266529 207385 124904 21208 -97134 -219588 -333418 -426277 -488648 -515237
35923e15237J0157M4329P3410R5759J10518J17624J17743J12130J02431R0599
$$ -515237 -505080 -460751 -387341 -291582 -181064 -63440 54303 166433 268864 359463
35913C59463P8706O8456O0471N3927M6907L7337K3884O335j4390l6371n6993p3543
$$ 359463 438169 506625 567096 621023 667930 705267 729151 735486 721096 684725 627732 554189
35901E54189q3857q6709q1906p0242n3308l3042j1270J0364L0010M5381N4178
$$ 554189 470332 383623 301717 231475 178167 145125 133855 144219 174229 219610 273788
35890B73788N4929M7547L3391J4843n268k4211l9731n0261n5158n4867n0738m4308
$$ 273788 328717 376264 409655 424498 419230 395019 355288 305027 249869 195002 144264 99956
35878I9956l6502k7395j6829n420M755J0508R044k28j4813l0146m1740m6993m5642
$$ 99956 63454 36059 19230 13810 18565 29073 38117 37889 23076 -7070 -48810 -95803 -141445
35865a41445l9144k9644j9072q571J456J0728J8556K3988K6566K6936K6786K8072
$$ -141445 -180589 -210233 -229305 -237876 -236420 -225692 -207136 -183148 -156582 -129646 -102860 -74788
35853g4788L2008L8461M6165N3585N9699O4103O6623O6976O4863O0185N3074M3852
$$ -74788 -42780 -4319 41846 95431 155130 219233 285856 352832 417695 477880 530954 574806
35841E74806L3113K1965J2132N744M841J0804K3881M2923O5395Q7630J05364J14667
$$ 574806 607919 629884 642016 647760 652601 663405 687286 730209 795604 883234 988598 1103265
35829A103265J13037J00226P8240N0502K0723p800l2343n0764o1681o4728o0457
$$ 1103265 1216302 1316528 1394768 1445270 1465993 1458193 1425850 1375086 1313405 1248677 1188220
35818A188220n0037l5039j7627o38J2850K0487K1467J6537P231n103j9687l6001
$$ 1188220 1138183 1103144 1085517 1084879 1097729 1118216 1139683 1156220 1163451 1158348 1138661 1102660
35806A102660n3152o9561q3079r1268r1647q2294o2930l6011o835J7819L2063
$$ 1102660 1049508 979947 896868 805600 713953 631659 568729 532718 525883 543702 575765
35795E75765L3144K2459M793j3725k7797l3886l0027j5426R000L9651P0182R3243
$$ 575765 608909 631368 636161 622436 594639 560753 530726 515300 524300 563951 634133 727376
35783G27376J03216R8238Q0292N3708K3505n499k8924m3071m5590l6182j6861
$$ 727376 830592 928830 1009122 1062830 1086335 1080836 1051912 1008841 963251 927069 910208
35772I10208Q420L4677N7201P2876Q0997Q3206Q2464Q1436Q0880P8926P1851N6130
$$ 910208 918628 953305 1010506 1083382 1164379 1247585 1330049 1411485 1492365 1571291 1643142 1699272
35760A699272L0554k731l8669p0840r3482j03441j01167r0107p4781n8739m3646
$$ 1699272 1729826 1727095 1688426 1617586 1524104 1420663 1319496 1229389 1154608 1095869 1052223
35749A052223k9748j7075o468K25R15n472j8147l4491n0865o3719p0531p0298
$$ 1052223 1022475 1005400 998932 999157 1000072 994600 976453 941962 891097 827378 756847 686549
35737F86549o3379n0748l3188j0985J5826M6980Q1575J17751J52433J81350J99642
$$ 686549 623170 572422 539234 528249 544075 591055 672630 790381 942814 1124164 1323806
35726A323806K03191J90315J62963J26468Q7652N2226K3148P05j6196k8812l8106
$$ 1323806 1526997 1717312 1880275 2006743 2094395 2146621 2169769 2170474 2154278 2125466 2087360
35715B087360m4881m9876n3616n6143n6921n4990m9274l8979k4026n353J5236
$$ 2087360 2042479 1992603 1938987 1882844 1825923 1770933 1721659 1682680 1658654 1653301 1668537
35704A668537L5742N4729P1476Q5378R5133R8582R3516P9045N6651L0181M541
$$ 1668537 1704279 1759008 1830484 1915862 2010995 2109577 2203093 2282138 2338789 2368970 2373511
35693B373511j6214l0354l8812m4547n1379o2511p8966r8627j16885j28772j31252
$$ 2373511 2357297 2326943 2288131 2243584 2192205 2129694 2050728 1952101 1835216 1706444 1575192
35682A575192j24098j09302q9976o9629n1614l8263k9922k4672j9160j0082M428
$$ 1575192 1451094 1341792 1251816 1182187 1130573 1092310 1062388 1037716 1018556 1008474 1012902
35671A012902K4040M6126O6338P9875Q3055P4554N5597K9230q00l0783n7360p7751
$$ 1012902 1036942 1083068 1149406 1229281 1312336 1386890 1442487 1471717 1470917 1440134 1382774 1305023
35659A305023r0210r4475r1656q3449p1267n6055l8904k1516n838O876J6583K3901
$$ 1305023 1214813 1120338 1028682 945233 873966 817911 779007 757491 751653 758529 775112 799013
35647G99013K9018L1019K8184J8966L125j7638l9826n9132p1839p6107p2451o3238
$$ 799013 828031 859050 887234 906200 909325 891687 851861 792729 720890 644783 572332 509094
$$ [...]
##END NTUPLES=NMR SPECTRUM
##END=
