##TITLE=31Pdec_DE-47rm
 
 24 sc
 10.4.2024
##JCAMPDX= 6.0         $$ Bruker NMR JCAMP-DX V2.0
##DATA TYPE= NMR SPECTRUM
##DATA CLASS= NTUPLES
##ORIGIN= UXNMR, Bruker Analytische Messtechnik GmbH
##OWNER= root
$$ XWIN-NMR		Version 3.5
$$ Thu Apr 11 15:44:12 2024 Russian Standard Time (UT+4h)  she@DPX200
##.OBSERVE FREQUENCY= 81.013821
##.OBSERVE NUCLEUS= ^31P
##.ACQUISITION MODE= SIMULTANEOUS
##.ACQUISITION SCHEME= undefined
##.AVERAGES= 24
##.DIGITISER RES= 16
##SPECTROMETER/DATA SYSTEM= spect
##.PULSE SEQUENCE= zgpg30
##.SOLVENT NAME= CDCl3
##.SHIFT REFERENCE= (INTERNAL, CDCl3, 0, 248.564)
##AUDIT TRAIL= $$ (NUMBER, WHEN, WHO, WHERE, WHAT)
$$ ##TITLE= Audit trail, XWIN-NMR		Version 3.5
$$ ##JCAMPDX= 5.01
$$ ##ORIGIN= Bruker BioSpin GmbH
$$ ##OWNER= she
$$ F:/spectra/data/she/nmr/P31/1/pdata/1/auditp.txt
$$ ##AUDIT TRAIL=  $$ (NUMBER, WHEN, WHO, WHERE, WHAT)
(   1,<2024-04-11 15:42:45.23 +0400>,<she>,<DPX200>,
      <created by zg, POWCHK disabled, PULCHK disabled
       configuration hash MD5:
       00 E9 B6 7A A2 85 ED C7 34 08 36 98 17 FE 4E 26
       data hash MD5: 32K
       A9 F4 5A 83 CA 96 29 AD B3 58 20 79 32 CA 95 F1>)
(   2,<2024-04-11 15:43:03.57 +0400>,<she>,<DPX200>,
      <Start of raw data processing
       efp BC_mod = 2 LB = 10 FT_mod = 6 PKNL = 1 PHC0 = -13456.26 PHC1 = 627.6829 SI = 64K 
       data hash MD5: 64K
       7B 63 B3 E6 A9 D2 03 A3 87 47 47 65 C7 C4 D7 B5>)
(   3,<2024-04-11 15:43:28.87 +0400>,<she>,<DPX200>,
      <pk PHC0 = 197.0589 PHC1 = -447.9999 
       data hash MD5: 64K
       62 CA 27 D9 9C 1A 60 85 13 F1 AC 93 E2 18 B6 C5>)
(   4,<2024-04-11 15:43:33.21 +0400>,<she>,<DPX200>,
      <abs ABSG = 5 
       data hash MD5: 64K
       85 3D 25 B7 FD BF B4 40 55 33 F4 F5 BB D9 45 08>)
$$ ##END=
$$ 
$$ hash MD5
$$ 36 AF 12 9D 21 78 32 DB F7 22 64 90 9A 97 DF 70
##$RELAX= 
##$RELAX= 
##$RELAX= 
##$RELAX= 
##$RELAX= 
##$RELAX= 
##$RELAX= 
##$RELAX= 
##$RELAX= 
$$ Bruker specific parameters
$$ --------------------------
##$DU= <F:/spectra>
##$EXPNO= 1
##$NAME= <P31>
##$PROCNO= 1
##$TYPE= <nmr>
##$USER= <she>
##$AMP= (0..31)
100 100 100 100 100 100 100 100 100 100 100 100 100 100 100 100 100 100 
100 100 100 100 100 100 100 100 100 100 100 100 100 100 
##$AQSEQ= 0
##$AQ_mod= 1
##$AUNM= <au_zg>
##$AUTOPOS= <>
##$BF1= 81.014009
##$BF2= 200.13
##$BF3= 200.13
##$BF4= 200.13
##$BF5= 200.13
##$BF6= 200.13
##$BF7= 200.13
##$BF8= 200.13
##$BYTORDA= 1
##$CFDGTYP= 0
##$CFRGTYP= 5
##$CHEMSTR= <none>
##$CNST= (0..31)
1 1 145 1 1 1 1 1 1 1 1 1 1 1 1 1 1 1 1 1 1 1 1 1 1 1 1 1 1 1 1 1 
##$CPDPRG= <waltz16>
##$CPDPRG1= <>
##$CPDPRG2= <waltz16>
##$CPDPRG3= <>
##$CPDPRG4= <mlev>
##$CPDPRG5= <mlev>
##$CPDPRG6= <mlev>
##$CPDPRG7= <mlev>
##$CPDPRG8= <mlev>
##$CPDPRGB= <>
##$CPDPRGT= <>
##$D= (0..31)
0 1 0 0 0 0 0 0 0 0 0 0.03 2e-05 3e-06 0 0 0 0 0 0 0 0 0 0 0 0 0 0 0 0 
0 0 
##$DATE= 1712835764
##$DBL= (0..7)
120 120 120 11 120 120 24 19 
##$DBP= (0..7)
150 150 150 150 150 150 150 150 
##$DBP07= 0
##$DBPNAM0= <>
##$DBPNAM1= <>
$$ [...]
##$SUBNAM3= <"">
##$SUBNAM4= <"">
##$SUBNAM5= <"">
##$SUBNAM6= <"">
##$SUBNAM7= <"">
##$SUBNAM8= <"">
##$SUBNAM9= <"">
##$SW= 501.771253377433
##$SWIBOX= (0..15)
0 1 3 0 0 0 0 0 0 0 0 0 0 0 0 0 
##$SW_h= 40650.406504065
##$TD= 32768
##$TD0= 1
##$TE= 0
##$TE2= 300
##$TE3= 300
##$TEG= 300
##$TL= (0..7)
0 120 53 12 22 120 120 120 
##$TP= (0..7)
150 150 150 150 150 150 150 150 
##$TP07= 0
##$TPNAME0= <>
##$TPNAME1= <>
##$TPNAME2= <>
##$TPNAME3= <>
##$TPNAME4= <>
##$TPNAME5= <>
##$TPNAME6= <>
##$TPNAME7= <>
##$TPOAL= (0..7)
0.5 0.5 0.5 0.5 0.5 0.5 0.5 0.5 
##$TPOFFS= (0..7)
0 0 0 0 0 0 0 0 
##$TUNHIN= 0
##$TUNHOUT= 0
##$TUNXOUT= 0
##$USERA1= <user>
##$USERA2= <user>
##$USERA3= <user>
##$USERA4= <user>
##$USERA5= <user>
##$V9= 5
##$VALIST= <valist>
##$VCLIST= <CCCCCCCCCCCCCCC>
##$VD= 0
##$VDLIST= <DDDDDDDDDDDDDDD>
##$VPLIST= <PPPPPPPPPPPPPPP>
##$VTLIST= <TTTTTTTTTTTTTTT>
##$WBST= 1024
##$WBSW= 4
##$XGAIN= (0..3)
0 0 0 0 
##$XL= 0
##$YL= 0
##$YMAX_a= 14054
##$YMIN_a= -10637
##$ZGOPTNS= <>
##$ZL1= 120
##$ZL2= 120
##$ZL3= 120
##$ZL4= 120
##$ABSF1= 248.5645
##$ABSF2= -253.2056
##$ABSG= 5
##$ABSL= 3
##$ALPHA= 0
##$AQORDER= 0
##$ASSFAC= 0
##$ASSFACI= 0
##$ASSFACX= 0
##$ASSWID= 0
##$AUNMP= <proc_1d>
##$AZFE= 0.1
##$AZFW= 0.5
##$BCFW= 0
##$BC_mod= 2
##$BYTORDP= 0
##$COROFFS= 0
##$CY= -3
##$DATMOD= 1
##$DC= 0
##$DFILT= <>
##$DTYPP= 0
##$F1P= 0
##$F2P= 0
##$FCOR= 1
##$FTSIZE= 65536
##$FT_mod= 6
##$GAMMA= 0
##$GB= 0
##$INTBC= 1
##$INTSCL= 6.047779e-11
##$ISEN= 30
##$LB= 10
##$LEV0= 0
##$LPBIN= 0
##$MAXI= 10000
##$MC2= 0
##$MEAN= 0
##$ME_mod= 0
##$MI= 50
##$NCOEF= 0
##$NC_proc= -7
##$NLEV= 6
##$NOISF1= 182.463
##$NOISF2= 159.3651
##$NSP= 0
##$NTH_PI= 0
##$NZP= 0
##$OFFSET= 248.5645
##$PC= 4
##$PHC0= -13259.2
##$PHC1= 179.683
##$PH_mod= 1
##$PKNL= yes
##$PPARMOD= 0
##$PSCAL= 0
##$PSIGN= 0
##$REVERSE= no
##$SF= 81.0140089999694
##$SI= 65536
##$SIGF1= 159.3651
##$SIGF2= -187.1042
##$SINO= 113.3802
##$SIOLD= 16384
##$SREGLST= <1H.CDCl3>
##$SSB= 0
##$STSI= 65536
##$STSR= 0
##$SW_p= 40650.406504065
##$SYMM= 0
##$S_DEV= 0
##$TDeff= 32768
##$TDoff= 0
##$TI= <>
##$TILT= no
##$TM1= 0
##$TM2= 0
##$TOPLEV= 0
##$USERP1= <user>
##$USERP2= <user>
##$USERP3= <user>
##$USERP4= <user>
##$USERP5= <user>
##$WDW= 1
##$XDIM= 65536
##$YMAX_p= 283044609
##$YMIN_p= -6107463
$$ End of Bruker specific parameters
$$ ---------------------------------
##NTUPLES= NMR SPECTRUM
##VAR_NAME=  FREQUENCY,     SPECTRUM/REAL,   SPECTRUM/IMAG
##SYMBOL=    X,             R,               I
##VAR_TYPE=  INDEPENDENT,   DEPENDENT,       DEPENDENT
##VAR_FORM=  AFFN,          ASDF,            ASDF
##VAR_DIM=   65536,         65536,           65536
##UNITS=     HZ,            ARBITRARY UNITS, ARBITRARY UNITS
##FACTOR=    0.620285442955139, 1,           1
##FIRST=     20137.2065510682, 0,            0
##LAST=      -20513.1999529968, 0,           0
##MIN=       -20513.1999529968, -6107463,    0
##MAX=       20137.2065510682, 283044609,    0
$$ Real data points
##PAGE= N=1
##DATA TABLE= (X++(R..R)), XYDATA
$$ [...]
41661B79481K9253K0849Q357n858j9289l0243l8289m3779m6882m6797m1883l0791
41649C4129j4009N387K2561L3016L4437K7138J3129n029k4919m4425o1769p5479
41637e5833q4343q7557q5215p8840p1364o6251o6117p1445q0079q7876r0362q4553
41625a009835o9901m7908k1091P778L5814O0149P8559R0284R6332R8945J00558
41614e80316J02950J06868J12094J17512J21016J19444J08996Q6409N0682M351
41604C50006m6502r3666j29046j47013j46144j29837j05261q0705o2520n3393
41594f44081n2814n8859o9723q4028j00306j16571j30288j38619j38812j28867
41584a662968j08464p9716m7118j6446O992J9864K1557J3945N89j4309k7044l5326
$$ y = [279481, 308734, 329583, 337940, 332082, 312793, 282550, 244261, 200482, 153600, 106803, 64920, 34129, 20120, 25507, 48068, 81084, 115521, 142659, 155788, 150759, 125840, 81415, 19646, -55833, -140176, -227733, -312948, -391788, -463152, -529403, -595520, -666965, -747044, -834920, -925282, -1009835, -1079736, -1127644, -1148735, -1140957, -1105143, -1044994, -966435, -876151, -779819, -680874, -580316, -477366, -370498, -258404, -140892, -19876, 99568, 208564, 294973, 345655, 350006, 303504, 209838, 80792, -66221, -212365, -342202, -447463, -528168, -590688, -644081, -696895, -755754, -825477, -909505, -1009811, -1126382, -1256670, -1395289, -1534101, -1662968, -1771432, -1851148, -1898266, -1914712, -1907720, -1887856, -1866299, -1852354, -1851765, -1866074, -1893118, -1928444]
41572a928444l8751l8549l6671l4667l2972l0970k7722k2790j6541r891l867O06
41560b221229K647J362l971j3510k6406m0532n2736n9664n8919m9934l4053j3806
41548b570751Q110K9556M9054O5607P8616Q8106R4973J00821J07345J15594J25545
41537a707424J36282J46604J55658J63230J69508J74605J78128J79116J76471
41528b27822J69601J58802J44977J28880J10759R0620O8773M6030K3519K627j5011
41517G01755k7810l4966l7064l5872l3617l2282l3287l7233m3607n0786n6536
41506B78695n8876n6562m9051l6237j8378L794K9083N5997Q2876J07847J28961
41495D68149J44759J54874J60174J62272J62938J63601J64809J65406J62193J50922
$$ y = [-1928444, -1967195, -2005744, -2042415, -2077082, -2110054, -2141024, -2168746, -2191536, -2208077, -2217968, -2221835, -2221229, -2218582, -2217220, -2221191, -2234701, -2261107, -2301639, -2354375, -2414039, -2472958, -2522892, -2556945, -2570751, -2562641, -2533085, -2484031, -2418424, -2339808, -2251702, -2156729, -2055908, -1948563, -1832969, -1707424, -1571142, -1424538, -1268880, -1105650, -936142, -761537, -583409, -404293, -227822, -58221, 100581, 245558, 374438, 485197, 575817, 644590, 690620, 714139, 716766, 701755, 673945, 638979, 601915, 566043, 532426, 500144, 466857, 429624, 386017, 335231, 278695, 219819, 163257, 114206, 77969, 59591, 63385, 92468, 148465, 231341, 339188, 468149, 612908, 767782, 927956, 1090228, 1253166, 1416767, 1581576, 1746982, 1909175, 2060097]
41485B060097J28464R4816N3367R231l3025p0601j02060j26114j41116j45807
41475A727252j40605j28185j12636r7775q5786p7034p0831o6254o2274n7488n0222
41464G78162l9347k5037q770P360K1142L0331L2767K7061J3486n725k6882m5911
41452G58637n9412o5497o4087n6539m4831l0933j6674l926N486J0200R728M393
41440D46545n025j7548l1864m6133n8147o5994o8852o7350o3233n8449n4213n0546
41428a40809m6704m2094l7061l2826l0556l0121k9477k5228j4277M459K9206N5943
41416c39545P9928R7281J05872J05368R6760Q1835O2915M2635K3496P151n954
41405C57742j6114k3397k7072k5892j8777n269J4293L8408O3981Q6447J00983
$$ y = [2060097, 2188561, 2283377, 2336744, 2345975, 2312950, 2242349, 2140289, 2014175, 1873059, 1727252, 1586647, 1458462, 1345826, 1248051, 1162265, 1085231, 1014400, 948146, 885872, 828384, 778162, 738815, 713778, 705008, 712368, 733510, 763841, 796608, 823669, 837155, 831430, 804548, 758637, 699225, 633728, 569641, 513102, 468271, 437338, 420664, 416738, 422224, 432424, 442152, 446545, 441520, 423972, 392108, 345975, 287828, 221834, 152982, 85632, 22399, -36050, -90263, -140809, -187513, -229607, -266668, -299494, -330050, -360171, -389648, -414876, -429153, -424694, -395488, -339545, -259617, -162336, -56464, 48904, 145664, 227499, 290414, 333049, 356545, 363696, 357742, 341628, 318231, 291159, 265267, 246490, 241221, 255514, 293922, 357903, 444350, 545333]
41394E45333J04357R6329P9735N9027L8087J8556k01j9505l9400n7814p1303p6556
41382F76645p1630n6360l2220j976L0762O2119Q8628J07614J17176J15986J03401
41371A140145Q0086M8568J3200k0662m7896o4931p0743o7023n7232m4930l2465
41360H76117k0722r701P81J0633J9251K5474K7903K5565J8590Q516j996r813j2168
41347I58430p512L898J9789L6396M9635N6397N5272M6429L1104J1210j0875l2598
41335A217575n1598o5913p3867p4087o5815m9473k6964j564K2686M1807N2857
41324I25644N4843M9261L9735L0556K4585K1925K0210J6237P641o465k5759m9120
41312A109293p4737j00172j22746j40319j51907j57494j57094j49893j34488j10250
$$ y = [545333, 649690, 746019, 825754, 884781, 922868, 941424, 941223, 921718, 882318, 824504, 753201, 676645, 605015, 548655, 516435, 514459, 545221, 607340, 695968, 803582, 920758, 1036744, 1140145, 1220231, 1268799, 1281999, 1261337, 1213441, 1148510, 1077767, 1010744, 953512, 908582, 876117, 855395, 845694, 846475, 857108, 876359, 901833, 929736, 955301, 973891, 982407, 980411, 970598, 958430, 950918, 954816, 974605, 1011001, 1060636, 1117033, 1172305, 1218734, 1249838, 1261048, 1250173, 1217575, 1165977, 1100064, 1026197, 952110, 886295, 836822, 809858, 808294, 830980, 872787, 925644, 980487, 1029748, 1069483, 1100039, 1124624, 1146549, 1166759, 1182996, 1190637, 1184172, 1158413, 1109293, 1034556, 934384, 811638, 671319, 519412, 361918, 204824, 54931, -79557, -189807]
41302a89807p8751m3947j0837J6546L6594N0365O0607P0168Q0586R1472J00865
41291A83861J06233J05598R8445Q6054P1134N6879M5704L8245L3139K7680J8996
41280H71968N122j4503l9085o6810r5133j20933j40686j50868j48774j33528j06780
41269a40010p2621l6752n198J7192K8033K8004K0227Q810k624j1554j6507j6888
41257a99888j2999n858L373J3895K5184L6412M6078N2417N4356N2288M8023M3813
41245A57094M0755L7750L1930K0692L836j5922l4562m9038n8412o3251o4236o1244
41233e4608n3519m0497k2678j913J9033L7485N1804O1584O6863O7080O0880M7300
41221B38814K7390M751j5569k8986l2709k6046j0011J3261M1171P1191J00950
$$ y = [-189807, -268558, -312505, -323342, -306796, -270202, -219837, -159230, -89062, -8476, 82996, 183861, 290094, 395692, 494137, 580191, 651325, 708204, 753908, 792153, 825292, 852972, 871968, 877090, 862587, 823502, 756692, 661559, 540626, 399940, 249072, 100298, -33230, -140010, -212631, -249383, -254581, -237389, -209356, -181352, -161125, -152315, -154939, -166493, -183000, -199888, -212887, -218745, -215372, -201477, -176293, -139881, -93803, -41386, 12970, 65258, 113281, 157094, 197849, 235599, 267529, 288221, 292057, 276135, 241573, 192535, 134123, 70872, 6636, -54608, -108127, -148624, -171302, -173215, -154182, -116697, -64893, -3309, 63554, 130634, 191514, 238814, 266204, 270955, 255386, 226400, 193691, 167645, 157634, 170895, 212066, 283257, 384207]
41210C84207J27837J48776J60892J62895J56155J44445J32435J23935J20760J22423
41200A784760J26557J29958J29821J24614J13941R7945P7145N2922K7856N146
41190B670665j2587k4124k9774l1000k9816k7830k5215k0468j1356L535K3740
41179B485770M6850O9177Q6822R6956R8954R4680Q7483Q0417P4821P0050O4279
41168C356259N5556M2487K4404J348k5764n4838q2559j04870j17907j19000j07375
41157B867741q4491n3921k0692R941L3858M8963N5426N5530N3226N3141N8982
41146C077704P2038R0789J11919J31894J47954J58128J60858J54945J40008J16964
41136D363201Q8021N6209K4823k966k4520l8127m3179l9874k8919j1758Q833K8747
$$ y = [384207, 512044, 660820, 821712, 984607, 1140762, 1285207, 1417642, 1541577, 1662337, 1784760, 1911317, 2041275, 2171096, 2295710, 2409651, 2507596, 2584741, 2637663, 2665519, 2670665, 2658078, 2633954, 2604180, 2573180, 2543364, 2515534, 2490319, 2469851, 2458495, 2462030, 2485770, 2532620, 2601797, 2688619, 2785575, 2884529, 2979209, 3066692, 3147109, 3221930, 3291980, 3356259, 3411815, 3454302, 3478706, 3480054, 3454290, 3399452, 3316893, 3212023, 3094116, 2975116, 2867741, 2783250, 2729329, 2708637, 2718578, 2752436, 2801399, 2856825, 2912355, 2965581, 3018722, 3077704, 3149742, 3240531, 3352450, 3484344, 3632298, 3790426, 3951284, 4106229, 4246237, 4363201, 4451222, 4507431, 4532254, 4529288, 4504768, 4466641, 4423462, 4383588, 4354669, 4342911, 4351744, 4380491]
41124D380491M3633N0538M8930M0455K7750J3183j788j6433l0149m1981n0767
41113D463862n5691n6874n5479n3096n0718m7962m3262l5045k3089q915N056J6824
41101D055611K5645L1866L6111L8584L8956L6789L1944K4632J5204M009q526k1730
41089D309095l4573m5737n3808n7629n6661n1094m1611k8949j3627L785K1904
41078C951095L7952M8184M9645M2315L0035J9227J5964K3047L8919N8741P6741
41067D391865Q8173R0007Q0724O0130K9485q393m9389q8569j20716j41030j46256
41056D186031j35732j11701p8501m1141m008K9901N9141Q3583J03839J20469J33246
41045D345127J40869J41396J33264J16205R1694O2788L3614Q449r520j9223k1796
$$ y = [4380491, 4424124, 4474662, 4523592, 4564047, 4591797, 4604980, 4603192, 4586759, 4556610, 4514629, 4463862, 4408171, 4351297, 4295818, 4242722, 4192004, 4144042, 4100780, 4065735, 4042646, 4033731, 4038787, 4055611, 4081256, 4113122, 4149233, 4187817, 4226773, 4263562, 4295506, 4320138, 4335342, 4339351, 4330825, 4309095, 4274522, 4228785, 4174977, 4117348, 4060687, 4009593, 3967982, 3939033, 3925406, 3929191, 3951095, 3989047, 4037231, 4086876, 4129191, 4159226, 4178453, 4194417, 4217464, 4256383, 4315124, 4391865, 4480038, 4570045, 4650769, 4710899, 4740384, 4731991, 4682602, 4594033, 4473317, 4332287, 4186031, 4050299, 3938598, 3860097, 3818956, 3814948, 3844849, 3903990, 3987573, 4091412, 4211881, 4345127, 4485996, 4627392, 4760656, 4876861, 4968555, 5031343, 5064957, 5073406, 5063886, 5044663, 5022867]
41034E022867j9545j4508p587J308J2411K5219L8173M9171N6524N9632N8868N4912
41022E337445M8129L8551K6326J2134k881j7565l1037m2365n0080n2362m8186
41011E218109l8448k6001j4413o411l017l632o758j0697j3772j4115r605J359
40999E072599J8651L9815O0886P8171Q9926R7068J02684J10531J23158J40616
40989E934105J60498J79244J93692K01881K02842J95978J80916J58108J29626
40980G536890R9112P0627M7081K9372J6660P236o83q411j6215k2904k6180k4109
40968G708476j6891p530m99O51n029j5943k9181m1682n0780n4360n0983l9998
40956G396251k1651K653L0028N6131P5990Q5470Q2726O8815M7083K1613m398k9443
$$ y = [5022867, 5003322, 4988814, 4981227, 4982535, 4994946, 5020165, 5058338, 5107509, 5164033, 5223665, 5282533, 5337445, 5385574, 5424125, 5450451, 5462585, 5459704, 5442139, 5411102, 5368737, 5318657, 5266295, 5218109, 5179661, 5153660, 5139247, 5132836, 5129819, 5126187, 5119429, 5108732, 5094960, 5080845, 5071240, 5072599, 5091250, 5131065, 5191951, 5270122, 5360048, 5457116, 5559800, 5670331, 5793489, 5934105, 6094603, 6273847, 6467539, 6669420, 6872262, 7068240, 7249156, 7407264, 7536890, 7636002, 7706629, 7753710, 7783082, 7799742, 7806978, 7806295, 7797884, 7781669, 7758765, 7732585, 7708476, 7691585, 7684055, 7683556, 7684207, 7679178, 7663235, 7634054, 7592372, 7541592, 7487232, 7436249, 7396251, 7374600, 7377253, 7407281, 7463412, 7539402, 7624872, 7707598, 7776413, 7823496, 7845109, 7840711, 7811268]
40944G811268n3352p6211r7352j15079j27220j32111j29333j19689j04422q4317
40934F772182n9381k9327N413M2851P9314J10280J31866J42159J41701J33011
40924G470069J19648J05301R2957Q3983P7412P0111N8397M0371J7540n620k4130
40913H106039l5455m1065m5380n2844o5212q0929r6649j09292j17081j19543j17182
40902G225407j11243j03163r3790q3079p0704n7035m3458l1870k4001k0997k3231
40891F562836k9999l9434m9014n6594o1322o3766o5342o7595p1735p8336q6992
40880E892707r6192j03805j08029j08078j04047r6180q4423o8645m9293k7939
40870E046076p322R077J7733J5957K879j9759m7533p4430r4890j05763j07131
$$ y = [7811268, 7757916, 7681705, 7584353, 7469274, 7342054, 7209943, 7080610, 6960921, 6856499, 6772182, 6712801, 6683474, 6688887, 6731738, 6811052, 6921332, 7053198, 7195357, 7337058, 7470069, 7589717, 7695018, 7787975, 7871958, 7949370, 8019481, 8077878, 8118249, 8135789, 8130169, 8106039, 8070584, 8029519, 7984139, 7931295, 7866083, 7785154, 7688505, 7579213, 7462132, 7342589, 7225407, 7114164, 7011001, 6917211, 6834132, 6763428, 6706393, 6662935, 6631065, 6607064, 6586067, 6562836, 6532837, 6493403, 6444389, 6387795, 6326473, 6262707, 6197365, 6129770, 6058035, 5979699, 5892707, 5796515, 5692710, 5584681, 5476603, 5372556, 5276376, 5191953, 5123308, 5074015, 5046076, 5038754, 5047831, 5065564, 5081521, 5084400, 5064641, 5017108, 4942678, 4847788, 4742025, 4634894]
40859D634894j01728r3453q5723q0252p6684p3373o8922o3550n9223n8466o2809
40848C810711p1947q3993r6158j05292j08392j03438r0368p1446n0509l1657j8136
40837B979375j1803j3072k1240l5171n3811p5983r9589j21232j37037j44334j42999
40826B123104j35524j25869j17774j13464j13280j16228j20910j26250j31777
40817A022028j37523j43723j50358j56785j61636j63122j59603j50300j35884
40808c36906j18641j01877q8731q1069p9085q1732q7469r4771j02160j08048j10824
40797a391313j09440j03967r5528q5431p4282o1921m8294l4290k1658j2064o241
40786b044429m100n630j1596k3216m1046o4063q9750j14944j36750j52978j62231
$$ y = [4634894, 4533166, 4439713, 4353990, 4273738, 4197054, 4123681, 4054759, 3991209, 3931986, 3873520, 3810711, 3738764, 3654771, 3558613, 3453321, 3344929, 3241491, 3151123, 3079677, 3029168, 2997511, 2979375, 2967572, 2954500, 2933260, 2898089, 2844278, 2768295, 2668706, 2547474, 2410437, 2266103, 2123104, 1987580, 1861711, 1743937, 1630473, 1517193, 1400965, 1280055, 1153805, 1022028, 884505, 740782, 590424, 433639, 272003, 108881, -50722, -201022, -336906, -455547, -557424, -646155, -727224, -806309, -888041, -975510, -1070281, -1172441, -1280489, -1391313, -1500753, -1604720, -1700248, -1785679, -1859961, -1921882, -1970176, -2004466, -2026124, -2038188, -2044429, -2048529, -2054159, -2065755, -2088971, -2130017, -2194080, -2283830, -2398774, -2535524, -2688502, -2850733]
40775b850733j63954j58530j47340j32591j16842j02394r0872q3096p9032p7655
40765d003039p6911p4266o7727n6644m1744k4590p131Q559K0490K6905K6288J7347
40753d252463n09k6381n7361q8959j16246j35030j42634j38344j23526j01321
40743e182774p5923n1585l1690j8128j1195j0020j3255j9564k7557l5464m1096
40732e518251m2409l8315k9092j6109j172J3897K7325L7371M2582M2410L7769
40721e443994L0873K4232J9366J6305J4260J2642J1276R781P144K280m795j2259
40709e312889j6937j5620o620R247K8710M7201O0599O6871O6901O4181O3445O8718
40697d876193Q1702J01201J23666J44678J60759J70804J76297J80182J85146J92484
$$ y = [-2850733, -3014687, -3173217, -3320557, -3453148, -3569990, -3672384, -3763256, -3846352, -3925384, -4003039, -4079950, -4154216, -4221943, -4278587, -4320331, -4344921, -4352052, -4343493, -4323003, -4296098, -4269810, -4252463, -4252972, -4279353, -4336714, -4425673, -4541919, -4676949, -4819583, -4957927, -5081453, -5182774, -5258697, -5310282, -5341972, -5360100, -5371295, -5381315, -5394570, -5414134, -5441691, -5477155, -5518251, -5560660, -5598975, -5628067, -5644176, -5645348, -5631451, -5604126, -5566755, -5524173, -5481763, -5443994, -5413121, -5388889, -5369523, -5353218, -5338958, -5326316, -5315040, -5305259, -5298115, -5295835, -5300630, -5312889, -5329826, -5345446, -5352066, -5342819, -5314109, -5266908, -5206309, -5139438, -5072537, -5008356, -4944911, -4876193, -4794491, -4693290, -4569624, -4424946, -4264187, -4093383, -3917086, -3736904, -3551758, -3359274]
40687c359274K01759K11148K18090K20421K17558K11056K03967J99336J98792
40678a477147K01956K06772K10424K10308K04660J92850J75447J54049J30764
40669B10083J07442Q5202O4686M6771L2997K5123K4034K8762L6362M2675M3513
40658G47650L5972J9474l812k9533n2566o8409p3937o7506m9003k0039J6064N4691
40646E09046R0770J19847J39143J48130J48165J41579J30891J18593J07062R8203
40636A751429R3178R2585R6924J06656J21782J41352J63440J85445K04494K17841
40626C175126K23231K19360K06181J84912J57505J25835R1092N3824J4503k5991
40616D425578o6219j04296j38102j65739j86080j99180k06044k07912k05466j98491
$$ y = [-3359274, -3157515, -2946367, -2728277, -2507856, -2290298, -2079242, -1875275, -1675939, -1477147, -1275191, -1068419, -857995, -647687, -443027, -250177, -74730, 79319, 210083, 317525, 402727, 467413, 514184, 547181, 572304, 596338, 625100, 661462, 704137, 747650, 783622, 803096, 799284, 769751, 717185, 648776, 574839, 507333, 458330, 438291, 454355, 509046, 599816, 719663, 858806, 1006936, 1155101, 1296680, 1427571, 1546164, 1653226, 1751429, 1844607, 1937192, 2034116, 2140772, 2262554, 2403906, 2567346, 2752791, 2957285, 3175126, 3398357, 3617717, 3823898, 4008810, 4166315, 4292150, 4383242, 4437066, 4451569, 4425578, 4359359, 4255063, 4116961, 3951222, 3765142, 3565962, 3359918, 3152006, 2946540, 2748049]
40606B748049j86094j67308j41815j10409p5132l8998n598K1386L8763M4600L8935
40595B166379K4051L975j6506l2990m2364m3550l7834k8626k0424j7331k1660
40584A933120l3140m9058o5226p7350q2105p7681o3969m2813j8038N233K2281
40573A451254L0576L0553K4890J6939R477M280K229L371O725J0085J0303M254
40561A604936r680l0459n4430p6835r3787j03508j06384j04403j00418r7192r6240
40550G31600r7136r7967r6740r2735q6973q1658p8971p9929q3811q8555r1585
40539b44460r0536q3563o9527m8325k1164R511M0456O8284R0174J04475J10994
40528a33681J10723J05262R6219Q4937P2440N9537M6860L4936K4303J5600R530
$$ y = [2748049, 2561955, 2394647, 2252832, 2142423, 2067291, 2028293, 2022695, 2044081, 2082844, 2127444, 2166379, 2190430, 2194405, 2177899, 2144909, 2102545, 2058995, 2021161, 1992535, 1972111, 1954780, 1933120, 1899980, 1850922, 1785696, 1708346, 1626241, 1548560, 1484591, 1441778, 1423740, 1428973, 1451254, 1481830, 1512383, 1537273, 1554212, 1563689, 1567969, 1570198, 1573569, 1580294, 1590379, 1600682, 1604936, 1595256, 1564797, 1510367, 1433532, 1339745, 1236237, 1129853, 1025450, 925032, 827840, 731600, 634464, 536497, 439757, 347022, 260049, 178391, 99420, 19491, -64320, -152875, -244460, -334996, -418559, -488086, -536411, -557575, -548064, -507608, -439324, -349150, -244675, -133681, -22958, 82304, 178523, 263460, 335900, 395437, 442297, 477233, 501536, 517136, 526666]
40517E26666O553O587Q937J2649J7025K1898K7415L3449L9169M3089M3586L9441
40505H26464L0163J6165j165j9709l7250n1991o2430o6970o4016n2969l5144j3622
40493D67526P992K6973M2165N3845O3090P0912P7437Q1583Q1606P6220O5523N1021
40481A165893L4861J9090N428m672j0143j0773p609k932L28l77o267j6855l0366
40468A135606m4541n7164o6210p0031o7745n9584m6922l1987j7451n818J259L209
40456F72621Q7q047k1084l8122n6934p4393q7637r5132r6980r4413q8880q1188
40444g0102p1192n8069m1096k0616J209K0478L2727L4867K6626J0533r413k9436
40432a73484m7066o1267p1983p9422q3406q3059p7092o4563m5789k2792R72K1513
$$ y = [526666, 533219, 539806, 548743, 561392, 578417, 600315, 627730, 661179, 700348, 743437, 787023, 826464, 856627, 872792, 871627, 851918, 814668, 762677, 700247, 633277, 569261, 516292, 481148, 467526, 475518, 502491, 544656, 598501, 661591, 732503, 809940, 891523, 973129, 1049349, 1114872, 1165893, 1200754, 1219844, 1225272, 1220600, 1210457, 1199684, 1192075, 1189143, 1189471, 1189094, 1182827, 1165972, 1135606, 1091065, 1033901, 967691, 897660, 829915, 770331, 723409, 691422, 673971, 668153, 669412, 672621, 672708, 664661, 643577, 605455, 548521, 474128, 386491, 291359, 194379, 99966, 11086, -70102, -141294, -199363, -240459, -261075, -259866, -239388, -206661, -171794, -145168, -134635, -144048, -173484, -220550, -281817, -353800, -433222, -516628, -599687, -676779, -741342, -787131, -809923, -808951, -787438]
40420g87438L5357M0388L6307K4829R649m029j0721o417R824L5368O5000R2931
40408d58952J14883J29246J36745J39048J37394J32357J24657J15847J07954J02151
40398G81330R7633R1638Q0567O1587L3969l29l6955p0197r4480j05942j03531
40387G35290q9039o6104l8856j1053J4112L4059M7127N2983N2598M7673L9835
40376H18625K9954J7867K536j7285m2080p0648r9661j24090j38611j39420j25618
40365A11569r9370o4941k7257R248M1147O6138Q2985R1431R2032Q5922P4481N9063
40353E22448M0719K0116k162k5064m6707o4722p7257q3977q6396q7232q9126r3266
40341g2626r8746j03085j03662r8999q9082p4938n8363m2026k9378k3667k6492
$$ y = [-787438, -752081, -711693, -675386, -650557, -640908, -644937, -655658, -662075, -652251, -616883, -551883, -458952, -344069, -214823, -78078, 60970, 198364, 330721, 455378, 571225, 679179, 781330, 878963, 970601, 1051168, 1112755, 1146724, 1146395, 1109440, 1039243, 944763, 838821, 735290, 646251, 580147, 541291, 530238, 544350, 578409, 625536, 678519, 731117, 778790, 818625, 848579, 866446, 868982, 851697, 809617, 738969, 639308, 515218, 376607, 237187, 111569, 12199, -52742, -79999, -70751, -29604, 36534, 119519, 210950, 302982, 388904, 463385, 522448, 563167, 583283, 581121, 556057, 509350, 444628, 367371, 283394, 196998, 109766, 20640, -72626, -171372, -274457, -378119, -477118, -566200, -641138, -699501, -741527, -770905, -794572, -821064]
40330h21064l6907n1773o6978p8786q4692q3649p5870o2540m5752k8495j4267
40319a450773n996m815r526j7248k4701k9324k9819k6293k0337j4709j2350j4887
40307a660778k1588k9648l5828l8315l7542l5382l3523l2276l0563k6764j9461
40296b001668p595R716L3084O2348R5999J31095J63800J90255K07384K13398K07945
40285f94239J92106J68328J40267J12355Q8873P2708O4419O2387O4003O7139P0733
40274D09079P4309P7148P8033P5854P0451O2926N5041M7971M1166L2243J8229
40263A042450k476k8720n6779q1979j00532j10449j11350j03866q9320o9830m8374
40252B38775k8426j3094m180j594l517p333j0819j2882j3524j3267j2513j1151
$$ y = [-821064, -857971, -909744, -976722, -1055508, -1140200, -1223849, -1299719, -1362259, -1408011, -1436506, -1450773, -1456769, -1461584, -1471110, -1488358, -1513059, -1542383, -1572202, -1598495, -1618832, -1633541, -1645891, -1660778, -1682366, -1712014, -1747842, -1786157, -1823699, -1859081, -1892604, -1924880, -1955443, -1982207, -2001668, -2009263, -1999547, -1966463, -1904115, -1808116, -1677021, -1513221, -1322966, -1115582, -902184, -694239, -502133, -333805, -193538, -81183, 7690, 80398, 144817, 207204, 271207, 338346, 409079, 483388, 560536, 638569, 714423, 784874, 847800, 902841, 950812, 991978, 1024221, 1042450, 1039974, 1011254, 954475, 872496, 771964, 661515, 550165, 446299, 356979, 287149, 238775, 210349, 197255, 193075, 191481, 187964, 180631, 169812, 156930, 143406, 130139, 117626, 106475]
40240A06475q491l504M775J6780L2205M9922O8093Q4587R7708J06833J12297J14509
40228G82189J12981J06219R2636P1879M5575J6793j1657l8826o5749r3843j22985
40217H95212j50983j74645j91215j99184j98393j90041j76374j59807j41733j22130
40207h09293j00535p7494n5092l6023k2118j3677r818r203j0389j1800j1697q474
40195a175613j305R089K0251K8961L3194L3682L3738L7312M6805O2039Q0681R9376
40183f91790J14711J23790J24551J16215R9799P8231N5592L5871K2105J6313J9587
40172A14975L1616M9913O9815Q5762R3297R0581P8839O1746M4228L1135K5969
40161G77876K9799M0733N4381O5442O9748O5701N4416L8679K1291L740j4168l3489
$$ y = [106475, 97984, 94480, 99255, 116035, 148240, 198162, 266255, 350842, 448550, 555383, 667680, 782189, 895170, 1001389, 1094025, 1165904, 1211479, 1228272, 1216615, 1177789, 1112040, 1018197, 895212, 744229, 569584, 378369, 179185, -19208, -209249, -385623, -545430, -687163, -809293, -909828, -987322, -1042414, -1078437, -1100555, -1114232, -1124050, -1133253, -1143642, -1155442, -1167139, -1175613, -1176918, -1167829, -1147578, -1118617, -1085423, -1051741, -1018003, -980691, -933886, -871847, -791166, -691790, -577079, -453289, -328738, -212523, -112724, -34493, 21099, 56970, 79075, 95388, 114975, 146591, 196504, 266319, 352081, 445378, 535959, 614798, 676544, 720772, 751907, 777876, 807675, 848408, 902789, 968231, 1037979, 1103680, 1158096, 1196775, 1218066, 1221806, 1207638, 1174149]
40149A174149n4671p6456r5736j08383j10449r9515p5721m2202m497L0913N8428
40138E95860P4831P9885P5824O5975N3239L9311K4944J0756k210j2648j9634k3255
40126I62878k4806k6470l0563l8669n0982o6139q1657r4777j03286j05919j02176
40115B37434r1987p5747n4689l0997p275J4281L2245M5759N4305N7975N7742N5261
40103B94307N2094M8915M5275M0183L3201K5320J8703J5105J4070J2501O230p447
40091E98457k8119n2494p6142r5374j08126j13812j12793j06022r4840q0644o4591
40080c34500m7586l0547j4569p68J0158J8221K4125K8762L2628L5765L8455M1866
40068a97990M7653N6633O7729P8212Q4964Q5786Q0054O8650N3234L5374J6178
$$ y = [1174149, 1119478, 1043022, 947286, 838903, 728454, 628939, 553218, 511016, 506519, 537432, 595860, 670691, 750576, 826400, 892375, 945614, 984925, 1009869, 1020625, 1018415, 1005767, 986133, 962878, 938072, 911602, 881039, 842370, 791388, 725249, 643592, 548815, 445529, 339610, 237434, 145447, 69700, 15011, -15986, -23261, -8980, 23265, 69024, 123329, 181304, 239046, 294307, 346401, 395316, 440591, 480774, 513975, 539295, 557998, 573103, 587173, 599674, 605904, 598457, 570338, 517844, 441702, 346328, 238202, 124390, 11597, -94425, -189265, -269909, -334500, -382086, -412633, -427202, -427970, -417812, -399591, -375466, -346704, -314076, -278311, -239856, -197990, -150337, -93704, -25975, 52237, 137201, 222987, 303041, 371691, 424925, 460299, 476477]
40057D76477l231k1015l4503m0852l7938k5183m301K0389M2729N6798N9138M9693
40045E38201L0914N955k2588n2684q2093j07999j27598j39150j42559j39152j31061
40034c69814j20545j09254r7637q5097p1020n5902m1472k9856k2641k0437k2731
40023a046406k7622l1769l1151k2545m950J9849M7857P4188R4524J06163J08359
40012g13503J02010Q9041P1689N1977L1657J2831j336o928j094J5729L9186O2869
40000b45872Q1579R3738J01458J08575J18068J30350J43063J52170J53682J45381
39990I82192J27939J04820Q0829N9828M3014K8913J5114L88j4295k6539l4245
39979A367958l6897l5458l1363k5848k0222j6450j6980k3804l7538n7207q0523
$$ y = [476477, 473246, 452231, 417728, 376876, 338938, 313755, 309454, 329843, 372572, 429370, 488508, 538201, 569115, 575070, 552482, 499798, 417705, 309706, 182108, 42958, -99601, -238753, -369814, -490359, -599613, -697250, -782347, -853367, -909269, -950741, -980597, -1003238, -1023675, -1046406, -1074028, -1105797, -1136948, -1159493, -1164443, -1144594, -1096737, -1022549, -928025, -821862, -713503, -611493, -522452, -450763, -398786, -367129, -354298, -355634, -362562, -363656, -347927, -308741, -245872, -164293, -70555, 30903, 139478, 257546, 387896, 530959, 683129, 836811, 982192, 1110131, 1214951, 1295780, 1355608, 1398622, 1427535, 1442649, 1443037, 1428742, 1402203, 1367958, 1331061, 1295603, 1264240, 1238392, 1218170, 1201720, 1184740, 1160936, 1123398, 1066191, 985668]
39968I85668j04139j24070j36442j38561j29648j11018q5789n8324l3374j4867
39958D9436m818k967p368j5436k4683l2736l7133l5537k6556j0516J0332L2363
39946a05619N1585O4761P0300O8522O1159N0448L8411K6641J6412Q939N515P484
39934C64558J5959L1351N2871P8139J03132J22750J32014J27427J07899P5171
39924A211271L3850r222m6746p3531q8332r3587r3411r1414q9438q7403q3876
39913D88161p7322o7415n5607m4442l6235l2041l1294l2096l2081k9676k4938
39902B5014j9131j3250o875J605J3663K9474M7612O5684Q1261R2634R8944R9819
39890E16454R5042Q4853P0609N5001M1237L1605K6366K3649K0413J3964L375r810
$$ y = [985668, 881529, 757459, 621017, 482456, 352808, 241790, 156001, 97677, 64303, 49436, 44618, 41651, 34283, 18847, -5836, -38572, -75705, -111242, -137798, -148314, -137982, -105619, -54034, 10727, 81027, 149549, 210708, 261156, 299567, 326208, 342620, 351559, 357074, 364558, 380517, 411868, 464739, 542878, 646010, 768760, 900774, 1028201, 1136100, 1211271, 1245121, 1235899, 1189153, 1115622, 1027290, 933703, 840292, 748878, 659440, 572037, 488161, 410839, 343424, 287817, 243375, 207140, 175099, 143805, 111709, 79628, 49952, 25014, 5883, -7367, -14242, -12637, 1026, 30500, 78112, 143796, 225057, 317691, 416635, 516454, 611496, 696349, 766958, 821959, 863196, 894801, 921167, 944816, 965229, 979193, 982568, 972758]
39878I72758k1902k8413k5926j3694N783K7612M6416N8268O1784N7997M9492L9297
39866A229472L0014K3168J8930J6275J3657R836M434k007q324j3103j5005j3052
39854A294295o808L573J7541L4421N3683P4944R7536J19896J39381J52912J58042
39843B139416J53601J39513J16343Q5322M8791J0310k6091n7033q0461r5674j03227
39832B330810j04933j03587j01990j01694j02640j04068j05878j09042j14689
39823A382289j22878j32151j40144j44685j44566j39622j30246j16929j00275
39814B10793q1426o2336m5226l1356j9900p712R642L5978P2463J16568J62639
39803C60127K03899K34843K52761K57855K52377K39586K22959K05589J89674J76189
$$ y = [972758, 950856, 922443, 896517, 882823, 888606, 916218, 962634, 1020902, 1082686, 1140683, 1190175, 1229472, 1259486, 1282654, 1301584, 1317859, 1331516, 1341352, 1345786, 1343779, 1335455, 1322352, 1307347, 1294295, 1287487, 1291060, 1308601, 1343022, 1396705, 1471649, 1569185, 1689081, 1828462, 1981374, 2139416, 2293017, 2432530, 2548873, 2634195, 2682986, 2693296, 2667205, 2610172, 2529711, 2434037, 2330810, 2225877, 2122290, 2020300, 1918606, 1815966, 1711898, 1606020, 1496978, 1382289, 1259411, 1127260, 987116, 842431, 697865, 558243, 427997, 311068, 210793, 129367, 67031, 21805, -9551, -29451, -37163, -27521, 8457, 80920, 197488, 360127, 564026, 798869, 1051630, 1309485, 1561862, 1801448, 2024407, 2229996, 2419670, 2595859]
39793B595859J65047J55828J48659J44683J45470J51331J59559J64272J58532
39784C989240J37499J00380N0131q085o8290j24589j72067k07681k30523k41186
39774C224829k40845k30763k12506j88436j62111j37954j20104j11055j11110
39765A709945j19010j33084j51687j72793j93333k09219k16294k11630j94373
39756A08522j65721j28311q5488m0846K139M0340P1123R2604J04227J07213J04208
39745B10010R7926Q9877Q0155O8330N4527M0008K7084J8335J5323J7687K3487
39734G42749L0723L8614M7342N6570O4165O6379N9354M0975J2025k3802o0884
39723A074210r3174j15740j25931j23984j12943r7843q4312p6890p7636q5614
$$ y = [2595859, 2760906, 2916734, 3065393, 3210076, 3355546, 3506877, 3666436, 3830708, 3989240, 4126739, 4227119, 4277250, 4269165, 4200875, 4076286, 3904219, 3696538, 3466015, 3224829, 2983984, 2753221, 2540715, 2352279, 2190168, 2052214, 1932110, 1821055, 1709945, 1590935, 1457851, 1306164, 1133371, 940038, 730819, 514525, 302895, 108522, -57199, -185510, -270998, -311844, -309705, -269365, -198242, -105638, -1411, 105802, 210010, 307936, 397813, 477968, 546298, 600825, 640833, 667917, 686252, 701575, 719262, 742749, 773472, 812086, 859428, 915998, 980163, 1046542, 1105896, 1146871, 1158896, 1135094, 1074210, 981036, 865296, 739365, 615381, 502438, 404595, 320283, 243393, 165757, 80143]
39713H0143r7319j07867j12465j07829r3060o9524l9869o952K6440N7297Q2390
39702c88615R8924J05304J01346Q8079O7540M2640J6788o853k5981l9414m6856
39691A2902m8537m5027l7275k6700j4968l534O689J5146K1224K4205K3704K0206
39679e1965J5017R656N083J407j642l904m346j458N878J7667L2631M8402O2034
39666A34460P0849P3426P0149O2916N4238M6360M0786L8096L8030L9756M2398
39655G11464M5461M8868N2500N5535N6230N2423M2657K7206Q306j0660k6521l7501
39643A025968m3608m6319m7845n0269n4781o1305o8730p5670q1219q5191q7769
39632C23262q9061q8971q7550q5393q3474q2307q1017p7311o8487n2797l0160
$$ y = [80143, -17176, -125043, -237508, -345337, -438397, -507921, -547790, -554742, -528302, -471005, -388615, -289691, -184387, -83041, 5038, 72578, 115218, 132006, 125153, 99172, 59758, 12902, -35635, -80662, -117937, -144637, -159605, -163139, -156450, -141304, -120080, -95875, -72171, -51965, -36948, -27292, -22209, -20802, -22444, -26348, -30694, -32152, -26274, -8607, 24024, 72426, 134460, 205309, 278735, 348884, 411800, 466038, 512398, 553184, 591280, 629310, 669066, 711464, 756925, 805793, 858293, 913828, 970058, 1022481, 1065138, 1092344, 1100650, 1089990, 1063469, 1025968, 982360, 936041, 888196, 837927, 783146, 721841, 653111, 577441, 496222, 411031, 323262, 234201, 145230, 57680, -27713, -111187, -193494, -274511, -351822, -420309, -473106, -503266]
39621e03266k236K7810N5761P7532R0897R6744R8735J01498J08491J20734J36802
39610D09502J53731J68120J76920J77945J70147J53731J29896J00441O7465L3315
39600A741213K05l0544n9144q6905j14998j43391j70942j96332k18902k38542
39590D81718k54863k66479k71304k67607k54998k34471k07512j75262j38320r7232
39580a686330n2967o894L9783Q6571J33701J81410K29048K74622L15127L47412
39570a38517L69153L79519L79138L69685L53429L33131L11769K91472K72086K50484
39560C171349K21474J79685J21389M5640m5156j45197k46157l38904m15627m71442
39550B077054n05041n18143n14158m96768m69133m33814l92882l47742k98878
$$ y = [-503266, -505502, -477692, -421931, -344399, -253502, -156758, -58023, 43475, 151966, 272700, 409502, 563233, 731353, 908273, 1086218, 1256365, 1410096, 1539992, 1640433, 1707898, 1741213, 1741418, 1710874, 1651730, 1564825, 1449827, 1306436, 1135494, 939162, 720260, 481718, 226855, -39624, -310928, -578535, -833533, -1068004, -1275516, -1450778, -1589098, -1686330, -1739297, -1746191, -1706408, -1619837, -1486136, -1304726, -1075678, -801056, -485929, -138517, 230636, 610155, 989293, 1358978, 1712407, 2045538, 2357307, 2648779, 2920865, 3171349, 3392823, 3572508, 3693897, 3739537, 3694381, 3549184, 3303027, 2964123, 2548496, 2077054, 1572013, 1053870, 539712, 42944, -426189, -860003, -1252885, -1600627, -1899505]
39541a899505k45993j88689j27178o2653K919O7402J29328J88325K44686K98207
39531a593151L47276L89279M21980M44547M57275M60424M53499M35491M05602
39522B222222L63847L11399K50838J86031J21207N9410J189n5456j13591j75107
39512C171989k38961l00910l54899l95245m18631m24975m17077l99207l75303
39503a53219l47551l15886k78654k33910j80657j19465n2218J8585R0416J60984
39493a411575K28240K90384L45807L92893M29952M55448M68394M68704M57138
39484B125385M34989M03665L64297L17613K64134K04530J39806P1292P12o9599
39474D256824j36750j97719k49950k91623l21633l39750l47014l45772l38898
$$ y = [-1899505, -2145498, -2334187, -2461365, -2524018, -2521099, -2453697, -2324369, -2136044, -1891358, -1593151, -1245875, -856596, -434616, 9931, 467206, 927630, 1381129, 1816620, 2222222, 2586069, 2897468, 3148306, 3334337, 3455544, 3514954, 3516143, 3460687, 3347096, 3171989, 2933028, 2632118, 2277219, 1881974, 1463343, 1038368, 621291, 222084, -153219, -500770, -816656, -1095310, -1329220, -1509877, -1629342, -1681560, -1662975, -1572559, -1411575, -1183335, -892951, -547144, -154251, 275701, 731149, 1199543, 1668247, 2125385, 2560374, 2964039, 3328336, 3645949, 3910083, 4114613, 4254419, 4325711, 4326423, 4256824, 4120074, 3922355, 3672405, 3380782, 3059149, 2719399, 2372385, 2026613, 1687715]
39465A687715l28418l14516k95712k70109k36760j96184j49754r8579m2955J7088
39455b28184Q0676J45326K07208K62107L06278L36889L52277L52356L38969L15627
39445B469529K86448K54692K21671J86520J46977J00912M7748j0993p2274j32673
39435C498557j89263k39907k83173l18069l43765l59460l64600l59253l44398
39426F96669l21860k93936k62693k28972j91565j47478r3754l0024M0048J09578
39416g23987J71115K19355K52366K71137K78182K76140K66924K51355K29337K00355
39406A692279J64151J21348P3769K4341k3520o6718j03251j32609j55679j74175
39396A419936j89471k01475k08315k07408j97093j77581j50598j18394q2999m5879
$$ y = [1687715, 1359297, 1044781, 749069, 478960, 242200, 46016, -103738, -202317, -245272, -228184, -147508, -2182, 205026, 467133, 773411, 1110300, 1462577, 1814933, 2153902, 2469529, 2755977, 3010669, 3232340, 3418860, 3565837, 3666749, 3714497, 3703504, 3631230, 3498557, 3309294, 3069387, 2786214, 2468145, 2124380, 1764920, 1400320, 1041067, 696669, 374809, 80873, -181820, -410792, -602357, -749835, -843589, -873613, -833565, -723987, -552872, -333517, -81151, 189986, 468168, 744308, 1011232, 1262587, 1491924, 1692279, 1856430, 1977778, 2051547, 2075888, 2052368, 1985650, 1882399, 1749790, 1594111, 1419936, 1230465, 1028990, 820675, 613267, 416174, 238593, 87995, -30399, -113398, -159277]
39386a59277p753L1451P2126J14142J56083J95156K27809K50699K61470K58976
39376A400882K43064K14357J74374J25718P1967J7182l4645q0135j17146j45359
39366A870259j66335j82798j97489k12144k26756k39275k46122k43641k29828
39357g4129k05261j72624j35482r7191o0504k7740j027J7872K8291L1408L0295
39346f66092K8891L0365L5743M3473N0107N1829M6182L3233J5524l118j9177l0563
39334c83603l6845l8829l7984l5790l3034k9203k2523j0765P683L3231O5075J01384
39322d21203J39296J75207K05586K28074K41969K47691K45897K37066K21932K02043
39312A723558J79676J56868J34426J11651Q7113N9903L0544J153k5218m5542n7687
$$ y = [-159277, -167030, -135579, -63453, 50689, 206772, 401928, 629737, 880436, 1141906, 1400882, 1643946, 1858303, 2032677, 2158395, 2230362, 2247544, 2212899, 2132764, 2015618, 1870259, 1703924, 1521126, 1323637, 1111493, 884737, 645462, 399340, 155699, -74129, -279390, -452014, -587496, -684687, -745191, -772931, -773958, -756086, -727795, -696387, -666092, -637201, -606836, -571093, -527620, -477513, -425684, -379502, -346269, -330745, -333863, -353040, -383603, -420448, -459277, -497261, -533051, -566085, -595288, -617811, -628576, -620893, -587662, -522587, -421203, -281907, -106700, 98886, 326960, 568929, 816620, 1062517, 1299583, 1521515, 1723558, 1903234, 2060102, 2194528, 2306179, 2393292, 2453195, 2483739, 2484892, 2459674, 2414132, 2356445]
39301B356445o0843n5687m4434l0684j8771j2550j4153k3427l8404n6337p4653
39290A926502r1329j04844j14081j18434j17987j13530j06227r7201q7185p6300
39280H99384o4008m9255l0932q500J7532M5489P2839R6865J15412J27371J32555
39269A354752J31047J22539J06290Q1755M9399J1115l0042p0506j06906j36522
39259A512921j57463j68562j69207j59239j39072j09879p3765l3884N511L9382
39249E46743O2956P3310P0733N9045M4407L3090K9016L2221L9015M3924M2445
39238A076905L3097J7821O97j4107k4146k9444l1924l3996l7267m2178m8618n6635
39226H10205o6361p7061q6205q9626q3016o3875l2737O965N0088R1263J26054
$$ y = [2356445, 2295602, 2239915, 2195481, 2164797, 2146026, 2133476, 2119323, 2095896, 2057492, 2001155, 1926502, 1835173, 1730329, 1616248, 1497814, 1379827, 1266297, 1160070, 1062869, 975684, 899384, 835376, 786121, 755189, 746689, 764221, 809710, 882549, 979414, 1094826, 1222197, 1354752, 1485799, 1608338, 1714628, 1796383, 1845782, 1856897, 1826855, 1756349, 1649443, 1512921, 1355458, 1186896, 1017689, 858450, 719378, 609499, 535734, 501850, 507361, 546743, 609699, 683009, 753742, 812787, 857194, 890284, 919300, 951521, 990536, 1034460, 1076905, 1110002, 1127823, 1128520, 1114413, 1090267, 1060823, 1028899, 994903, 957636, 915458, 866840, 810205, 743844, 666783, 580578, 490952, 407936, 344061, 311324, 318289, 368377, 459640, 585694]
39215E85694J51397J65443J67083J55842J32397R9220O0596K1567j3690m3109
39205A482440o6891q6644j04016j19590j32450j40522j41323j32786j13988q5576
39195C58654m9716r463L2048P2053J08158J38262J60779J75010J81151J79782
39185A346718J71148J54810J30109R7193N8006J6349k3233n6921q2451r8941j06234
39174A606553j04427r3645p4024m5782r594L3011P9308J25304J66115J97031K15006
39163B094856K19754K13462J99375J80292J58040J33950J09559Q6907O8161N4870
39153C519226M7302M4428M4524M5952M7566M8640M8710M7604M5524M3026M0921
39142D023423M0118M1349M4693M9122N2599N2827M8235L8543K4797R127n770j7600
$$ y = [585694, 737091, 902534, 1069617, 1225459, 1357856, 1457076, 1517672, 1539239, 1525549, 1482440, 1415549, 1328905, 1224889, 1105299, 972849, 832327, 691004, 558218, 444230, 358654, 308938, 299475, 331523, 403576, 511734, 649996, 810775, 985785, 1166936, 1346718, 1517866, 1672676, 1802785, 1899978, 1957984, 1974333, 1951100, 1894179, 1811728, 1712787, 1606553, 1502126, 1408481, 1334457, 1288675, 1279081, 1312092, 1391400, 1516704, 1682819, 1879850, 2094856, 2314610, 2528072, 2727447, 2907739, 3065779, 3199729, 3309288, 3396195, 3464356, 3519226, 3566528, 3610956, 3655480, 3701432, 3748998, 3797638, 3846348, 3893952, 3939476, 3982502, 4023423, 4063541, 4104890, 4149583, 4198705, 4251304, 4304131, 4352366, 4390909, 4415706, 4424833, 4419063, 4401463]
39130D401463k5693l1594l8344m8759o3816q2111j00397j14834j22400j21881
39120C651634j13885r9895q1091n8023l1263k397K5627M9240O5794P4949P8855
39109C559545Q0981Q4372R0574R9492J09580J18086J21749J18305J07997R3685
39099D584366P9215O7219N7910M9429L9211K5480Q314j0232k7037l9514m6901
39088D787460n0340n1618n1639m9906m5598l9228l3244l0833l4094m3330n7835
39077D299795p6786r8948j21601j40356j50515j48951j35087j10532p8076m0716
39067C198227j004L9302P9159J17847J54418J87337K14430K33266K41956K40029
39057D704967K28839K11112J89892J67597J45638J24664J05100Q7792P4451O7559
$$ y = [4401463, 4375770, 4344176, 4305832, 4257073, 4193257, 4111146, 4010749, 3895915, 3773515, 3651634, 3537749, 3437854, 3356763, 3298740, 3267477, 3265080, 3290707, 3339947, 3405741, 3480690, 3559545, 3640526, 3724898, 3815472, 3914964, 4024544, 4142630, 4264379, 4382684, 4490681, 4584366, 4663581, 4730800, 4788710, 4838139, 4877350, 4902830, 4911144, 4900912, 4873875, 4834361, 4787460, 4737120, 4685502, 4633863, 4583957, 4538359, 4499131, 4465887, 4435054, 4400960, 4357630, 4299795, 4223009, 4124061, 4002460, 3862104, 3711589, 3562638, 3427551, 3317019, 3238943, 3198227, 3197223, 3236525, 3315684, 3433531, 3587949, 3775286, 3989716, 4222982, 4464938, 4704967, 4933806, 5144918, 5334810, 5502407, 5648045, 5772709, 5877809, 5965601, 6040052, 6107611]
39047F107611O9399Q0434R8054J16660J29402J30621J17721R1665N6368J7445
39037G015380j9253m9142o9963q1809q6096q4247p6912o4023m5301k0795Q679
39026F426518M1278P4225J04302J28659J45487J54248J55381J49676J37803J20242
39016G637819R7517P0372L9832P250k5398n5328p9176r3698r6771q8214p0080
39005G344125m6101k0597K419J9452K7473K4245R060j6729m9856q5666j18662
38994G089163j43190j54463j49657j28351r1987m2799J6797Q3891J54010K20279
38984F853693K73781L05420L08541K81091K26427J52473O9785j0727p9558j29482
38974H251444j55843j56805j33596r0363l3491K9448R0720J43454J82799K06929
$$ y = [6107611, 6177010, 6257444, 6355498, 6472158, 6601560, 6732181, 6849902, 6941567, 6997935, 7015380, 6996127, 6946985, 6877022, 6795213, 6709117, 6624870, 6547958, 6483935, 6438634, 6417839, 6426518, 6467796, 6542021, 6646323, 6774982, 6920469, 7074717, 7230098, 7379774, 7517577, 7637819, 7735336, 7805708, 7845540, 7852790, 7827392, 7772064, 7692888, 7599190, 7502419, 7414205, 7344125, 7298024, 7277427, 7279846, 7299298, 7326771, 7351016, 7360076, 7343347, 7293491, 7207825, 7089163, 6945973, 6791510, 6641853, 6513502, 6421515, 6378716, 6395513, 6479404, 6633414, 6853693, 7127474, 7432894, 7741435, 8022526, 8248953, 8401426, 8471211, 8460484, 8380926, 8251444, 8095601, 7938796, 7805200, 7714837, 7681346, 7710794, 7801514, 7944968, 8127767, 8334696]
38964H334696K17275K17621K12468K05407J98168J90558J81236J68994J53849
38955A0080272J37296J21509J08294R8685R3366R3189R9014J11155J29179J52140
38945A1224099J78714K06757K32893K53064K64018K64695K56204K40472K18655
38936A3339571J90752J56606J17385P6130L6747K179k6917n2141p6157j01093
38926A3663062j27291j52829j74049j87034j89308j80819j63553j40110j12214
38917A2235855q0057m2819N4M7521R6398J42039J79964K07587K25088K34872K40087
38906A3486589K43116K44899K45328K44171K41793K39242K37843K38691K42511
38897A5664183K49794K60833K75336K91828L07526L19223L24715L23956L19162
$$ y = [8334696, 8551971, 8769592, 8982060, 9187467, 9385635, 9576193, 9757429, 9926423, 10080272, 10217568, 10339077, 10447371, 10546056, 10639422, 10732611, 10831625, 10942780, 11071959, 11224099, 11402813, 11609570, 11842463, 12095527, 12359545, 12624240, 12880444, 13120916, 13339571, 13530323, 13686929, 13804314, 13880444, 13917191, 13919370, 13892453, 13840312, 13764155, 13663062, 13535771, 13382942, 13208893, 13021859, 12832551, 12651732, 12488179, 12348069, 12235855, 12155798, 12112979, 12113033, 12160554, 12256952, 12398991, 12578955, 12786542, 13011630, 13246502, 13486589, 13729705, 13974604, 14219932, 14464103, 14705896, 14945138, 15182981, 15421672, 15664183, 15913977, 16174810, 16450146, 16741974, 17049500, 17368723, 17693438, 18017394, 18336556]
38888A8336556L13839L11185L12466L16329L19458L18442L11638K99901K85827
38879B1125641K72197K60464K49964K38087K21369J96940J63634J22222P4941
38870B2925459K4807k4781p0203j07740j34126j47390j47606j36997j19189r8033
38860B1964201p6657n7172m0963k9108k2459k1431k5921l5551m9974o8638r0057
38849B1446270j11349j28790j39222j41401j36318j26411j14369j02311r1632
38840B0354467q3172p7274p3703p1767p0651o9536o7219o1521m9341k7688M734
38829A9707329M6372R2719J37414J74007J97600K05850J99277J81179J57125J33603
38819B1232475J15924J06285J03203J02512R9215Q9234P0743M4884J5490j2310
$$ y = [18336556, 18650395, 18961580, 19274046, 19590375, 19909833, 20228275, 20539913, 20839814, 21125641, 21397838, 21658302, 21908266, 22146353, 22367722, 22564662, 22728296, 22850518, 22925459, 22950266, 22925485, 22855282, 22747542, 22613416, 22466026, 22318420, 22181423, 22062234, 21964201, 21887544, 21830372, 21789409, 21760301, 21737842, 21716411, 21690490, 21654939, 21604965, 21536327, 21446270, 21334921, 21206131, 21066909, 20925508, 20789190, 20662779, 20548410, 20446099, 20354467, 20271295, 20194021, 20120318, 20048551, 19977900, 19908364, 19841145, 19779624, 19730283, 19702595, 19707329, 19753701, 19846420, 19983834, 20157841, 20355441, 20561291, 20760568, 20941747, 21098872, 21232475, 21348399, 21454684, 21557887, 21660399, 21759614, 21848848, 21919591, 21964475, 21979965, 21967655]
38809B1967655l4090m7538n2655n0982m4690l6140k7742k1559j8491j7553j6067
38798B1600148j0855M31J8782M4305P6916J16612J63249K16406K75460L39643
38788B2841097M07630M76910N43608O03220O51888O87164P07811P12999P01773
38779B8334100O73173O26776N63269M84832L95296K99950K05059J17261M2886
38770C1742602j2661m5470n3699l7985j412N1351J15533J87472K64689L45026
38760C2555446M26021N05384N82090O57029P32542Q11269Q95321R86423J086745
38751C9238270J199392J327773J474138J638323J817511K007107K202185K399111
38743E3303810K596784K797057L004308L224625L465196L734073M040191M393252
$$ y = [21967655, 21933565, 21886027, 21833372, 21782390, 21737700, 21701560, 21673818, 21652259, 21633768, 21616215, 21600148, 21589293, 21589724, 21608506, 21652811, 21729727, 21846339, 22009588, 22225994, 22501454, 22841097, 23248727, 23725637, 24269245, 24872465, 25524353, 26211517, 26919328, 27632327, 28334100, 29007273, 29634049, 30197318, 30682150, 31077446, 31377396, 31582455, 31699716, 31742602, 31729941, 31684471, 31630772, 31592787, 31591375, 31642726, 31758259, 31945731, 32210420, 32555446, 32981467, 33486851, 34068941, 34725970, 35458512, 36269781, 37165102, 38151525, 39238270, 40437662, 41765435, 43239573, 44877896, 46695407, 48702514, 50904699, 53303810, 55900594, 58697651, 61701959, 64926584, 68391780, 72125853, 76166044, 80559296]
38735H0559296M803102N278334N824144O439987P117273P837001Q567386R262148
38727A35688671R860293J0287320J0457505J0277790R656563Q521939O850713
38720B01600794M699611K220937l54547k768515m799467o310849p264066p699033
38712A79324865p699895p363701o780687o026096n159408m226741l263511k295999
38704A36508827j341718m09255N01615J398935K296357L209918M154284N139130
38696A51458093O166540P229565Q311422R384297J0407110J1322456J2053307
38689B16332790J2500507J2543641J2050037J0897764R014602O424552L280716
38682B83044609j40535l494378o453507q786478j0394238j1297499j1594422j1415555
$$ y = [80559296, 85362398, 90640732, 96464876, 102904863, 110022136, 117859137, 126426523, 135688671, 145548964, 155836284, 166293789, 176571579, 186228142, 194750081, 201600794, 206300405, 208521342, 208166795, 205398280, 200598813, 194287964, 187023898, 179324865, 171624970, 164261269, 157480582, 151454486, 146295078, 142068337, 138804826, 136508827, 135167109, 134757854, 135259469, 136658404, 138954761, 142164679, 146318963, 151458093, 157624633, 164854198, 173165620, 182549917, 192957027, 204279483, 216332790, 228833297, 241376938, 253426975, 264324739, 273339341, 279763893, 283044609, 282904074, 279409696, 272956189, 264169711, 253775473, 242477974, 230883552, 219467997]
38674B19467997j0892560j0142744r263960q333848p409574o526811n699418m922124
38666A56276958m177129l442713k700402j938378j150947l35733N09360J388016
38658A44429032K305278L265069M266272N298952O342308P364572Q324305R172226
38650A90768014R853086J0306818J0468010J0264218R616689Q450129O717139
38643B56444103M434334J714319j229275m117327o671671q682847j0048923j0774229
38635B21068484j0938738j0658514j0053221r226964q261428p216875o136029
38628A58576715n047458l967469k901475j846019p91970K71420J352415K453491
38620A48099650L569525M687511N787642O844899P829530Q704515R419610R904450
$$ y = [219467997, 208575437, 198432693, 189168733, 180834885, 173425311, 166898500, 161199082, 156276958, 152099829, 148657116, 145956714, 144018336, 142867389, 142531656, 143041016, 144429032, 146734310, 149999379, 154265651, 159564603, 165906911, 173271483, 181595788, 190768014, 200621100, 210927918, 221395928, 231660146, 241276835, 249726964, 256444103, 260878437, 262592756, 261363481, 257246154, 250574483, 241891636, 231842713, 221068484, 210129746, 199471232, 189418011, 180191047, 171929619, 164712744, 158576715, 153529257, 149561788, 146660313, 144814294, 144022324, 144293744, 145646159, 148099650, 151669175, 156356686, 162144328, 168989227, 176818757, 185523272, 194942882, 204847332]
38612B04847332J0065673R794360Q988684P591097N628766L236126O40161j893239
38604B48898960m129876n922256p227468q088949q599028q860447q957750q942463
38596A88170723q832463q622796q302126p867415p331474o721964o074653n425552
38588A28992280m805623m238867l742001l323614k982293k705099k468375k242316
38580A02484092j998681j718542j396175j037478o55194k64740J17298M72929
38572I6003509P82587J025958J183983J242087J194214J046109Q15731N29675
38564A03823853K16346j01380m10715p08372r95570j272314j535153j779732k005287
38555I5231676k216736k422036k626448k827607l014766l172480l286271l347096
$$ y = [204847332, 214913005, 224707365, 233696049, 241287146, 246915912, 250152038, 250792199, 248898960, 244769084, 238846828, 231619360, 223530411, 214931383, 206070936, 197113186, 188170723, 179338260, 170715464, 162413338, 154545923, 147214449, 140492485, 134417832, 128992280, 124186657, 119947790, 116205789, 112882175, 109899882, 107194783, 104726408, 102484092, 100485411, 98766869, 97370694, 96333216, 95678022, 95413282, 95530580, 96003509, 96786096, 97812054, 98996037, 100238124, 101432338, 102478447, 103294178, 103823853, 104040199, 103938819, 103528104, 102819732, 101824162, 100551848, 99016695, 97236963, 95231676, 93014940, 90592904, 87966456, 85138849, 82124083, 78951603, 75665332, 72318236]
38547G2318236l352978l308180l220985l100938k956293k792625k613375k421821
38539D8551041k222970k023948j832891j657213j502326j370969j263120j176229
38531C5501375j106029j047852r98096r54940r17805q86012q57775q30214q00149
38522B7102503p64907p22926o74263o21103n67657n19063m79468m50314m29806
38513B1872996m13789l97327l76061l47053l09425k64992k18376j76053j44336
38504A9225584j27245j25339j36183j56174j82752k15573k55861l04525l60454
38495A7361478m19990m77608n27244n63734n84003n87626n76647n54850n26752
38486A2543024m96373m66086m36071m04799l70196l30706k85888k36692j85760
$$ y = [72318236, 68965258, 65657078, 62436093, 59335155, 56378862, 53586237, 50972862, 48551041, 46328071, 44304123, 42471232, 40814019, 39311693, 37940724, 36677604, 35501375, 34395346, 33347494, 32349398, 31394458, 30476653, 29590641, 28732866, 27902652, 27102503, 26337596, 25614670, 24940407, 24319304, 23751647, 23232584, 22753116, 22302802, 21872996, 21459207, 21061880, 20685819, 20338766, 20029341, 19764349, 19545973, 19369920, 19225584, 19098339, 18973000, 18836817, 18680643, 18497891, 18282318, 18026457, 17721932, 17361478, 16941488, 16463880, 15936636, 15372902, 14788899, 14201273, 13624626, 13069776, 12543024, 12046651, 11580565, 11144494, 10739695, 10369499, 10038793, 9752905, 9516213, 9330453]
38477I330453j37344r6425o6959n0259m4635m6517n2130n8381o2886o3850o0457
38466H590610n3418m5113l9167l9582m9442o9395r6890j27022j54655j76373j91146
38455G548407j99812k04088k05649k05318k02767j96861j86555j71712j53273
38446E822372j32887j12247r2619p4585n8040m2354k6674j0261P294K5954M4960
38435E350913O2527P6005Q3018Q2882P7056O8047N7730M6570L4086J9808L894
38424E962536j2832k9156m3951n6624o7314p6672q5287r3252j00096j05102j07733
38413E184517j07751j05083r9794r2283q3401p4006o4206n3130l9751k4172q185
38402D432755N531J4931J9639K0707J9626J7653J5974J6096J9368K5757L3170
$$ y = [9330453, 9193109, 9096684, 9029725, 8979466, 8934831, 8888314, 8836184, 8777803, 8714917, 8651067, 8590610, 8537192, 8492079, 8452912, 8413330, 8363888, 8294493, 8197603, 8070581, 7915926, 7739553, 7548407, 7348595, 7144507, 6938858, 6733540, 6530773, 6333912, 6147357, 5975645, 5822372, 5689485, 5577238, 5484619, 5410034, 5351994, 5309640, 5282966, 5272705, 5279999, 5305953, 5350913, 5413440, 5489445, 5572463, 5655345, 5732401, 5800448, 5858178, 5904748, 5938834, 5958642, 5962536, 5949704, 5920548, 5876597, 5819973, 5752659, 5675987, 5590700, 5497448, 5397352, 5292250, 5184517, 5076766, 4971683, 4871889, 4779606, 4696205, 4622199, 4557993, 4504863, 4465112, 4440940, 4432755, 4438286, 4453217, 4472856, 4493563, 4513189, 4530842, 4546816, 4562912, 4582280, 4608037, 4641207]
38391D641207L8501L9855L8086L6342L8043M4826N5723O7802P7668Q2937Q2797
38380E243787P7488O7360N2486L3131J0434j3485l6185n5894p2275q6506j00445
38369E119896j15288j30651j44954j56788j65848j72549j76812j77468j72984
38360C706554j62838j48261j31708j15495j00670q6944p3621o0594m8543l8185
38350B739695k9537k1970j4924q541l627j025r43k683n072p356r881j3819k0114
38337B600203k8562l7738m5623n0339n0670m6475l8729k8883j7827n452Q747K4608
38325B283260M0770N5084O5537P1058P1980O9901O7113O5830O7556P2677Q0357
38314C011123Q8811R6182J01574J05559J09616J14925J21459J27999J32979J35470
$$ y = [4641207, 4679708, 4719563, 4757649, 4793991, 4832034, 4876860, 4932583, 5000385, 5078053, 5160990, 5243787, 5321275, 5388635, 5441121, 5474252, 5484686, 5471201, 5435016, 5379122, 5306847, 5220341, 5119896, 5004608, 4873957, 4729003, 4572215, 4406367, 4233818, 4057006, 3879538, 3706554, 3543716, 3395455, 3263747, 3148252, 3047582, 2960638, 2887017, 2826423, 2777880, 2739695, 2710158, 2688188, 2673264, 2664723, 2661096, 2660071, 2659128, 2656445, 2651373, 2644017, 2634136, 2620317, 2600203, 2571641, 2533903, 2488280, 2437941, 2387271, 2340796, 2302067, 2273184, 2255357, 2249905, 2258652, 2283260, 2324030, 2379114, 2444651, 2515709, 2587689, 2657590, 2724703, 2790533, 2858089, 2930766, 3011123, 3099934, 3196116, 3297690, 3403249, 3512865, 3627790, 3749249, 3877248, 4010227, 4145697]
38304D145697J35721J35109J35917J41013J53368J75200K07071K47432K92858
38295E769386L38927L81516M18173M49071M76906N05837N40052N82662O35089
38286A0097619O96947P66174Q39104R10154R71248J011599J018427R78850Q82886
38277A8173008P27228N18559K74386K0032k17623m16942n65946o62956p13920
38268A7135826p28339p15724o83898o38887n85464n27341m66943m05146l41501
38259A2042583k75171k06258j36683o9870r333M2933Q7314J26539J65008K07636
38249A1974698K58265L18082L84907M53897N19157N75191O17163O40080O37709
38240A6379149O02322N26079M04104K38234L9438j73203l77207n52959o88161
$$ y = [4145697, 4281418, 4416527, 4552444, 4693457, 4846825, 5022025, 5229096, 5476528, 5769386, 6108313, 6489829, 6908002, 7357073, 7833979, 8339816, 8879868, 9462530, 10097619, 10794566, 11560740, 12399844, 13309998, 14281246, 15292845, 16311272, 17290122, 18173008, 18900236, 19418795, 19693181, 19713213, 19495590, 19078648, 18512702, 17849746, 17135826, 16407487, 15691763, 15007865, 14368978, 13783514, 13256173, 12789230, 12384084, 12042583, 11767412, 11561154, 11424471, 11354601, 11345268, 11388201, 11475515, 11602054, 11767062, 11974698, 12232963, 12551045, 12935952, 13389849, 13909006, 14484197, 15101360, 15741440, 16379149, 16981471, 17507550, 17911654, 18149888, 18189326, 18016123, 17638916, 17085957, 16397796]
38231A6397796p78623q26110q35605q13717p68284p08042o41454n74834n11039
38222I940088m49718l89237l28932k70235k16013j68976j30422j00231p7689o2164
38212G746471n3090m9612n0623n5179o2632p2215q2506r1423r6811r7262r2896
38201F942222q5766p9437p7539q2113r2833j07568j23496j38021j49239j56209
38191E850001j59090j59121j58336j58959j62421j68411j74760j78514j77593
38182D352796j71885j63264j54832j49831j50509j57278j68462j80805j90270
38173B865660j92909j85744j67654j39931j05966p0203l6870q964J2346K7920
38163A997685M0169N1899O4973P9650R5029J10074J24256J37414J49234J59016
$$ y = [16397796, 15619173, 14793063, 13957458, 13143741, 12375457, 11667415, 11025961, 10451127, 9940088, 9490370, 9101133, 8772201, 8501966, 8285953, 8116977, 7986555, 7886324, 7808635, 7746471, 7693381, 7643769, 7593146, 7537967, 7475335, 7403120, 7320614, 7229191, 7132380, 7035118, 6942222, 6856456, 6777019, 6699480, 6617367, 6524534, 6416966, 6293470, 6155449, 6006210, 5850001, 5690911, 5531790, 5373454, 5214495, 5052074, 4883663, 4708903, 4530389, 4352796, 4180911, 4017647, 3862815, 3712984, 3562475, 3405197, 3236735, 3055930, 2865660, 2672751, 2487007, 2319353, 2179422, 2073456, 2003253, 1966383, 1957419, 1969765, 1997685, 2037854, 2089753, 2154726, 2234376, 2329405, 2439479, 2563735, 2701149, 2850383, 3009399]
38153C009399J65818J68644J66484J58243J42873J19824Q9809N5197J9443j4496
38143D081238m5565p4479j02163j28329j51451j69842j82491j88949j88786j81424
38133B667759j66567j44830j18084q9234o1557l7921k0247r168l933k658l158
38122B010402m032n275p919j2992k0582k9602l8466m6125n2730n9408o7327p6823
38110A589121q7046r6292j02746j05360j04415j01304r7549r3779q9396q3050
38100F28184p3443n9917m2679k2678j418J9025L5850M5717M5808L5388J6820m888
38088F21769k3881l5589l8103l2319k0973p246O347J8241K7355L2439L2077K5405
38076F05522J2970l167k0286l5984m8575n6768n9422n5808m6153l1805j4773K881
$$ y = [3009399, 3175217, 3343861, 3510345, 3668588, 3811461, 3931285, 4021094, 4076291, 4095734, 4081238, 4035673, 3961194, 3859031, 3730702, 3579251, 3409409, 3226918, 3037969, 2849183, 2667759, 2501192, 2356362, 2238278, 2149044, 2087487, 2049566, 2029319, 2020151, 2016218, 2013560, 2010402, 2006370, 2001095, 1993176, 1980184, 1959602, 1930000, 1891534, 1845409, 1792679, 1733271, 1665944, 1589121, 1502075, 1405783, 1303037, 1197677, 1093262, 991958, 894409, 800630, 711234, 628184, 554741, 494824, 452145, 429467, 428049, 447074, 482924, 528641, 574449, 609837, 626657, 621769, 597888, 562299, 524196, 491877, 470904, 463658, 470005, 488246, 515601, 548040, 580117, 605522, 618492, 615325, 595039, 559055, 510480, 453712, 394290, 338482, 292329, 260524, 245751, 248632]
38064B48632J9333L2887M2006M5787M4511L9640L3091K6404K0483J5845J2976
38053E81595J2489J5104K1444L1572M4534N8456P1252Q1385Q8038R0813Q9471
38042A186153Q3969P4620O2049M6978K9921J0978j0022l2978n6808p9185r7062
38031A218613j07642j09146j00987q3592n8393k8063L467L1890N4120O9665Q0657
38020I70589R0398J01366J13907J26157J35043J37670J32487J19685J00692P7223
38010B105217N0574K1656q363l7415o2504q0482q9209q8529q0530o9076n8715
37999A602624n3285n4619o1987p2779q4070r3940j01603j06511j07634j03744
37989G62452r4250p9694o1481m1493k2072o137L271M109l702j8440l7592n8639
$$ y = [248632, 267965, 300852, 342858, 388645, 433156, 472796, 505887, 532291, 552774, 568619, 581595, 594084, 609188, 630632, 662204, 706738, 765194, 836446, 917831, 1005869, 1096682, 1186153, 1270122, 1344742, 1406791, 1453769, 1483690, 1494668, 1484646, 1451668, 1394860, 1315675, 1218613, 1110971, 1001825, 900838, 817246, 758853, 730790, 734257, 766147, 820267, 889932, 970589, 1060987, 1162353, 1276260, 1402417, 1537460, 1675130, 1807617, 1927302, 2027994, 2105217, 2155791, 2177447, 2169084, 2131669, 2069165, 1988683, 1899474, 1810945, 1730415, 1661339, 1602624, 1549339, 1494720, 1432733, 1359954, 1275884, 1181944, 1080341, 973830, 866196, 762452, 668202, 588508, 527027, 485534, 463462, 457325, 460596, 464705, 461003, 442563, 404971, 346332]
37977C46332p8820r4496j01441r6561p9899n5335k9245p875N104R744R201P825
37965a65466R037J4118K2327L1770M0234M5658M6456M1916L2606K0417P994k355
37953A44712r606j4117j6774j8001j7654j5642j2462r040o361n436p509j3704
37941a594k4131l7136m9640n8469o1838o0124n5502n0863m8641n0200n5726o4380
37929f18244p4534q4194r1453r4693r2593q4354p0382n2704l4405j8350o240J415
37917a320731M904N174L869L171N313J2083K4302M1320O0722P8901R2495R9831
37905h88646J01331R8785R4246Q9285Q4660Q0152P4573O6278N4176L8577K1291
37894h5292M855q552j7957k3946k8272l2850l8577m4862n0103n2712n1845m7598
$$ y = [346332, 267512, 173016, 71575, -24986, -104885, -160220, -189465, -197340, -192236, -182492, -173291, -165466, -156429, -142311, -119984, -88214, -47980, -2322, 44134, 86050, 118656, 139073, 147067, 144712, 135106, 120989, 104215, 86214, 68560, 52918, 40456, 31416, 25055, 19619, 12110, -1594, -25725, -62861, -112501, -170970, -232808, -292932, -348434, -399297, -447938, -498138, -553864, -618244, -692778, -776972, -868425, -963118, -1055711, -1140065, -1210447, -1263151, -1297556, -1315906, -1322146, -1320731, -1315827, -1310653, -1306784, -1303613, -1298300, -1286217, -1261915, -1220595, -1159873, -1080972, -988477, -888646, -787315, -688530, -594284, -504999, -420339, -340187, -265614, -199336, -145160, -106583, -85292, -80437, -88989, -106946, -130892, -159164, -192014, -230591, -275453, -325556, -378268, -430113, -477711]
37882d77711m0806l2623k3946j4916m847P392K2797M1628O2822Q3704J00480J09616
37870a66410J09283R9936Q3655O2955L9889J5896p874l0108m9083o2834o9763
37859B5542o9488o3412n4349m5278l7977l2493k7695k2379j6155r774m821k854
37847c61133m338q108j1777j2960j0370m309L608J1177J6542J8972J9027J8020
37835c25649J7168J7021J7384J7527J6493J3361P383k070j5580l3285n3955p4242
37823c98444q8972r2795q2291n7460k1989J7640N3754P9283Q9221Q1321N6227
37812c64505J7351k9504p7206j19079j50562j69747j76679j72292j57725j34155
37802a534103j02929o6007k6549J1086M2474O4890P8161Q3776Q3247P7328O6728
$$ y = [-477711, -518517, -551140, -575086, -590002, -594849, -587457, -564660, -523032, -460210, -376506, -276026, -166410, -57127, 42809, 126464, 189419, 229308, 245204, 237330, 207222, 158139, 95305, 25542, -43946, -107358, -161707, -206985, -244962, -277455, -305150, -327529, -343684, -353458, -358279, -361133, -365471, -373579, -385356, -398316, -408686, -412995, -409387, -398210, -381668, -362696, -343669, -325649, -308481, -291460, -274076, -256549, -240056, -226695, -219312, -221382, -236962, -270247, -324202, -398444, -487416, -580211, -662502, -719962, -741951, -724311, -670557, -591274, -502053, -420732, -364505, -347154, -376658, -453864, -572943, -723505, -893252, -1069931, -1242223, -1399948, -1534103, -1637032, -1703039, -1729588, -1718502, -1676028, -1611138, -1532977, -1449201, -1365954, -1288626, -1221898]
37791a221898N3178L9417K8121K0741J7244J6667J7916K0267K3347K6636K8905
37780i29459K8127K2257J0478n958k3890l9328m8777n0204m3407k9874j2320N911
37768a116444K1552L2064L6031L3173K4124J0325n840k1045l1689l5174l1084
37757a084007k1382r516J074Q268J1819J2966J3306J3613J3374J1291O273j865
37745a024786j2458k4532l7348n0303o2296p1051p3259o5691m6611j6600K1641
37734a463294O4100J06338J44178J74170J93851K01854J98043J83563J60569J31638
37724I5010R9278O5872L3886N929j5562k8732l2634k7538j5212J203J7921L1556
37712B30977L9766M1171L5029K1384J793k0145l9421n1471n4363m9788m2176l6395
$$ y = [-1221898, -1168720, -1129303, -1101182, -1080441, -1063197, -1046530, -1028614, -1008347, -985000, -958364, -929459, -901332, -879075, -868597, -874555, -898445, -937773, -986550, -1036754, -1080161, -1110035, -1122355, -1116444, -1094892, -1062828, -1026797, -993624, -969500, -959175, -965015, -986060, -1017749, -1052923, -1084007, -1105389, -1114905, -1113831, -1105563, -1093744, -1080778, -1067472, -1053859, -1040485, -1029194, -1022921, -1024786, -1037244, -1061776, -1099124, -1149427, -1211723, -1282774, -1356033, -1421724, -1468335, -1484935, -1463294, -1399194, -1292856, -1148678, -974508, -780657, -578803, -380760, -197197, -36628, 95010, 194288, 260160, 294046, 299975, 284413, 255681, 223047, 195509, 180297, 181500, 199421, 230977, 270743, 311914, 346943, 368327, 370120, 349975, 310554, 259083, 204720, 154932, 112756, 76361]
37700G6361l5436l9457m6425n3555n8483n9743n6744m9603l8987k5947j1751K264
37688c97506J4817K4826L1463L4238L3128K8624K1511J2396J568j0596k3029l3881
37676b62441m1191m3658m0829l2751j9633j944J9294M2531O6092Q8566J08833
37665a17131J25862J38624J46022J46678J38853J21112R3931O1010K8880M454
37655H88295q035q621q23J0759K2647L3224M1956M8220N0800M8215L9431K4298
37643A190366L529k1625m9689p8993j07491j32718j52085j63296j64653j55237
37633A68108j35256j06490p2396l7463n866J9899L9587N4468O5803P3673P7085
37622A41152P4959O6942N3491L5481J3907j0240l5976o2164q7294j09543j27342
$$ y = [76361, 40925, 1468, -44957, -98512, -156995, -216738, -273482, -323085, -362072, -388019, -399770, -397506, -382689, -357863, -326400, -292162, -259034, -230410, -208899, -196503, -194935, -205531, -228560, -262441, -303632, -347290, -388119, -420870, -440503, -442447, -423153, -380622, -314530, -225964, -117131, 8731, 147355, 293377, 440055, 578908, 700020, 793951, 854961, 883841, 888295, 880260, 871639, 870816, 881575, 904222, 937446, 979402, 1027622, 1078422, 1126637, 1166068, 1190366, 1193895, 1172270, 1122581, 1043588, 936097, 803379, 651294, 487998, 323345, 168108, 32852, -73638, -146034, -183497, -189363, -169464, -129877, -75409, -9606, 64067, 141152, 216111, 283053, 336544, 372025, 385932, 375692, 339716, 277552, 190258, 80715, -46627]
37611d6627j39985j47741j51320j51090j46660j37185j22269j02855q1223o0010
37601a286965m1023k4811j0925J731J4774L0057M8970P1579R6193J19810J39336
37590h41274J52862J60065J61307J56258J43430J21155Q9212M9831P621l1437
37580A69030o1545p8793q2204p3644n6705l5506j3927M777J8402K6169K8594K6804
37568a28548K1724J3890M019o390j5276k1173k4334k6727l0877l8428m9360o2002
37556c63482p3385p9641p6685o1543l4001K476M1547P6276J01574J15262J17531
37545b34071J09740R3747P1981M7662K4530O113n173q665n554J612R986J7499
37533A29407K3366K7763L0961L2728L2362K9240K3248J4775M428p105j8975l0198
$$ y = [-46627, -186612, -334353, -485673, -636763, -783423, -920608, -1042877, -1145732, -1226955, -1286965, -1327988, -1352799, -1363724, -1361993, -1347219, -1317162, -1268192, -1196613, -1100420, -980610, -841274, -688412, -528347, -367040, -210782, -67352, 53803, 143015, 192846, 200467, 169030, 107485, 28692, -53512, -127156, -183861, -219367, -233294, -228517, -210115, -183946, -155352, -128548, -106824, -92934, -88915, -95305, -110581, -131754, -156088, -182815, -213692, -252120, -301480, -363482, -436867, -516508, -593193, -654736, -688737, -686261, -644714, -568438, -466864, -351602, -234071, -124331, -30584, 41397, 89059, 113589, 119702, 114529, 105864, 100310, 101922, 111908, 129407, 152773, 180536, 211497, 244225, 276587, 305827, 329075, 343850, 348278, 341173, 322198, 292000]
37521B92000m0122m9054n8333o9567q3352r8234j10604j15588j08766q8215n6061
37510e85896j8549J5901L9900M9917M7029L5338J9404K470j3707k7963l8995m5594
37498e20745m7553m6387m5115m7098n4679o8324q6441j05711j21798j30467j28809
37487a403127j16082r3712o4570l2053P02L1215N7672P8712R3366J01328J03217
37476a243332J00391R4178Q5184P3338N8717M2528K7478J6975J3546J7384K5936
37465f87677L4869L9843L8162K9600J6139R31j2941k3311k9275l1099k9817k6655
37453f81231k2473j7517j1671m883K434R262J4163J5859J3990R445L860j353n651
37440f75766r159j2022j3995j4598j3486j0581n941K78P629J5156K1696K6537
$$ y = [292000, 251878, 202824, 144491, 74924, -8428, -106662, -217266, -332854, -441620, -529835, -585896, -604445, -588544, -548644, -498727, -451698, -416360, -396956, -394486, -408193, -436156, -475151, -520745, -568298, -614685, -659800, -706898, -761577, -829901, -916342, -1022053, -1143851, -1274318, -1403127, -1519209, -1612921, -1677491, -1709544, -1708842, -1677627, -1619955, -1541243, -1447877, -1346549, -1243332, -1142941, -1048763, -963579, -890241, -831524, -788996, -761518, -744543, -730997, -713613, -687677, -652808, -612965, -574803, -545203, -529064, -528133, -541074, -564385, -593660, -624759, -654576, -681231, -703704, -721221, -732892, -737775, -735341, -726079, -711916, -696057, -682067, -672622, -668762, -670115, -675766, -684925, -696947, -710942, -725540, -739026, -749607, -755548, -755270, -747641, -732485, -710789, -684252]
37428f84252K9794L1978L3149L2542K9065K2328J3339M380j877l645r26M647J1026
37415d78452J7086K3021K9425L6089M1633M4216M2607L6671K7130J5209K472r198
37403a72091j7951k2530k2613j8704j1802l305M968J0999J3304J1806Q048M360
37391b15511K340J763R48j672n985j0020j1172p645J012J4298L1215N0250O9181
37378h0998Q5299R6221J00789R9514R4197Q6959P9270P1642O4041N6581M9680
37367H03195M3594L7813L0950K1208P061j2175l6203o3927r3671j23013j48399
37356D66433j65359j69996j61172j41823j18103r6769q2307p5424p3514p2593
37346f90627o9551o3593n6355n0740m9083n1488n5473n7369n4816m8347m0728
$$ y = [-684252, -654458, -622480, -589331, -556789, -527724, -505396, -492057, -487677, -489554, -493199, -494125, -489478, -478452, -461366, -438345, -408920, -372831, -331198, -286982, -244375, -207704, -180574, -165365, -162893, -172091, -190042, -212572, -235185, -253889, -265691, -268996, -264028, -253029, -239725, -227919, -219871, -215511, -213171, -211408, -210460, -212132, -218117, -228137, -239309, -246954, -245942, -231644, -200429, -150179, -80998, 4301, 100522, 201311, 300825, 395022, 481981, 561251, 632893, 696934, 753515, 803195, 846789, 884602, 915552, 936760, 943821, 931646, 895443, 831516, 737845, 614832, 466433, 301074, 131078, -30094, -171917, -290020, -386789, -469096, -544520, -618034, -690627, -760178, -823771, -880126, -930866, -979949, -1031437, -1086910, -1144279, -1199095, -1247442, -1288170]
37335a288170l4687l1143k9202k7339k4262j8987j0725Q29J5121L0869M6986O3571
37323a307139Q2127J04661J32105J63277J95013K23395K45083K58057K61562K55784
37313F13925K41686K21032J96180J69328J41495J12078P9513M2533J053m3817
37303A775006r0139j35251j75668k07210k25749k28344k14341j85890j47651j05506
37293E9257o4936k9760j852J8468L1921L9872M3927M5297M4285M0292L2641K1538
37281B80950Q493m251j5011k3801l2362m2782n5457o8031p6349p6954o9244n5829
37269b30628m0966k8323j9446j3627q950l577L525J2809K4669L9477N6734P4071
37257a34232Q7251R1750Q5138O8593M6367K3606M118j0487k0281k5976k8368k8377
$$ y = [-1288170, -1322857, -1354000, -1383202, -1410541, -1434803, -1453790, -1464515, -1463686, -1448565, -1417696, -1370710, -1307139, -1225012, -1120351, -988246, -824969, -629956, -406561, -161478, 96579, 358141, 613925, 855611, 1076643, 1272823, 1442151, 1583646, 1695724, 1775237, 1817770, 1818823, 1775006, 1684867, 1549616, 1373948, 1166738, 940989, 712645, 498304, 312414, 164763, 59257, -5679, -35439, -37291, -18823, 13098, 52970, 96897, 142194, 186479, 226771, 259412, 280950, 289443, 285192, 270181, 246380, 214018, 171236, 115779, 47748, -28601, -105555, -174799, -230628, -271594, -299917, -319363, -332990, -341940, -345517, -341992, -329183, -304514, -265037, -208303, -134232, -46981, 44769, 129907, 198500, 244867, 268473, 272591, 262104, 241823, 215847, 187479, 159102]
37245A59102k7416k7568l1327m0863n7193p9515j05265j30944j53386j70586j81529
37234h46490j85399j81247j68529j47893j21123r0305n7034k2375J2601M6281
37224a761513P6571J01516J20154J32884J40939J45546J47488J47486J46527J45645
37214d56757J45073J43603J38621J26968J06375P6893M1413M778k8210n4660p4241
37203A69856q8393r8804j06278j10721j12014j10727j08110j05441j03430j01992
37193h76054j00332r7170r1084q0878o5871m6130k2804J748K4493M2932N6365
37182a254785O6183P4869Q4275R4259J02652J06561J04035R4921Q0500O2603M3111
37171c40816K4010P494m429j0642j1446q389l527J377N236P372P127L809k735
$$ y = [159102, 131686, 104118, 72791, 31928, -25265, -104780, -210045, -340989, -494375, -664961, -846490, -1031889, -1213136, -1381665, -1529558, -1650681, -1740986, -1798020, -1820395, -1807794, -1761513, -1684942, -1583426, -1463272, -1330388, -1189449, -1043903, -896415, -748929, -602402, -456757, -311684, -168081, -29460, 97508, 203883, 280776, 322189, 326967, 298757, 244097, 169856, 81463, -17341, -123619, -234340, -346354, -457081, -565191, -670632, -774062, -876054, -976386, -1073556, -1164640, -1245518, -1311389, -1357519, -1380323, -1378575, -1354082, -1311150, -1254785, -1188602, -1113733, -1029458, -935199, -832547, -725986, -621951, -527030, -446530, -383927, -340816, -316806, -309312, -313741, -324383, -335829, -344218, -347745, -346368, -341132, -333760, -326633, -322824, -325559]
37158c25559j1542k0567k7584l1289l1546k8623k2213j1487L816K2218M0578N5411
37146c88387O4304O6428O2058N1943L7110J8979o58k0043l7867n3485o6734p7608
37134c43960q5961r1448r3787r3005q9406q3216p4252o1955m5702k5340j907K1727
37122a068212M1155N2119N2760M4631L1479J6772J908j3726l1158n0147o8552
37111i90971q3209r1439r2067q5405p2805n6467l9361k4751j5271j2177j5127
37100a579050k2126k9661l3431k9935j8097K89K1670M2422O0081P3554Q2786Q8335
37088a343163R1130R2309R2922R3516R3851R3030R0001Q4029P4811O2337M6789
37077d28438K8800R826p930k2373l2691l9916m6256n3733o3215p4476q6814r9443
$$ y = [-325559, -337101, -357668, -385252, -416541, -448087, -476710, -498923, -510410, -506594, -484376, -443798, -388387, -324083, -257655, -195597, -143654, -106544, -87565, -88223, -108266, -146133, -199618, -266352, -343960, -429921, -521369, -615156, -708161, -797567, -880783, -955035, -1016990, -1062692, -1088032, -1089939, -1068212, -1027057, -974938, -922178, -877547, -846068, -829296, -827388, -841114, -872272, -922419, -990971, -1074180, -1165619, -1257686, -1343091, -1415896, -1472363, -1511724, -1536475, -1551746, -1563923, -1579050, -1601176, -1630837, -1664268, -1694203, -1712300, -1712011, -1690341, -1647919, -1587838, -1514284, -1431498, -1343163, -1252033, -1159724, -1066802, -973286, -879435, -786405, -696404, -612375, -537564, -475227, -428438, -399638, -389812, -397742, -420115, -452806, -492722, -538978, -592711, -655926, -730402, -817216, -916659]
37065i16659j11438j21576j28513j31039j28177j19065j03123q0528n2675k2003
37055a914796Q768L7390O2249Q2013R5248J00588R7293Q5889O8396M8092K8799
37044a200071J4021O119N845J2345K3537L6757M9386N9417O5728O8071O6820O2814
37032g29211N7422N2646N0798N3651O1473P2516Q3313Q9814Q9042Q0532O6553
37021B8549N0747L6177K4282J5297R233O248O265Q633J2249J5796J7896J7211
37009B48583J2892N259l738j0753j2005m877J0607L1284N1825O6799P2681O8807
36997E37364N7136M1237K5048J1654K407l291p285j1393j6488k2539k9266l6559
36985E48025m4230n1475n6782n8390n4926m5743l0899j0861J3720M1918P2189
$$ y = [-916659, -1028097, -1149673, -1278186, -1409225, -1537402, -1656467, -1759590, -1840118, -1892793, -1914796, -1906028, -1868638, -1806389, -1724376, -1629128, -1528540, -1431247, -1345358, -1276962, -1228870, -1200071, -1186050, -1179931, -1174086, -1161741, -1138204, -1101447, -1052061, -992644, -926916, -858845, -792025, -729211, -671789, -619143, -568345, -514694, -453221, -380705, -297392, -207578, -118536, -38004, 28549, 79296, 115473, 139755, 155052, 164285, 170533, 176798, 185431, 197680, 213476, 231372, 248583, 261475, 266734, 262996, 252243, 240238, 235361, 245968, 277252, 329077, 395876, 468557, 537364, 594500, 635737, 660785, 672439, 674846, 671555, 664270, 652877, 636389, 613850, 584584, 548025, 503795, 452320, 395538, 337148, 282222, 236479, 205580, 194719, 208439, 250357, 322546]
36974C22546J02102J28523J48265J58791J58726J48048J28026J00858O9025L4792
36964A499702N2l3460o3874q9185j07626j18108j20494j15560j04872r0761p6098
36953E79716o3575n4701m9310m6136m3966m2377m1403m0590l8523l3479k4887
36942A00769j4337n215j059l812j2988k6081l9586n0206n5810n5888n1253m3228
36930b58694l3101k2055j1260j522P368J6774K8325M2532N7997P1930Q1644Q5997
36918F5935Q5742Q2623P7907P1499O2230M8984L1718J1764q637k6987m1063m9263
36906D12452n0918m6557l7881k7353j7572j0681p931r514j4758k2675l2596m4345
36894H9671n7801p2244q6188r7751j05263j07590j04298r5690q2747o6856m9534
$$ y = [322546, 424648, 553171, 701436, 860227, 1018953, 1167001, 1295027, 1395885, 1464910, 1499702, 1499754, 1466294, 1402420, 1313235, 1205609, 1087501, 967007, 851447, 746575, 655814, 579716, 516141, 461440, 412130, 365994, 322028, 279651, 238248, 197658, 159135, 125656, 100769, 86432, 81217, 80158, 76346, 63358, 37277, -2309, -52515, -108325, -164213, -215466, -258694, -291795, -313850, -325110, -326632, -319264, -302490, -274165, -231633, -173636, -101706, -20062, 65935, 151677, 234300, 312207, 383706, 445936, 494920, 526638, 538402, 529765, 502778, 461715, 412452, 361534, 314977, 277096, 249743, 232171, 221490, 213559, 204045, 189287, 166612, 134016, 89671, 31870, -40374, -126562, -224313, -329576, -437166, -541464, -637154, -719901, -786757, -836291]
36883h36291l2320j6690l743O087J2977J7123J8323J6212J1077M507p95k048K338
36870h03243J2092K5442M0096N4070O5889P4385P8577P7940P2952O5513N8707
36859a77580N5594N7565O3381O9662P2477O9033N8773M3657K7461J4174O209L626
36847C64032M942Q735J4682K3383L5400N0259O5991P9382Q6804Q5340P3753N2996
36835I45699K6102k403k7417m4393n0446m5155l0558j0317J1601L1863M8093N8779
36823I11448O3132O0915N2347L8157J9867o9j8721l3534m3017m6853m5669m0780
36811I17223l3922k6928k1222j7414j5182j3532j1332p736k338M856J3367K2160
36799H08000K9848L5171L7444L6658L3327K8410K3295J9617J8803K1638K7975
$$ y = [-836291, -868611, -885301, -889044, -882957, -869980, -852857, -834534, -818322, -807245, -802738, -803533, -805581, -803243, -791151, -765709, -725613, -671543, -605654, -531269, -452692, -374752, -301800, -236287, -177580, -121986, -64421, -1040, 68622, 141099, 210132, 268905, 312562, 340023, 354197, 360406, 364032, 368974, 377709, 392391, 415774, 451174, 501433, 567424, 646806, 733610, 818950, 892703, 945699, 971801, 969398, 941981, 897588, 847142, 801987, 771429, 761112, 772713, 804576, 852669, 911448, 974580, 1035495, 1087842, 1125999, 1145866, 1145797, 1127076, 1093542, 1050525, 1003672, 958003, 917223, 883301, 856373, 835151, 817737, 802555, 789023, 777691, 769955, 767617, 772473, 785840, 808000, 837848, 873019, 910463, 947121, 980448, 1008858, 1032153, 1051770, 1070573, 1092211, 1120186]
36788A120186L6678M5800N3110N6930N6909N4085N0046M5662M0350L2542K0926
36777A613224N494j2311l0146m5404n5867o0470n9951n6623n3008n0245m7648
36766A147045m3778l7966l1009k4558k0040j7990j8054j9400k1097k2476k3320
36755H67357k3718k3602k2425j9444j4541q712l668r02j149m617j1366k1171l3033
36742F79009m5130n5510o2954o7222o8547o7033o2559n5072m4896l2632j8994
36731I8460m777Q882K0411K8159L1156K9792K5900K2020K0163K0836K2967K4816
36719C48785K5214K4270K3027K2487K2739K2834K1287J6725Q333l903j8963l4712
36707D78123m8328n7301o0448n8232n2031m2956l1018j5157O050L3412O6363J02545
$$ y = [1120186, 1156864, 1202664, 1255774, 1312704, 1369613, 1423698, 1473744, 1519406, 1559756, 1592298, 1613224, 1618718, 1606407, 1576261, 1530857, 1474990, 1414520, 1354569, 1297946, 1244938, 1194693, 1147045, 1103267, 1065301, 1034292, 1009734, 989694, 971704, 953650, 934250, 913153, 890677, 867357, 843639, 820037, 797612, 778168, 763627, 754915, 751247, 750345, 749196, 744579, 733213, 712042, 679009, 633879, 578369, 515415, 448193, 379646, 312613, 250054, 194982, 150086, 117454, 98460, 93683, 102565, 122976, 151135, 182291, 212083, 237983, 260003, 280166, 301002, 323969, 348785, 373999, 398269, 421296, 443783, 466522, 489356, 510643, 527368, 535701, 531798, 512835, 478123, 429795, 372494, 312046, 253814, 201783, 158827, 127809, 112652, 118702, 152114, 218477, 321022]
36695C21022J37977J67780J87465J94363J88499J72325J49372J22712R4267O5255
36685A801037L7112J1744r196k5310l7575m7273n4622n8325n6533m8375l4803
36674A477881j8105n14J7014L4917N3931P3656R1951J05816J13017J13157J07333
36663B170054R6854Q2235O3184L9346J1206j9402m9269p4414r1249r7952r5365
36652B035228q6794p6672o8708o4393o2582o0319n4391m2786k5447m292J7252
36641A506096L4980M5037M5294L6429K2007P280k846n751j967N475J2853J7449
36629A722336J8162J4930P907k869j7229l4532n3561p2707r0335j05159j16462
36618A270481j23997j27729j27577j23294j14519j01086q3323o2168l9039j5797
$$ y = [321022, 458999, 626779, 814244, 1008607, 1197106, 1369431, 1518803, 1641515, 1735782, 1801037, 1838149, 1849893, 1840697, 1815387, 1777812, 1730539, 1675917, 1617592, 1561059, 1512684, 1477881, 1459776, 1459262, 1476276, 1511193, 1565124, 1638780, 1730731, 1836547, 1949564, 2062721, 2170054, 2266908, 2349143, 2412327, 2451673, 2462879, 2443477, 2394208, 2319794, 2228545, 2130593, 2035228, 1948434, 1871762, 1803054, 1738661, 1676079, 1615760, 1561369, 1518583, 1493136, 1488844, 1506096, 1541076, 1586113, 1631407, 1667836, 1689843, 1697123, 1694277, 1688526, 1686559, 1692034, 1704887, 1722336, 1740498, 1755428, 1763335, 1760466, 1743237, 1708705, 1655144, 1582437, 1492102, 1386943, 1270481, 1146484, 1018755, 891178, 767884, 653365, 552279, 468956, 406788, 367749, 351952]
36608C51952N180K1264L0585L3299L1970L0584L2726L9957N1022O2228O8890O7286
36596H26943N6119L6711J2116j4070l8593n9011p3685q1442q1181p1995n4007
36585D57905k9414k814J9870L3680L6887L1782K3430J7268J7031K3905L6779N2873
36573G19182O8360P8943Q0656P0994N0123K1461r023l4649n0160n3252m5093k9841
36561H67701j3178k83N905N112j319j2088k6772m5241o6247q6719j02467j09817
36549D14587j06847r3538p1258m2314r792K2601N0989P2110Q4130Q7182Q3160
36538D91010P4822O4658N4162M3790L3380K2711J1857J268q433j6636k2732k6002
36526G23855k5636k1095j2656j704R573J9153K6160L1046L4766L7764L9767M0422
$$ y = [351952, 357132, 378396, 408981, 442280, 474250, 504834, 537560, 577517, 628539, 690767, 759657, 826943, 883062, 919773, 931889, 917819, 879226, 820215, 746530, 665088, 583907, 511912, 457905, 428491, 425677, 445547, 479227, 516114, 547896, 571326, 588594, 605625, 629530, 666309, 719182, 787542, 866485, 947141, 1018135, 1068258, 1089719, 1080696, 1046047, 995887, 942635, 897542, 867701, 854523, 854240, 860145, 865257, 863938, 851850, 825078, 779837, 713590, 626871, 524404, 414587, 307740, 214202, 142944, 100630, 90838, 113439, 164428, 236538, 320668, 407850, 491010, 565832, 630490, 684652, 728442, 761822, 784533, 796390, 797658, 789225, 772589, 749857, 723855, 698219, 677124, 664468, 662764, 672337, 691490, 717650, 748696, 783462, 821226, 860993, 901415]
36514I01415L9826L8285L5556L0466K1193N993j5965m3857p4847j04442j27712
36503G05911j40839j42214j32636j14808r2622p0581n3186m4049m4857n4790p0889
36492b55560q9266j06418j20012j28792j31980j28701j17975r9307p3569m3461
36482a295041j3109J3179L2398M3654M7891M6920M2565L6404K9790K3698J8435
36471i73216J3735R299N391K879K620M667P771R510P139j131j4966l1548m6333
36458a004183n4558n2798l9948j7486J0840L9782O3813P8572Q2116P5256O0789
36447g57805M1998K1331j88k2680m6637p2020r7482j20201j36684j44323j42680
36436a477371j33519j19640j03587q7038p0811n4973l9051k2505n315J1851K7905
$$ y = [901415, 941241, 979526, 1015082, 1045548, 1066741, 1072734, 1056769, 1012912, 938065, 833623, 705911, 565072, 422858, 290222, 175414, 82792, 12211, -40975, -85024, -129881, -184671, -255560, -344826, -451244, -571256, -700048, -832028, -960729, -1078704, -1178011, -1251580, -1295041, -1308150, -1294971, -1262573, -1218919, -1171028, -1124108, -1081543, -1045139, -1015349, -991651, -973216, -959481, -950182, -944791, -941912, -939292, -934625, -926854, -917344, -910205, -911336, -926302, -957850, -1004183, -1058741, -1111539, -1151487, -1168973, -1158133, -1118351, -1054538, -975966, -893850, -818594, -757805, -715807, -694476, -694664, -717344, -763981, -836001, -933483, -1053684, -1190368, -1334691, -1477371, -1610890, -1730530, -1834117, -1921155, -1991966, -2046939, -2085990, -2108495, -2113810, -2101959, -2074054]
36425b074054M1624N1605N6256N4161M4661K8125N758k0613m8490p4540r4785
36414b030292j05434j04155r1052o8643m0847j1737J5126L6928N1859N9579O1249
36403b227419N8786N3932M7812M1075L4095K6998J9737J2395N506N9k743j871
36391a931638K977J0887J9632K6386K8962K6896K1674J5998J2438J2059J3756
36380a739973J4685J1656K693j2010l0126m7985o1755o8674o7928o0811m9952
36369b110180l7811k5327j1658M714K4280M5573O5718Q1967R2999R9158J01683
36358a668884J01742R9775R5449Q7994P6792O2059M5247K8795J5142N539m61m502
36346a055313q329j3055j9229k7502l9018n4990p5550r8725j20434j35749j40694
$$ y = [-2074054, -2032430, -1980825, -1924569, -1870408, -1825747, -1797622, -1791864, -1812477, -1860967, -1935507, -2030292, -2135726, -2239881, -2330933, -2399576, -2440423, -2452160, -2437034, -2400106, -2348247, -2288668, -2227419, -2168633, -2114701, -2066889, -2025814, -1991719, -1964721, -1944984, -1932589, -1927083, -1927024, -1929767, -1931638, -1928661, -1917774, -1898142, -1871756, -1842794, -1815898, -1794224, -1778226, -1765788, -1753729, -1739973, -1725288, -1713632, -1710939, -1722949, -1753075, -1801060, -1862815, -1931489, -1999417, -2060228, -2110180, -2147991, -2173318, -2184976, -2180262, -2155982, -2110409, -2044691, -1962724, -1869725, -1770567, -1668884, -1567142, -1467367, -1371918, -1283924, -1207132, -1145073, -1099826, -1071031, -1055889, -1050350, -1050811, -1055313, -1063642, -1076697, -1095926, -1123428, -1162446, -1217436, -1292986, -1391711, -1512145, -1647894, -1788588]
36335a788588j33541j15065q8008n6216k3653O573L2797N4487P1254Q2029Q5255
36324a872676P9999O7243N0400L4632K4962K4014L0750M1280N1346N8603O3157
36313a346290O6460O9948P4368P9754Q5502R0493R3432R3320Q9834Q3507P5781
36302d43891O8848O5000O5628P0358P7008Q2461Q4066Q0976P4809O9340O9008
36291C63611P6777R2416J12195J30269J40860J40173J27397J04728P6510M7673
36281A412609K2189K362j0794j6911j6100r257J868J5140K8698M1334N2529O2304
36269A585971P0826P7914Q2721Q3922Q0367P1714N8656M2628K5219P629r591k6410
36257B151566m2952n8919p3051q2887q5192p7231n8395l1354j883K2916L7276
$$ y = [-1788588, -1922129, -2037194, -2125202, -2181418, -2205071, -2198498, -2165701, -2111214, -2039960, -1957931, -1872676, -1792677, -1725434, -1675034, -1640402, -1615440, -1591426, -1560676, -1519396, -1468050, -1409447, -1346290, -1279830, -1209882, -1135514, -1055760, -970258, -879765, -786333, -693013, -603179, -519672, -443891, -375043, -310043, -244415, -174057, -97049, -14588, 69478, 150454, 225263, 294603, 363611, 440388, 532804, 644999, 775268, 916128, 1056301, 1183698, 1288426, 1364936, 1412609, 1434798, 1437160, 1426366, 1409455, 1393355, 1384098, 1385966, 1401106, 1429804, 1471138, 1523667, 1585971, 1656797, 1734711, 1817432, 1901354, 1981721, 2053435, 2112091, 2154719, 2179938, 2187567, 2177976, 2151566, 2108614, 2049695, 1976644, 1893757, 1808565, 1731334, 1672939, 1641585, 1639702, 1662618, 1699894]
36246A699894L8963K9707J3899l487j8481k8862l4297l6071l6290l6873l8790
36235A549312m2151m6762n2533n9315o6500p3013p7832q0548q1351q0531p7992
36224H10784p3443o7092o0356n5973n7420o7811q8730j19434j56654j94978k27704
36213c58811k48125k51054k34349j99750j52724j01241n3851j7677L114P981k73
36202a606760j6477l4461m8626n5451n4479m8234m0967l6701l7494m2665m9176
36191b071491n2752m9238l5805j1847K0672N7687R4311J26327J51056J67282J74714
36180a429084J73733J65486J51726J34029J12871Q7616N7572K3342j2644m6848
36170e82201p5869r7454j10732j15787j13046j02991q6296o4238l8946j3280R777
$$ y = [1699894, 1738857, 1768564, 1782463, 1778976, 1760495, 1731633, 1697336, 1661265, 1624975, 1588102, 1549312, 1507161, 1460399, 1407866, 1348551, 1282051, 1209038, 1131206, 1050658, 969307, 888776, 810784, 737341, 670249, 609893, 553920, 496500, 428689, 339959, 220525, 63871, -131107, -358811, -606936, -857990, -1092339, -1292089, -1444813, -1546054, -1599905, -1617582, -1614468, -1606487, -1606760, -1623237, -1657698, -1706324, -1761775, -1816254, -1864488, -1905455, -1942156, -1979650, -2022315, -2071491, -2124243, -2173481, -2209286, -2221133, -2200461, -2142774, -2048463, -1922136, -1771080, -1603798, -1429084, -1255351, -1089865, -938139, -804110, -691239, -603623, -546051, -522709, -535353, -582201, -658070, -755524, -866256, -982043, -1095089, -1198080, -1284376, -1348614, -1387560, -1400840, -1391063]
36159a391063K7960M0530M8374N3092N5608N5377N0901M1051K6048P493j2117
36148i96746k9784m2236m6406m0258k3468K416L4394O8732J01783J30552J52752
36137f88269J66415J69734J61681J43040J16942Q8371O2960M5655L9522M4840
36127C50891N8938P7041R3752J04483J06389R8908Q3845O4743M5588K9327J6980
36116A130885P640o48r654j9997l1033m1455m9987n5687n8052n7193n4075n0350
36104G10394m7759m7421m9391n2677n5539n6031n2654m4983l4049k2078j1603
36093B36209m253QK670N757J0858J8579K8462L9250M9537N8530O6488P4410Q3158
36080F69663R2528J00828J05191J02483R0553O9312M1240J1109j5292l3140m0680
$$ y = [-1391063, -1363103, -1322573, -1274199, -1221107, -1165499, -1110122, -1059221, -1018170, -992122, -984629, -996746, -1026530, -1068766, -1115172, -1155430, -1178898, -1176482, -1142088, -1073356, -971573, -841021, -688269, -521854, -352120, -190439, -47399, 69543, 157914, 220874, 266529, 306051, 350891, 409829, 486870, 580622, 685105, 791494, 890402, 974247, 1038990, 1084578, 1113905, 1130885, 1138525, 1137877, 1128223, 1108226, 1077193, 1035738, 985751, 930064, 872012, 814819, 760744, 710394, 662635, 615214, 565823, 513146, 457607, 401576, 348922, 303939, 269890, 247812, 236209, 231956, 231964, 234634, 240391, 251249, 269828, 298290, 337540, 387077, 445607, 512095, 586505, 669663, 762191, 863019, 968210, 1070693, 1161246, 1230558, 1271798, 1282907, 1267615, 1234475, 1193795]
36069A193795m0244l7348l8001m5742o0107p7292r2274j01010j01536r3722p8375
36058D28144n6486k9191J779L3749O3242Q6611J00847J04373R7521Q2389O2134
36047I75112M0147J9638L546n792p378k294O355J4392J8104J5669P845k474j1654
36034A071216j6901j7286j3842r019n627n683r681j6706k5154l3412m0306m5534
36022H32065n0133n6393o6812q2660j03200j26036j47998j65872j76746j78209
36012c21994j68601j47301j15057p4236k8683J7065N9035R4778J23377J44568
36002d17049J57731J61644J55103J38025J12337Q2145N2852K9402J4546Q141P869
35991E02746J0813J4811J9089K4066L0659L9426N0077O1571P2622Q2242R0148
$$ y = [1193795, 1153551, 1116203, 1078202, 1032460, 972353, 895061, 802787, 701777, 600241, 506519, 428144, 371658, 342467, 344246, 377995, 441237, 527848, 628695, 733068, 830589, 912978, 975112, 1015259, 1034897, 1038443, 1032651, 1025273, 1022979, 1029334, 1043726, 1061830, 1077499, 1085344, 1082870, 1071216, 1054315, 1037029, 1023187, 1014168, 1008541, 1002858, 993177, 976471, 951317, 917905, 877599, 832065, 781932, 725539, 658727, 576067, 472867, 346831, 198833, 32961, -143785, -321994, -490595, -637896, -752953, -827189, -855872, -838807, -779772, -684994, -561617, -417049, -259318, -97674, 57429, 195454, 307791, 389936, 442788, 472190, 486736, 494877, 502746, 513559, 528370, 547459, 571525, 602184, 641610, 691687, 753258, 825880, 908122, 998270]
35980I98270R6899J03612J11129J19127J25944J29323J27655J20793J10179R8310
35970B141241Q7790Q0152P4960O9783O1211M6329K3862n314l8216p0359r7026
35959B374413j14941j23407j24121j19811j12762j04070r3861q2021o9066n6511
35949A373842m6462m0593l9432m2570m9289n8718o9413p9305q6533r0572r2597
35938F78358r4662r8411j04179j11072j17835j23830j29282j34450j38502j39338
35928e13203j34733j24097j09343r4139q1918p3908o8388o1705n0328l2624r176
35917a353562J8179M7554P7259J05225J28621J44414J50660J47396J36553J21188
35907b76513J04632Q9734P8095O9499O2172N3951M3735L2088K0673J1087M044
$$ y = [998270, 1095169, 1198781, 1309910, 1429037, 1554981, 1684304, 1811959, 1932752, 2042931, 2141241, 2229031, 2309183, 2384143, 2453926, 2515137, 2561466, 2585328, 2580014, 2541798, 2471439, 2374413, 2259472, 2136065, 2011944, 1892133, 1779371, 1675301, 1581440, 1499419, 1430353, 1373842, 1327380, 1286787, 1247355, 1204785, 1155496, 1096778, 1027365, 948060, 861527, 770955, 678358, 583696, 485285, 381106, 270034, 152199, 28369, -100913, -235363, -373865, -513203, -647936, -772033, -881376, -975515, -1057433, -1131341, -1199729, -1261434, -1311762, -1344386, -1353562, -1335383, -1287829, -1210570, -1105345, -976724, -832310, -681650, -534254, -397701, -276513, -171881, -82147, -4052, 65447, 127619, 181570, 225305, 257393, 278066, 289153, 293197]
35896B93197p09l893o011o798n051J195J4101L5080O3667R6734J28904J54335
35884G64751J68881J71134J61917J43276J18072R0070O3593M2341K8278K1397
35874A773710K0314K3056K7630L2313L5751L6865L4738K8821J9410P934l288j1804
35862B025450j5915j5364j1499o746l522l245n943j0713j6484k2504k8408l4083
35850A851024l9532m4861n0158n5307n9912o3414o5319o5364o3571o0235n5765
35839A227586n0402m3964l6029k6563j6630q439m552o609j4203k4523l2954l4520
35827I28198k5666n628K3214N6218Q8194J15162J35347J48909J56778J59565J57252
35816A937543J49703J37126J20083R9431P6606N4000L4592K0564J1924O375P45
$$ y = [293197, 292488, 288595, 282584, 275786, 270735, 271930, 286031, 321111, 384778, 481512, 610416, 764751, 933632, 1104766, 1266683, 1409959, 1528031, 1618101, 1681694, 1724035, 1752313, 1773710, 1794024, 1817080, 1844710, 1877023, 1912774, 1949639, 1984377, 2013198, 2032608, 2040542, 2037254, 2025450, 2009535, 1994171, 1982672, 1975926, 1972404, 1969159, 1963216, 1952503, 1936019, 1913515, 1885107, 1851024, 1811492, 1766631, 1716473, 1661166, 1601254, 1537840, 1472521, 1407157, 1343586, 1283351, 1227586, 1177184, 1133220, 1097191, 1070628, 1053998, 1045559, 1041007, 1034398, 1020195, 995672, 962718, 928198, 902532, 896904, 920118, 976336, 1064530, 1179692, 1315039, 1463948, 1620726, 1780291, 1937543, 2087246, 2224372, 2344455, 2443886, 2520492, 2574492, 2609084, 2629648, 2641572, 2647947, 2648692]
35805B648692p018j6582k5362k9765k6837j5606K362K3238M1977N3902N6323M9553
35793B754877L6798K2840J2181P566R467J6505K6324L6569M5695N3370O0143O6496
35781C148831P1869P4467P2011O3001M7833K9247J1815M86j299P113K3650M4717
35769C593741O6664Q6564J02072J10947J11036J01161Q2158N6968K9409K497k2452
35758D320765m5487o7140q7676j06779j23640j37303j47135j53047j55423j54866
35748C142269j51957j47200j41109j34393j28029j22916j19324j16528j13095
35739A967718j07587r9147q7664p3668n8274m3274l0984k3573k1897k4654k8644
35728A368352l0202k7077j9498r721l84P257J3911K1285L0435M0711N0040N6047
$$ y = [2648692, 2641674, 2625092, 2599730, 2569965, 2543128, 2527522, 2529884, 2553122, 2595099, 2649001, 2705324, 2754877, 2791675, 2814515, 2826696, 2834262, 2843729, 2860234, 2886558, 2923127, 2968822, 3022192, 3082335, 3148831, 3220700, 3295167, 3367178, 3430179, 3478012, 3507259, 3519074, 3519560, 3518261, 3525374, 3549024, 3593741, 3660405, 3746969, 3849041, 3959988, 4071024, 4172185, 4254343, 4311311, 4340720, 4343217, 4320765, 4275278, 4208138, 4120462, 4013683, 3890043, 3752740, 3605605, 3452558, 3297135, 3142269, 2990312, 2843112, 2702003, 2567610, 2439581, 2316665, 2197341, 2080813, 1967718, 1860131, 1760984, 1673320, 1599652, 1541378, 1498104, 1467120, 1443547, 1421650, 1396996, 1368352, 1338150, 1311073, 1291575, 1281854, 1281470, 1288727, 1302638, 1323923, 1354358, 1395069, 1445109, 1501156]
35716A501156N7176N3227M5224L4864K3835J3450M672j670m788m043R19J0116
35704A734138K3069L8545N4386O7833P6422P8966P5979O9266O1132N3767M8793
35693B382296M6788M6967M7743M8073M8423N0316N4704O0891O6877P0745P1841
35682B995664P0877O9192O7648O5989O2900N6663M5935L0296J0593j1135l2290
35671C432332n0904o6627q0678r4669j09052j22359j31646j33871j27389j12831
35661B402306r3175p3133n8038n2377n8263p4557r7196j20816j40742j54306j60880
35650A318823j60942j55077j43503j26311j04042p8148n0945k4876j458J9477
$$ y = [1501156, 1558332, 1611559, 1656783, 1691647, 1715482, 1728932, 1733604, 1731934, 1727146, 1723103, 1724022, 1734138, 1757207, 1795752, 1850138, 1917971, 1994393, 2073359, 2149338, 2218604, 2279736, 2333503, 2382296, 2429084, 2476051, 2523794, 2571867, 2620290, 2670606, 2725310, 2786201, 2853078, 2923823, 2995664, 3066541, 3135733, 3203381, 3269370, 3332270, 3388933, 3434868, 3465164, 3475757, 3464622, 3432332, 3381428, 3314801, 3234123, 3139454, 3030402, 2908043, 2776397, 2642526, 2515137, 2402306, 2309131, 2235998, 2177960, 2125583, 2067320, 1992763, 1895567, 1774751, 1634009, 1479703, 1318823, 1157881, 1002804, 859301, 732990, 628948, 550800, 499855, 474979, 473521, 492998]
$$ [...]
##END NTUPLES=NMR SPECTRUM
##END=
