##TITLE=31Pdec_DE-47EA_D2O
 D2O, 64 sc
 12.7.2024
##JCAMPDX= 6.0         $$ Bruker NMR JCAMP-DX V2.0
##DATA TYPE= NMR SPECTRUM
##DATA CLASS= NTUPLES
##ORIGIN= UXNMR, Bruker Analytische Messtechnik GmbH
##OWNER= root
$$ XWIN-NMR		Version 3.5
$$ Fri Jul 12 13:52:03 2024 Russian Standard Time (UT+4h)  she@DPX200
##.OBSERVE FREQUENCY= 81.013821
##.OBSERVE NUCLEUS= ^31P
##.ACQUISITION MODE= SIMULTANEOUS
##.ACQUISITION SCHEME= undefined
##.AVERAGES= 64
##.DIGITISER RES= 17
##SPECTROMETER/DATA SYSTEM= spect
##.PULSE SEQUENCE= zgpg30
##.SOLVENT NAME= CDCl3
##.SHIFT REFERENCE= (INTERNAL, CDCl3, 0, 198.062)
##AUDIT TRAIL= $$ (NUMBER, WHEN, WHO, WHERE, WHAT)
$$ ##TITLE= Audit trail, XWIN-NMR		Version 3.5
$$ ##JCAMPDX= 5.01
$$ ##ORIGIN= Bruker BioSpin GmbH
$$ ##OWNER= she
$$ F:/spectra/data/she/nmr/P31/2/pdata/1/auditp.txt
$$ ##AUDIT TRAIL=  $$ (NUMBER, WHEN, WHO, WHERE, WHAT)
(   1,<2024-07-12 13:51:08.37 +0400>,<she>,<DPX200>,
      <created by zg, POWCHK disabled, PULCHK disabled
       configuration hash MD5:
       00 E9 B6 7A A2 85 ED C7 34 08 36 98 17 FE 4E 26
       data hash MD5: 32K
       1C D8 41 A4 A3 32 3D C5 ED CE 1C 1A F4 5B 4F 5A>)
(   2,<2024-07-12 13:51:10.57 +0400>,<she>,<DPX200>,
      <Start of raw data processing
       efp BC_mod = 2 LB = 1.5 FT_mod = 6 PKNL = 1 PHC0 = 2586.643 PHC1 = 228.287 SI = 64K 
       data hash MD5: 64K
       82 FC BB 28 09 57 BD D0 44 09 5A 4A 04 1D E1 C7>)
(   3,<2024-07-12 13:51:31.89 +0400>,<she>,<DPX200>,
      <pk PHC0 = 120.6365 PHC1 = -19.99999 
       data hash MD5: 64K
       B5 DA B1 A7 1C 19 B5 D1 C6 1E EB DB 7C 01 67 61>)
$$ ##END=
$$ 
$$ hash MD5
$$ 87 02 AA 52 26 00 0C 60 18 B8 5B 74 33 09 73 BB
##$RELAX= 
##$RELAX= 
##$RELAX= 
##$RELAX= 
##$RELAX= 
##$RELAX= 
##$RELAX= 
##$RELAX= 
$$ Bruker specific parameters
$$ --------------------------
##$DU= <F:/spectra>
##$EXPNO= 2
##$NAME= <P31>
##$PROCNO= 1
##$TYPE= <nmr>
##$USER= <she>
##$AMP= (0..31)
100 100 100 100 100 100 100 100 100 100 100 100 100 100 100 100 100 100 
100 100 100 100 100 100 100 100 100 100 100 100 100 100 
##$AQSEQ= 0
##$AQ_mod= 1
##$AUNM= <au_zg>
##$AUTOPOS= <>
##$BF1= 81.014009
##$BF2= 200.13
##$BF3= 200.13
##$BF4= 200.13
##$BF5= 200.13
##$BF6= 200.13
##$BF7= 200.13
##$BF8= 200.13
##$BYTORDA= 1
##$CFDGTYP= 0
##$CFRGTYP= 5
##$CHEMSTR= <none>
##$CNST= (0..31)
1 1 145 1 1 1 1 1 1 1 1 1 1 1 1 1 1 1 1 1 1 1 1 1 1 1 1 1 1 1 1 1 
##$CPDPRG= <waltz16>
##$CPDPRG1= <>
##$CPDPRG2= <waltz16>
##$CPDPRG3= <>
##$CPDPRG4= <mlev>
##$CPDPRG5= <mlev>
##$CPDPRG6= <mlev>
##$CPDPRG7= <mlev>
##$CPDPRG8= <mlev>
##$CPDPRGB= <>
##$CPDPRGT= <>
##$D= (0..31)
0 1 0 0 0 0 0 0 0 0.06 0 0.03 2e-05 3e-06 0 0 0.0002 0 0 0 0 0 0 0 0 0 
0 0 0 0 0 0 
##$DATE= 1720777867
##$DBL= (0..7)
120 120 120 11 120 120 24 19 
##$DBP= (0..7)
150 150 150 150 150 150 150 150 
##$DBP07= 0
##$DBPNAM0= <>
##$DBPNAM1= <>
##$DBPNAM2= <>
##$DBPNAM3= <>
##$DBPNAM4= <>
##$DBPNAM5= <>
##$DBPNAM6= <>
##$DBPNAM7= <>
##$DBPOAL= (0..7)
0.5 0.5 0.5 0.5 0.5 0.5 0.5 0.5 
##$DBPOFFS= (0..7)
$$ [...]
##$SUBNAM2= <"">
##$SUBNAM3= <"">
##$SUBNAM4= <"">
##$SUBNAM5= <"">
##$SUBNAM6= <"">
##$SUBNAM7= <"">
##$SUBNAM8= <"">
##$SUBNAM9= <"">
##$SW= 400.765351723535
##$SWIBOX= (0..15)
0 1 3 0 0 0 0 0 0 0 0 0 0 0 0 0 
##$SW_h= 32467.5324675325
##$TD= 32768
##$TD0= 1
##$TE= 0
##$TE2= 300
##$TE3= 300
##$TEG= 300
##$TL= (0..7)
0 120 53 12 22 120 120 120 
##$TP= (0..7)
150 150 150 150 150 150 150 150 
##$TP07= 0
##$TPNAME0= <>
##$TPNAME1= <>
##$TPNAME2= <>
##$TPNAME3= <>
##$TPNAME4= <>
##$TPNAME5= <>
##$TPNAME6= <>
##$TPNAME7= <>
##$TPOAL= (0..7)
0.5 0.5 0.5 0.5 0.5 0.5 0.5 0.5 
##$TPOFFS= (0..7)
0 0 0 0 0 0 0 0 
##$TUNHIN= 0
##$TUNHOUT= 0
##$TUNXOUT= 0
##$USERA1= <user>
##$USERA2= <user>
##$USERA3= <user>
##$USERA4= <user>
##$USERA5= <user>
##$V9= 5
##$VALIST= <valist>
##$VCLIST= <CCCCCCCCCCCCCCC>
##$VD= 0
##$VDLIST= <DDDDDDDDDDDDDDD>
##$VPLIST= <PPPPPPPPPPPPPPP>
##$VTLIST= <TTTTTTTTTTTTTTT>
##$WBST= 1024
##$WBSW= 4
##$XGAIN= (0..3)
0 0 0 0 
##$XL= 0
##$YL= 0
##$YMAX_a= 3145
##$YMIN_a= -15719
##$ZGOPTNS= <>
##$ZL1= 120
##$ZL2= 120
##$ZL3= 120
##$ZL4= 120
##$ABSF1= 0
##$ABSF2= 0
##$ABSG= 0
##$ABSL= 0
##$ALPHA= 0
##$AQORDER= 0
##$ASSFAC= 0
##$ASSFACI= 0
##$ASSFACX= 0
##$ASSWID= 0
##$AUNMP= <proc_1d>
##$AZFE= 0.1
##$AZFW= 0.5
##$BCFW= 0
##$BC_mod= 2
##$BYTORDP= 0
##$COROFFS= 0
##$CY= -3
##$DATMOD= 1
##$DC= 0
##$DFILT= <>
##$DTYPP= 0
##$F1P= 0
##$F2P= 0
##$FCOR= 1
##$FTSIZE= 65536
##$FT_mod= 6
##$GAMMA= 0
##$GB= 0
##$INTBC= 1
##$INTSCL= 9.790993e-09
##$ISEN= 30
##$LB= 1.5
##$LEV0= 0
##$LPBIN= 0
##$MAXI= 10000
##$MC2= 0
##$MEAN= 0
##$ME_mod= 0
##$MI= 50
##$NCOEF= 0
##$NC_proc= -10
##$NLEV= 6
##$NOISF1= 182.463
##$NOISF2= 159.3651
##$NSP= 0
##$NTH_PI= 0
##$NZP= 0
##$OFFSET= 198.0616
##$PC= 4
##$PHC0= 2707.28
##$PHC1= 208.287
##$PH_mod= 1
##$PKNL= yes
##$PPARMOD= 0
##$PSCAL= 0
##$PSIGN= 0
##$REVERSE= no
##$SF= 81.0140089999434
##$SI= 65536
##$SIGF1= 159.3651
##$SIGF2= -187.1042
##$SINO= 113.3802
##$SIOLD= 16384
##$SREGLST= <1H.CDCl3>
##$SSB= 0
##$STSI= 65536
##$STSR= 0
##$SW_p= 32467.5324675325
##$SYMM= 0
##$S_DEV= 0
##$TDeff= 32768
##$TDoff= 0
##$TI= <>
##$TILT= no
##$TM1= 0
##$TM2= 0
##$TOPLEV= 0
##$USERP1= <user>
##$USERP2= <user>
##$USERP3= <user>
##$USERP4= <user>
##$USERP5= <user>
##$WDW= 1
##$XDIM= 65536
##$YMAX_p= 290793577
##$YMIN_p= -173402995
$$ End of Bruker specific parameters
$$ ---------------------------------
##NTUPLES= NMR SPECTRUM
##VAR_NAME=  FREQUENCY,     SPECTRUM/REAL,   SPECTRUM/IMAG
##SYMBOL=    X,             R,               I
##VAR_TYPE=  INDEPENDENT,   DEPENDENT,       DEPENDENT
##VAR_FORM=  AFFN,          ASDF,            ASDF
##VAR_DIM=   65536,         65536,           65536
##UNITS=     HZ,            ARBITRARY UNITS, ARBITRARY UNITS
##FACTOR=    0.49542278885378, 1,            1
##FIRST=     16045.7642231865, 0,            0
##LAST=      -16421.768244346, 0,            0
##MIN=       -16421.768244346, -173402995,   0
##MAX=       16045.7642231865, 290793577,    0
$$ Real data points
##PAGE= N=1
##DATA TABLE= (X++(R..R)), XYDATA
$$ [...]
6456B0174524q244259K63663P471571O600356L134623J765772j501065p719495
6448B1945690r053030k163265M549538M629801K726758K862331O15507m264792
6440B1848538j613062J1044468J7939323P510452p155908q381801l429686j1443059
6432B6319265k7546991k6547870l721616J4262150P893193q061177r621348K049868
6424b4974526Q679460N076099J997083M386144N021187M125m359508l469111j834891
6415i473938l826691n523083j660586M610264N016651k615335j0957064j1411476
6407c5841258l437605N549825Q778507O564036L289244R58831m92569Q50611N676554
6398h103824O904944l981150k1043326k4855518o714529J7003871K4544048J5402675
$$ y = [20174524, 11930265, 12193928, 19665499, 26265855, 29400478, 31166250, 29665185, 21945690, 12892660, 10729395, 15278933, 19908734, 22635492, 25497823, 26113330, 21848538, 20235476, 31279944, 49219267, 56729719, 49573811, 41192010, 37762324, 26319265, -1227726, -27775596, -31497212, -17235062, -9341869, -17403046, -27024394, -24974526, -16295066, -11218967, -9221884, -4835740, 185447, 189572, -4169936, -7639047, -9473938, -13300629, -18823712, -20484298, -15874034, -10857383, -13472718, -24429782, -35841258, -39278863, -33729038, -24950531, -18386495, -15097251, -14138420, -14630989, -13780378, -8103824, -1198880, -5180030, -26223356, -51078874, -57793403, -40789532, -16245484, -842809]
6390h42809N292709R45359m093345j0730064r451608J840942J0684984P774965
6382A421133p85722o338203j0522433j6072628j6398714o558957M208741M473082
6374d6573701q51966K208439J4443582K2406848J8685251J0160966M673814R70762
6366B6123995m764349j1162346j4025158j0772969j460518R468330J3645984P471882
6358A4524851j568605m415509k968503m200767o377251l766895j288131p973011
6350a8033821j6814250j0601762Q721614J7313037M513441r459149m193329J0540435
6342a8013784J2658060J705236n525167l726532k082955l613347k062456K021022
6334a8639923O47146n637887p521249l561043j667517l064860l27837O865381
$$ y = [-842809, 4449900, 5395259, 1301914, -9428150, -18879758, -17038816, -6353832, 1421133, 635411, -5702792, -16225225, -32297853, -48696567, -55255524, -51046783, -46573701, -47425667, -45217228, -30773646, -8366798, 10318453, 20479419, 25153233, 26123995, 21359646, 10197300, -3827858, -14600827, -16061345, -6593015, 7052969, 14524851, 12956246, 8540737, 5572234, 1371467, -5005784, -8772679, -10060810, -18033821, -34848071, -45449833, -36728219, -19415182, -14901741, -24360890, -28554219, -18013784, -5355724, -3650488, -9175655, -12902187, -14985142, -18598489, -20660945, -18639923, -17992777, -23630664, -31151913, -34712956, -36380473, -39445333, -39773170, -32907789]
6326c2907789R646570O338416N448328Q780112P320223j123393n889563j443965
6318c831061L755984L557158L905517P750986N969213n327394j3228642p462385
6310d910624J614347k65159p831818o394025L608798R928895R565738Q185045
6302A3501197L609629j0269075k4846771k2318126k413512J4241667J4111020
6295a4383971O230442M103270P331344R478124J1142945J4575807J4404798M774224
6287E7656983r125438j5678382j0873350j908028J524668l980577j3449309j8112626
6279a3946059j3970939n585751J441765Q567834J8245388K3394637J4416336l278955
6271B9284256j1839779m795007M250120K731668l556833l454116L98529j861754
$$ y = [-32907789, -23261219, -16922803, -11474475, -2694363, 4625860, 3502467, -2387096, -3831061, -75077, 3482081, 7387598, 15138584, 21107797, 15780403, 2551761, -4910624, -3296277, -3561436, -11393254, -17787279, -14178481, -4249586, 5316152, 13501197, 17110826, 6841751, -18005020, -40323146, -42736658, -28494991, -14383971, -8153529, -4050259, 3281085, 12759209, 23902154, 38477961, 52882759, 57656983, 48531545, 32853163, 21979813, 20071785, 21596453, 17615876, 4166567, -13946059, -27916998, -33502749, -32060984, -23493150, -5247762, 18146875, 32563211, 29284256, 17444477, 12649470, 16899590, 19631258, 16074425, 12620309, 13018838, 11157084]
6263A1157084q628147q644979O48331Q517959N684076m567702j1415432p545234
6255a4794044M786053J5269221J4925620O431957P21843P25582l408041j6744026
6247G914165k6724717j9162354k77741J0893660Q291923K537173O87463j582038
6239a7422466n824656n177699J355806L464983l304910p493915P97119J2898752
6231b0706986J4459014P558921N867737J1708419J2531913Q89842j4573665k1755069
6223d019874j9290166j3227832o453569K427795J2755406J9443558J7288946O597956
6215A5522220n285042r479895m763694N62473p47590n095174m304634P98695J706452
6206a1086189k698744k856165N428570J1731925N953597n426870q959598m872649
$$ y = [11157084, 2528937, -6116042, -5467711, 3050248, 8734324, 4166622, -7248810, -14794044, -10007991, 5261230, 20186850, 26618807, 27340650, 28066232, 24658191, 7914165, -18810552, -37972906, -38250647, -27356987, -19065064, -16527891, -15840428, -17422466, -23247122, -28424821, -27069015, -23604032, -26908942, -34402857, -33605738, -20706986, -6247972, 1310949, 7178686, 18887105, 31419018, 32308860, 17735195, -4019874, -23310040, -36537872, -42991441, -40563646, -27808240, -8364682, 8924264, 15522220, 10237178, 757283, -4006411, -3443938, -4191528, -9286702, -13591336, -12792641, -11086189, -13784933, -16641098, -11212528, 519397, 6472994, 1046124, -7913474, -12786123]
6198a2786123m825317j0429539q892499N592993J9232229J6353086R81438r677692
6190d451424q233328l037547k944180n876042m197533M671494J4732225J5644786
6182F308451K069573j7686559k5972185j4658384L708327J0904767N517944O88229
6174b9119837K257645K424104l570983q314609n372771k2178N81695j281748p1458
6165d2490140L479888O398941R343303J1124503N875724n625269j0606092j112324
6157b3611466J1643222J2064410K482711l051505j334772m40441j497945K020656
6149a725130P314692L135051r125818j2902528j278066J1655081J2566210P398291
6141A7037783P436045R494823L540762q049922j2653167n567125M676161Q037534
$$ y = [-12786123, -17611440, -28040979, -36933478, -31340485, -12108256, 4244830, 5226268, -4451424, -12684752, -15722299, -18666479, -24542521, -28740054, -24068560, -9336335, 6308451, 8378024, -9308535, -35280720, -49939104, -46230777, -35326010, -29808066, -29119837, -26862192, -24438088, -28009071, -36323680, -41696451, -41718629, -41136934, -42418682, -42490140, -39010252, -32611311, -23268008, -12143505, -6267781, -11893050, -22499142, -23611466, -11968244, 96166, 2578877, -472628, -1807400, -2247841, -3745786, -1725130, 5589562, 8724613, -401205, -13303733, -14581799, -2926718, 9639492, 17037783, 24473828, 33968651, 37509413, 29459491, 16806324, 11239199, 15915360, 23952894]
6133B3952894K920148m244419m980510K858686J0198709N732875p713935j4089098
6125A4635350n765521N397536N513906k738539q384695r726716j1652495j2613602
6117b5334776p856892j155827J04909j376175K635975R632188Q814112J00260
6109a4436226l622942L588544J1401240R024312k05364o203523n560910j021153
6101g036022N718843J3511072J7926345J4229648L248401q808681j5506860j4300378
6093H982368p611777o46858L233653M443928L646113l80255o589321r820598p800235
6084a2542982n433673o277270n117904K940923J1412567J0947961M662238K714551
6076C306411M679911J495681o211055p608699j135925J758461l352507o154178
$$ y = [23952894, 26873042, 22628623, 17648113, 20506799, 30705508, 36438383, 28724448, 14635350, 8869829, 14267365, 19781271, 17042732, 8658037, -1068679, -12721174, -25334776, -33191668, -34347495, -34242586, -35618761, -32982786, -23350598, -14536486, -14436226, -18059168, -14470624, -3069384, 5954928, 5749564, -453959, -6014869, -7036022, -1317179, 12193893, 30120238, 44349886, 47598287, 38789606, 23282746, 8982368, 1370591, 723733, 3957386, 8401314, 12047427, 11667172, 5077851, -4742747, -12542982, -17976655, -24253925, -29371829, -26430906, -15018339, -4070378, 591860, 3306411, 7986322, 9482003, 3270948, -4337751, -5473676, -3715215, -7067722, -13221900]
6068a3221900n43634M386973J447533j461425L007187O332658r52572r903538
6060a0908718n678321P326012J0351307j942796j4429733j3402876k558715N948574
6052b5295266O792397M113702M665500J0501969J5787044J2362699R11874q239618
6044B1600301r307336q725748j2226080j3188163m438611O337388O912815O86184
6036a2349250P06548O700684N694205m193667r049613k625173L050985j423241
6028a3488522o817191j466764Q573147Q780714j977362j1376679j1290299n135965
6020c4198921j85702p33026o363966j0424932m146578J0762298J8762253Q867527
6012a7661047p992558j1464897K63734Q010073o72061j3764298j1698267O531108
$$ y = [-13221900, -13765534, -9378561, -7931028, -9392453, -6385266, -52608, -1005180, -10908718, -16587039, -9261027, 1090280, -852516, -15282249, -28685125, -31243840, -25295266, -18502869, -14389167, -9723667, 778302, 16565346, 28928045, 29839919, 21600301, 12292965, 3567217, -8658863, -21847026, -26285637, -19948249, -13035434, -12349250, -11642702, -4942018, 752187, -3441480, -12491093, -15116266, -12065281, -13488522, -20305713, -21772477, -13199330, -4418616, -6395978, -17772657, -29062956, -34198921, -34384623, -35117649, -41481615, -51906547, -56053125, -45290827, -26528574, -17661047, -25653605, -37118502, -36854768, -28844695, -29516756, -43281054, -54979321, -48448213]
6004d8448213K2992734K2702597Q243854o261162r730708k273167P062414R573536
5996C861885N655668L567070P888856J2073959O887282n756654j4076657j2041828
5988H059581o218600l824637j785182N273719J2288311R598177o28205n432705
5980A7330459k42004M155000j334293j0120359j0823978m459064j166630m610165
5972a1271034r253080j0293461p192237N24447J1647376J8901299J5970145Q302764
5964A7336219O441000Q483032J809765j4576255k3259709j2358552M924699O811784
5956d388017p525335j8042508j1390952L841933J1328055O714237j136017k340008
5948b2938612N036074J4581034J6806260P520131o529029j2959177p145336K328981
$$ y = [-48448213, -25455479, -2752882, 5490972, -770190, -10500898, -12774065, -5711651, 3861885, 9517553, 13084623, 20973479, 33047438, 39934720, 34178066, 20101409, 8059581, 1840981, -1983656, -3768838, 1504881, 13793192, 23391369, 22763164, 17330459, 17088455, 21243455, 19909162, 9788803, -1035175, -5494239, -6660869, -11271034, -20524114, -30817575, -38009812, -37485365, -25837989, -6936690, 9033455, 17336219, 23777219, 32260251, 34070016, 19493761, -3765948, -16124500, -11199801, -4388017, -11913352, -29955860, -41346812, -37504879, -26176824, -19462587, -20598604, -22938612, -17902538, -3321504, 13484756, 21004887, 14475858, 1516681, -5628655, -3299674]
5940c299674M608540K70408p70510N814088J2137867R163196m11578n727542k312550
5931A9472245K987414K277939l771041r150617j0690403r027960m802401J154102
5923a1550722N463934M953985J541977K46780K009107K254396k377167r033108
5915f490818j2204322j0484006p802336q014255r552381p183046K49645O568631
5907e4912888O359114M155756Q874271J8698398J9913687N045490j4936670k2653933
5899b9456775j3370106L627265J6924586J9446530Q996230q519806j9965973j7440746
5891c9758795o823244K759530J1456988K0941737K2189416O795737j3350116j5805286
5883a1594033J737696J7128544J3735380o21980r576379q210078p55129P781790
$$ y = [-3299674, 1308866, 1579274, 808764, 6622852, 18760719, 27923915, 27512337, 21784795, 19472245, 22459659, 24737598, 20966557, 11815940, 1125537, -7902423, -12704824, -11550722, -6086788, -1132803, 409174, 655954, 2665061, 4919457, 2542290, -6490818, -18695140, -29179146, -36981482, -44995737, -54548118, -61731164, -61481519, -54912888, -48553774, -44398018, -35523747, -16825349, 3088338, 8133828, -6802842, -29456775, -42826881, -39199616, -22275030, -2828500, 6167730, -2352076, -22318049, -39758795, -46582039, -43822509, -32365521, -11423784, 10765632, 17561369, 4211253, -11594033, -9856337, 7272207, 21007587, 20385607, 10809228, 2599150, 1844021, 9625811]
5875I625811J0198812K15566j5033298j8111476n239902N631309J16341j2498194
5867b5095031j5902439j0369089n385987m43331R375035J6879996J0874169k926152
5859b2992829o951518K629009J1073929P266818k899358q153714n617288N83335
5851b5061616O010639P983028O310449L188076n36321o071960j0500024p001437
5843b5679166K445051L907203q421965j8331804q687174J0832546J5578897K276935
5835b6079477o669689L005219J8479465K0759762Q759891n229984j1713139q267926
5827f955878J957526R376618M431865r745441j9280331j7465613j1211240o944314
5819e5836808j967444N575975J0590048J1327398J3846286J8793344J6010662
$$ y = [9625811, 19824623, 20040189, 5006891, -13104585, -18344487, -12713178, -12596837, -25095031, -40997470, -51366559, -56752546, -57195877, -47820842, -30940846, -20066677, -22992829, -29944347, -27315338, -16241409, -8974591, -11873949, -20027663, -25644951, -25061616, -19050977, -11067949, -4757500, -1569424, -2105745, -8177705, -18677729, -25679166, -23234115, -19326912, -27748877, -46080681, -54767855, -43935309, -28356412, -26079477, -32749166, -29743947, -11264482, 9495280, 18255171, 13025187, 1312048, -6955878, -4998352, 4378266, 8810131, -935310, -20215641, -37681254, -48892494, -55836808, -57804252, -52228277, -41638229, -30310831, -16464545, 2328799, 18339461]
5812A8339461J775665j0338148p704970K144616L946213j729179k550541K994685
5804F877802L637535m491857j1013376q096575j718863m12811k170032Q0476N747120
5795a1560581P173489J183395o188673p304342j340961O395351J0639282R156691
5787H153651J919189q232185j4449630j0923899j045915M783798K603400K58525
5779a6933066M695916J0673263R623679L509534k94752l053878j1188832k1301845
5771b4269981k2328962j2803249k690340L262511J0134187J8058269J7751555
5764a2886010O817233k870696j757383M756940P436320N455714l70j1687395k5666400
5755c0402047k6782573p980907J4772004K0471049R390404j520098l555969k472555
$$ y = [18339461, 20115126, 9776978, 2072008, 4216624, 8162837, 6433658, 3883117, 6877802, 10515337, 6023480, -4989896, -13086471, -14805334, -15218145, -17388177, -17307701, -11560581, -4387092, -3203697, -9392370, -16696712, -18037673, -11642322, -1003040, 8153651, 10072840, 1840655, -12608975, -23532874, -24578789, -19794991, -17191591, -16933066, -12237150, -1563887, 8059792, 11569326, 11274574, 8220696, -2968136, -24269981, -46598943, -59402192, -62092532, -58830021, -48695834, -30637565, -12886010, -6068777, -8939473, -10696856, -5939916, 1496404, 6952118, 6951748, -4735647, -30402047, -57184620, -65165527, -50393523, -29922474, -20532070, -22052168, -25608137, -28080692]
5747b8080692l433003m154276l047020k436682k398805k88399K996634L855685
5739c6986558K959617M309827P511860P465234K031906m798106p211654k312466
5731b7030340P068516J2261573O332757n527735r919956l278034K481865j981612
5723a9592966r205091p012243L831128J3535649J7003518J4064932M484484o731354
5715A0378057q205702J568353O725881l056001j3106715n830828P677936K294438
5707a554581j9583786k8261111j0843681J0961557J5075529P776659N984234J0234307
5699a0210873J0841588P309259N883386O302842M176976N25713j567842m220157
5691A9040892r451936j2031873o475807L150059Q265657O831144K620710k508400
$$ y = [-28080692, -31513695, -35667971, -38714991, -41151673, -43550478, -43838877, -40842243, -36986558, -34026941, -29717114, -22205254, -14740020, -12708114, -17506220, -24717874, -27030340, -19961824, -7700251, -1367494, -6895229, -16815185, -20093219, -17611354, -19592966, -28798057, -35810300, -31979172, -18443523, -1440005, 12624927, 17109411, 10378057, 2172355, 3740708, 10466589, 7410588, -5696127, -11526955, -3849019, -1554581, -21138367, -49399478, -60243159, -49281602, -34206073, -26429414, -20445180, -10210873, 630715, 7939974, 13823360, 20126202, 24303178, 24828891, 23261049, 19040892, 9588956, -2442917, -8918724, -5768665, 2496992, 9328136, 11948846, 9440446]
5683I440446q692292j3529365j4031133j1323747q390339m798448J968027J0799388
5675c8557463J5801518J1342519j636089j3606862j3178901Q40126J6382887K0885385
5667a726880J3741753J990171r720905j7132516j2666473L086417J2768666K489439
5659g170328j3210252p683086J6314713K5786087N122497j9964648k0382351m195006
5651b5382374J086295q609393j2893879k028248J0111544R371181J77832l828038
5643c1995080K556526J2231081J4489087O254494l532535l804952L275280M484345
5635C958246m007320r428767k475201P472465Q040157L711027N787379J1200560
5627B4258546P927358l452495j0364581q424846n398983n271759l205248K075669
$$ y = [9440446, 748154, -12781211, -26812344, -38136091, -46526430, -51324878, -49356851, -38557463, -22755945, -11413426, -13049515, -26656377, -39835278, -38995152, -22612265, -1726880, 12014873, 14005044, 4284139, -12848377, -25514850, -22428433, -9659767, -7170328, -20380580, -28063666, -11748953, 14037134, 19159631, -805017, -21187368, -25382374, -24296079, -32905472, -45799351, -47827599, -37716055, -28344874, -28167042, -31995080, -29438554, -17207473, -2718386, 3536108, 3573, -3801379, -526099, 3958246, -49074, -9477841, -11953042, -4480577, 3559580, 7270607, 13057986, 24258546, 32185904, 28733409, 18368828, 9943982, 4544999, -726760, -3932008, -1856339]
5619a856339M309779R84587k547434k601877q42463K655353R183097J2957973
5611B2242676N042896j0816858j8000344q443853N453195P270304k612019j0190857
5603a0054860p037569J143742M018117k69703l011291M225955J7438844K2616014
5595B9069249J2825722k011093p823892m120635j252923l897664p321598q425044
5587G042122r630449j1024703q775793l455715q32520j989511j451711K025233
5579b8093047J641115o347003j5255800j6177454p648551N859632J8608389K4048701
5571b3364018J8209569O650077R49205L953413N738238q10778q364726o507278
5563c546298J895821N173696k4938o007890p455321p691857r215104o615460M769706
$$ y = [-1856339, 2453440, 3438027, 890593, -1711284, -2553747, 101606, 9284703, 22242676, 27285572, 16468714, -1531630, -9975483, -4522288, 2748016, 135997, -10054860, -17092429, -15948687, -11930570, -12200273, -15211564, -10985609, 6453235, 29069249, 41894971, 39883878, 32059986, 27939351, 26686428, 22788764, 15467166, 7042122, -2588327, -13613030, -22388823, -25844538, -26677058, -28666569, -30118280, -28093047, -26451932, -32798935, -48054735, -64232189, -71880740, -66021108, -47412719, -23364018, -5154449, 1495628, 2444833, 6398246, 12136484, 11325706, 2960980, -3546298, -1650477, 3523219, 3498281, -2509609, -9964930, -17656787, -26871891, -33487351, -28717645]
5554b8717645J7754414J8905610N777551q126933r455705j134640M052488K779305
5546A834445L965979J0912600J2410692l22564j6530122j7963509m824854L124017
5538g393316o614355k1839396k0949761k5948K2070460K5356983J1196405o24597
5530A176475K572068J0148783M750914j0017812j3253978Q23205J2427917O604480
5522A5232052m532467m822328j597599q418228j4933740k703460J7067590J4604755
5514I896575r815579k2318295p717799P961550J596450j1456669p429712O079293
5506c3204186P062034k923316n896799L3272K841122K760727R234079J6627501
5498c465566R739562p359626j3302172k626430O175530M35591j0185279j3333458
$$ y = [-28717645, -10963231, 7942379, 13719930, 5592997, -3862708, -4997348, -944860, 1834445, 5800424, 16713024, 29123716, 28801152, 12271030, -5692479, -10517333, -7393316, -14007671, -35847067, -56796828, -56822776, -34752316, -9395333, 1801072, 1176475, 3748543, 13897326, 18648240, 8630428, -4623550, -3800345, 8627572, 15232052, 10699585, 5877257, 4279658, -4138570, -19072310, -21775770, -4708180, 9896575, 80996, -22237299, -29955098, -21993548, -20397098, -31853767, -39283479, -33204186, -26142152, -29065468, -34962267, -34928995, -32087873, -29327146, -20093067, -3465566, 6273996, -1085630, -14387802, -17014232, -10838702, -10403111, -20588390, -33921848]
5490c3921848j0307972m825573N718301J7370730J5360373l685520j9316024j2821774
5482d6429307M891436Q233264n744153j3159576K139521K5313809K9553117R643106
5474A4441217j3182049j7894768o337551M341689N535249M484122Q250119J1264697
5466A0902725N405472n232401r435178m868840Q90351L200078M076419L749482
5458H688108j019456q902237j3678780j3608365j2391342r909949k240636P310021
5450d5752636Q722873P25915n599922l742604n78133j778604j207068N336618
5442d3873561Q314708K37505p075574J393472J6826101J6004997k774993j4217872
5434b5165217k586775J4763995J2375406q074560k2610492j7924019m099502L953149
$$ y = [-33921848, -44229820, -49055393, -43337092, -25966362, -10605989, -14291509, -33607533, -46429307, -41537871, -33304607, -39048760, -52208336, -50068815, -24755006, 4798111, 14441217, 1259168, -16635600, -22973151, -18631462, -13096213, -8612091, -361972, 10902725, 16308197, 11075796, 1640618, -3228222, -2337871, 862207, 4938626, 8688108, 7668652, -1233585, -14912365, -28520730, -40912072, -50822021, -53062657, -45752636, -37029763, -36303848, -41903770, -45646374, -46224507, -48003111, -49210179, -43873561, -35558853, -35321348, -42396922, -41003450, -24177349, -8172352, -10947345, -25165217, -27751992, -12987997, -612591, -8687151, -31297643, -49221662, -53321164, -49368015]
5426d9368015L822320J343460k42234r07483R9065K920579N115201N366684O268680
5417b5581743R091270Q685472k41979j2433829j4598411j522741J5291895J9832476
5409a477590R975523j309991k597972L239617M736166l325287j4016332j6162381
5401b0938247n928165R285503J7498195J3257107K628043l998720l963768l874154
5393C965794p528767p703138L236048J7272975J6052861m128240k2565117j8355609
5385a9753193J917651J2630185L020736j0979053j1352450n61971Q367048J2501126
5377d209921J7024900J9808180J3064346r86483r993019r076694o605221q642353
5369A0383735q927086r24701R234540J0652625L302483k512927l6195P117159
$$ y = [-49368015, -45545695, -44202235, -44444469, -45351952, -45252887, -42332308, -37217107, -31850423, -25581743, -16490473, -7805001, -8046980, -20480809, -35079220, -36601961, -21310066, -1477590, 8497933, 7187942, 4589970, 7829587, 12565753, 9240466, -4775866, -20938247, -26866412, -17580909, -82714, 13174393, 15802436, 11803716, 7839948, 3965794, -3562973, -11266111, -8030063, 9242912, 25295773, 21167533, -1397584, -19753193, -17835542, -5205357, -2184621, -13163674, -24516124, -25078095, -16711047, -4209921, 12814979, 32623159, 45687505, 44701022, 34708003, 25631309, 19026088, 10383735, 1456649, 531948, 9766488, 20419113, 23721596, 21208669, 21172474, 28289633]
5361B8289633J1170199Q612304K446447j859515l246070p394454j8717338l0819748
5353a1518542l1569969j9108939n286780J66235J142543N765310J3035285J6133368
5345c1241489J3549065R351861O182436M401704M401768M110498r05294q922313
5337I28236j0032474m06081Q270280L993517o690287p537132L376819J2251446
5329D154324J0913012N395098K012532j077131m539581k967878M487364Q973974
5321B7351714M180214m629147r906393j1968260j3122868r644105J457747J2942423
5313c338675J4004788M279107o523046j1854617j3965113j5715950j3712582l974463
5305e0800551Q603819J2472611L515716p119161n344474O790423J2905796N556781
$$ y = [28289633, 39459832, 48072136, 50518583, 48659068, 45412998, 38018544, 19301206, -11518542, -43088511, -62197450, -67484230, -67317995, -66175452, -60410142, -47374857, -31241489, -17692424, -8340563, -2158127, 2243577, 6645345, 10755843, 9850549, 928236, -9104238, -9510319, -1240039, 2753478, -3936809, -11473941, -8097122, 4154324, 15067336, 20462434, 22474966, 21397835, 16858254, 13890376, 18377740, 27351714, 31531928, 26902781, 16996388, 5028128, -8094740, -17738845, -16281098, -3338675, 10666113, 14945220, 8422174, -3432443, -17397556, -33113506, -46826088, -50800551, -42196732, -29724121, -26208405, -33327566, -38672040, -31881617, -18975821, -13419040]
5297a3419040k835759M87275Q967068R323911N073649R459020J8859411J4685275
5289E0600810n312919j8830159j1079540L228768L025471q617692j2751884k999367
5281b736512J0519666J8986554K0675717J3015654n139380k3646086k7562973
5274D112640j5902477l331079j075472n386578p096442l797879R64380L745394
5266b7767513K743291j768337n596240l154936N523462J3050102J2088216L164504
5258a717451n837274p428637j931766L176899K831536J464245N616483J0917711
5250G091746N769033r389996j7573936p793455P415078Q652283k543963o754688
5242a5127898M349817J6699760J4685549J373371q648610q765540m909086l992662
$$ y = [-13419040, -16254799, -15767524, -6800456, 2523455, 7597104, 17056124, 35915535, 50600810, 45287891, 26457732, 15378192, 18606960, 21632431, 13014739, 262855, -2736512, 7783154, 26769708, 47445425, 60461079, 55321699, 31675613, 4112640, -11789837, -15120916, -16196388, -21582966, -28679408, -32477287, -31512907, -27767513, -25024222, -26792559, -32388799, -35543735, -30020273, -16970171, -4881955, -1717451, -7554725, -14983362, -16915128, -13738229, -10906693, -9442448, -3825965, 7091746, 12860779, 3470783, -14103153, -21896608, -14481530, -5829247, -8373210, -15127898, -10778081, 5921679, 20607228, 21980599, 13331989, 4566449, -342637, -4335299]
5234d335299m910794k452251L484319O686305L733303P8163J714998L969081j851247
5225F116578j1134752q706427O569776J4803720L108635j2945185j1200333M387008
5217i000980J1796305M882992k118419j922451l513282j0523644j1007048K811231
5209a8595296K0466157K7681747K2272097R043027p752071j9732185j6377343
5202A7006133j186444O815936k128215j4044898j2204053p47011N071786J630624
5194B13858l892071q210303j1391538r128788l66677L889631m893353j4828942
5186d8608183p427250J3587378K5218687J7025284K635090k999958j140036J029349
5178f79639K960438N320855M211745q31286k662495J796019M061358l746829j6006034
$$ y = [-4335299, -9246093, -11698344, -8214025, -1527720, 2205583, 2283746, 3998744, 7967825, 6116578, -5018174, -13724601, -7154825, 7648895, 10757530, -2187655, -13387988, -9000980, 2795325, 7678317, 5559898, 3637447, 124165, -10399479, -21406527, -18595296, 1870861, 29552608, 51824705, 60867732, 53115661, 33383476, 17006133, 15819689, 22635625, 20507410, 6462512, -5741541, -6488552, -1416766, 213858, -3678213, -11888516, -23280054, -32408842, -32775519, -28885888, -33779241, -48608183, -56035433, -42448055, -17229368, -204084, 2431006, -568952, -1708988, -679639, 2280799, 7601654, 11813399, 10982113, 8319618, 10115637, 14176995, 10430166, -5575868]
5169e575868k0477087j2986352P77704J2837246J6970418J1304051K710144K241543
5161G801799R806943J0696793m011238k0700325j8906713K67996J5243390J3430863
5153A3629508N531127N854330J1001183P737237n492843j6226887j5062967n518558
5145A452130L950683R744401J1869360R185640J148620q538310j4459440j4376722
5137b3638q864170Q95268J0453202J0800087j989786j6282804j4130582N302856
5129a3839567K1164446J6775939J289138n225696j298922l060962j5152934k0579251
5121a9927809o472915J4304777J9124373M730516j1811625j6560185j0945772
5114b7558640k483630M503918O964225K226448o406188j0311620o498175k346791
$$ y = [-5575868, -26052955, -39039307, -38261603, -25424357, -8453939, 2850112, 5560256, 7801799, 17608742, 28305535, 24294297, 3593972, -15312741, -15044745, 198645, 13629508, 19160635, 25014965, 36016148, 43753385, 38260542, 22033655, 6970688, 1452130, 5402813, 15147214, 27016574, 36202214, 37350834, 28812524, 14353084, -23638, -8887808, -7992540, 2460662, 13260749, 11270963, -5011841, -19142423, -13839567, 7324879, 24100818, 25389956, 20164260, 18865338, 15804376, 651442, -19927809, -26400724, -12095947, 7028426, 11758942, -52683, -16612868, -27558640, -30042270, -25538352, -18574127, -16347679, -22753867, -33065487, -39563662, -41910453]
5106d1910453m563175q375511m429625O013913J0509695J825975j0779251j1344956
5098f3053388L686924K1083186K6468847J9914825J2275363R217412N605104l656040
5090C1542233j4244448j8135589j3815582n426647M594207J5316745K1791898
5083B1622817J7731540N093617n310016n606353P65158M501287O16975q609962
5075C0805063j7191772j9551660j3799933l098468P462098J5153144J8516176
5068A8294648J4245918J334951j2020147j3943197m328075K995753j433316r580782
5060d434247q543085k92310J511712p650894j6151484j2239407Q17912R824446
5052c7157357P497625o46630l636523K779273J1240711J0908215J180044n987529
$$ y = [-41910453, -46473628, -54849139, -59278764, -53264851, -42755156, -40929181, -51708432, -63053388, -59366464, -38283278, -11814431, 8100394, 20375757, 29593169, 35198273, 31542233, 17297785, -837804, -14653386, -20080033, -15485826, -169081, 21622817, 39354357, 44447974, 39137958, 33531605, 34296763, 38798050, 39415025, 30805063, 13613291, -5938369, -19738302, -22836770, -15374672, -221528, 18294648, 32540566, 33875517, 21855370, 7912173, 3584098, 6579851, 5146535, -4434247, -12977332, -13269642, -11757930, -19408824, -35560308, -47799715, -46981803, -37157357, -29659732, -30306362, -33942885, -31163612, -19922901, -9014686, -7834642, -13822171]
5044a3822171q41569J0493565J3146978K844167q947203j0133291j644662O887342
5036b016844R737599Q691237O533065J899668p650042j8748741k1627027j0405634
5028c3586719O147535J0505437k998295j9170581j9893102n913872P652786J2717170
5020d4539641J3255942J1527005M301483m742728m136675O819225J2033131J495713
5012c986545j0924907n797879J3382423K4926948J8559985N122101l473584q902883
5004B8905659j5854744j9081209j0732330N161236J4802401J0360288k476069
4997A1085232j2896444j5846352j2606134m959235N746228J4242063J2741701
4990b492941J099635q876874o012712N476185J1329514O180011j962836o243875
$$ y = [-13822171, -14663740, -4170175, 8976803, 11820970, 2873767, -7259524, -8904186, -2016844, 7720755, 16411992, 22945057, 24844725, 17194683, -1554058, -23181085, -33586719, -27439184, -16933747, -19932042, -39102623, -58995725, -64909597, -57256811, -44539641, -31283699, -19756694, -15455211, -20197939, -24334614, -17515389, -5482258, -3986545, -14911452, -20709331, -7326908, 17600040, 36160025, 41282126, 37808542, 28905659, 13050915, -6030294, -16762624, -11601388, 3201013, 13561301, 11085232, -1811212, -17657564, -30263698, -35222933, -29476705, -15234642, -2492941, -1393306, -10270180, -16282892, -10806707, 522807, 6702818, 4739982, -1503893]
4982a503893q393767q443111k91024J4251924J9064875L932080j7267861k2651964
4974b1302741j0907856R97659M391836N900813Q669298N780124k514673k876397
4966a1861937R667601J8866475R479508q055033j1312210J309081R000464Q5093
4958A7179042j1921996j0409880K77452M942339K550105N035468J3353491J2438804
4950C3444825m100116j9696648j7248970m521676j285251q597819j0398461k931878
4942c5335994j8089n428070l590711J1613983K0811636Q524042r794923j0847047
4934b4065173J051819N548117K298121P778457K0952976K1236987L216006j2827030
4926B5190280j1629324j434640N978141J1975226J7420155J2522201n788743k1885106
$$ y = [-1503893, -9897660, -18340771, -18631795, -4379871, 14685004, 18617084, 1349223, -21302741, -32210597, -31212938, -26821102, -20920289, -12250991, -6470867, -8985540, -11861937, -2194336, 16672139, 26151647, 18096614, 6784404, 8093485, 17093949, 17179042, 5257046, -5152834, -4875382, 66957, 2617062, 7652530, 21006021, 33444825, 29344709, 9648061, -7600909, -12122585, -13407836, -22005655, -32404116, -35335994, -35354083, -40782153, -44372864, -32758881, -11947245, -3423203, -13218126, -24065173, -23013354, -17465237, -15167116, -7388659, 13564317, 34801304, 38017310, 25190280, 13560956, 12126316, 18104457, 30079683, 47499838, 60022039, 54233296, 32348190]
4918C2348190k0882626q385422R59376L561366M282000M036853J354002j744522
4910A5529217m334926q967110j3092324q887409J838540N590869j764921n947157
4902b0035221L623774J6816646J9670414J4321762Q969337K037010q401250j2682897
4894B4319575m331966M591944P84864p821226n253532O054858J1160263P096176
4886C6600956K185985k286040j0315885j6684331j2862610k658892M218687P011187
4878E209057P025704j805393j6831794j7778001M75253M845258l0236246o9338276
4870a18434438n4968557N280705M2908335K6329187M02799R139844L1389395K7072231
4862c0880499M432789j837862R742290J3699307N015105o54176k204023j0741312
$$ y = [32348190, 11465564, 3080142, 4039518, 7600884, 11882884, 15919737, 17273739, 15529217, 11194291, 2227181, -10865143, -19752552, -17914012, -12323143, -14088064, -20035221, -16411447, 405199, 20075613, 34397375, 43366712, 45403722, 37002472, 24319575, 19987609, 24579553, 25364417, 17543191, 12289659, 18344517, 29504780, 36600956, 38786941, 36500901, 26185016, 9500685, -3361925, -6020817, -1802130, 5209057, 12234761, 10429368, -6402426, -24180427, -23705174, -18859916, -49096162, -118434438, -173402995, -168122290, -125213955, -98884768, -98481969, -89342125, -57952730, -30880499, -26447710, -28285572, -18543282, -4843975, 171130, -483046, -2687069, -13428381]
4854a3428381j9580746j1449660Q549108J8519616J4811807J1980893J1737308
4847B1139945K790387j0198968r232857L945304Q016657j299579n286324J765422
4839A1639987K076293j0617258j6566926m783537O172492J58188r155528l938338
4831b5014627O525761M062109o015408o019243K724243M701866j304530k595199
4823b2935028K688005L676726j414516k209671L687713N884488k86626o494555
4815a7403464o686209n426111o417895n541562n75116L400427L557374M060319
4807c1032237O351447N113900l56777j375664N897948J1278568N462211l863847
4799b524451k778075O843106R192207k096541j4586089j4310778l011268P214258
$$ y = [-13428381, -33009127, -44458787, -35909679, -17390063, -2578256, 9402637, 21139945, 23930332, 13731364, 4498507, 8443811, 16460468, 15160889, 9874565, 11639987, 13716280, 3099022, -13467904, -18251441, -12078949, -11920761, -21076289, -25014627, -18488866, -14426757, -20442165, -26461408, -23737165, -19035299, -20339829, -22935028, -20247023, -16570297, -17984813, -20194484, -16506771, -10622283, -10908909, -17403464, -24089673, -29515784, -35933679, -41475241, -42050357, -38649930, -35092556, -31032237, -24680790, -19566890, -19923667, -21299331, -15401383, -4122815, 1339396, -2524451, -5302526, 1540580, 10732787, 8636246, -5949843, -20260621, -23271889, -16057631]
4791a6057631R896707Q222266O431798M114017l35564n205754p035873n116436
4783e086470k191732q17131j002072k199820n052861q266623o015759N457130
4775b5175338J7953473J5827029m103873k3211323k0480023J469325J9682594
4768a8038136J9816459J0466365N545256M598205n97330q809289j0918556n032285
4760b969311J376386L654963M218453M255576J099632m076168n247228j749940
4752E62363j097259o968205j2011791q441445O46994P010018Q719429Q633188
4744b946708O152880p53469p751120p381255j80523N254603M604923L156139O139865
4735F295335R838901O762826l787679j4619338j8574458j4365096n575667K792203
$$ y = [-16057631, -6160924, 2061342, 8493140, 12607157, 12271593, 7065839, 29966, -5086470, -7278202, -8095333, -9097405, -11297225, -16350086, -24616709, -30632468, -25175338, -7221865, 8605164, 4501291, -18710032, -39190055, -37720730, -18038136, 1778323, 12244688, 17789944, 22388149, 21790819, 12981530, 2062974, -2969311, -1592925, 2062038, 6280491, 10536067, 11635699, 7559531, 2312303, 562363, -534896, -7503101, -19514892, -27956337, -27309343, -20299325, -11579896, -2946708, 3206172, 2452703, -5298417, -12679672, -12860195, -7605592, -3000669, 155470, 6295335, 16134236, 22897062, 19109383, 4490045, -14084413, -28449509, -34025176, -31232973]
4727c1232973O471511L706077k755350o402638k406272O831076J3517394J3170271
4719H99096R453454Q335430R745322Q456833J740907p653196j4829891j5219267
4711I28688o298796P169681J2271275J307827j4682453j6747248l912807M670262
4703a5293571j555296q203509R16183J7041130J8974525M707756p683103q145012
4695G59103n221473o440249n484795M079243J5558394J8410224J1755276J196677
4687C4612400r909127j8702303j9625536j1255058j336740K232802J151386J049151
4679b1783025J150646k436466o827861m823421L631424J0338130R936862N836315
4671d977396L693556M056936L633274N41367l930335p490304r521010j1270620
$$ y = [-31232973, -24761462, -21055385, -23810735, -30213373, -32619645, -25788569, -12271175, 899096, 10352550, 18687980, 28433302, 36890135, 38631042, 30977846, 16147955, 928688, -5370108, 1799573, 14070848, 15378675, 696222, -16051026, -19963833, -15293571, -16848867, -25052376, -24136193, -7095063, 11879462, 16587218, 8904115, 759103, -4462370, -10902619, -16387414, -12308171, 3250223, 21660447, 33415723, 34612400, 24703273, 6000970, -13624566, -24879624, -26216364, -23983562, -22832176, -21783025, -20632379, -23068845, -29896706, -34720127, -31088703, -20750573, -10813711, -4977396, -1283840, 2773096, 6406370, 6947737, 3017402, -4472902, -13993912, -25264532]
4663b5264532j2620900r642305J064255J5020947K1874030J7503618R213084M768079
4655B1916276J648805o173894j5226498j5770177p048529L44711p44259n360301
4647b6413866o049943l346756j275677J065343O131188J0353299Q004188Q49851
4639a0682373l720267l672691l580120m206461R8660R615272J3432579L330421
4631F15020j1782386j4924887l028518R359369R447653Q97708m079064l97527
4623a3892632O798673R896487N243056m435805j0432313n032469Q190016J5892957
4615A2227970J1249264K979828J718138L493100l095177j6649594k2230322j2152256
4607b2459049L140651Q985550L296593m944672p654391l576715L091974O246792
$$ y = [-25264532, -37885432, -47527737, -46463482, -31442535, -9568505, 7935113, 17148197, 21916276, 23565081, 17391187, 2164689, -13605488, -20654017, -20309306, -21053565, -26413866, -32463809, -35810565, -37086242, -36020899, -29889711, -19536412, -11532224, -10682373, -14402640, -18075331, -21655451, -25861912, -25763252, -16147980, -2715401, 615020, -11167366, -26092253, -29120771, -19761402, -10313749, -9416041, -13495105, -13892632, -7093959, 2802528, 8045584, 3609779, -6822534, -11855003, -3664987, 12227970, 23477234, 26457062, 28175200, 31668300, 28573123, 11923529, -10306793, -22459049, -19318398, -10332848, -7036255, -11980927, -19635318, -23212033, -20120059, -13873267]
4599a3873267L372406r25895j048492J23418m896928j3940621j4581645k199796
4591d7970820J0859547J1395285K770921k417367o56968J592420J039908P18514
4583b2668560J400873k64419m407805o488915m054908J022356O599647J0554639
4575a8307092Q580262q42739j0210250j0054056k404055J258183l533668q460344
4567d3973759n137825M681099J4184098J8739592J5504572M601944n872940n425654
4559b698873L649278O627651k166779r566477m378215L647230l12764j0277795
4551a5476744p635068Q507199J8650607J2313795J416435j746623k345367q052613
4543E631621j1020009l24623J6367290K0243521P490785o693055j0307288p495953
$$ y = [-13873267, -10500861, -11426756, -12475248, -12351830, -17248758, -31189379, -45771024, -47970820, -37111273, -25715988, -22945067, -25362434, -26019402, -24426982, -23387074, -22668560, -21267687, -21532106, -25939911, -32428826, -36483734, -35461378, -28861731, -18307092, -9726830, -10569569, -20779819, -30833875, -33237930, -31979747, -35513415, -43973759, -49111584, -44430485, -30246387, -11506795, 3997777, 8599721, 2726781, -2698873, 950405, 7578056, 5411277, -4155200, -8533415, -4886185, -5198949, -15476744, -23111812, -14604613, 4045994, 16359789, 17776224, 16029601, 13684234, 5631621, -5388388, -5713011, 10654279, 30897800, 38388585, 31695530, 21388242, 13892289]
4535A3892289o536527o787850l866145K87267J04081m574535q209063o925431
4527b2615914k038890L203493P199021R637491R418690M978566k488560q076720
4519g82823q621257p854987j0601548j2154383k683288J4200369J8779988R79763
4511h738166k0837503k1273123j996621J2646211J1276376O898622J0568286J4407473
4503B951555Q995135l13472n335220p847944q965674j320015J4296296J9910823
4495B2371484N409808j1143512q643593L529366J238978j3827483j7258417k900903
4487b1224272Q176074L118772n581420o054451m845254p661573n477518N910508
4479c3639134J2547676M497311n933507m649153J459280o3038l849690J142448
$$ y = [13892289, 7355762, 567912, -3298233, -3010966, -2906885, -7481420, -15690483, -22615914, -24654804, -21451311, -14252290, -4614799, 4803891, 9782457, 7293897, -782823, -9404080, -17259067, -27860615, -40014998, -42698286, -28497917, -9717929, -8738166, -29575669, -50848792, -52845413, -40199202, -28922826, -22024204, -11455918, 2951555, 11946690, 11633218, 6297998, -1549946, -10515620, -11835635, 2460661, 22371484, 27781292, 16637780, 7994187, 11523553, 12762531, -1064952, -18323369, -21224272, -13048198, -9929426, -15510846, -21565297, -26410551, -34072124, -39549642, -33639134, -21091458, -16594147, -22527654, -27176807, -25717527, -25780565, -29630255, -28487807]
4471b8487807Q434583M813879m882435o138324j042453l000592r628282n503494
4463d5434925Q582432J3755802L923033m631580q45280N677302N620759N528325
4455g824132J0288091R139811m837924j6772342j0294439N156399P429838m257445
4447a1972143r146730J930936J2967946P564364q044302j5409994p511343O829802
4439b2791464J6239508J6447444R782762K058489p89173J915975L554670k518877
4431B3899334j3629944j9664176j5184841n813957n26712j174527k949976k175969
4423c7220768J113562O248138J1587481J2125537M812664l151829k71378J1804739
4415G048146J6628759N421912q483121q443322K26843q98659j2694803j5057016
$$ y = [-28487807, -20053224, -15239345, -20121780, -26260104, -27302557, -30303149, -39931431, -45434925, -36852493, -23096691, -19173658, -23805238, -24650518, -18973216, -13352457, -7824132, 2463959, 11603770, 6765846, -10006496, -20300935, -15144536, -7714698, -11972143, -21118873, -19187937, -6219991, 1344373, -6699929, -22109923, -29621266, -22791464, -6551956, 9895488, 19678250, 21736739, 20947566, 22863541, 26418211, 23899334, 10269390, -9394786, -24579627, -30393584, -30920296, -32094823, -35044799, -37220768, -36107206, -29859068, -18271587, -6146050, -1333386, -4485215, -4756593, 7048146, 23676905, 29098817, 20615696, 12172374, 12399217, 11500558, -1194245, -16251261]
4407a6251261J842303J9545132J5008471q524257k6507097k3198933n445552J0922024
4399c2609170J7442585J4562521N645105n555441j4458295j6640828j0623701
4392d2237224j30443P527953Q089934N351954O011211R529280Q696404J787584
4384D626653l076169l65125K860260k866517j3573226j5446305l263900J3072910
4376a8031419K1081566J7628303P360662l386409q628490n467850J253126K254835
4368A4064324m253554q750643k975164Q206946J3130773Q117937k94327n587960
4360B1658332p015328o145114m361006l817620m706487j930532Q110943J7458948
4352A9252136J3166469l355134j4462396r802817q34910k273746r276134p324522
$$ y = [-16251261, -14408958, 5136174, 20144645, 11620388, -14886709, -38085642, -43531194, -32609170, -15166585, -604064, 5041041, -514400, -14972695, -31613523, -42237224, -42367667, -34839714, -26749780, -21397826, -15386615, -5857335, 2839069, 4626653, 1550484, 1185359, 4045619, 1179102, -12394124, -27840429, -31104329, -18031419, 3050147, 20678450, 28039112, 24652703, 16024213, 10556363, 11809489, 14064324, 9810770, 1060127, -1915037, 6291909, 19422682, 27540619, 27246292, 21658332, 14643004, 8497890, 4136884, 319264, -4387223, -6317755, 1793188, 19252136, 32418605, 29063471, 14601075, 4798258, 3963348, 1689602, -7586532, -14911054]
4344a4911054K212494M175714m640222j0373814n490053M44333l27879p43913
4336b9654394N546345J0430319N322811l451512o551408p669244j2774710j3806393
4328e2608186j173334J5251320J7886146R567141Q219781J5040001J1960492n439314
4320A8704047j6869008r168090K460713q0796q733864m261003J1830817K0242286
4312A4125102J2378725k550496j5807395k6787495l2128777k4004189m338561
4305g9113086J1795854J3629908P186986M575396P518714P888207P60769q794544
4297c4551796j1246854k498856J0942862J6620361Q641465m447262q436037j028564
4289b6004681M808372j368871j1611531r044089Q159758K1468214J4816212m577798
$$ y = [-14911054, -12698560, -8522846, -13163068, -23536882, -29026935, -28582602, -28910481, -29654394, -24108049, -13677730, -8354919, -11806431, -18357839, -26027083, -38801793, -52608186, -53781520, -38530200, -20644054, -11076913, -2857132, 12182869, 24143361, 18704047, 1835039, -7333051, -4872338, -4953134, -13686998, -17948001, -6117184, 14125102, 26503827, 23953331, 8145936, -18641559, -50770336, -74774525, -79113086, -67317232, -53687324, -46500338, -41924942, -34406228, -26518021, -25757252, -34551796, -45798650, -48297506, -37354644, -20734283, -12092818, -16540080, -24976117, -26004681, -21196309, -22565180, -34176711, -43220800, -35061042, -13592828, 1223384, -3354414]
4281c354414j6428218j4222149j0305979j3544904j5382736n774706Q082548J1691033
4273e9239525N622072L426534R483810J4114723J1982599R942188J1625753Q822507
4265A5780661l188578j3953418j2365534l562729J34854k360697l639965k709862
4257b5865268l638870l185837N622740J8083385K0128068Q636989k978782l983852
4249A2818573j42520j945556q187032r910764n061314j42059N22512p91479j624010
4240a4463649l312630o149466n732473J127446Q959064P768596l802488j4053079
4232b9658679j1105745K463088J3233639J3898213R900091Q414474Q388826N431769
4224B0965676J43445m166932p405775j0090301q392343J116203J3238299J7240837
$$ y = [-3354414, -19782632, -34004781, -44310760, -57855664, -73238400, -79013106, -70930558, -59239525, -53617453, -50190919, -40707109, -26592386, -14609787, -4667599, 6958154, 15780661, 12592083, -1361335, -13726869, -17289598, -17154744, -19515441, -23155406, -25865268, -29504138, -32689975, -27067235, -8983850, 11144218, 19781207, 16802425, 12818573, 12676053, 10730497, 2543465, -7367299, -12428613, -12570672, -12048160, -12839639, -14463649, -17776279, -23925745, -29658218, -28530772, -19571708, -11803112, -15605600, -29658679, -40764424, -38301336, -25067697, -11169484, -1269393, 7145081, 15533907, 20965676, 21109121, 16942189, 9536414, -553887, -8946230, -7830027, 5408272, 22649109]
4216B2649109Q623339o344734j7506420j9014524j2281854m531109k769464n783012
4208c6958669m742753M478850J3830157J3888125P773817N436551O808684K255298
4200A2770060r044711j3696240l671272Q477924M890860j1235069j6694700J515716
4192b6687432K6165822K8082565J845977k5878900k7371040o270759R655693N385614
4184a5072460m100843J969676K0061913K8165898J6591101r16452q127159n975418
4176C2596256m999105p126502m920399L978083J1149940Q330274j782578r455552
4168B7770417r833899o944736o614324r424488j1975549j1937720r235895m226203
4160d2422397K304761Q406783J2727932J5566626J5728546R255764m032012j5101160
$$ y = [22649109, 31272448, 24927714, 7421294, -11593230, -23875084, -28406193, -31175657, -36958669, -41701422, -37222572, -23392415, -9504290, -1730473, 3706078, 10514762, 12770060, 3725349, -9970891, -13642163, -5164239, -273379, -11508448, -28203148, -26687432, -521610, 27560955, 29406932, 3528032, -23843008, -30113767, -20458074, -15072460, -19173303, -17203627, 2858286, 31024184, 47615285, 46698833, 38571674, 32596256, 27597151, 20470649, 15550250, 19528333, 30678273, 39008547, 37225969, 27770417, 17936518, 10991782, 4377458, -5047030, -17022579, -28960299, -38196194, -42422397, -40117636, -31710853, -18982921, -3416295, 12312251, 21568015, 17536003, 2434843]
4152B434843j3484995o06853J0521260R714563r45638j1697305j3883902n323412
4144b3271439O692531R179803k242051j4723625j3018855m51776P047279N679097
4136b5109036O191729J0860017Q054312l999018q742961J854720J1230769M620817
4128D961349n952190k640988P052923L617518r905461j2416933M8509Q584345
4120f650928K371205o461820l982058O814065J4318038J2494330K494837r606557
4112A1791112j4686518r091607p71196J262188n48155Q8236N12642l025133l201127
4103a7669558O041219J3243094N252668q162066p832029L430629P948817N400697
4095G653471R453211J7909976J9777541K7597821O0106641Q9722379N8572537
$$ y = [2434843, -11050152, -11657005, -1135745, 8578818, 7633180, -4064125, -17948027, -23271439, -16578908, -7399105, -9641156, -24364781, -37383636, -37835412, -30788133, -25109036, -18917307, -8057290, -2978, -4001996, -12744957, -10890237, 340532, 4961349, -990841, -3631829, 3421094, 7038612, -2866849, -15283782, -15235273, -6650928, -4279723, -10741543, -14723601, -7909536, 6408502, 18902832, 21397669, 11791112, -2895406, -11987013, -12758209, -11496021, -12044176, -11955940, -11443298, -14468431, -17669558, -11628339, 1614755, 6867423, -1294643, -9126672, -5696043, 2252774, 7653471, 17106682, 35016658, 54794199, 82392020, 142498661, 232221040, 290793577]
4088B90793577l3532137j05494450r2473460k8485784P254690n634133k4352202
4081H076101k0251248q503210o104798o860326m322153m513745p761491m784708
4073e5025578L396789N002211J20164R99508P562922O359179k867965m054327
4065c8507097O140118J0286427k68062j0450811p465047j388582n399080j2038775
4057e9090909o107436R547289J7880098J2449883M270937L917752O991358J869852
4049h271176j1508970j6868891j169203K3302838K8245649N669907j8450227j7977211
4041a7027284j110582N773632k176348p477185l503809k420435q473627q657951
4033d5073589K576654J1154949O469430j473123p8N926828M191002m664239j0179353
$$ y = [290793577, 257261440, 151766990, 59293530, 30807746, 38062436, 32428303, 8076101, -12175147, -20678357, -26783155, -33643481, -37965634, -42479379, -50240870, -55025578, -51628789, -46626578, -46506414, -45506906, -37943984, -31584805, -34452770, -38507097, -32366979, -22080552, -22348614, -32799425, -40264472, -41653054, -47052134, -59090909, -65198345, -55651056, -37770958, -25321075, -21050138, -17132386, -10141028, -8271176, -19780146, -36649037, -37818240, -14515402, 13730247, 19400154, 949927, -17027284, -18137866, -12364234, -14540582, -22017767, -25521576, -27942011, -36415638, -45073589, -42496935, -31341986, -24872556, -26345679, -26345757, -20418929, -16227927, -20892166, -31071519]
4024c1071519p202482Q62413Q271482J0295809O171693K091095M333813Q503342
4016B255646N318620k769683l816433L438245O932298K016428j987671j204555
4008A0182895m904527j5310036j8065299m895953J0702539J4056980J0178631
4001A945230Q892250M445522j0864276k4783220j8824613K460884J6469766J3547317
3993f711140M341887j694321o300605j0046819p555974R07779P051209P827576
3985a2180408R010110J1737497P558616p092270k1161197k1119147p183153Q396989
3977c2032963J5510484J4169750J0673671R312777Q024195K362133n969171p861549
3969A4189327K187555J6114684J8560704L342716j9537015l3227453k8339061
$$ y = [-31071519, -38274001, -37411588, -29140106, -18844297, -12672604, -10581509, -6247696, 2255646, 7574266, 4804583, 988150, 4426395, 11358693, 13375121, 11387450, 10182895, 5278368, -10031668, -28096967, -32992920, -22290381, -8233401, 1945230, 10837480, 15283002, 4418726, -20364494, -39189107, -36728223, -20258457, -6711140, -2369253, -4063574, -10364179, -20410998, -27966972, -27059193, -20007984, -12180408, -3170298, 8567199, 16125815, 9033545, -12127652, -33246799, -40429952, -32032963, -16522479, -2352729, 8320942, 17633719, 25657914, 28020047, 22050876, 14189327, 16376882, 32491566, 51052270, 54394986, 34857971, 1630518, -26708543]
3962b6708543r399586J0019827J8740868J5827684P322113k251157j1226274j6231358
3954a3906426j3889030p233802k588853L79003O185041J0729832M087626r997947
3946b6234556j2366715M892100K3544179K3037803P714652l704184n571720n622244
3938E689315n367221R89406J0811602J3685544P821827J018561m100705j0735022
3930A9813307j4474142o342673Q602475J3026692K700793o177724k250856L968251
3922A8866123j342298j2893266j5481495o815040J907112K975520j960697r569272
3914b4313313j7197972j8691496q127779J0409691K3962626K4191575J5421531
3907E654863P691319N544177N733310L502519j569460n910932o562931m138302
$$ y = [-26708543, -36108129, -26088302, -7347434, 8480250, 15802363, 13551206, 2324932, -13906426, -27795456, -35029258, -37618111, -37239108, -31054067, -20324235, -16236609, -26234556, -38601271, -33709171, -10164992, 12872811, 20587463, 16883279, 11311559, 5689315, 322094, 1311500, 12123102, 25808646, 33630473, 34649034, 30548329, 19813307, 5339165, -1003508, 7598967, 20625659, 23326452, 17148728, 14897872, 18866123, 17523825, 4630559, -10850936, -17665976, -15758864, -12783344, -14744041, -24313313, -41511285, -60202781, -68330560, -57920869, -33958243, -9766668, 5654863, 13346182, 18890359, 24623669, 28126188, 26556728, 20645796, 14082865, 9944563]
3899I944563j366467n88505l483855j0409630j7201286j5375860q43694J7774823
3891b1549911K5009464J5032688j230685q250741k923694L766033J558271o372576
3883E038849q531211j357941N576055L720907j322136J101902Q548451Q656967
3875B1431843L98877k770390L903642N865243p213395k1272429j7323743r74930
3867a7955282O593257J262072j327773N665337J0624238O039678O07935J252287
3859A2761749Q15660o143236j0563790m055435N522874O537375J450976j022957
3851E303216k642551r599034j6337867j1827713P93758P004761L674843L297875
3843b0332712J1620717J6020052N006657j1841710j5668352m562958M773073J258226
$$ y = [9944563, 8578096, 7989591, 4505736, -5903894, -23105180, -38481040, -39324734, -21549911, 3459553, 18492241, 17261556, 9010815, 6087121, 9853154, 11411425, 5038849, -3492362, -4850303, 725752, 4446659, 3124523, 4226425, 12774876, 21431843, 21830720, 19060330, 22963972, 28829215, 21615820, 343391, -16980352, -17955282, -11362025, -10099953, -11427726, -5762389, 4861849, 10901527, 11509462, 12761749, 13577409, 7434173, -3129617, -7185052, -1662178, 4875197, 6326173, 5303216, 2660665, -6938369, -23276236, -35103949, -34310191, -27305430, -23630587, -20332712, -8711995, 7308057, 12314714, 473004, -15195348, -19758306, -14985233, -13727007]
3835a3727007o584541n493284L092089P342011L782290O07824K186523J376237
3827g417858p798204j8518514j9824630j1337986j570272M435060P952615J0312389
3819d3767400J1857516J4716372J8803913J7719888O997475o367955j1834942
3812H124867r742174p476096n013569K114751P814431L69643j5757453k0401751
3804c9967351n514231J3221216J9393061J4887561P541378l702166j8647603k5107880
3796c7896015j4072324M028598J2843754J1688321R809608P889422J233398n615894
3788a0091132m767472r21003m058535r325404k747439J3177315J8617054N243668
3780E127052j0716112j1226926Q37290R531035O648921k693298q587207n009405
$$ y = [-13727007, -20311548, -25804832, -22712743, -15370732, -11588442, -10980618, -8794095, -7417858, -15216062, -33734576, -53559206, -64897192, -66467464, -62032404, -54079789, -43767400, -31909884, -17193512, 1610401, 19330289, 26327764, 19959809, 8124867, -1617307, -9093403, -14106972, -11992221, -4177790, -3808147, -19565600, -39967351, -45481582, -32260366, -12867305, 2020256, 9561634, 5859468, -12788135, -37896015, -51968339, -47939741, -35095987, -23407666, -13598058, -5708636, -4475238, -10091132, -14858604, -15779607, -19838142, -29163546, -31910985, -18733670, -116616, 5127052, -5589060, -16815986, -15978696, -6447661, 201260, -2492038, -11079245, -16088650]
3772a6088650N103574J1034470N929441k819750k698087N096049P104004n82166
3764A2078885n213823K069152J0776181N880425j0202623k1262769j8601382q863930
3756c3339884k056295j28085J111864M110280O701073O124981M004544N047311
3748h424211R942498J2963026R763721L687841o48243n375192j3097385j6949500
3740h137445q461518O016676R945507j73762q950914m132919P323474J1732412
3732E161511O741840r73136p126865j0099540o861286K246401R363259P523006
3724E975190j90840n357640m014925K098351Q202215O993374n258664j8786285
3716a0339224j6918125O42448J2650379M312380j0870866j0481498N108234J6184667
$$ y = [-16088650, -10985076, 49394, 5978835, 3159085, 460998, 5557047, 12661051, 12078885, 6865062, 8934214, 19710395, 25590820, 15388197, -5874572, -24475954, -33339884, -35396179, -35524264, -34412400, -30302120, -23601047, -17476066, -13471522, -8424211, 1518287, 14481313, 24245034, 27932875, 27284632, 21909440, 8812055, -8137445, -16598963, -10582287, -636780, -810542, -9761456, -13894375, -6570901, 5161511, 11903351, 10930215, 3803350, -6296190, -13157476, -10911075, -1547816, 5975190, 5784350, 426710, -3588215, -1489864, 6712351, 13705725, 8447061, -10339224, -27257349, -26614901, -13964522, -9652142, -20523008, -31004506, -25896272, -9711605]
3708i711605J2322369R67098q653894j3597986j1121489q05787P529767L493527
3700a9578000o195627n361877N842355J0097772N71577q634316n634897K618935
3692b6274078N229532L565933K655964j6680n894718p078455J667961J2167314
3684a3977227J4879725J2471636J0771124O293545m511653j2827349r244526j219281
3676B635994k854367j1377251j0239005N090459J9873286K0909461J1623972K576153
3668C8238702k361508n086844o078847l950163O58585L747602O42316q193723
3660A7616120j3834460p185691O984015J2568319L748756n788930l355851M086549
3652A4838827L975736J12563L693344J0271834N805583p880656j4478796r715690
$$ y = [-9711605, 2610764, 3577862, -5076032, -18674018, -29795507, -30601294, -23071527, -19578000, -25773627, -31135504, -25293149, -15195377, -14623800, -23258116, -28893013, -26274078, -21044546, -17478613, -14822649, -14839329, -20734047, -27812502, -26144541, -13977227, 902498, 13374134, 24145258, 30438803, 25927150, 13099801, 3855275, 2635994, -218373, -11595624, -21834629, -16744170, 3129116, 24038577, 35662549, 38238702, 35877194, 30790350, 24711503, 20761340, 21419925, 25167527, 25809843, 17616120, 3781660, -3404031, 3579984, 16148303, 19897059, 14108129, 10752278, 14838827, 18814563, 18927126, 22620470, 32892304, 38697887, 30817231, 16338435, 6622745]
3644F622745n852599p818825n977306K517003O050172K7371l474044K833177Q689167
3635C616861O039142L585296Q269620R275275l103112j6918857j5093177j782401
3627f111353N659444K733096j470963k808464m369317n083171j665444J926801
3619a1189371O61563r67198K164387L212990m793740j1450718j756058J8050414
3611f067731K6800430J8450545O611525n9125o784871j5244309j7289275j1025061
3603d607872n601343m460752j58293Q474855J0489660J488134p043895n418455
3595f837961O88568K430596O83758j263602m920870p788890o63957J5527924K2582825
3586B0438391P820897j5284720k2743056r875409O841209J2706155P439592k207891
$$ y = [6622745, 770146, -7048679, -13025985, -10508982, -4458810, -4431439, -7905483, -5072306, 3616861, 9656003, 13241299, 21510919, 30786194, 27683082, 10764225, -4328952, -6111353, -451909, 2281187, 810224, -1998240, -6367557, -11450728, -13116172, -11189371, -10527808, -11495006, -9330619, -6117629, -10911369, -22362087, -24118145, -6067731, 20732699, 39183244, 45794769, 45735644, 38950773, 23706464, 6417189, -4607872, -10209215, -14669967, -14828260, -6353405, 4136255, 5624389, -1419506, -6837961, -6149393, -3718797, -3035039, -4298641, -9219511, -17008401, -17672358, -2144434, 20438391, 28259288, 12974568, -9768488, -19643897, -12802688, -96533, 7343059, 5135168]
3578E135168j0996806j5699020j4567335q019836K174232J2378337J5512391O519904
3570g562965p984959j3011599k609014J2469313J8507772J3438821M118560l009476
3562A4356453m090049J165909N956198K010484p187362q562129N79877O462528
3554A0691909n14944j1451088j4423351j2021935j1667115r566479J251229J4956002
3546c2745772J9738775J5157702R199518L166671o522057j5308147j3823365l214923
3538b4351598N291848N770524J900704k852579q341295j1316974o639483L492442
3530c7046411R719086O630404j733310p424631n503600K734657J0007739R917509
3522a2698557N851819O690629J1360610P927251o865586j9311657j8147865r875985
$$ y = [5135168, -5861638, -21560658, -36127993, -44147829, -41973597, -29595260, -14082869, -7562965, -15547924, -28559523, -31168537, -18699224, -191452, 13247369, 17365929, 14356453, 10266404, 11432313, 17388511, 19398995, 12211633, 3649504, 4229381, 10691909, 10176965, -1274123, -15697474, -27719409, -39386524, -48953003, -47701774, -32745772, -13006997, 2150705, 11350223, 14516894, 7994837, -7313310, -21136675, -24351598, -19059750, -13289226, -11388522, -14241101, -22582396, -33899370, -40538853, -37046411, -27327325, -20696921, -22430231, -29854862, -35358462, -32623805, -22616066, -12698557, -6846738, -156109, 11204501, 19131752, 12266166, -7045491, -25193356, -35069341]
3514c5069341m692691m92285O238996P342109k568311j0590585l345431R765576
3506c3411963J1130338L690599L276342R666001R136446J296019r17270L992553
3498G859065M743254k60561j906177p68241n170854r963282k291039J1549688
3490C791853J1772894j014303n840387J842145L867807m628479n648443N406378
3482I549465P524077p202259j5719644m237931N341184o469133k0814375j1530054
3474d3558670J1202822J8959272Q872433q52179m847209j0595885j5832215j3624310
3466e0275941j0481935j3909571j2402365O124352K6766961K6346926J0193729
3459a7637844J455683K519437j963277j0776148q686441J55577l620731j6400861
$$ y = [-35069341, -39762032, -40254317, -34015321, -26673212, -29241523, -39832108, -43177539, -33411963, -22281625, -18591026, -15314684, -5648683, 3487763, 4783782, 3866512, 7859065, 12602319, 12341758, 10435581, 9667340, 4496486, -5466796, -7757835, 3791853, 15564747, 14550444, 8710057, 10552202, 14420009, 9791530, 4143087, 9549465, 17073542, 9871283, -5848361, -10086292, -4745108, -11214241, -32028616, -43558670, -32355848, -13396576, -4524143, -5376322, -10223531, -20819416, -36651631, -50275941, -60757876, -74667447, -87069812, -80945460, -54178499, -27831573, -17637844, -16182161, -13662724, -15626001, -26402149, -35088590, -34933013, -38553744, -54954605]
3451e4954605j2747643J0358379K4715834J5132365K92936j879792Q85456j331526
3443a9528596j516348L382705m87848j6882065k4037679p338594J4306283J7065285
3435c5036857P637205O141071J0977453P637344m50065J707946J1010989J0409742
3427B0034828o09945n412945Q2463J524701o683417j0826986j751078R448307
3419E805928R251916J083147l076259j5713M956624P904535P667295K917002n043351
3410C1451124j0217300q200944j964351K293379K182737p47647m141428m578287
3402F077283K094068J5084239K5036750K1535677N209401j1445415j7213869j3223797
3394C3154337q156814n503103j639599L616643K942524o907114j6329114j4431023
$$ y = [-54954605, -67702248, -57343869, -32628035, -17495670, -17202734, -19082526, -18197070, -19528596, -21044944, -17662239, -18150087, -35032152, -59069831, -66408425, -52102142, -35036857, -27399652, -21258581, -10281128, -2643784, -3093849, -1385903, 9625086, 20034828, 19424883, 14011938, 14094401, 15619102, 8935685, -1891301, -3642379, 5805928, 15057844, 16140991, 13064732, 13049019, 18005643, 25910178, 33577473, 36494475, 31451124, 21233824, 13032880, 11068529, 13361908, 15544645, 14796998, 10655570, 6077283, 8171351, 23255590, 48292340, 69828017, 75037418, 63592003, 46378134, 33154337, 24997523, 19494420, 17854821, 21471464, 24413988, 17506874, 1177760, -13253263]
3386a3253263n249950j764857n471971m658631N152297J2722101R277664K763974
3378d82636M127739R248610O773401k703411q498711p301115n789104o985551
3370a1610778o333269k071685J779904M350410Q913389J2860500Q420756k495617
3362A3813610o277165K442870R970400K868800j0935843j3273734k209901P273598
3354C672635P241278N779641Q872261Q196956m146820j9255098k1461454r760137
3346b0860738J685116K734463k419952m200365J291662J1469262K0608914K2146218
3338C2454580J3540556R08440o092649n228271k487092j709965m56758K424783
3330C3353624L330224J245192M00996J262548k449156j1606736j5498653o670486
$$ y = [-13253263, -18503213, -20268070, -25740041, -30398672, -25246375, -12524274, -3246610, -482636, 3645103, 12893713, 19667114, 16963703, 8464992, 1163877, -4625227, -11610778, -17944047, -20015732, -18235828, -13885418, -4972029, 7888471, 16309227, 13813610, 7536445, 9979315, 19949715, 22818515, 11882672, -1391062, -3600963, 3672635, 10913913, 16693554, 25565815, 33762771, 29615951, 10360853, -11100601, -20860738, -19175622, -16441159, -18861111, -23061476, -21769814, -10300552, 10308362, 32454580, 45995136, 46903576, 40810927, 35582656, 33095564, 31385599, 30928841, 33353624, 36683848, 37929040, 38330036, 39592584, 37143428, 25536692, 10038039, 3367553]
3322C367553N587354P333843n9917l863171j48758K687008p33585o315384j0069623
3313b214680j2680064j2601498n258643P704015J7304363J8324945J3905245P706734
3305C2190417K98015n201501l864156J773013K686924l231367q095696p055696
3297I499953l920133p20406N888010J2662707P988998r097810k0740370j2906905
3289a1345956L804146Q916837k28709r034578p989505o64743O790226J0841001
3281A088719P644838k453406r013663k115208J2215557J8858292J4419983Q410159
3273D9055271M779523k212702j1550340j1504009O37503R033052J14591j7245400
3265B1107489k3946283j5883146m894313J018363N222923J0131464R685683k94626
$$ y = [3367553, 8954907, 16288750, 16228833, 12365662, 12216904, 14903912, 14170327, 7854943, -2214680, -14894744, -27496242, -32754885, -25050870, -7746507, 10578438, 24483683, 32190417, 32488432, 27286931, 23422775, 25195788, 27882712, 24651345, 16555649, 9499953, 5579820, 4859414, 10747424, 23410131, 31399129, 22301319, 1560949, -11345956, -7541810, 1375027, 1146318, -7888260, -15877765, -16542508, -9752282, 1088719, 8733557, 6280151, -2733512, -4848720, 7366837, 26225129, 40645112, 49055271, 53834794, 51622092, 40071752, 28567743, 29205246, 38238298, 38352889, 21107489, -2838794, -18721940, -23616253, -22597890, -17374967, -7243503, 2442180, 2147554]
3257B147554j1725649j1862615N64539J2930166J3646757M989901k440984m715912
3249C533757p215313j1954307j1001043J146759J4710215J4080756j296720j5279979
3241a3275875j5706391p560616j902615l70414K540720P844592J1171149J1111101
3233f148349J0748672J0769691P395415q88531r001674j0674357o188588k017710
3225f005431k869595n967521m688948K469399Q898040P595504O7678n632538m827323
3216a0960735j76611M096943O768807O898066K263021n569703r217217l924631
3208i822060M967953Q752627P229592P070034R512533Q127478O61782n291312
3200C1208627l514617N57554j899752q700446r382096j566905M508849Q42883
$$ y = [2147554, -9578095, -21440710, -20876171, -7946005, 5700752, 10690653, 8249669, 3533757, -3681556, -15635863, -26636906, -25490147, -10779932, 3300824, 2004104, -13275875, -28982266, -36542882, -38445497, -38815911, -36275191, -28430599, -17259450, -6148349, 4600323, 15370014, 22765429, 21876898, 12875224, 2200867, -3987721, -6005431, -8875026, -14842547, -19531495, -17062096, -8164056, -568552, -500874, -6133412, -10960735, -11137346, -7040403, -271596, 6626470, 8889491, 3319788, -5897429, -9822060, -4854107, 3898520, 11128112, 18198146, 27710679, 35838157, 36499939, 31208627, 27694010, 28251564, 26351812, 17651366, 8269270, 6702365, 11211214, 12054097]
3192A2054097o279086m987484N491473J3873531J1946438M013120j546600n036195
3184B9529294j3306429k5447646k8424738j2981972J0094921J9041244P825213
3177a3670113n667156l582875Q830446J4072745R117164O295589R554414P506867
3169C2457081n014694j4949388j0805706j462369j937460r820805j0739929j313293
3161b3586563Q546423J2926396J4527572J3368780N859032l994332o572102k048439
3153A9026767o76727n337456p531630m162407l520260q682329r732348j279963
3145b1896353N761157J074660p698107p258026M35727L108331j909460o042751
3137c4424822m386846j11507M387640R938699J4433727J3062411N221057m664137
$$ y = [12054097, 5775011, 787527, 6279000, 20152531, 32098969, 36112089, 34565489, 29529294, 16222865, -9224781, -37649519, -50631491, -40536570, -21495326, -13670113, -19337269, -22920144, -14089698, -16953, 9100211, 15395800, 24950214, 32457081, 27442387, 12492999, 1687293, 224924, -1712536, -11533341, -22273270, -23586563, -15040140, -2113744, 12413828, 25782608, 31641640, 27647308, 21075206, 19026767, 18350040, 13012584, 5480954, 1318547, -2201713, -10884042, -20616390, -21896353, -16135196, -15060536, -22758643, -30016669, -29580942, -26472611, -28382071, -34424822, -38811668, -38923175, -34535535, -24596836, -10163109, 2899302, 8120359, 3456222]
3129C456222j1845352j2054846j843219J5064751K5890978K1245963O517868n939482
3121D0492883j1366125j1346052m134354J1418934K4985023K1469572P85031j9387931
3113E2916981k3627162j3894474k717180J255657j878246o922301q818973o838327
3105a0524025m214663k633652n45346O79143m370291j4241522j6248544k789503
3097e4888403J4005436J5913634K923900q794154j0285575p135665m649489j024936
3089e3935252K931197J880545k625255k141562L270535L208201m400882p006123
3081e8818596K374833J2049641R363473M69162k41020P271556J0117292K808276
3073a4605383n993016o609435J030019J0539946J5815805J3501940M028756p841506
$$ y = [3456222, -8389130, -20443976, -22287195, -7222444, 18668534, 39914497, 46432365, 40492883, 29126758, 17780706, 13646352, 25065286, 50050309, 71519881, 72304912, 52916981, 29289819, 15395345, 12678165, 13933822, 12055576, 5133275, -3685698, -10524025, -14738688, -17372340, -17917686, -17238543, -21608834, -35850356, -52098900, -54888403, -40882967, -24969333, -22045433, -30839587, -41125162, -48260827, -52910316, -53935252, -51004055, -49123510, -51748765, -53890327, -50619792, -47411591, -51812473, -58818596, -56443763, -44394122, -35030649, -34561487, -34802507, -27530951, -17413659, -14605383, -20598399, -27207834, -26177815, -15637869, 177936, 13679876, 17708632, 9867126]
3065I867126j5932138j7287122j3686393r132145n459725L78684J2084317K4610825
3057a4556571K4369303O360190j3190128j3133251M205509J4375111L791793j2403441
3049a81485j3068493K31617Q467849J678337j1433772j7250567j1143276J210192
3041d1489598R777602Q489357J816687M57930P191427J1914063N607465o107046
3033b342113j0260382l749687M072922M494343j180780n351795k943450M022137
3025a3238805Q920287P819566L555508J57580m071715j1526360j5685711p246919
3017c1316569Q969161J5658171O530283m031661k584930M054588K508537m229006
3009d441426k653856P782020J2935331N545710m831041o230349J341115R420848
$$ y = [9867126, -6065012, -23352134, -37038527, -46170672, -51630397, -51251713, -39167396, -14556571, 9812732, 16172922, 2982794, -10150457, -5944948, 8430163, 12221956, -181485, -13249978, -13018361, -4550512, -2872175, -14305947, -31556514, -42699790, -41489598, -31711996, -23222639, -21405952, -20948022, -13756595, -1842532, 3764933, -2342113, -12602495, -16352182, -12279260, -7784917, -8965697, -14317492, -17260942, -13238805, -4318518, 3501048, 7056556, 7214136, 3142421, -8383939, -24069650, -31316569, -22347408, -6689237, -158954, -4190615, -6775545, -2720957, -212420, -4441426, -7095282, 686738, 13622069, 19167779, 14336738, 8106389, 9447504, 18868352]
3001A8868352J1756904Q075347K059615j727508j435767Q27456K593961L689268
2993D4707628L086399k791372j3901458k2048367j8538898n151312P238499J0124374
2985B725493M218196l326628n422182o80346N155639N540348J276312k029912
2977G456920m111790r510446j5664152j2506250J045102J1332329Q613134J181427
2969a2163726R25549M452181J236722o877512q763960k590351K494573J670145
2961a9616379o99487r16099j8456J701819N049364P429387N928804L095554K396533
2952D351040J578694j561702k094723L770475R227501O866879J768636J518428
2944B5425228J43342j1209489k3065251j7683327R32339R024835j544566j1293791
$$ y = [18868352, 30625256, 38700603, 40760218, 39032710, 37596943, 38424399, 41018360, 44707628, 47794027, 45002655, 31101197, 9052830, -9486068, -14637380, -7398881, 2725493, 6943689, 3617061, -1805121, -2485467, 2670172, 8210520, 9486832, 7456920, 3345130, -6165316, -21829468, -34335718, -33290616, -21958287, -13345153, -12163726, -11238177, -6785996, -5549274, -12426786, -21190746, -23781097, -21286524, -19616379, -20315866, -21231965, -21250421, -19548602, -14499238, -7069851, -1141047, 1954507, 4351040, 5929734, 4368032, 2273309, 6043784, 15271285, 22138164, 23906800, 25425228, 25568570, 14359081, -8706170, -26389497, -25457158, -16432323, -17976889, -29270680]
2936b9270680l979005J0253267J3992952Q370020N244177N261091l73488j1512662
2928b014328j6307373p148115Q588409J5546376O232829r823395j4459658j666386
2920b1051641J3848190J5202077N085824j456214o84347j460250n312755l319858
2912H51026N152369Q712627L816616J056542N164979O073171j692935p898001
2904B1236394n444694l709661j0244314j4875635p458042K341219N95842o626739
2896b4185630l529164Q713790J4758097J0020601M354472K828166L04104m291400
2888H973036m215427J595821M363491j039724q370294r737310n585616j668277
2880a5684300j278409k719797j634890L993781R603208Q114580J56987n708648
$$ y = [-29270680, -33249685, -22996418, -9003466, -633446, 4610731, 9871822, 9498334, -2014328, -18321701, -25469816, -16881407, -1335031, 4897798, -4925597, -19385255, -21051641, -7203451, 7998626, 13084450, 11628236, 10943889, 9483639, 4170884, 851026, 6003395, 14716022, 18532638, 19589180, 24754159, 30827330, 29134395, 21236394, 15791700, 12082039, 1837725, -13037910, -20495952, -18154733, -17558891, -24185630, -27714794, -19001004, -4242907, 5777694, 10132166, 12960332, 13264436, 8973036, 4757609, 6353430, 10716921, 9677197, 1306903, -8430407, -14016023, -15684300, -16962709, -19682506, -21317396, -17323615, -7720407, 394173, 551160, -5157488]
2872e157488n975975o884253j0810967q526402N400705J9077229J7916360N797934
2864A0837143j991508j462737r34038l166461k306084K095091K974161j027988
2856E017579l423946k422880k887208m108647Q07003R764738R482278m885512
2848G343405j9337554j8947845p878486j732686m697903m757676P439460K2770233
2840a9799052K3000553N064400j1458306p596670R091770J3911174q1753j2969000
2832h36884r650588j815453m105483o171836Q269000K6272522J9025915j1637523
2824A9349670k9853559j5430864R335430J4565469K251283n542059j129508N038924
2816a415214N391117K637899K41173j723855l331371n485984j0075385j3658240
$$ y = [-5157488, -11133463, -18017716, -28828683, -37355085, -31954380, -12877151, 5039209, 10837143, 8845635, 7382898, 6448860, 3282399, 976315, 3071406, 6045567, 5017579, 1593633, -829247, -3716455, -7825102, -7018099, 2746639, 12228917, 7343405, -11994149, -30941994, -38820480, -40553166, -45251069, -50008745, -42569285, -19799052, 3201501, 8265901, -3192405, -10789075, -1697305, 12213869, 12132116, -836884, -10487472, -12302925, -16408408, -22580244, -14311244, 11961278, 30987193, 19349670, -10503889, -25934753, -16599323, -2033854, 217429, -5324630, -6454138, -1415214, 3975903, 6613802, 6854975, 5131120, 1799749, -3686235, -13761620, -27419860]
2808b7419860p633456Q446944K1149793J9018201P570078o9175j266984l322375
2800A6473166r736500j6327800j8039555j2495438k98819J2232436J5439480P557929
2792e195101j726760m580817m659646o696176n633260L432809J2408849J0215800
2784b434302L85745m489036k141898j015738l654369l593828J515055O644545
2776h783826R492550J1297323P717651o605420k2606855k1926392l151263J1995217
2768b2571015P332417o038383p691853L409905J1699543R193115K295528k536647
2760d907390o167225r186294q330713l319235R31597J534158O41779k29051k014359
2751c1046733k489627L345460J3328881J5768966L497752j4124171k0298151j0240067
$$ y = [-27419860, -35053316, -26606372, -5456579, 13561622, 21131700, 21062525, 19795541, 16473166, 6736666, -9591134, -27630689, -40126127, -40424946, -28192510, -12753030, -5195101, -6921861, -11502678, -16162324, -22858500, -28491760, -25058951, -12650102, -2434302, -2048557, -6537593, -8679491, -9695229, -13349598, -16943426, -15428371, -8783826, 708724, 12006047, 19723698, 13118278, -9488577, -31414969, -34566232, -22571015, -15238598, -21276981, -28968834, -25558929, -13859386, -4666271, -2370743, -4907390, -11074615, -20260909, -28591622, -31910857, -30979260, -29445102, -28803323, -29032374, -31046733, -33536360, -30190900, -16862019, -1093053, 2404699, -11719472, -32017623, -42257690]
2743d2257690M320489R571805L432090n426139p912489k456270M681036O129812
2735b9917356J935633J82834O286288J3705173J0825663l158209j5811655j6904510
2727c2856139j0003282m891114m079569k528298K822043R182717J1858136P720547
2719b2774959k787077j2728761j1318802M043657K0710073K3002837J0557368
2712H704336k543592o105685l177149o72130K74219J364636K069213J870383K199382
2703C983613K803026J383278o33089J582169O915622O692258k539028j1811783
2695H376066j2070641p121223n832398p032370l041232M518620M707309n341367
2687b2837236j3876293j0463782p47890J483156p110566j5462158j1975968K550581
$$ y = [-42257690, -37937201, -28365396, -24933306, -30359445, -38271934, -40728204, -36047168, -29917356, -27981723, -27798889, -21512601, -7807428, 3018235, -139974, -15951629, -32856139, -42859421, -47750535, -51830104, -54358402, -51536359, -42353642, -30495506, -22774959, -25562036, -38290797, -49609599, -45565942, -24855869, -1853032, 8704336, 6160744, 55059, -3122090, -3794220, -3520001, -2155365, -86152, 1784231, 3983613, 6786639, 8169917, 7536828, 9118997, 16034619, 22726877, 20187849, 8376066, -3694575, -10815798, -16648196, -23680566, -26721798, -22203178, -17495869, -22837236, -36713529, -47177311, -47925201, -46442045, -53552611, -69014769, -80990737, -78440156]
2679g8440156J6835800K0842717J3898665L003123m065715l661332K589263Q750443
2671b0247192Q386526J217082m701017j899968N630310O619019j080672o078560
2663a2154472k63357P628758M215631p561848j1410386j534684Q433466N157776
2655g489116n497028q108020q28010K094632q482566k2409797k2931453q455822
2647h2107180N905376P945372K226170J174906P960358J4486051J4134873R338243
2639a8935831N346765K600413j104461m495306l192745M287575J3110751J5433620
2631A3050781Q041140k735125o533422j991923P9613p545320j4521438n896848
2623a8052542J2712739J8164737K307060j4283847j1320276K379615M737997m990442
$$ y = [-78440156, -61604356, -40761639, -26862974, -23859851, -27925566, -31586898, -28997635, -20247192, -11860666, -10643584, -15344601, -17244569, -11614259, -4995240, -6075912, -12154472, -12417829, -4789071, -573440, -8135288, -19545674, -21080358, -12646892, -7489116, -12986144, -21094164, -21922174, -19827542, -28310108, -50719905, -73651358, -82107180, -76201804, -68256432, -66030262, -64855356, -56894998, -42408947, -28274074, -18935831, -13589066, -10988653, -12093114, -16588420, -19781165, -15493590, -2382839, 13050781, 21091921, 18356796, 11823374, 9831451, 9911064, 2365744, -12155694, -18052542, -5339803, 12824934, 15131994, 848147, -10472129, -8092514, -3354517, -8344959]
2615h344959p706873K871810J0764901N101298k500977J759685J0857475Q482069
2607B1284429m753811j1905278m629993N770472N465181l281194p265588j793872
2599a109654K960875l054499j4064461j4596017j032615J1194564P388010n750102
2591a8063899q886713K761805J2712756O799653o972580r914295K169600J4675382
2583d718291J3851176K815937m456703n56900P783843Q785018n05500j1299235
2575A1699345j3499502o433103K073796M705642K78576p113843j0996463o655924
2567b5941476L303849R200013M687104m761073q881238n799238j462679J653336
2559b8001402N751831Q071335J564071j1562342j7933164j0429848J899374P987259
$$ y = [-8344959, -16051832, -13180022, -2415121, 2686177, 185200, 1944885, 12802360, 21284429, 16530618, 4625340, -4653, 5765819, 11231000, 7949806, 684218, -1109654, 1851221, -1203278, -15267739, -29863756, -30896371, -19701807, -12313797, -18063899, -26950612, -24188807, -11476051, -4676398, -11648978, -21563273, -19393673, -4718291, 9132885, 11948822, 7492119, 6935219, 14719062, 23504080, 22998580, 11699345, -1800157, -8233260, -6159464, -1453822, -1175246, -8289089, -19285552, -25941476, -22637627, -13437614, -8750510, -13511583, -22392821, -28192059, -29654738, -28001402, -22249571, -14178236, -12614165, -24176507, -42109671, -52539519, -50640145, -42652886]
2551d2652886R423409J2375725J3809532P646471j239112k391617L376230N203438
2543E551190j60068m253390k009755J023774L66072L47420L902739M035313n815100
2534B988195j8867553k1679863j1222503K360733Q949829P749483L625854N83340
2526b5512485M67192L103652N203915K788639k611511l535441L668361J1144342
2518e283336P660036n075048j1215132o41913J5437513J7249783K942882q255201
2510A2819584k110907J1988594J5927238P757999L10000k97859j088991o970212
2502C8335446j2109530j0727472n866299j817702K923594Q632421R187147K359800
2494C0917405k488607K795446J0888727R197458l98043n530072m399003p035664
$$ y = [-42652886, -33229477, -20853752, -7044220, 602251, -636861, -3028478, 347752, 5551190, 5391122, 1137732, -872023, 151751, 517823, 865243, 4767982, 8803295, 2988195, -15879358, -37559221, -48781724, -46420991, -37471162, -29721679, -26095825, -25512485, -25045293, -21941641, -16737726, -13949087, -16560598, -20096039, -16427678, -5283336, 2376700, -2698348, -13913480, -14555393, 882120, 18131903, 21074785, 12819584, 10708677, 22697271, 38624509, 46382508, 46692508, 46394649, 45305658, 38335446, 26225916, 15498444, 9632145, 7814443, 10738037, 19370458, 28557605, 30917405, 28428798, 31224244, 42112971, 51310429, 50912386, 45382314, 40983311, 33947647]
2486C3947647j4536648j4403223k972504M041656m838047j6120231j0094062Q587981
2478a6387431J7488613R749352J201740K209932J947622j0324818k3928389k0767815
2470c8811194k000352J3690091J5134322R211975O333145O562194L714558m095880
2462I738859j2330394j4942127r451410P1321M959516Q42008n405596k701987
2454b9219810R208283J7444425J1651594k807920j1589988q128537J000732N842663
2446f598558L514797j304017k748170P99306O011831Q314144O605336L980452
2438A8575121L214339K841443l10493n395855p411755l970766L63078o12108o039280
2429A253724q231797k679378N400141P266108J319371o008810q873118p208030
$$ y = [33947647, 19410999, 5007776, 2035272, 6076928, 1238881, -14881350, -24975412, -16387431, 1101182, 10850534, 12052274, 14262206, 16209828, 5885010, -18043379, -38811194, -40811546, -27121455, -11987133, -2775158, 3557987, 10120181, 13834739, 9738859, -2591535, -17533662, -26985072, -26913751, -21954235, -21112227, -26517823, -29219810, -20011527, -2567102, 9084492, 6276572, -5313416, -13441953, -12441221, -6598558, -3083761, -4387778, -7135948, -6336642, -324811, 7989333, 14594669, 18575121, 21789460, 24630903, 24320410, 18924555, 11512800, 7542034, 7905112, 7293004, 1253724, -6978073, -9657451, -4257310, 3008798, 4328169, -1680641, -10553759, -17761789]
2421a7761789l321555J789195O854857R038356O800066J532664m693075r381389
2413i142670p488097L995378J6723815J5122835l291588j9691092j6283127p39792
2405b0794338M935886l577876q559764L62891R929452M866343q301928j1918004
2397c3057338k797657O772772R111416Q367704Q233747N194277k409949p992680
2389h577708n068335L153779P568022M179062k418475n711572m492695k283170
2381a3651092q40877K584203R365537J4058284J0506327K184804j263852J217056
2373B4160390J11209q238458j3594623p616685K005169L748953L54339J492198
2365B422492M827903O98409p404052n364366P153741J3227507N010129l865214
$$ y = [-17761789, -21083344, -19294149, -12439292, -3400936, 3399130, 4931794, 238719, -9142670, -16630767, -12635389, 4088426, 19211261, 15919673, -3771419, -20054546, -20794338, -15858452, -19436328, -27996092, -27633201, -17703749, -12837406, -21139334, -33057338, -35854995, -29082223, -19970807, -11603103, -3369356, 1824921, -585028, -8577708, -13646043, -10492264, -2924242, 1254820, -1163655, -6875227, -11367922, -13651092, -14491969, -11907766, -2542229, 11516055, 22022382, 24207186, 22943334, 24160390, 24271599, 16033141, 2438518, -5178167, -3172998, 575955, 930294, 2422492, 7250395, 7948804, 544752, -4819614, 2334127, 15561634, 20571763, 16706549]
2357A6706549j045353N444716L129565l748878m487289k826123r542536j9989725
2349a6359074j7960677j512718J2059923J0193406l3524n592431m073418l33034
2341b3611547L750376Q505757J1261584Q500776N89420q680829j4414617j2073978
2333b6173058j820426Q180509R337703M215589K732030N804765L154865q746957
2325c314980j7816211j3080441o70977O751478Q564636J2015869J4930751P081644
2317A4461769j1283933k5067470k2057382o474542Q190675J2853175P112144l009300
2309b5274864q373648l518498O789730J2292855J0074849P111646Q406335R609717
2301A7118122N284201j886803n798348o310302p621773r721919p787219k07921
$$ y = [16706549, 15661196, 21105912, 24235477, 20486599, 15999310, 13173187, 3630651, -16359074, -34319751, -35832469, -23772546, -13579140, -13612664, -19205095, -23278513, -23611547, -19861171, -11355414, -93830, 8406946, 8996366, 315537, -14099080, -26173058, -27993484, -19812975, -10475272, -6259683, -3527653, 2277112, 5431977, -3314980, -21131191, -34211632, -34882609, -28131131, -19566495, -7550626, 7380125, 14461769, 3177836, -21889634, -43947016, -50421558, -42230883, -29377708, -22265564, -25274864, -33648512, -37167010, -30377280, -18084425, -8009576, -897930, 7508405, 17118122, 22402323, 20515520, 14717172, 8406870, 785097, -8936822, -16724041, -16931962]
2293a6931962P525753Q766219L398399k346647l799049l839301q212529j5003118
2285c0442235j4308012k313139R853117R127396r33708m426644M938706J6898825
2277a1605694K0812747J7209523R752068k062610j5439418k0746432j4803884
2270a6883700q667667j1839915j6597972r839510N601876J4545616J0992609L476591
2262b9212072L69711J455959L818110N620325M001662j324191l090595N068738
2254a3292353J6138302J6423568M502036p368865j0580697p344807q13810Q296988
2246E960362J3476315N470362j1702945k0999541j4175574j225366O706248R870049
2238f620090R403906O19144j2928159j4471333K380986J8150513J2454138n744354
$$ y = [-16931962, -9406209, -639990, 2758409, 411762, -3387287, -7226588, -15439117, -30442235, -44750247, -47063386, -37210269, -28082873, -29016581, -33443225, -28504519, -11605694, 9207053, 26416576, 36168644, 34106034, 18666616, -2079816, -16883700, -25551367, -37391282, -53989254, -63828764, -58226888, -43681272, -32688663, -29212072, -28842361, -27386402, -23568292, -17947967, -13946305, -15270496, -18361091, -13292353, 2845949, 19269517, 23771553, 16402688, 5821991, -1522816, -2336626, 5960362, 19436677, 24907039, 13204094, -7795447, -21971021, -23196387, -16490139, -6620090, 2783816, 3402960, -9525199, -23996532, -21615546, -3465033, 8989105, 3244751]
2230C244751j1398198L84181J1397090J0112122L834447J83578m219263j1385984
2222B152724j4184690q207053K66190M531545O013020P421338O803094L584569
2214H380737J674969J473302k428748j0261803j2959877n711066K988914M021015
2206a2822557J963999O967873J7402547K1191534J2734753n58828q669830q630915
2198B9578576l339186K648108M388437j111495j0928291j7300392j4953978o406922
2190a7425143Q39883J760250j723028l542662j057514J198788k347366r178651
2182c1475443j0180393j676413Q781941J1872935P573829K472848j41285j602687
2174a4374668j901630M41852L152757K126958o71288J122862O473703N400358
$$ y = [3244751, -8153447, -7769266, 3627824, 13739946, 17574393, 17757971, 13538708, 2152724, -12031966, -20239019, -19972829, -15441284, -9428264, -2006926, 4796168, 8380737, 10055706, 11529008, 9100260, -1161543, -14121420, -19832486, -16843572, -12822557, -10858558, -3890685, 13511862, 34703396, 47438149, 46879321, 38209491, 29578576, 26239390, 28887498, 33275935, 32164440, 21236149, 3935757, -11018221, -17425143, -16585260, -14825010, -16548038, -20090700, -21148214, -19949426, -22296792, -31475443, -41655836, -43332249, -34550308, -22677373, -15103544, -12630696, -12771981, -14374668, -16276298, -15834446, -12681689, -10554731, -11226019, -10103157, -3629454, 1770904]
2166A770904n380504j3498069p065798N665605N442501r835071j9659389q438269
2158e0998090J3226855K3713971J8366818J0702467J0038566J0715309M344152
2151D0110048p719690j7450855j8592123r729676M387399J2608393N815491j0943908
2143a514921k1034167j4532880J631068J4605106J9645354J8956840J3952237
2136C1708637N738713j460963m561095o683830j2207394j8726049j8814079q803930
2128c3809990O722701J7404183J3899473k739605j7840963j6409109j377521R816154
2120b4334677Q776991M919761O661566Q006507K586079k926277j923196j696722
2112G0032r108442j4231724o346364M226906J696700o187780J7437J5028054J2964878
$$ y = [1770904, -3609600, -17107669, -24173467, -18507862, -13065361, -22900432, -42559821, -50998090, -37771235, -14057264, 4309554, 15012021, 25050587, 35765896, 40110048, 32390358, 14939503, -3652620, -13382296, -8994897, 3613496, 9428987, -1514921, -22549088, -37081968, -35450900, -20845794, -1200440, 17756400, 31708637, 37447350, 35986387, 31425292, 24741462, 12534068, -6191981, -25006060, -33809990, -27087289, -9683106, 4216367, 1476762, -16364201, -32773310, -34150831, -24334677, -15557686, -10637925, -3976359, 4030148, 6616227, 3689950, 1766754, 70032, -9038410, -23270134, -29616498, -25389592, -23692892, -29880672, -29863235, -14835181, -1870303]
2103a870303r933430k5628673j5960971K164320O136336r22338m116217k475176
2095e2606452k289672l80049O886295J0020129O79915j0088442o257182Q065927
2087d5969531J5622351J1910597O599671L937797l71706n222251m088447J430328
2079a6151191L047094O55938J853909O852205P722427L010579n24380j462391
2071E004190n203156j0433281q294643J748221Q643374O570579K334443J168209
2063A537936j861251r336047j2384455l540615J0035967J5656398J1138180L401400
2055A4647513l406118r715921j4137101j3415372p522199N72200Q394344J3175341
2047a1407313J0775036N12189j1132528j6227987j3152724n483756L566168J1292870
$$ y = [-1870303, -11803733, -37432406, -53393377, -51229057, -45092721, -46015059, -50131276, -52606452, -54896124, -55276173, -48389878, -38369749, -37689834, -47778276, -54035458, -45969531, -30347180, -18436583, -11836912, -7899115, -8270821, -13493072, -17581519, -16151191, -13104097, -12448159, -10594250, -3742045, 3980382, 6990961, 6466581, 5004190, -198966, -10632247, -18926890, -17178669, -8535295, -1964716, 369727, 1537936, -323315, -9659362, -22043817, -25584432, -15548465, 107933, 11246113, 14647513, 11241395, 1525474, -12611627, -26026999, -33549198, -32976998, -24582654, -11407313, -632277, -120088, -11252616, -27480603, -40633327, -46117083, -42550915, -31258045]
2039c1258045J3703341R825456N984089R114252J5856961J4747565J142145j5138678
2031B3977086k0034011r885194O521362J7461137J7078983P825667j664860k758314
2023C8521856M601474J0080863M208888r063683j6809058j4378624j0256582j0680834
2015c775700q909071K376203J5919059J8775914J1753491O762513O681955K579228
2007E2163592p649358j3409164r509384n771522j0355605j6039407j3028396m481949
1999b8081193J699170O588376J3492547J6552322J0139766K577325N342787J3415241
1991D1726341J1803228j197107j2540370j4951393j3891181j3625008j0721659
1984a3397149l713747K931343O478786P123688K065168r476133j6669270p694860
$$ y = [-31258045, -17554704, -7729248, -1745159, 7369093, 23226054, 37973619, 39115764, 23977086, 3943075, -5942119, 579243, 18040380, 35119363, 42945030, 41280170, 38521856, 43123330, 53204193, 57413081, 48349398, 31540340, 17161716, 6905134, -3775700, -12684771, -10308568, 5610491, 24386405, 36139896, 42902409, 49584364, 52163592, 44514234, 31105070, 21595686, 15824164, 5468559, -10570848, -23599244, -28081193, -26382023, -19793647, -6301100, 10251222, 20390988, 22968313, 28311100, 41726341, 53529569, 52332462, 39792092, 24840699, 10949518, -2675490, -13397149, -17110896, -14179553, -7700767, -577079, 1488089, -7988044, -24657314, -32352174]
1976c2352174R438099J3443319J72952j0957315o431471L665854O456067O804155
1968i760514J3010089J6587630M317475j7644211k9094720k2144909q043455R99391
1960e1773224M218558N829192O798910O254443M721402L211537K069249J371331
1952a7298602Q95522P04603K375669O865041J0869578R755826M694342J434974
1944B0296953J369689L55009k982991n759490q403299j3753979j6795809p534296
1936c3208213J1156832K1181185J2256299l943391j1033281q244639m065698r46324
1928a6847230J780418k42586q127022j1445133j993259J1059829J3524161P008112
1920e282710L040595L224769J543586M73741O060364J0623221J089326j5649551
$$ y = [-32352174, -22914075, -9470756, -9297804, -20255119, -26686590, -23020736, -16564669, -9760514, 3249575, 19837205, 24154680, 6510469, -22584251, -44729160, -52772615, -51773224, -47554666, -41725474, -34926564, -28672121, -23950719, -20739182, -18669933, -17298602, -16403080, -15698477, -13322808, -6457767, 4411811, 14167637, 18861979, 20296953, 21666642, 22021651, 19038660, 13279170, 4875871, -8878108, -25673917, -33208213, -22051381, -870196, 11386103, 7442712, -3590569, -11835208, -15900906, -16847230, -15066812, -15309398, -23436420, -34881553, -36874812, -25814983, -12290822, -5282710, -2242115, 982654, 2526240, 2999981, 9060345, 19683566, 20772892, 5123341]
1912E123341j7276178J22536J3584784O534351q396120j1322139m025865k085914
1904a7741204q786714j2815531p568228N82381L124372k31463l008859O04329
1896d5840917R488984J5107793J0012211k107917r399534o210681J147857M812348
1888b2989856M837824N038586N860397N767084M571988J635794m179702r559685
1880i017570p758649J358970Q330508O075980o75871l393037j894842j781343
1872h755854l490662j588771N509324J0910539O169487q683703k2567001k2228857
1864d4725498o493811R901595J1707881J269002n561456q90815P179759R346485
1856a8266858O841579L787756j171870q018066r668088k579954M583232K860304
$$ y = [5123341, -12152837, -12030301, 1554483, 8088834, -307286, -11629425, -15655290, -17741204, -26527918, -39343449, -46911677, -46329296, -43204924, -43436387, -46445246, -45840917, -36351933, -21244140, -11231929, -13339846, -22739380, -28950061, -27802204, -22989856, -18152032, -13113446, -7253049, -1485965, 3086023, 4721817, 542115, -9017570, -16776219, -15417249, -7086741, -1010761, -1686632, -5079669, -6974511, -8755854, -12246516, -13835287, -8325963, 2584576, 8754063, 70360, -22496641, -44725498, -51219309, -41317714, -29609833, -28340831, -33902287, -34793102, -27613343, -18266858, -11425279, -7637523, -8809393, -16827459, -26495547, -29075501, -24492269, -21631965]
1848b1631965l069750l414389N39250R95287o09856L329319J0055465Q144847
1840e661792l014500r743123m055625N521832Q770045P947281R340151J0086328
1832A9190597L467817p996093j4364944j1272808l860786J408336K947482J925739
1824h554660j269663o534978j1651427j2184270n735706K721582L462265n252304
1816d4999161j0373378J408848K3066312L2167778J9519624J448254l171870K958890
1808B2025297N074328P26221k26992M323604M844767k657876r720129r548519
1800A4840701o157658m329205j245043N132403Q529067L403416n100559q190873
1792F882249n459184k769652k579033l159291l457477k473297J893381P405606
$$ y = [-21631965, -24701715, -28116104, -27576854, -26581567, -27191423, -23862104, -13806639, -5661792, -8676292, -18419415, -22475040, -16953208, -8183163, -235882, 9104269, 19190597, 22658414, 14662321, 297377, -10975431, -14836217, -13427881, -10480399, -8554660, -9824323, -16359301, -28010728, -40194998, -45930704, -43209122, -39746857, -44999161, -55372539, -53963691, -30897379, 1270399, 20790023, 22238277, 19066407, 22025297, 27099625, 27825846, 27598854, 31922458, 36767225, 34109349, 24389220, 14840701, 8683043, 4353838, 3108795, 8241198, 16770265, 20173681, 15073122, 6882249, 1423065, -1346587, -3925620, -7084911, -10542388, -13015685, -11122304, -3716698]
1784c716698O506603k131868p760800k764918L096401l330102j5299872j3227014
1776c8628268N468021K0678228J7754671N525720j020487j890000n399386j1138040
1768h649541j2017293p328528k940248j851702k769565m862887o992471n516376
1760e2928611J104316Q902127J4069010J6915364J6242289P884477m918014r235876
1752a964918M1633R513753O048493k174020J424322J4059235J6888684M340194
1744D8177376q349247r302379m650513l800839n317930n004907n299290p943150
1736a490879p484353p53056N476328M429636k17642j496694k56535j430080m542421
1727g765696n190530j933329L814773J0291021J3454008Q574958j590765p363368
$$ y = [-3716698, 2789905, 658037, -7102763, -9867681, -6771280, -10101382, -25401254, -38628268, -33160247, -12482019, 5272652, 10798372, 9777885, 7887885, 2488499, -8649541, -20666834, -27995362, -30935610, -32787312, -35556877, -40419764, -47412235, -52928611, -51824295, -42922168, -28853158, -11937794, 4304495, 12188972, 7270958, -1964918, -1923285, 7590468, 13638961, 11464941, 12889263, 26948498, 43837182, 48177376, 39828129, 30525750, 25875237, 22074398, 16756468, 11751561, 6452271, -1490879, -8975232, -9728288, -4251960, 177676, -39966, -1536660, -1793195, -3223275, -7765696, -12956226, -14889555, -11074782, -783761, 12670247, 21245205, 19654440, 12291072]
1719A2291072o115025o860562j3566001j4298634O52514J8045070J5709226n222910
$$ y = [12291072, 6176047, -684515, -14250516, -28549150, -27896636, -9851566, 5857660, 634750]
$$ [...]
##END NTUPLES=NMR SPECTRUM
##END=
