##TITLE=31Pdec_DE-46_EA_W
 D2O
 24 sc
 8.4.2024
##JCAMPDX= 6.0         $$ Bruker NMR JCAMP-DX V2.0
##DATA TYPE= NMR SPECTRUM
##DATA CLASS= NTUPLES
##ORIGIN= UXNMR, Bruker Analytische Messtechnik GmbH
##OWNER= root
$$ XWIN-NMR		Version 3.5
$$ Mon Apr  8 16:28:56 2024 Russian Standard Time (UT+4h)  she@DPX200
##.OBSERVE FREQUENCY= 81.013821
##.OBSERVE NUCLEUS= ^31P
##.ACQUISITION MODE= SIMULTANEOUS
##.ACQUISITION SCHEME= undefined
##.AVERAGES= 24
##.DIGITISER RES= 16
##SPECTROMETER/DATA SYSTEM= spect
##.PULSE SEQUENCE= zgpg30
##.SOLVENT NAME= CDCl3
##.SHIFT REFERENCE= (INTERNAL, CDCl3, 0, 248.564)
##AUDIT TRAIL= $$ (NUMBER, WHEN, WHO, WHERE, WHAT)
$$ ##TITLE= Audit trail, XWIN-NMR		Version 3.5
$$ ##JCAMPDX= 5.01
$$ ##ORIGIN= Bruker BioSpin GmbH
$$ ##OWNER= she
$$ F:/spectra/data/she/nmr/P31/1/pdata/1/auditp.txt
$$ ##AUDIT TRAIL=  $$ (NUMBER, WHEN, WHO, WHERE, WHAT)
(   1,<2024-04-08 16:27:57.01 +0400>,<she>,<DPX200>,
      <created by zg, POWCHK disabled, PULCHK disabled
       configuration hash MD5:
       00 E9 B6 7A A2 85 ED C7 34 08 36 98 17 FE 4E 26
       data hash MD5: 32K
       C3 BC 5F 7D 87 F1 D5 00 9E 0F C5 AB 66 93 D1 8E>)
(   2,<2024-04-08 16:27:59.32 +0400>,<she>,<DPX200>,
      <Start of raw data processing
       efp BC_mod = 2 LB = 10 FT_mod = 6 PKNL = 1 PHC0 = -13236.68 PHC1 = 65.08333 SI = 64K 
       data hash MD5: 64K
       B6 A6 68 CB C0 2D EA F2 8E 15 37 D4 1A C9 6B 0D>)
(   3,<2024-04-08 16:28:18.93 +0400>,<she>,<DPX200>,
      <pk PHC0 = 4.95384 PHC1 = -0.9999995 
       data hash MD5: 64K
       50 76 07 C1 97 A9 26 4B 1F 79 91 5D 9A 09 49 46>)
$$ ##END=
$$ 
$$ hash MD5
$$ 15 D0 0E A4 4D 00 34 CE F8 A0 85 AB 65 A1 96 C4
##$RELAX= 
##$RELAX= 
##$RELAX= 
##$RELAX= 
##$RELAX= 
##$RELAX= 
##$RELAX= 
##$RELAX= 
##$RELAX= 
$$ Bruker specific parameters
$$ --------------------------
##$DU= <F:/spectra>
##$EXPNO= 1
##$NAME= <P31>
##$PROCNO= 1
##$TYPE= <nmr>
##$USER= <she>
##$AMP= (0..31)
100 100 100 100 100 100 100 100 100 100 100 100 100 100 100 100 100 100 
100 100 100 100 100 100 100 100 100 100 100 100 100 100 
##$AQSEQ= 0
##$AQ_mod= 1
##$AUNM= <au_zg>
##$AUTOPOS= <>
##$BF1= 81.014009
##$BF2= 200.13
##$BF3= 200.13
##$BF4= 200.13
##$BF5= 200.13
##$BF6= 200.13
##$BF7= 200.13
##$BF8= 200.13
##$BYTORDA= 1
##$CFDGTYP= 0
##$CFRGTYP= 5
##$CHEMSTR= <none>
##$CNST= (0..31)
1 1 145 1 1 1 1 1 1 1 1 1 1 1 1 1 1 1 1 1 1 1 1 1 1 1 1 1 1 1 1 1 
##$CPDPRG= <waltz16>
##$CPDPRG1= <>
##$CPDPRG2= <waltz16>
##$CPDPRG3= <>
##$CPDPRG4= <mlev>
##$CPDPRG5= <mlev>
##$CPDPRG6= <mlev>
##$CPDPRG7= <mlev>
##$CPDPRG8= <mlev>
##$CPDPRGB= <>
##$CPDPRGT= <>
##$D= (0..31)
0 1 0 0 0 0 0 0 0 0 0 0.03 2e-05 3e-06 0 0 0 0 0 0 0 0 0 0 0 0 0 0 0 0 
0 0 
##$DATE= 1712579276
##$DBL= (0..7)
120 120 120 11 120 120 24 19 
##$DBP= (0..7)
150 150 150 150 150 150 150 150 
##$DBP07= 0
##$DBPNAM0= <>
##$DBPNAM1= <>
##$DBPNAM2= <>
##$DBPNAM3= <>
##$DBPNAM4= <>
##$DBPNAM5= <>
##$DBPNAM6= <>
##$DBPNAM7= <>
##$DBPOAL= (0..7)
0.5 0.5 0.5 0.5 0.5 0.5 0.5 0.5 
##$DBPOFFS= (0..7)
$$ [...]
##$SUBNAM2= <"">
##$SUBNAM3= <"">
##$SUBNAM4= <"">
##$SUBNAM5= <"">
##$SUBNAM6= <"">
##$SUBNAM7= <"">
##$SUBNAM8= <"">
##$SUBNAM9= <"">
##$SW= 501.771253377433
##$SWIBOX= (0..15)
0 1 3 0 0 0 0 0 0 0 0 0 0 0 0 0 
##$SW_h= 40650.406504065
##$TD= 32768
##$TD0= 1
##$TE= 0
##$TE2= 300
##$TE3= 300
##$TEG= 300
##$TL= (0..7)
0 120 53 12 22 120 120 120 
##$TP= (0..7)
150 150 150 150 150 150 150 150 
##$TP07= 0
##$TPNAME0= <>
##$TPNAME1= <>
##$TPNAME2= <>
##$TPNAME3= <>
##$TPNAME4= <>
##$TPNAME5= <>
##$TPNAME6= <>
##$TPNAME7= <>
##$TPOAL= (0..7)
0.5 0.5 0.5 0.5 0.5 0.5 0.5 0.5 
##$TPOFFS= (0..7)
0 0 0 0 0 0 0 0 
##$TUNHIN= 0
##$TUNHOUT= 0
##$TUNXOUT= 0
##$USERA1= <user>
##$USERA2= <user>
##$USERA3= <user>
##$USERA4= <user>
##$USERA5= <user>
##$V9= 5
##$VALIST= <valist>
##$VCLIST= <CCCCCCCCCCCCCCC>
##$VD= 0
##$VDLIST= <DDDDDDDDDDDDDDD>
##$VPLIST= <PPPPPPPPPPPPPPP>
##$VTLIST= <TTTTTTTTTTTTTTT>
##$WBST= 1024
##$WBSW= 4
##$XGAIN= (0..3)
0 0 0 0 
##$XL= 0
##$YL= 0
##$YMAX_a= 1170
##$YMIN_a= -1455
##$ZGOPTNS= <>
##$ZL1= 120
##$ZL2= 120
##$ZL3= 120
##$ZL4= 120
##$ABSF1= 0
##$ABSF2= 0
##$ABSG= 0
##$ABSL= 0
##$ALPHA= 0
##$AQORDER= 0
##$ASSFAC= 0
##$ASSFACI= 0
##$ASSFACX= 0
##$ASSWID= 0
##$AUNMP= <proc_1d>
##$AZFE= 0.1
##$AZFW= 0.5
##$BCFW= 0
##$BC_mod= 2
##$BYTORDP= 0
##$COROFFS= 0
##$CY= -3
##$DATMOD= 1
##$DC= 0
##$DFILT= <>
##$DTYPP= 0
##$F1P= 0
##$F2P= 0
##$FCOR= 1
##$FTSIZE= 65536
##$FT_mod= 6
##$GAMMA= 0
##$GB= 0
##$INTBC= 1
##$INTSCL= 6.047779e-11
##$ISEN= 30
##$LB= 10
##$LEV0= 0
##$LPBIN= 0
##$MAXI= 10000
##$MC2= 0
##$MEAN= 0
##$ME_mod= 0
##$MI= 50
##$NCOEF= 0
##$NC_proc= -10
##$NLEV= 6
##$NOISF1= 182.463
##$NOISF2= 159.3651
##$NSP= 0
##$NTH_PI= 0
##$NZP= 0
##$OFFSET= 248.5645
##$PC= 4
##$PHC0= -13231.73
##$PHC1= 64.08333
##$PH_mod= 1
##$PKNL= yes
##$PPARMOD= 0
##$PSCAL= 0
##$PSIGN= 0
##$REVERSE= no
##$SF= 81.0140089999694
##$SI= 65536
##$SIGF1= 159.3651
##$SIGF2= -187.1042
##$SINO= 113.3802
##$SIOLD= 16384
##$SREGLST= <1H.CDCl3>
##$SSB= 0
##$STSI= 65536
##$STSR= 0
##$SW_p= 40650.406504065
##$SYMM= 0
##$S_DEV= 0
##$TDeff= 32768
##$TDoff= 0
##$TI= <>
##$TILT= no
##$TM1= 0
##$TM2= 0
##$TOPLEV= 0
##$USERP1= <user>
##$USERP2= <user>
##$USERP3= <user>
##$USERP4= <user>
##$USERP5= <user>
##$WDW= 1
##$XDIM= 65536
##$YMAX_p= 375504629
##$YMIN_p= -40470310
$$ End of Bruker specific parameters
$$ ---------------------------------
##NTUPLES= NMR SPECTRUM
##VAR_NAME=  FREQUENCY,     SPECTRUM/REAL,   SPECTRUM/IMAG
##SYMBOL=    X,             R,               I
##VAR_TYPE=  INDEPENDENT,   DEPENDENT,       DEPENDENT
##VAR_FORM=  AFFN,          ASDF,            ASDF
##VAR_DIM=   65536,         65536,           65536
##UNITS=     HZ,            ARBITRARY UNITS, ARBITRARY UNITS
##FACTOR=    0.620285442955139, 1,           1
##FIRST=     20137.2065510682, 0,            0
##LAST=      -20513.1999529968, 0,           0
##MIN=       -20513.1999529968, -40470310,   0
##MAX=       20137.2065510682, 375504629,    0
$$ Real data points
##PAGE= N=1
##DATA TABLE= (X++(R..R)), XYDATA
$$ [...]
43854 -3202612 -3711033 -4175760 -4626325 -5082566 -5549206 -6015398 -6457531 -6845150 -7149279
43845 -7149279 -7349751 -7437997 -7415015 -7287016 -7060594 -6737919 -6313584 -5775961 -5113620 -4323239
43835 -4323239 -3414965 -2414827 -1366003 -328006 630476 1447268 2085952 2548592 2874209
43826 2874209 3123130 3354608 3607206 3888903 4179306 4441780 4639597 4748811 4762918 4689852
43816 4689852 4546250 4353420 4134876 3912233 3698512 3493016 3283623 3057499 2813917
43807 2813917 2570313 2357804 2210451 2156131 2213371 2392099 2693826 3109803 3620067 4196803
43797 4196803 4812054 5446177 6092770 6757794 7453280 8188081 8959440 9748944 10524267
43788 10524267 11244954 11868936 12357876 12681819 12823840 12783222 12574710 12223879 11761974
43779 11761974 11223486 10645579 10065803 9516731 9020415 8586128 8211192 7882326 7576996
43770 7576996 7267094 6925970 6535351 6087405 5581348 5018823 4402002 3734237 3020933
43761 3020933 2270617 1498637 733633 21837 -576769 -1000607 -1200357 -1147702 -838118 -291347
43751 -291347 448881 1318818 2245345 3161289 4018945 4795716 5489593 6106769 6647319 7096514
43741 7096514 7426424 7606081 7613608 7444651 7115805 6664008 6141760 5607480 5112937 4692954
43731 4692954 4362464 4121839 3966232 3892273 3897727 3975289 4106511 4261933 4408558 4520105
43721 4520105 4583108 4594425 4551478 4442236 4243285 3929369 3489156 2936991 2313142 1672929
43711 1672929 1071136 548936 127400 -191984 -421698 -580128 -683593 -740840 -751748 -709947
43701 -709947 -606444 -431394 -175106 167266 585272 1042235 1473416 1799013 1948711 1887446
43691 1887446 1630760 1242448 814973 441277 190332 94934 152239 332317 590022 877151
43681 877151 1151642 1380809 1539383 1607807 1575964 1451501 1266795 1079062 962024 990083
43671 990083 1217647 1659916 2285151 3025628 3803367 4556212 5249933 5873025 6422607 6893402
43661 6893402 7276547 7567038 7773453 7922662 8055516 8214809 8431407 8715129 9053548
43652 9053548 9417295 9768463 10069644 10292558 10425115 10474724 10466091 10433839 10412799 10430016
43642 10430016 10501908 10637419 10844297 11133258 11516263 11999669 12576860 13225128 13908784
43633 13908784 14586783 15219989 15772814 16208143 16481020 16539271 16334482 15839045 15061348
43624 15061348 14052944 12904746 11732201 10653073 9764636 9126295 8749786 8597254 8589051
43615 8589051 8622810 8600003 8450607 8146536 7699746 7146825 6526676 5861141 5147354 4363830
43605 4363830 3484618 2493666 1394271 211226 -1014822 -2237361 -3411108 -4491672
43597 -4491672 -5431923 -6183993 -6710268 -6996857 -7059552 -6937478 -6677078 -6313777 -5859591 -5302622
43587 -5302622 -4618813 -3789982 -2818883 -1733899 -581581 588329 1736714 2839828 3882857
43578 3882857 4846733 5695895 6373926 6810856 6941218 6726207 6169671 5320163 4258953
43569 4258953 3081135 1878781 731319 -297279 -1158613 -1821031 -2272322 -2521486 -2597799
43560 -2597799 -2547413 -2427665 -2297478 -2203528 -2167236 -2181430 -2221342 -2264279 -2304844 -2355194 -2431338
43549 -2431338 -2537864 -2664708 -2798542 -2937260 -3092526 -3276461 -3483377 -3681704 -3822261
43540 -3822261 -3856653 -3754139 -3508255 -3131838 -2646562 -2076516 -1451381 -814921 -227985 241003
43530 241003 534111 619905 499765 204349 -215530 -699512 -1186741 -1621525 -1956397 -2156062
43520 -2156062 -2204614 -2113109 -1920744 -1685540 -1467751 -1314009 -1248378 -1270573 -1357646 -1466428
43510 -1466428 -1537605 -1504085 -1304432 -898793 -282659 506402 1392748 2278051 3063555 3670566
43500 3670566 4051839 4192959 4108311 3835992 3431998 2962019 2490814 2071729 1739343 1507021
43490 1507021 1369491 1309186 1303857 1332203 1374838 1409893 1406311 1321265 1107384 729058 179247
43479 179247 -513746 -1293802 -2093850 -2852455 -3522606 -4071374 -4474745 -4713753 -4775361 -4656784
43469 -4656784 -4369408 -3939559 -3405829 -2813408 -2206008 -1617681 -1068863 -569517 -127022
43460 -127022 247288 537128 725043 798051 754077 609748 408090 221324 143917 275060
43450 275060 694810 1441194 2495959 3784381 5189957 6579420 7830414 8854182 9607567
43441 9607567 10091792 10340671 10406224 10349924 10240583 10152112 10154589 10300397 10614097 11092827
43431 11092827 11716351 12459839 13301762 14222824 15197792 16187738 17141194 18006253 18746510
43422 18746510 19350320 19828140 20200582 20483099 20672079 20736354 20618659 20248957 19564492
43413 19564492 18526352 17125832 15382967 13344251 11082446 8695379 6300197 4023354
43405 4023354 1987994 298918 -974022 -1809375 -2237788 -2332591 -2189513 -1901604 -1537433
43396 -1537433 -1130312 -681724 -174433 413283 1097237 1879576 2741761 3640244 4509011
43387 4509011 5270470 5852105 6203956 6310981 6195381 5907816 5511398 5064490 4606970
43378 4606970 4153227 3694458 3210046 2683116 2113130 1521315 948669 447165 64925
43369 64925 -170413 -261575 -238008 -141097 -9054 128992 250012 334114 368916 359227 333513
43358 333513 341383 443830 701419 1163553 1859807 2795028 3949598 5283228 6738835
43349 6738835 8245977 9726574 11103943 12311418 13296339 14019632 14454510 14586227 14412093
43340 14412093 13941472 13197318 12219228 11063863 9797522 8481202 7156215 5840628
43332 5840628 4540189 3266972 2053422 953276 30229 -657721 -1070623 -1193470 -1039735
43323 -1039735 -652653 -101767 527785 1150719 1694752 2106733 2353586 2422951 2324987 2092789
43313 2092789 1779525 1453210 1190042 1065252 1140690 1451212 1993649 2721929 3551733 4376917
43303 4376917 5094786 5630501 5950076 6059091 5992656 5803264 5548532 5278172 5021709 4780794
43293 4780794 4528948 4218644 3793933 3206459 2431612 1479734 397034 -745533 -1870729
43284 -1870729 -2911492 -3818021 -4555916 -5102572 -5448164 -5600642 -5588954 -5459724 -5267230
43275 -5267230 -5059627 -4865831 -4688926 -4511983 -4316480 -4103723 -3904892 -3772183 -3756838 -3887483
43265 -3887483 -4158848 -4532877 -4949399 -5342466 -5657143 -5860171 -5940486 -5902265 -5757968 -5527272
43255 -5527272 -5241426 -4947223 -4704162 -4572472 -4595837 -4786910 -5122285 -5548015 -5992228 -6381399
43245 -6381399 -6658151 -6796606 -6808084 -6731652 -6612341 -6478213 -6328138 -6134924 -5859709 -5469350
43235 -5469350 -4949821 -4312259 -3591460 -2838306 -2108511 -1450968 -899132 -467583 -153060
43226 -153060 62910 212382 339997 499317 743149 1108359 1600846 2188265 2804874 3366719
43216 3366719 3791444 4017409 4019145 3816389 3472296 3077107 2719680 2457966 2302909 2223880
43206 2223880 2171423 2103730 2003664 1881193 1765034 1691415 1696125 1810922 2060536 2456044
43196 2456044 2985502 3609057 4265670 4890432 5432835 5866473 6188818 6416267 6578807
43187 6578807 6714374 6862023 7055310 7318060 7663006 8092400 8599738 9171328 9785887
43178 9785887 10412328 11009558 11532223 11940829 12209685 12327846 12294732 12115955 11803056 11376864
43168 11376864 10871428 10334578 9822150 9386446 9063979 8868685 8793163 8815898 8910856 9056897
43158 9056897 9244523 9476797 9762315 10102284 10478069 10846045 11142910 11299626 11258996 10991210
43148 10991210 10502458 9833334 9046890 8209861 7373052 6557182 5749654 4915607 4021363
43139 4021363 3060748 2070751 1127894 327847 -241392 -522278 -500472 -205110 303065 951583
43129 951583 1676527 2435611 3210201 3997755 4800278 5615076 6430245 7222018 7950656 8557473
43119 8557473 8970526 9122257 8972192 8522753 7821309 6949420 6003167 5068083 4195002
43110 4195002 3387690 2610936 1815957 967932 60165 -889014 -1848817 -2788464 -3685678
43101 -3685678 -4531029 -5326487 -6076089 -6771993 -7385636 -7872273 -8187360 -8304155 -8222020 -7962980
43091 -7962980 -7561953 -7057968 -6490145 -5897884 -5322482 -4807211 -4393476 -4112413 -3975207
43082 -3975207 -3969218 -4065325 -4233714 -4457448 -4734321 -5067029 -5449523 -5857053 -6242619 -6540720
43072 -6540720 -6680094 -6604557 -6293952 -5772873 -5099963 -4342634 -3551164 -2745360 -1918127 -1050686
43062 -1050686 -130195 837615 1824043 2781522 3654948 4397528 4986560 5433818 5786686
43053 5786686 6119555 6517812 7057666 7785145 8698829 9743457 10821300 11821477 12656374
43044 12656374 13287457 13727247 14018157 14202352 14300250 14307494 14207828 13990632 13661477 13240797
43034 13240797 12754209 12222034 11652958 11041239 10364791 9584827 8651619 7519117 6164172
43025 6164172 4601174 2885149 1103225 -640742 -2243381 -3617928 -4707533 -5493647
43017 -5493647 -5996940 -6268799 -6374431 -6373018 -6302671 -6175168 -5979788 -5692323 -5286287 -4744314
43007 -4744314 -4066209 -3269500 -2382274 -1433766 -448648 553531 1555671 2538396 3474398
42998 3474398 4326724 5057809 5648727 6115915 6509124 6886817 7283685 7692432 8071974
42989 8071974 8375691 8581285 8705572 8799756 8932897 9174790 9583444 10195190 11014935 12009669
42979 12009669 13111288 14230101 15273109 16159728 16832406 17263761 17460407 17460221 17320355
42970 17320355 17098715 16837071 16554259 16252276 15929579 15591145 15247728 14906014 14558677
42961 14558677 14182490 13744884 13213117 12560682 11770618 10838532 9777062 8620518 7426481
42952 7426481 6270949 5235129 4386015 3758351 3347571 3117804 3019553 3006810 3047087 3124565
42942 3124565 3239255 3403749 3638416 3966770 4411918 4992154 5713262 6558760 7483282
42933 7483282 8413917 9260717 9933687 10360599 10498297 10332654 9869742 9127386 8134562
42924 8134562 6936972 5600384 4205681 2837434 1572166 470467 -427006 -1100947
42916 -1100947 -1552562 -1800447 -1876142 -1819809 -1676425 -1491715 -1307273 -1155474 -1055089 -1008380
42906 -1008380 -1000931 -1005909 -992615 -935622 -819241 -635200 -376916 -36274 393398 909489
42896 909489 1492612 2105097 2697550 3220474 3635170 3919576 4067991 4085810 3981060 3755810
42886 3755810 3401926 2904711 2253844 1456736 547751 -411480 -1341592 -2161332 -2803562
42877 -2803562 -3225831 -3413338 -3375126 -3135687 -2724475 -2166264 -1475279 -654927 296655 1376764
42867 1376764 2567581 3830012 5105464 6324370 7416057 8315111 8964221 9317670 9348956
42858 9348956 9060929 8491937 7711494 6805166 5855759 4929778 4072748 3309945 2647685
42849 2647685 2074957 1569207 1108116 682794 304260 -1143 -203219 -277147 -204883 28573
42839 28573 436885 1028314 1798460 2725059 3768433 4878612 6007485 7120352 8198548
42830 8198548 9229088 10187957 11030953 11701361 12150914 12361222 12353925 12185325 11929109 11655882
42820 11655882 11419718 11257832 11200373 11279745 11530061 11976373 12621622 13439962 14379320 15370332
42810 15370332 16337278 17208590 17926851 18458089 18797984 18970916 19020040 18992115 18924552 18840257
42800 18840257 18750066 18658331 18566952 18474999 18373282 18236201 18016572 17649809 17069519 16229765
42790 16229765 15124870 13798072 12334603 10841062 9418918 8142579 7048937 6138694
42782 6138694 5385713 4751143 4199651 3712515 3290511 2944419 2680060 2488475 2345520
42773 2345520 2216315 2058546 1824723 1467942 952776 266733 -574100 -1527254 -2530939
42764 -2530939 -3512312 -4396570 -5118834 -5638633 -5951878 -6093042 -6124617 -6118632 -6139187 -6231963
42754 -6231963 -6420513 -6706098 -7069719 -7477952 -7893811 -8290074 -8658936 -9012480 -9373275
42745 -9373275 -9760169 -10176586 -10606426 -11018088 -11373795 -11640281 -11797601 -11843981 -11795772 -11683008
42735 -11683008 -11543044 -11415997 -11343673 -11368540 -11526401 -11831002 -12258003 -12740097 -13179353 -13472618
42725 -13472618 -13540137 -13348008 -12917837 -12320031 -11652385 -11012098 -10472412 -10071661 -9815445
42716 -9815445 -9686799 -9657601 -9696764 -9774757 -9866166 -9951219 -10016110 -10052955 -10061115 -10049194 -10033918
42705 -10033918 -10034011 -10063009 -10126724 -10225538 -10356176 -10508810 -10661259 -10775387 -10799690 -10678996 -10368451
42694 -10368451 -9845631 -9115302 -8207270 -7172830 -6082544 -5021177 -4074741 -3312282 -2771797
42685 -2771797 -2457262 -2345291 -2394755 -2554009 -2764936 -2966201 -3098821 -3115425 -2991561 -2734615
42675 -2734615 -2385481 -2010407 -1684817 -1474758 -1422638 -1541159 -1815297 -2209623 -2677768 -3171034
42665 -3171034 -3644185 -4058990 -4387948 -4618929 -4757741 -4825304 -4850361 -4862190 -4886080 -4940683
42655 -4940683 -5035941 -5172680 -5345129 -5544894 -5763506 -5992727 -6224266 -6449957 -6661636 -6849998
42645 -6849998 -7003644 -7109874 -7156428 -7131319 -7019074 -6795226 -6423317 -5857750 -5053029 -3977016
42635 -3977016 -2623881 -1021583 769350 2664557 4566990 6375916 7993186 9329406
42627 9329406 10312288 10897422 11079447 10898803 10437211 9798186 9078457 8344342 7624855
42618 7624855 6921856 6227749 5540684 4872450 4248680 3703025 3268519 2969738 2817145
42609 2817145 2802964 2899971 3067720 3267578 3478767 3702887 3952151 4230043 4518504 4778867
42599 4778867 4963453 5030207 4953939 4730225 4370929 3894816 3320013 2662971 1942219 1181254
42589 1181254 407177 -353143 -1075190 -1735146 -2306266 -2757261 -3055653 -3175851 -3108510 -2866835
42579 -2866835 -2486710 -2019850 -1521597 -1037718 -595907 -205765 134031 426975 673983
42570 673983 874535 1031464 1155691 1268337 1399410 1583203 1850327 2216805 2673480 3182157
42560 3182157 3684222 4120599 4453406 4676870 4811629 4887335 4924887 4927125 4879398 4756281
42550 4756281 4530753 4183637 3710474 3122231 2439177 1682536 870070 17359 -858776
42541 -858776 -1738638 -2600091 -3419002 -4169087 -4822629 -5353348 -5740475 -5971866 -6044994 -5966710
42531 -5966710 -5753302 -5430990 -5035292 -4607984 -4192395 -3829273 -3554839 -3400779 -3394370 -3556319
42521 -3556319 -3894712 -4396247 -5019487 -5695766 -6340309 -6871058 -7228907 -7391268 -7371620 -7203059
42511 -7203059 -6913866 -6510558 -5980205 -5309481 -4505106 -3600369 -2644451 -1683965 -749812
42502 -749812 143919 991824 1787841 2520726 3174155 3727556 4155685 4429025 4518004 4400583
42492 4400583 4069812 3538985 2844634 2047042 1224676 458954 -187559 -689033 -1059993
42483 -1059993 -1343637 -1593224 -1856502 -2167560 -2544673 -2991009 -3496239 -4038137 -4584255
42474 -4584255 -5094536 -5525771 -5837138 -5994996 -5976416 -5773465 -5399785 -4896620 -4331752 -3787028
42464 -3787028 -3337490 -3030682 -2873805 -2831383 -2832526 -2786170 -2601782 -2210464 -1579830 -718289
42454 -718289 330983 1502330 2721184 3915348 5022993 5998171 6814050 7462432 7949199
42445 7949199 8289232 8505752 8634126 8723840 8832600 9013665 9303219 9713486 10232924 10832418
42435 10832418 11475684 12129958 12771121 13380392 13936504 14411119 14771911 14990976 15052827
42426 15052827 14957782 14719634 14358327 13890179 13320729 12645970 11863311 10986083 10051580
42417 10051580 9116605 8243364 7484614 6876097 6437946 6180238 6105643 6206132 6457739
42408 6457739 6820877 7249296 7702097 8149313 8567049 8927867 9196580 9336815 9324579 9159129
42398 9159129 8862630 8467139 7995348 7446005 6792923 5999213 5039839 3921285 2689312
42389 2689312 1422317 214109 -846724 -1693463 -2288934 -2623699 -2708812 -2568783 -2238070
42380 -2238070 -1761079 -1193844 -604804 -71129 332322 549770 559522 379050 58214 -333829
42370 -333829 -721017 -1029604 -1196223 -1176421 -951496 -529589 60200 777359 1578492 2422863
42360 2422863 3275539 4108300 4897524 5619725 6247751 6749969 7092234 7241967 7175426 6888261
42350 6888261 6404965 5780623 5092556 4425678 3857343 3444915 3217057 3169943 3270486 3468151
42340 3468151 3714026 3980715 4272705 4620034 5059186 5614611 6292098 7083386 7972476
42331 7972476 8935893 9937268 10922411 11821073 12557295 13064085 13294671 13225551 12854261
42322 12854261 12198387 11297318 10210849 9008965 7754817 6489248 5224481 3949597
42314 3949597 2645848 1306138 -49962 -1374162 -2603083 -3681549 -4583393 -5318490
42306 -5318490 -5922600 -6437251 -6892830 -7303655 -7672778 -7997839 -8273318 -8492001 -8648916
42297 -8648916 -8745356 -8788645 -8788230 -8752506 -8687991 -8598551 -8484269 -8343325 -8177917 -7998640 -7820891
42286 -7820891 -7654811 -7497657 -7335522 -7152836 -6942321 -6709606 -6471655 -6251565 -6071998
42277 -6071998 -5947440 -5875128 -5827317 -5750512 -5575644 -5236659 -4689011 -3919541 -2944838 -1801864
42267 -1801864 -538564 789017 2112554 3346422 4389966 5140073 5510310 5450182 4959576
42258 4959576 4094999 2964661 1711546 488361 -567770 -1353874 -1810941 -1927387 -1738147
42249 -1738147 -1317901 -765748 -182708 350807 789160 1122837 1367665 1546078 1668137
42240 1668137 1722396 1683059 1529303 1263635 917481 542090 191480 -94068 -298211 -430452
42230 -430452 -520965 -611052 -740875 -935407 -1192117 -1476999 -1733159 -1898241 -1921889 -1777077
42220 -1777077 -1464661 -1012228 -466518 120851 710100 1284322 1848281 2415166 2988886
42211 2988886 3551887 4064321 4473479 4728168 4792551 4655558 4333412 3865130 3303755 2707204
42201 2707204 2130719 1620740 1210127 916084 742304 685140 741004 910163 1193045 1580189
42191 1580189 2043125 2534563 3000393 3398247 3713589 3965432 4197831 4459427 4780113
42182 4780113 5156327 5551065 5905479 6153531 6233202 6093307 5698704 5036214 4119931 2991627
42172 2991627 1713628 357161 -1007451 -2315444 -3509993 -4546961 -5402880 -6082605
42164 -6082605 -6621788 -7080594 -7528020 -8021334 -8589350 -9226749 -9899325 -10554007 -11128541
42155 -11128541 -11560658 -11798447 -11811056 -11596008 -11180549 -10617934 -9981657 -9358776 -8839783
42146 -8839783 -8501948 -8388512 -8493152 -8759712 -9098561 -9410744 -9608924 -9630246 -9443006 -9049838
42136 -9049838 -8487032 -7817975 -7120514 -6470994 -5929462 -5530723 -5284290 -5182235 -5208691 -5343464
42126 -5343464 -5557799 -5808728 -6040267 -6191934 -6206714 -6032294 -5619605 -4928249 -3941194 -2679349
42116 -2679349 -1204029 395093 2017901 3566945 4952383 6093479 6923615 7401227
42108 7401227 7521939 7323669 6879846 6283218 5627372 4991390 4429127 3963832 3590743
42099 3590743 3288897 3037180 2825130 2652652 2522033 2430938 2371385 2332158 2299231 2252738
42089 2252738 2164662 2002219 1737251 1356380 865716 288564 -340234 -979344 -1585622 -2121090
42079 -2121090 -2561295 -2898995 -3137928 -3279289 -3310752 -3206781 -2940751 -2501267 -1903124 -1187394
42069 -1187394 -411501 365066 1092737 1737513 2280279 2712129 3028239 3222137 3282153 3191581
42059 3191581 2932350 2489922 1857046 1036264 42629 -1093264 -2324137 -3588415 -4814766
42050 -4814766 -5926351 -6845502 -7502338 -7848335 -7869719 -7593428 -7083089 -6428667 -5734187
42041 -5734187 -5103880 -4624884 -4348179 -4274665 -4354025 -4498771 -4609434 -4603371 -4439344 -4130342
42031 -4130342 -3738395 -3350140 -3040810 -2842075 -2728968 -2631504 -2463394 -2152117 -1656593 -968752
42021 -968752 -105831 896439 1985021 3088736 4122139 4996639 5634873 5981649 6008000
42012 6008000 5710160 5107885 4244315 3184894 2011042 807777 -349464 -1401406 -2302063
42003 -2302063 -3011143 -3490533 -3711065 -3668461 -3399746 -2988734 -2553815 -2220903 -2092143 -2222046
41993 -2222046 -2607782 -3194575 -3893043 -4602403 -5231851 -5714418 -6012928 -6121474 -6064067 -5888000
41983 -5888000 -5649801 -5397747 -5160363 -4948340 -4768989 -4644120 -4619608 -4758503 -5117756 -5718448
41973 -5718448 -6525498 -7449980 -8375227 -9194468 -9841813 -10303868 -10611156 -10818711 -10987117
41964 -10987117 -11169524 -11402833 -11699430 -12040424 -12375757 -12635090 -12746771 -12657379 -12344962
41955 -12344962 -11822781 -11133668 -10337315 -9495399 -8660635 -7872944 -7160070 -6536814 -6000492
41946 -6000492 -5526844 -5072832 -4588162 -4030667 -3378488 -2634918 -1825706 -990804 -173485
41937 -173485 589557 1273560 1864515 2351982 2719511 2939163 2976136 2803164 2415644 1836313
41927 1836313 1106287 269861 -636657 -1587468 -2562778 -3541119 -4492451 -5376672 -6150739
41918 -6150739 -6781994 -7259197 -7592513 -7801045 -7896076 -7872146 -7712908 -7408236 -6971961 -6450393
41908 -6450393 -5917464 -5457384 -5139575 -4995046 -5005185 -5108314 -5219153 -5251381 -5137120 -4841764
41898 -4841764 -4371562 -3769543 -3099558 -2425789 -1797083 -1240479 -762627 -355525 -2726
41889 -2726 317004 628437 956991 1320844 1720383 2132602 2516944 2832375 3057361 3200166
41879 3200166 3290724 3357419 3404262 3404777 3316833 3108335 2778606 2365182 1934191 1559731 1301827
41868 1301827 1192034 1230346 1391178 1633717 1912386 2183994 2410088 2557262 2600611 2531384
41858 2531384 2362485 2124724 1854893 1584766 1338350 1135856 997538 943209 988759 1142783
41848 1142783 1404464 1762471 2195478 2675563 3173981 3666278 4133964 4563178 4942962
41839 4942962 5264213 5517622 5689575 5759072 5700285 5491165 5122792 4603773 3958936 3225327
41829 3225327 2447268 1669836 931369 258704 -331642 -827905 -1218210 -1489893 -1632498
41820 -1632498 -1642028 -1524411 -1296200 -980467 -598336 -160827 333031 890285 1515017 2202571
41810 2202571 2939489 3706205 4478251 5225141 5910691 6499012 6965443 7305458 7533876
41801 7533876 7673754 7742690 7745404 7674583 7515051 7246589 6846364 6294688 5584092 4726195
41791 4726195 3750812 2697347 1604165 501757 -588597 -1652569 -2679045 -3655431
41783 -3655431 -4562335 -5369916 -6039241 -6529551 -6808068 -6857500 -6679323 -6294298 -5741018 -5070765
41773 -5070765 -4337842 -3589230 -2859360 -2171052 -1537694 -962325 -435562 61710 548394
41764 548394 1030241 1492045 1901061 2221753 2435048 2551420 2609800 2662588 2754996 2909385
41754 2909385 3121689 3370368 3631859 3892875 4151943 4410274 4659886 4878608 5035958
41745 5035958 5106080 5079635 4967824 4796566 4593961 4376977 4143166 3871089 3529386 3090118
41735 3090118 2539359 1879837 1126246 298742 -580020 -1482947 -2374473 -3209028 -3935842
41726 -3935842 -4510279 -4906440 -5123096 -5178951 -5101157 -4915179 -4640973 -4294225 -3888730 -3438030
41716 -3438030 -2957413 -2467600 -1998818 -1591339 -1289264 -1128958 -1128451 -1284442 -1578145 -1984934
41706 -1984934 -2480914 -3043684 -3650423 -4278615 -4910863 -5538970 -6161069 -6772121 -7356692
41697 -7356692 -7893448 -8370713 -8801222 -9223524 -9688382 -10240246 -10905390 -11689493 -12578746
41688 -12578746 -13539044 -14515398 -15437774 -16234321 -16844965 -17228034 -17360086 -17234376 -16860682
41679 -16860682 -16264202 -15482014 -14559841 -13551704 -12519557 -11527118 -10627125 -9848690 -9192777
41670 -9192777 -8637684 -8149633 -7692596 -7235229 -6755970 -6246674 -5712972 -5169811 -4633722
41661 -4633722 -4115606 -3616951 -3130286 -2643119 -2143703 -1625673 -1088713 -535317 33239
41652 33239 618734 1225506 1858847 2522523 3215082 3926047 4634285 5309954 5919722 6434121
41642 6434121 6835122 7121008 7306187 7416443 7482322 7532544 7587619 7654497 7725119 7780965
41632 7780965 7801732 7773226 7690411 7554892 7369073 7130988 6833588 6469305 6036422 5542224
41622 5542224 5001235 4431372 3851526 3280801 2737361 2235918 1784913 1384602 1026523
41613 1026523 695363 374532 54320 -262556 -563365 -835255 -1075335 -1292951 -1502774
41604 -1502774 -1714857 -1929292 -2137823 -2328680 -2489877 -2610489 -2683485 -2712542 -2720311 -2752411
41594 -2752411 -2872782 -3149980 -3637188 -4351505 -5260578 -6284075 -7311303 -8228198 -8943736
41585 -8943736 -9408922 -9625348 -9641295 -9534656 -9387694 -9264723 -9203003 -9218422 -9318422 -9512283
41575 -9512283 -9813111 -10231867 -10767863 -11401555 -12094041 -12793656 -13445436 -13997720 -14403422
41566 -14403422 -14618638 -14603466 -14327134 -13775231 -12955121 -11896940 -10649137 -9268280 -7804997
41557 -7804997 -6292189 -4743931 -3168830 -1591522 -68354 1314753 2463199 3302278
41549 3302278 3798167 3962530 3843242 3510686 3046962 2538320 2066895 1699765 1478135
41540 1478135 1411439 1478707 1635664 1824556 1985313 2067773 2042736 1906944 1678532 1385325
41530 1385325 1052645 695359 314121 -106146 -595768 -1197522 -1962387 -2944219 -4190639
41521 -4190639 -5727202 -7538350 -9555856 -11664450 -13724052 -15597825 -17174211 -18378612
41513 -18378612 -19177640 -19579397 -19628825 -19395212 -18953011 -18363488 -17666270 -16884591 -16039779
41504 -16039779 -15164979 -14308417 -13522926 -12847423 -12291501 -11832373 -11425913 -11026700 -10608738
41495 -10608738 -10178085 -9771151 -9439226 -9227850 -9161857 -9241123 -9444924 -9740806 -10094903 -10480008
41485 -10480008 -10877105 -11269785 -11636503 -11946253 -12159030 -12230235 -12119819 -11806311 -11300502
41476 -11300502 -10649881 -9929166 -9220319 -8589569 -8068375 -7644035 -7264222 -6854908 -6344385
41467 -6344385 -5683485 -4855884 -3878059 -2791466 -1650603 -511772 573005 1556235 2393853
41458 2393853 3048389 3497259 3740897 3803501 3723523 3538372 3272478 2936173 2535444 2084516
41448 2084516 1610700 1146437 713734 313064 -73722 -467672 -875423 -1282270 -1658383
41439 -1658383 -1970608 -2190168 -2293558 -2262031 -2085785 -1772417 -1352757 -877763 -406300 10711
41429 10711 343363 589109 771200 929936 1109298 1342806 1642291 1991973 2349067 2651037
41419 2651037 2827493 2812391 2552750 2014402 1188787 101808 -1181400 -2564319 -3940120
41410 -3940120 -5215637 -6325476 -7232261 -7919106 -8382710 -8630997 -8684504 -8578340 -8360836
41401 -8360836 -8086869 -7808724 -7570827 -7410660 -7360261 -7441330 -7655788 -7981662 -8380587 -8811758
41391 -8811758 -9241465 -9643387 -9994563 -10274969 -10473511 -10596722 -10674079 -10755844 -10902726 -11169651
41381 -11169651 -11588454 -12156755 -12839810 -13586125 -14348213 -15095336 -15810900 -16478775 -17069661
41372 -17069661 -17535953 -17816519 -17848109 -17579621 -16986101 -16079374 -14911387 -13566326 -12140611
41363 -12140611 -10716712 -9343047 -8030825 -6768352 -5542242 -4352813 -3218089 -2168706
41355 -2168706 -1238455 -453557 177318 669828 1065183 1424860 1819243 2311536 2939903
41346 2939903 3703094 4556087 5419844 6203352 6829850 7256110 7476278 7509136 7376399 7084583
41336 7084583 6620661 5963046 5100418 4047769 2853215 1595615 376152 -694560 -1514151
41327 -1514151 -2009381 -2153994 -1975196 -1544538 -956781 -305955 332193 906955 1390650
41318 1390650 1774494 2068155 2302169 2525577 2792702 3143239 3588273 4111197 4680524
41309 4680524 5264005 5836630 6382220 6891109 7355519 7764513 8102304 8352522 8506296
41300 8506296 8568295 8556119 8492950 8397013 8272339 8104262 7861687 7506874 7011297 6372341
41290 6372341 5622305 4823071 4047703 3358508 2792246 2357236 2040567 1821012 1682556
41281 1682556 1622143 1645810 1753277 1919784 2087590 2174328 2095194 1788247 1231014 441938
41271 441938 -531303 -1627738 -2784130 -3938629 -5032295 -6014992 -6855552 -7548953 -8113301
41262 -8113301 -8576444 -8959398 -9265321 -9479046 -9576977 -9543026 -9383744 -9135300 -8857549 -8616044
41252 -8616044 -8459437 -8403406 -8429776 -8500566 -8576891 -8630019 -8639385 -8583681 -8435540 -8164584 -7744784
41241 -7744784 -7159662 -6403708 -5483489 -4420909 -3255930 -2043771 -845224 285468 1308969
41232 1308969 2202534 2956652 3570286 4047666 4397660 4634694 4779069 4855736 4893212 4924627
41222 4924627 4989185 5128432 5373860 5730243 6165822 6618646 7018404 7311911 7476973 7517157
41212 7517157 7443811 7260150 6957822 6524433 5953024 5247022 4420468 3495496 2497763 1450766
41202 1450766 372020 -726075 -1831192 -2925010 -3979085 -4954177 -5803712 -6480784 -6946276
41193 -6946276 -7175838 -7165576 -6937015 -6539071 -6042420 -5525104 -5055589 -4682652 -4435967 -4332125
41183 -4332125 -4377583 -4565868 -4874713 -5270468 -5719964 -6201527 -6706300 -7228886 -7754571 -8251537
41173 -8251537 -8671421 -8956596 -9051161 -8913083 -8525226 -7903155 -7098539 -6197422 -5311982 -4564096
41163 -4564096 -4061789 -3874810 -4019139 -4458319 -5121840 -5931519 -6822121 -7746510 -8666473
41154 -8666473 -9540161 -10317998 -10950731 -11403529 -11666891 -11759472 -11723785 -11617646 -11502859 -11432413
41144 -11432413 -11440159 -11538643 -11726840 -12001594 -12361985 -12800717 -13287875 -13760493 -14128702 -14297610
41134 -14297610 -14192693 -13774409 -13036326 -11993566 -10674318 -9121733 -7401633 -5604347
41126 -5604347 -3833507 -2185893 -733732 481950 1446965 2164938 2649920 2922877 3010624
41117 3010624 2944632 2758274 2482965 2144623 1761386 1342597 889116 395493 -145869 -739914
41107 -739914 -1385526 -2074432 -2791840 -3518116 -4231729 -4913352 -5549252 -6131019 -6650233 -7090314
41097 -7090314 -7420910 -7600152 -7585703 -7349041 -6884309 -6207288 -5348075 -4344856 -3241934
41088 -3241934 -2089123 -938852 158945 1162466 2044242 2797987 3442483 4016973 4567108
41079 4567108 5127411 5708749 6295952 6855764 7351029 7753864 8051030 8240427 8324617 8308119
41069 8308119 8199410 8013236 7769004 7484460 7166786 6805803 6375619 5847775 5209886
41060 5209886 4476919 3686356 2880992 2091804 1330473 591667 -140986 -889717 -1677417
41051 -1677417 -2519434 -3413016 -4330306 -5221043 -6024991 -6687995 -7175201 -7478650 -7618464
41042 -7618464 -7636715 -7585100 -7511739 -7453501 -7435500 -7474210 -7580084 -7758500 -8009374 -8325151
41032 -8325151 -8686967 -9060564 -9395231 -9628766 -9699159 -9560134 -9194683 -8620783 -7887000 -7059776
41022 -7059776 -6206451 -5379111 -4605009 -3887455 -3215341 -2573611 -1947313 -1318648 -663371
41013 -663371 46040 828047 1675108 2541432 3344199 3980966 4357618 4415808 4149225 3603220
41003 3603220 2859238 2011453 1144946 321636 -425086 -1088726 -1681817 -2222331 -2717988
40994 -2717988 -3155480 -3500582 -3709591 -3746810 -3600481 -3290595 -2865210 -2386255 -1910219 -1471704
40984 -1471704 -1077018 -710304 -347638 30420 435924 880268 1382370 1968724 2662046
40975 2662046 3463633 4339102 5216194 5998171 6589129 6921335 6972934 6769076 6368417 5844096
40965 5844096 5268840 4707829 4216111 3835419 3589004 3477409 3478762 3554706 3661103 3761740
40955 3761740 3841770 3915181 4020768 4206091 4506129 4927254 5444212 6010047 6571677 7082316
40945 7082316 7506901 7823218 8023635 8118543 8137604 8124487 8125424 8177150 8300413 8500656 8771681
40934 8771681 9096641 9445076 9770830 10016904 10128268 10067078 9823101 9415861 8889376 8301500
40924 8301500 7709234 7152559 6643011 6164695 5690016 5202205 4710229 4246473 3849602
40915 3849602 3543520 3322214 3144879 2943163 2641241 2183629 1557512 796091 -38600
40906 -38600 -880935 -1679472 -2401012 -3025756 -3542089 -3945518 -4240056 -4437208 -4549710 -4582845
40896 -4582845 -4529745 -4374459 -4099993 -3694917 -3155041 -2481873 -1681767 -767963 235255
40887 235255 1289482 2344495 3348263 4261507 5068552 5776836 6404797 6966303 7462394
40878 7462394 7885536 8232064 8512470 8751560 8979377 9220851 9491147 9796648 10136459
40869 10136459 10500820 10867885 11203091 11463918 11609304 11609706 11452646 11140982 10686478 10105338
40859 10105338 9420416 8667657 7898851 7174510 6547994 6047987 5667160 5361956 5064947
40850 5064947 4707343 4244304 3671886 3026507 2366790 1748095 1204243 745501 370774
40841 370774 82941 -104673 -175429 -124903 25566 225771 406345 498100 453841 263373
40831 263373 -45728 -421905 -809874 -1166941 -1470197 -1715943 -1914645 -2083446 -2238505 -2390938
40821 -2390938 -2548804 -2722896 -2930549 -3193217 -3528544 -3941631 -4420324 -4936041 -5448108
40812 -5448108 -5908746 -6268509 -6484182 -6529389 -6403630 -6133768 -5765747 -5350273 -4929292 -4529110
40802 -4529110 -4162420 -3836921 -3564748 -3367203 -3273425 -3315872 -3525480 -3926168 -4527229 -5314917
40792 -5314917 -6248011 -7261543 -8278157 -9221797 -10027833 -10647385 -11048091 -11214561 -11148870
40783 -11148870 -10868359 -10398945 -9766699 -8994005 -8104798 -7136841 -6152695 -5240335 -4500141
40774 -4500141 -4023136 -3870028 -4059572 -4570108 -5352570 -6348394 -7502818 -8766176 -10083631
40765 -10083631 -11382679 -12570626 -13548135 -14234156 -14588909 -14621047 -14374044 -13900160 -13238082
40756 -13238082 -12405935 -11409147 -10254028 -8958678 -7558230 -6104800 -4663148 -3303810
40748 -3303810 -2095965 -1100924 -365357 85596 252531 160073 -151040 -634985 -1250320
40739 -1250320 -1963497 -2744700 -3559629 -4365373 -5116582 -5779641 -6345253 -6830376 -7267666
40730 -7267666 -7687550 -8100925 -8489574 -8808090 -8996031 -8994364 -8759000 -8267251 -7517797 -6528028
40720 -6528028 -5332412 -3982324 -2543890 -1089866 313988 1621042 2805730 3853118
40712 3853118 4744309 5450765 5944186 6215447 6287935 6214952 6063687 5897372 5765196 5700390
40702 5700390 5720657 5827065 6003595 6222286 6454811 6684402 6909543 7136349 7365515 7584096
40692 7584096 7768286 7895276 7956791 7966407 7956087 7962504 8009355 8094470 8187751 8239565 8194392
40681 8194392 8004134 7637881 7087564 6370385 5528337 4622893 3722264 2882788 2132515
40672 2132515 1466548 856729 269342 -318488 -909353 -1484409 -2009958 -2449191 -2773409
40663 -2773409 -2966299 -3019852 -2927708 -2684264 -2292571 -1775712 -1182763 -584229 -58945 321838
40653 321838 508382 481957 258047 -118165 -582903 -1067120 -1507192 -1851124 -2061355 -2115760
40643 -2115760 -2007284 -1741923 -1334955 -805622 -171042 558915 1383381 2306790 3330063
40634 3330063 4440528 5606782 6782255 7914834 8955549 9862485 10602849 11157832 11528956
40625 11528956 11739533 11827710 11834733 11794288 11725039 11625390 11470982 11217745 10812270 10207466
40615 10207466 9378069 8329326 7094296 5721436 4260873 2758389 1258919 -186933
40607 -186933 -1521365 -2685780 -3632734 -4338380 -4809912 -5083700 -5213594 -5254101 -5245956 -5210576
40597 -5210576 -5156063 -5091514 -5040124 -5039819 -5127928 -5318871 -5589252 -5877814 -6097422 -6153016 -5962188
40586 -5962188 -5475165 -4687726 -3641472 -2413174 -1100636 189913 1356021 2313093 3008194
40577 3008194 3428023 3597180 3567076 3398598 3143375 2829707 2458737 2011975 1464888 797609
40567 797609 -3014 -947787 -2047472 -3306163 -4707333 -6201824 -7706876 -9118126 -10329102
40558 -10329102 -11250237 -11821196 -12013674 -11825235 -11268306 -10360392 -9120907 -7576817 -5774928
40549 -5774928 -3794025 -1747429 230591 2011780 3501771 4654960 5470772 5976601
40541 5976601 6207595 6191477 5942285 5463457 4757696 3838040 2734034 1490422 161188
40532 161188 -1195460 -2518014 -3740834 -4796761 -5625443 -6183350 -6448673 -6418577 -6103688
40523 -6103688 -5527362 -4732545 -3791479 -2809476 -1915777 -1240672 -885398 -896189 -1252709 -1874701
40513 -1874701 -2643402 -3430617 -4127597 -4666215 -5026726 -5231191 -5327191 -5368358 -5396234 -5426357
40503 -5426357 -5442156 -5399965 -5244128 -4925485 -4415133 -3709277 -2826620 -1802583 -684039
40494 -684039 474413 1613926 2676292 3610068 4375902 4949158 5319879 5491813 5482347
40485 5482347 5324282 5068833 4787204 4566648 4497925 4655347 5075657 5744021 6592756 7512755
40475 7512755 8373073 9043119 9413977 9417279 9039552 8327989 7382973 6336024 5318469
40466 5318469 4432213 3734360 3240566 2941583 2820834 2862357 3046240 3337108 3675547 3980376
40456 3980376 4162963 4147095 3884789 3361856 2593636 1615701 474577 -778410 -2089615
40447 -2089615 -3403972 -4668001 -5836739 -6882167 -7797729 -8595525 -9297229 -9923062 -10483172
40438 -10483172 -10973899 -11378696 -11671182 -11817428 -11777055 -11505902 -10963200 -10122716 -8983904
40429 -8983904 -7579175 -5976029 -4274140 -2596304 -1071583 187508 1106659 1661921
40421 1661921 1879589 1827541 1602481 1313152 1058598 906730 884552 987290 1200434 1518590
40411 1518590 1948003 2492744 3136289 3832351 4511566 5100046 5538816 5794129 5856398 5733008
40401 5733008 5440769 4998342 4415896 3684341 2773918 1650624 306192 -1215632 -2813439
40392 -2813439 -4346597 -5667542 -6654250 -7233766 -7391854 -7166299 -6626713 -5851194 -4911522
40383 -4911522 -3869952 -2780433 -1686761 -618629 407817 1382182 2289749 3106451 3802066
40374 3802066 4349836 4738216 4979590 5110915 5183898 5247624 5331124 5433392 5524049 5552621
40364 5552621 5462200 5204031 4751016 4107710 3313133 2433780 1548397 730024 31056 -525460
40354 -525460 -946772 -1262435 -1508434 -1709621 -1870439 -1980585 -2032663 -2039622 -2038637 -2076321 -2182676
40343 -2182676 -2349273 -2525201 -2633524 -2598632 -2369545 -1928557 -1284990 -462498 510071 1599888
40333 1599888 2766489 3960003 5125778 6214303 7190473 8035505 8739400 9289164 9662370
40324 9662370 9832200 9781207 9514413 9063684 8482397 7835670 7192516 6622618 6195094 5973275
40314 5973275 6001569 6287402 6787914 7411496 8037488 8548067 8860106 8944448 8825578 8564010
40304 8564010 8231743 7892774 7594795 7370144 7239859 7216340 7304109 7500032 7793565 8166407
40294 8166407 8592081 9038089 9472952 9876631 10248328 10605121 10969573 11351618 11735238
40285 11735238 12079144 12332595 12457133 12440816 12297033 12050811 11722606 11319179 10835466
40276 10835466 10264784 9610115 8888789 8127602 7352576 6581265 5822787 5084578 4380358
40267 4380358 3733840 3175935 2737594 2443117 2307761 2338978 2536425 2886463 3352809 3871343
40257 3871343 4356752 4720475 4890227 4820535 4491938 3904823 3074558 2029960 814262
40248 814262 -512538 -1872642 -3175412 -4330044 -5260436 -5914119 -6263157 -6302663 -6052745
40239 -6052745 -5563863 -4920741 -4239687 -3656138 -3302793 -3284018 -3655705 -4417305 -5516126
40230 -5516126 -6859421 -8330358 -9806239 -11177804 -12366916 -13338070 -14098738 -14686757 -15149559
40221 -15149559 -15525028 -15831443 -16066424 -16210301 -16231544 -16095586 -15777320 -15272877 -14604118
40212 -14604118 -13812629 -12946121 -12044068 -11128746 -10203795 -9258914 -8278521 -7252326 -6184497
40203 -6184497 -5096892 -4023988 -3002177 -2059231 -1208529 -449268 228330 834755 1372443
40194 1372443 1829435 2178242 2382045 2407701 2239899 1887616 1378297 745321 19935 -766123
40184 -766123 -1571406 -2338249 -2995489 -3470707 -3707179 -3678478 -3395105 -2902347 -2272814 -1596828
40174 -1596828 -970444 -480063 -185871 -109894 -233927 -508411 -868146 -1248276 -1595323 -1872358
40164 -1872358 -2060434 -2157454 -2173342 -2121341 -2009084 -1834729 -1589908 -1266431 -862376 -385683
40154 -385683 143831 692844 1214069 1649852 1941724 2043646 1932733 1612035 1105335 448336
40144 448336 -319555 -1161734 -2049558 -2965671 -3903746 -4863737 -5844124 -6834959 -7815557 -8757706
40134 -8757706 -9631424 -10409021 -11065953 -11580205 -11932810 -12110535 -12110239 -11943415 -11638164 -11235268
40124 -11235268 -10777207 -10293755 -9791475 -9253452 -8650176 -7956622 -7167596 -6304668 -5412397
40115 -5412397 -4546919 -3763614 -3110072 -2625789 -2344367 -2292208 -2481867 -2904462 -3527839 -4303512
40105 -4303512 -5179092 -6109574 -7062510 -8016653 -8956854 -9867989 -10728937 -11507650 -12160593
40096 -12160593 -12640205 -12909324 -12955458 -12797245 -12481496 -12074678 -11651971 -11283701 -11019623
40087 -11019623 -10876377 -10835502 -10854946 -10889475 -10910202 -10913469 -10914436 -10929463 -10958982 -10982627 -10969361
40076 -10969361 -10894149 -10748636 -10539276 -10276667 -9966289 -9608845 -9210295 -8793820 -8404465
40067 -8404465 -8102367 -7947291 -7980809 -8212479 -8615062 -9131058 -9687980 -10215065 -10654064 -10962541
40057 -10962541 -11114278 -11102071 -10942746 -10678394 -10367544 -10066176 -9806435 -9584121 -9361400
40048 -9361400 -9082426 -8693487 -8159350 -7471574 -6648554 -5729520 -4766021 -3814345 -2929998
40039 -2929998 -2162632 -1549752 -1110845 -846505 -745214 -794076 -985033 -1310318 -1750101 -2263235
40029 -2263235 -2790850 -3272041 -3660940 -3934371 -4088456 -4131043 -4077462 -3951489 -3788269 -3634064
40019 -3634064 -3538875 -3541880 -3655637 -3858499 -4100761 -4320668 -4460623 -4477205 -4345886 -4064195
40009 -4064195 -3653854 -3159071 -2639187 -2157461 -1769817 -1516502 -1417516 -1471571 -1658831 -1948446
39999 -1948446 -2310032 -2724083 -3184630 -3692560 -4246226 -4837779 -5456724 -6094862 -6747761
39990 -6747761 -7414058 -8095661 -8797572 -9523579 -10268442 -11012815 -11726120 -12375752 -12935890
39981 -12935890 -13390401 -13729286 -13942467 -14016023 -13934322 -13687518 -13280349 -12737388 -12102264 -11431404
39971 -11431404 -10784593 -10215020 -9761199 -9442251 -9256862 -9185265 -9193641 -9240483 -9284178 -9290065
39961 -9290065 -9234174 -9101267 -8877461 -8541883 -8064182 -7412003 -6565697 -5531732 -4346775
39952 -4346775 -3070773 -1774171 -526273 611768 1590428 2374434 2945622 3305207 3474336
39943 3474336 3492313 3411775 3290039 3177345 3105727 3083895 3101747 3142932 3198671 3274508 3385518
39932 3385518 3542557 3737687 3937263 4087140 4128915 4021575 3759998 3381594 2956958 2568826
39922 2568826 2290177 2171174 2235935 2482453 2879863 3365135 3846694 4218951 4383292 4266736
39912 4266736 3832415 3081973 2053408 817840 -523867 -1847526 -3020232 -3924845 -4487588
39903 -4487588 -4696217 -4599495 -4288529 -3868896 -3434484 -3050961 -2750963 -2537420 -2389332 -2268018
39893 -2268018 -2126281 -1921554 -1627667 -1237588 -755884 -188608 459688 1178771 1941110
39884 1941110 2695907 3375620 3913385 4261870 4403023 4344742 4108554 3716248 3182028 2512722
39874 2512722 1713658 794581 -228511 -1334473 -2496939 -3682112 -4848027 -5948470
39866 -5948470 -6939881 -7786690 -8462153 -8945120 -9215890 -9256258 -9058069 -8638395 -8051368 -7385215
39856 -7385215 -6741695 -6206786 -5826482 -5597877 -5477972 -5405404 -5325748 -5210597 -5064894 -4922918
39846 -4922918 -4836795 -4860783 -5032811 -5355704 -5784034 -6224775 -6556214 -6660193 -6454037 -5907890
39836 -5907890 -5042154 -3911394 -2586713 -1145041 334565 1772812 3094300 4233298
39828 4233298 5138175 5773410 6120842 6181690 5978688 5556155 4975987 4308599 3619793 2957454
39818 2957454 2343620 1775385 1233889 698033 158887 -370127 -852636 -1240019 -1487946
39809 -1487946 -1569341 -1478384 -1227780 -844679 -367364 159467 692884 1200770 1665068 2074300
39799 2074300 2408777 2630193 2686599 2532906 2154868 1581660 879838 132685 -583603 -1214449
39789 -1214449 -1725439 -2088552 -2268807 -2224262 -1922092 -1360698 -583136 326452 1260459 2109694
39779 2109694 2780813 3206113 3347289 3196163 2773977 2128394 1325670 436903 -477988
39770 -477988 -1380992 -2255585 -3096670 -3898481 -4648056 -5326378 -5913960 -6395563 -6760363 -6997687
39760 -6997687 -7091852 -7020253 -6756109 -6274399 -5559039 -4610495 -3452999 -2139161 -748543
39751 -748543 622496 1879288 2950184 3801277 4436725 4884898 5178617 5339136 5368955
39742 5368955 5254002 4974050 4518447 3900736 3164240 2374870 1605125 917845 355994
39733 355994 -61487 -341373 -516941 -645041 -796356 -1040852 -1435105 -2016803 -2806060 -3809368
39723 -3809368 -5022430 -6430243 -8004688 -9701770 -11461835 -13214265 -14884366 -16398679
39715 -16398679 -17687684 -18688333 -19349246 -19638920 -19554221 -19124550 -18408267 -17482556 -16432372
39706 -16432372 -15342815 -14293350 -13349926 -12556080 -11929492 -11467646 -11158063 -10985569 -10934061
39697 -10934061 -10986037 -11122866 -11325154 -11571240 -11834108 -12079391 -12267026 -12356660 -12313931 -12113844
39687 -12113844 -11740411 -11185818 -10453190 -9562637 -8555158 -7488519 -6424237 -5411192 -4474547
39678 -4474547 -3615983 -2824176 -2087998 -1404573 -780236 -228343 231954 576635 780982
39669 780982 828352 719457 475083 127636 -296019 -790856 -1378442 -2096169 -2976561 -4027338
39659 -4027338 -5221083 -6497939 -7779973 -8991785 -10079060 -11017568 -11810944 -12481989 -13063032
39650 -13063032 -13586675 -14076084 -14537331 -14959851 -15327335 -15632520 -15884893 -16106023 -16317506
39641 -16317506 -16531189 -16747241 -16958424 -17155246 -17328108 -17465829 -17552663 -17567047 -17485049 -17288910
39631 -17288910 -16977408 -16572505 -16117913 -15669386 -15280499 -14989096 -14808465 -14725425 -14705720 -14705212
39621 -14705212 -14683121 -14612413 -14483717 -14302325 -14080744 -13830034 -13552242 -13235094 -12849799 -12353720
39611 -12353720 -11700143 -10855172 -9815975 -8619504 -7333610 -6033829 -4780002 -3606351
39603 -3606351 -2527269 -1550262 -685973 49385 638940 1074172 1362350 1526319 1595882
39594 1595882 1597915 1554002 1486356 1423642 1397925 1432772 1531015 1671311 1815895 1924378 1965605
39583 1965605 1922475 1789637 1567212 1254401 846377 336458 -277951 -991229 -1791911 -2669468
39573 -2669468 -3617424 -4627344 -5677485 -6725849 -7714179 -8581363 -9279412 -9785097 -10103457
39564 -10103457 -10263072 -10306437 -10280430 -10230554 -10199382 -10226844 -10349468 -10596899 -10985899 -11513443
39554 -11513443 -12151764 -12848741 -13536123 -14144391 -14618200 -14924566 -15050135 -14991024 -14742401
39545 -14742401 -14292798 -13624287 -12718286 -11566314 -10182432 -8610644 -6921168 -5195723
39537 -5195723 -3508515 -1911168 -426569 947090 2223069 3407155 4480819 5396444
39529 5396444 6090347 6509350 6638031 6512772 6214922 5844588 5485066 5173333 4890802
39520 4890802 4578671 4168935 3615302 2911613 2093767 1227491 387647 -363040 -988366
39511 -988366 -1483231 -1870982 -2196763 -2517276 -2886695 -3342103 -3894555 -4529739 -5217274 -5924169
39501 -5924169 -6626360 -7312374 -7976610 -8606531 -9173340 -9633876 -9943932 -10076446 -10035875 -9861457
39491 -9861457 -9615836 -9362243 -9140937 -8957426 -8787835 -8595878 -8350518 -8036594 -7657002
39482 -7657002 -7228521 -6773539 -6310461 -5846901 -5379504 -4900706 -4408212 -3911336 -3430674
39473 -3430674 -2992100 -2620004 -2335424 -2160660 -2124766 -2260447 -2588432 -3097607 -3736481 -4425090
39463 -4425090 -5081105 -5644168 -6085963 -6405137 -6614616 -6729843 -6762769 -6722345 -6619522 -6473705
39453 -6473705 -6317928 -6200282 -6178734 -6307413 -6617405 -7101243 -7711034 -8372707 -9008726 -9557301
39443 -9557301 -9980144 -10258805 -10385879 -10359139 -10183339 -9877510 -9479667 -9041191 -8610857 -8217217
39433 -8217217 -7860076 -7515246 -7147640 -6723909 -6219359 -5620246 -4925358 -4148178 -3316911
39424 -3316911 -2468849 -1639080 -847836 -92979 647402 1401868 2187371 2995171 3788856
39415 3788856 4515901 5126832 5592762 5914052 6118051 6248691 6353047 6469472 6620135
39406 6620135 6809415 7028254 7261737 7494241 7707847 7876485 7964356 7934803 7766114 7463477
39396 7463477 7058929 6600088 6135041 5700725 5317924 4991754 4714020 4464211 4209072
39387 4209072 3904256 3501763 2963101 2273624 1451961 550225 -355594 -1181550 -1851742
39378 -1851742 -2308806 -2516636 -2456432 -2118878 -1496651 -583051 618913 2079464 3727344
39369 3727344 5448883 7104784 8558549 9705093 10488696 10904448 10984799 10780320 10346405
39360 10346405 9742370 9039264 8325687 7702116 7262715 7072988 7155516 7491289 8034672
39351 8034672 8732911 9540864 10426349 11366532 12339665 13318787 14272863 15174768 16008756
39342 16008756 16770103 17457240 18063930 18578226 18987901 19286577 19475729 19562394 19556239 19469756
39332 19469756 19321860 19140445 18958125 18800282 18672775 18559914 18436352 18284841 18106426
39323 18106426 17916327 17730565 17553909 17375707 17173189 16918895 16589189 16170482 15659641
39314 15659641 15058647 14369158 13593806 12744945 11854228 10974532 10169767 9494518 8971675
39305 8971675 8580320 8263882 7957950 7624194 7272082 6957294 6758373 6742726 6936273 7309137
39295 7309137 7783464 8260180 8653033 8915786 9052744 9110288 9153818 9238745 9386239 9573090
39285 9573090 9739498 9810787 9723488 9446148 8989267 8403062 7764591 7158357 6657120 6309594
39275 6309594 6137438 6138634 6292940 6568096 6927829 7341068 7788533 8262950 8763207 9286519
39265 9286519 9822343 10348949 10832486 11230260 11500904 11620286 11596053 11472382 11322201 11231561
39255 11231561 11283157 11543076 12051877 12820516 13831433 15043732 16400690 17838905 19299144
39246 19299144 20737345 22132279 23486793 24822503 26170866 27564834 29034602 30607794
39238 30607794 32310379 34163134 36172381 38319744 40558406 42820207 45032089 47135688
39230 47135688 49102318 50937788 52676983 54373808 56093402 57909410 59903594 62162926
39222 62162926 64771463 67798526 71288194 75255739 79693363 84582848 89910453 95680596
39214 95680596 101926081 108711932 116130363 124289018 133299216 143269031 154299180 166476341
39206 166476341 179862039 194479299 210298082 227218155 245051047 263508465 282204069
39199 282204069 300667388 318361995 334702533 349073442 360857286 369478756 374463723
39192 374463723 375504629 372516104 365662433 355345110 342152220 326783375 309968056
39185 309968056 292392649 274647218 257198428 240388080 224448446 209521539 195673648
39178 195673648 182905353 171163354 160359471 150396040 141190208 132687109 124856413
39171 124856413 117676740 111120006 105145446 99702921 94737964 90193770 86012409 82139133
39163 82139133 78528941 75150720 71985859 69022215 66247185 63644462 61197428 58896849
39155 58896849 56744915 54748844 52906727 51196939 49580704 48017003 46480179 44969886
39147 44969886 43508204 42125116 40838898 39641119 38494948 37349205 36161723 34919228
39139 34919228 33642128 32372112 31152039 30011452 28963772 28010469 27144365 26349420
39131 26349420 25599887 24861761 24096919 23269627 22355251 21349252 20272418 19169226 18099490
39122 18099490 17125587 16297733 15640356 15143925 14765901 14440921 14097225 13675861 13149311
39113 13149311 12533641 11885752 11281912 10785956 10425344 10189211 10046389 9967767 9938296 9955953
39103 9955953 10024794 10149620 10334400 10582695 10897508 11279142 11721713 12211278 12728484 13254822
39093 13254822 13777433 14287965 14776303 15224492 15605371 15885696 16030438 16006145 15784463
39084 15784463 15347890 14697677 13860879 12892277 11867631 10867650 9956968 9167048 8491028
39075 8491028 7891279 7313240 6699276 6001895 5197751 4299231 3356373 2445644 1650255
39066 1650255 1040488 659816 518528 595110 844671 1211255 1638698 2076107 2478559 2807119
39056 2807119 3032047 3139674 3139706 3068354 2983837 2953401 3034003 3252131 3590481 3988394 4358068
39045 4358068 4611906 4691266 4585169 4330296 3991647 3633826 3298403 2997443 2720869 2447129
39035 2447129 2149185 1796048 1354915 796882 104707 -720912 -1658868 -2669153 -3697310
39026 -3697310 -4680509 -5554330 -6259778 -6750515 -6999925 -7006452 -6794718 -6411226 -5916408 -5376200
39016 -5376200 -4854183 -4402460 -4050651 -3797214 -3609572 -3435357 -3220160 -2924423 -2534472
39007 -2534472 -2065587 -1555565 -1048748 -576106 -142599 269005 679850 1095353 1497913
38998 1497913 1855162 2135555 2320266 2405723 2397894 2302757 2118103 1831434 1426031 892080
38988 892080 235557 -520694 -1342525 -2190339 -3020413 -3782902 -4421647 -4879161 -5105676 -5068567
38978 -5068567 -4759065 -4194620 -3416570 -2484025 -1466394 -436823 533239 1379686 2051830
38969 2051830 2517112 2763085 2797971 2652064 2379091 2052447 1751687 1541075 1449680 1464380
38959 1464380 1540533 1624477 1675373 1676103 1631347 1558231 1476106 1398611 1328296 1254312 1155005 1006123
38947 1006123 792000 514388 194471 -133121 -431954 -676568 -861165 -1000049 -1119198
38938 -1119198 -1242366 -1377705 -1510825 -1608482 -1633117 -1562339 -1402610 -1188376 -966961 -778111
38928 -778111 -638496 -536884 -440710 -310962 -118705 145193 471623 843010 1244250 1669937
38918 1669937 2126916 2631819 3203148 3850316 4565641 5324585 6094115 6843707 7552475
38909 7552475 8208865 8804479 9327791 9763779 10100617 10338268 10491697 10585447 10642468 10673499
38899 10673499 10672496 10620003 10492720 10275049 9968253 9594338 9193825 8818085 8517414 8326488
38889 8326488 8250648 8259023 8290420 8272235 8144736 7879898 7488558 7016506 6532938 6113962
38879 6113962 5824591 5704805 5764782 5989643 6349831 6812749 7352838 7957612 8627174 9366902
38869 9366902 10176564 11040645 11922976 12766325 13497064 14035734 14313413 14289812 13965319 13380745
38859 13380745 12605649 11722406 10812533 9946428 9174793 8522035 7983869 7529779 7108942
38850 7108942 6659119 6119328 5445095 4621583 3669540 2641813 1610600 647302 -199587
38841 -199587 -919607 -1541318 -2120143 -2720916 -3402551 -4207094 -5152490 -6229636 -7405839
38832 -7405839 -8635650 -9876456 -11102296 -12307941 -13498921 -14671502 -15794035 -16800803
38824 -16800803 -17601436 -18100787 -18221650 -17924574 -17220160 -16169150 -14868708 -13430137 -11958189
38815 -11958189 -10539183 -9236889 -8090468 -7111448 -6281935 -5557168 -4872872 -4156564 -3342888
38806 -3342888 -2391955 -1305165 -130159 1049934 2139759 3057879 3754758 4215584 4449221
38797 4449221 4473226 4306781 3975180 3517740 2987407 2438236 1908108 1408211 926400 443185
38787 443185 -48173 -529292 -960049 -1295674 -1506002 -1585080 -1548052 -1421218 -1232453 -1004665
38777 -1004665 -751761 -477238 -176754 155747 521605 914172 1319408 1718555 2091145
38768 2091145 2418030 2684695 2884523 3020954 3107284 3163093 3207545 3252074 3296522 3331008
38758 3331008 3341632 3315429 3242053 3113951 2928561 2693081 2428110 2165670 1941254 1784724
38748 1784724 1716040 1747244 1886085 2135055 2484274 2903312 3339720 3728489 4009956 4148460
38738 4148460 4143461 4028962 3863257 3715407 3654590 3743776 4033904 4553938 5297669 6215253
38728 6215253 7218312 8199132 9054480 9703069 10093376 10205595 10050209 9660862 9080143
38719 9080143 8343962 7473910 6481593 5380220 4195297 2969374 1759743 630010 -362222
38710 -362222 -1177168 -1799593 -2238892 -2524470 -2698623 -2806950 -2886348 -2954347 -3006243 -3022953
38700 -3022953 -2984427 -2879085 -2703986 -2459194 -2144200 -1760765 -1319401 -843015 -363625 85740
38690 85740 477407 788385 994111 1064179 966870 681709 212116 -410143 -1131378 -1889500
38680 -1889500 -2627770 -3302414 -3881507 -4337974 -4643206 -4766379 -4679097 -4360974 -3802701 -3007027
38670 -3007027 -1990066 -783776 562055 1980402 3390675 4704647 5833687 6697281
38662 6697281 7232694 7404449 7210557 6682063 5874616 4855117 3690122 2441852 1171697
38653 1171697 -55320 -1172225 -2118943 -2852570 -3352372 -3617754 -3662573 -3510386 -3193014
38644 -3193014 -2751805 -2238914 -1715004 -1240838 -863581 -603130 -446219 -353546 -278254 -187164
38634 -187164 -74666 35813 100925 72057 -88925 -396710 -837097 -1372703 -1957828 -2554112
38624 -2554112 -3137961 -3696983 -4220323 -4690508 -5081540 -5363348 -5509697 -5506055 -5354530 -5074246
38614 -5074246 -4697335 -4262935 -3812535 -3388427 -3033764 -2791171 -2698710 -2785224 -3067530 -3549144
38604 -3549144 -4217953 -5042192 -5968495 -6927026 -7844199 -8657010 -9321255 -9811008 -10113818
38595 -10113818 -10228072 -10164359 -9946777 -9609077 -9185140 -8699014 -8161499 -7576344 -6952076
38586 -6952076 -6310429 -5684340 -5107033 -4601486 -4178760 -3844739 -3607043 -3474644 -3450085 -3520382
38576 -3520382 -3653090 -3800073 -3907033 -3923976 -3812108 -3545692 -3110857 -2504417 -1734327 -821496
38566 -821496 198469 1275491 2348735 3353887 4232700 4943585 5471505 5832686 6067736
38557 6067736 6221888 6321588 6361758 6310473 6124663 5765753 5210520 4459687 3545357 2532226
38547 2532226 1506758 555819 -255402 -895641 -1366439 -1692427 -1910314 -2060403 -2179580
38538 -2179580 -2294116 -2413814 -2531631 -2630852 -2696841 -2726901 -2733125 -2737781 -2765039 -2833880 -2954838
38527 -2954838 -3130088 -3354506 -3615558 -3891736 -4151458 -4355442 -4464067 -4447571 -4293815 -4008797
38517 -4008797 -3609786 -3116169 -2544373 -1909176 -1228054 -523472 178123 847149 1448640
38508 1448640 1939669 2272890 2408761 2330700 2053261 1617664 1077427 482612 -129278 -732991
38498 -732991 -1309229 -1839052 -2303707 -2689364 -2991972 -3217350 -3375178 -3469955 -3494762 -3432836
38488 -3432836 -3267145 -2992375 -2621640 -2183593 -1711799 -1232419 -756456 -279744 210822
38479 210822 729565 1286775 1885914 2520750 3172363 3809798 4397433 4906669 5325517 5660924
38469 5660924 5933034 6163762 6363677 6522561 6608799 6578921 6392809 6027169 5481980 4779355
38459 4779355 3957643 3064541 2151839 1271694 471898 -211650 -762763 -1187366 -1507382
38450 -1507382 -1749861 -1938844 -2094238 -2235687 -2386736 -2576421 -2837494 -3200021 -3679062
38441 -3679062 -4258878 -4881821 -5451586 -5854310 -5990714 -5806062 -5306100 -4554219 -3652289
38432 -3652289 -2712664 -1831499 -1073061 -469309 -30624 242136 352477 311478 144866 -102340
38422 -102340 -367822 -581089 -676862 -608486 -358011 59513 600044 1204061 1816104 2401780
38412 2401780 2953800 3484702 4011012 4537187 5047147 5507423 5879396 6132559 6251414
38403 6251414 6235505 6097619 5863162 5568203 5252794 4951300 4685290 4461913 4275199 4106637
38393 4106637 3925697 3694881 3381481 2971521 2477813 1937919 1404752 934983 577978
38384 577978 366299 310607 402099 620515 940561 1331958 1756754 2171953 2540103 2841260
38374 2841260 3076614 3260112 3403809 3507095 3556282 3533254 3426841 3241183 2998480 2735839
38364 2735839 2497783 2328586 2269072 2357709 2629795 3109259 3796414 4662326 5657288 6729550
38354 6729550 7841711 8973432 10108860 11217991 12245820 13118434 13764152 14138603 14241494
38345 14241494 14118791 13850638 13528928 13230222 12992254 12803292 12609606 12337689 11921167
38336 11921167 11322359 10543471 9626284 8640384 7662370 6753872 5949440 5260094 4687547
38327 4687547 4237791 3926103 3773876 3802819 4031533 4475713 5148937 6058618 7194251
38318 7194251 8512960 9933835 11349079 12647550 13736855 14553896 15066060 15271909 15203966
38309 15203966 14926278 14519101 14054038 13572589 13079195 12549497 11946866 11240251 10419077
38300 10419077 9501732 8534421 7580788 6707630 5973165 5420072 5071100 4925166 4955507
38291 4955507 5113262 5337023 5564691 5743211 5835107 5823390 5714807 5537994 5333544 5138823
38281 5138823 4975695 4848105 4749166 4671152 4612012 4577199 4579484 4638473 4778451 5022721 5385779
38270 5385779 5867372 6451268 7107875 7797688 8474129 9087413 9592048 9957716 10178350
38261 10178350 10272339 10271643 10206365 10095628 9950318 9783471 9619345 9495425 9457120 9547192
38251 9547192 9792289 10190830 10708492 11285631 11854097 12354597 12745747 13002713 13110886
38242 13110886 13061636 12852223 12486674 11974440 11327477 10558326 9680298 8709460 7668510
38233 7668510 6592177 5531046 4549023 3712769 3076789 2670478 2491577 2506768 2657590
38224 2657590 2869216 3060882 3158313 3107913 2889482 2521949 2058299 1570402 1128734 784499
38214 784499 561508 460775 472685 586377 789651 1062538 1373644 1684908 1962240 2184937
38204 2184937 2348629 2461493 2537192 2588467 2623136 2642269 2640551 2610030 2547461 2462297 2380885
38193 2380885 2344362 2400796 2593411 2947664 3461901 4106441 4831086 5574651 6269471 6840793
38183 6840793 7207829 7292408 7033952 6404033 5414462 4117053 2596122 955186 -700357
38174 -700357 -2281283 -3728558 -5018798 -6159024 -7171976 -8076676 -8871618 -9528881 -10004120
38165 -10004120 -10259121 -10284819 -10110804 -9795856 -9406522 -8996430 -8594793 -8204842 -7809659
38156 -7809659 -7383607 -6906976 -6378805 -5822083 -5278790 -4796728 -4412825 -4138696 -3954247
38147 -3954247 -3812519 -3653703 -3421903 -3078276 -2607565 -2018149 -1337264 -603732 139549
38138 139549 852521 1504960 2083625 2597218 3075694 3562499 4101963 4726406 5447130 6251132
38128 6251132 7103234 7952617 8743085 9425811 9971617 10378600 10672010 10896309 11102243
38119 11102243 11333231 11614946 11950206 12319555 12687534 13014518 13271701 13453219 13578999
38110 13578999 13687340 13822829 14026571 14331536 14761430 15330665 16043395 16889780 17838918
38101 17838918 18832019 19783030 20592009 21168747 21456714 21446826 21176883 20719638 20165017 19600539
38091 19600539 19093171 18676778 18349328 18080742 17828105 17552349 17229489 16850543 16409441
38082 16409441 15887350 15246734 14442472 13444165 12255623 10920564 9512980 8118233 6814021
38073 6814021 5658879 4690523 3929703 3383346 3045104 2896192 2908510 3047902 3274504
38064 3274504 3540773 3790766 3963597 4002042 3865717 3545762 3073993 2518655 1965319 1491339
38054 1491339 1146714 948495 886299 931862 1047990 1196229 1343055 1462977 1537403 1550263
38044 1550263 1482695 1309435 1000428 530768 -102562 -865837 -1686566 -2468677 -3118887 -3572136
38034 -3572136 -3805322 -3835246 -3704623 -3465416 -3168110 -2858852 -2579417 -2363976 -2231433 -2177581
38024 -2177581 -2173162 -2171939 -2127646 -2012367 -1825764 -1589345 -1330388 -1067123 -803841 -535227
38014 -535227 -253103 49759 378912 738212 1129254 1550976 2000455 2474854 2973176 3495192
38004 3495192 4035208 4571417 5056637 5418112 5569733 5432371 4953905 4122597 2972129
37995 2972129 1579043 53236 -1478015 -2890662 -4084924 -5000649 -5621092 -5963448 -6061121
37986 -6061121 -5947181 -5646510 -5177290 -4556748 -3805714 -2950546 -2024118 -1066834 -125531
37977 -125531 752340 1527709 2175914 2684789 3046790 3253157 3296740 3182592 2938789 2619342
37967 2619342 2296283 2044526 1926149 1979269 2213427 2611829 3139933 3757308 4426480 5113981
37957 5113981 5785474 6401795 6920384 7300585 7509033 7523507 7335387 6950247 6386363 5672397
37947 5672397 4845457 3948753 3027783 2126048 1281789 525014 -126614 -671164 -1121457
37938 -1121457 -1499660 -1831925 -2146030 -2469484 -2824157 -3218231 -3640134 -4057584 -4421441
37929 -4421441 -4673703 -4759970 -4644449 -4321332 -3815623 -3171665 -2434766 -1635382 -784071 119925
37919 119925 1070946 2040333 2972007 3795000 4448043 4903993 5181611 5338952 5452234 5590782
37909 5590782 5798595 6087292 6439032 6815504 7169724 7457302 7642577 7697069 7594501 7311992
37899 7311992 6842502 6210990 5479023 4729680 4040704 3462761 3013238 2682484 2442430
37890 2442430 2251446 2057129 1802379 1437729 936745 306143 -417327 -1183017 -1945635
37881 -1945635 -2676447 -3364118 -4011226 -4630295 -5235908 -5830096 -6387917 -6855492 -7164495
37872 -7164495 -7254094 -7088097 -6662835 -6008206 -5183651 -4267452 -3339110 -2459652 -1657356 -923945
37862 -923945 -221610 502174 1296310 2188790 3175161 4216360 5246217 6184825 6952592
37853 6952592 7482195 7728120 7672370 7323190 6706397 5855029 4804533 3594429 2270049
37844 2270049 878273 -541573 -1964749 -3380479 -4783829 -6164810 -7500136 -8750638
37836 -8750638 -9864411 -10784362 -11459035 -11855089 -11967213 -11819697 -11457469 -10932058 -10291868
37827 -10291868 -9581215 -8843395 -8119647 -7441545 -6822690 -6257598 -5730331 -5228236 -4753137
37818 -4753137 -4324363 -3972926 -3730669 -3620175 -3649867 -3815869 -4109592 -4527693 -5078661 -5780039
37808 -5780039 -6645146 -7666155 -8804102 -9991326 -11143163 -12171721 -12997867 -13562015 -13834231
37799 -13834231 -13820180 -13557117 -13097611 -12486985 -11747042 -10876549 -9868007 -8729255 -7497084
37790 -7497084 -6237368 -5033893 -3970068 -3107709 -2468885 -2028240 -1719567 -1453130 -1136088
37781 -1136088 -690306 -66032 748914 1726968 2808960 3921943 4999394 5993407 6873407
37772 6873407 7615572 8193061 8574417 8730083 8641811 8309842 7754947 7014290 6131815 5146640
37762 5146640 4085346 2963333 1795379 608616 -552135 -1632326 -2584545 -3383035
37754 -3383035 -4027274 -4535882 -4938659 -5272182 -5577505 -5895746 -6260874 -6692884 -7193821
37745 -7193821 -7746045 -8311878 -8836894 -9259604 -9525749 -9600321 -9471445 -9146665 -8647160 -8004549
37735 -8004549 -7260752 -6467762 -5682999 -4957583 -4320041 -3764296 -3251442 -2727040 -2145304
37726 -2145304 -1487933 -770305 -35063 662043 1267504 1740767 2058692 2217110 2233184 2147112
37716 2147112 2017919 1911799 1888525 1992675 2250368 2666577 3219953 3858142 4499738 5046175
37706 5046175 5401562 5494748 5296752 4827882 4152047 3360503 2550849 1807574 1188134 716245
37696 716245 383174 157147 -1228 -122467 -216569 -269868 -250227 -118010 160298 599506
37686 599506 1189081 1896834 2682263 3511516 4363633 5224467 6075304 6887446 7627993 8272363
37676 8272363 8815006 9272661 9679719 10078315 10506466 10987441 11522922 12091758 12655224
37667 12655224 13167761 13589095 13891957 14062534 14096434 13995467 13767415 13426695 12993767
37658 12993767 12493880 11956076 11410985 10885732 10398459 9958109 9571596 9252713 9023976
37649 9023976 8908296 8916545 9040490 9255769 9532082 9844169 10178855 10536656 10928088 11365267
37639 11365267 11850441 12365805 12870526 13308714 13625630 13783769 13770886 13598465 13295489
37630 13295489 12902720 12468269 12041939 11667131 11372239 11165037 11032120 10942806 10855024 10720872
37620 10720872 10491872 10125925 9596879 8903617 8073134 7154511 6206223 5282944 4427237
37611 4427237 3667629 3020529 2492103 2078391 1765964 1536690 1376606 1283495 1266942 1339987
37601 1339987 1508044 1761941 2077492 2419158 2744914 3012381 3187983 3258336 3238756 3172991
37591 3172991 3122750 3151635 3310542 3629142 4114250 4753874 5525024 6402256 7362620 8383868
37581 8383868 9437768 10485226 11479626 12378202 13154320 13802924 14337313 14781361 15161970
37572 15161970 15503235 15821561 16121728 16395253 16622202 16776181 16831302 16769646 16587773 16300135
37562 16300135 15936457 15531308 15109051 14673419 14210956 13708034 13169325 12623780 12114673
37553 12114673 11682124 11348898 11114346 10956277 10839726 10730798 10610339 10480015 10356859
37544 10356859 10259605 10195207 10153161 10109702 10037985 9918303 9745508 9534926 9327449 9189607
37534 9189607 9202356 9437970 9933315 10671194 11577435 12535039 13411983 14094616 14514423 14657045
37524 14657045 14552021 14252922 13820323 13312949 12784150 12278906 11829584 11450931 11135720
37515 11135720 10853978 10559780 10206205 9762257 9222499 8605446 7945706 7287967 6685156
37506 6685156 6195136 5869381 5734777 5778685 5948261 6166140 6353799 6450753 6423596 6266403
37496 6266403 5996175 5645234 5251786 4851630 4474472 4145506 3889512 3733653 3706483 3832563
37486 3832563 4124233 4573932 5150555 5800987 6455576 7036261 7467357 7688520 7666587 7401246
37476 7401246 6921612 6275899 5520283 4712332 3909659 3170016 2548803 2093508 1837645
37467 1837645 1796391 1964183 2313892 2798095 3352971 3904697 4378100 4707766 4850505 4795123
37457 4795123 4564073 4204340 3770554 3308368 2846805 2403235 1995458 1649264 1393461
37448 1393461 1245927 1203010 1241496 1331129 1447605 1577464 1713631 1846373 1955926 2011516
37438 2011516 1978488 1831433 1567669 1213954 821488 449966 147497 -64659 -196923 -285777
37428 -285777 -381582 -534599 -783819 -1152069 -1647821 -2270323 -3013430 -3865982 -4809708 -5816336
37418 -5816336 -6845116 -7842021 -8742484 -9478746 -9991126 -10240859 -10220878 -9959683 -9514012
37409 -9514012 -8950470 -8322940 -7656560 -6946830 -6174669 -5329327 -4426144 -3508911 -2635903
37400 -2635903 -1858156 -1201413 -659036 -197014 232136 672203 1149211 1664422 2193593
37391 2193593 2689261 3085587 3308789 3294528 3006976 2450000 1664172 711471 -343792
37382 -343792 -1448719 -2565707 -3667947 -4731298 -5727097 -6618931 -7365350 -7928970 -8288536
37373 -8288536 -8446840 -8428824 -8270789 -8007792 -7666288 -7264192 -6815767 -6337250 -5850149 -5380965
37363 -5380965 -4957859 -4605527 -4339304 -4159302 -4046199 -3961133 -3851466 -3661945 -3348670 -2892019
37353 -2892019 -2304325 -1629213 -932478 -287879 237485 594617 758832 729833 526327 178782
37343 178782 -274433 -784716 -1287907 -1703877 -1947474 -1949846 -1680808 -1160400 -453041 353054
37333 353054 1171396 1936409 2609245 3170601 3607923 3906515 4049555 4024615 3830296 3478684
37323 3478684 2993773 2408356 1761355 1096365 461287 -91858 -508356 -734313 -721796 -434881
37313 -434881 143108 1001237 2094443 3345042 4656289 5934002 7105065 8123664 8966428
37304 8966428 9625457 10105245 10421061 10593876 10643094 10583317 10427669 10192787 9899085 9565337
37294 9565337 9201716 8805598 8362760 7855456 7276601 6644430 6008286 5439285 5008607
37285 5008607 4764201 4717031 4841301 5085290 5385982 5682004 5922163 6069037 6099061 6002331
37275 6002331 5784845 5472267 5110593 4759257 4476144 4298824 4229647 4233058 4249220 4218780
37265 4218780 4105990 3909101 3657028 3398988 3192713 3092002 3134069 3330293 3664126 4096071
37255 4096071 4573188 5041073 5455638 5789565 6029261 6165732 6188992 6092114 5880157 5573495
37245 5573495 5200453 4784427 4334869 3847459 3312154 2724040 2091530 1437946 795795
37236 795795 197647 -329707 -763351 -1076404 -1231356 -1181441 -881583 -304282 547215 1634331
37226 1634331 2888180 4221109 5540965 6766094 7839151 8734947 9456504 10019337 10433709
37217 10433709 10697797 10806207 10765236 10601534 10357936 10080742 9806809 9555808 9329009
37208 9329009 9114283 8895730 8663418 8416870 8159140 7885573 7576229 7198524 6718836
37199 6718836 6115469 5385420 4542466 3609369 2609419 1561908 483362 -607365 -1684599
37190 -1684599 -2715287 -3661749 -4484740 -5145910 -5611785 -5860481 -5887919 -5708886 -5352765
37181 -5352765 -4858775 -4274837 -3658380 -3074198 -2587108 -2251926 -2104584 -2156479 -2393063 -2778278
37171 -2778278 -3265670 -3812866 -4391828 -4988078 -5589293 -6171857 -6696362 -7117040 -7400318
37162 -7400318 -7541019 -7565761 -7520903 -7451874 -7386012 -7328354 -7271120 -7209109 -7150841 -7119190 -7141451
37151 -7141451 -7233488 -7385286 -7555806 -7682075 -7700237 -7568408 -7278758 -6852569 -6323009 -5718061
37141 -5718061 -5054097 -4341312 -3593498 -2833520 -2091182 -1395494 -764971 -199472 322339
37132 322339 836299 1377657 1964248 2586423 3208296 3779428 4252484 4600556 4827169 4964313
37122 4964313 5059462 5157601 5285007 5439271 5588105 5677890 5649520 5455061 5068773 4490169
37112 4490169 3740862 2857615 1883522 859762 -179231 -1205876 -2195610 -3120938 -3945978
37103 -3945978 -4625423 -5111033 -5363946 -5366705 -5129546 -4689917 -4106271 -3446679 -2774438 -2137434
37093 -2137434 -1568409 -1095186 -750251 -568112 -568409 -734392 -1001182 -1263272 -1399465 -1303313
37083 -1303313 -905191 -179517 859930 2170011 3689340 5348745 7079077 8814576
37075 8814576 10493200 12058082 13462740 14677521 15691806 16509019 17137802 17586473 17864907
37066 17864907 17990395 17989936 17895378 17735214 17528884 17285088 17001689 16666148 16258074 15754386
37056 15754386 15134954 14386566 13505498 12499171 11385812 10191136 8943108 7666277
37048 7666277 6375989 5073910 3749667 2392246 1006410 -377764 -1710444 -2938763
37040 -2938763 -4022993 -4943779 -5700676 -6306668 -6781814 -7146647 -7415635 -7592120 -7666851
37031 -7666851 -7621795 -7438709 -7108545 -6636059 -6037122 -5332209 -4542412 -3691192 -2809274 -1937829
37021 -1937829 -1127396 -433168 91979 406226 488389 345262 12257 -454765 -993482 -1548016
37011 -1548016 -2075014 -2542177 -2923413 -3196132 -3343710 -3361692 -3262598 -3074278 -2831325 -2564555
37001 -2564555 -2294676 -2032248 -1781747 -1546716 -1334402 -1158392 -1037333 -989003 -1022075 -1129738
36991 -1129738 -1288705 -1464717 -1622619 -1736526 -1795767 -1805360 -1782586 -1750800 -1730184 -1726673 -1723757
36980 -1723757 -1682429 -1550743 -1280341 -845040 -255030 440688 1167603 1850245 2436050 2906429
36970 2906429 3270277 3544656 3734248 3821908 3775803 3568221 3194612 2682825 2088288 1476825
36960 1476825 902615 393502 -46531 -419780 -716211 -907761 -957897 -838507 -545182 -105809
36950 -105809 420246 953410 1412279 1731374 1870693 1814659 1563893 1126512 515321 -246545
36940 -246545 -1115241 -2019583 -2866065 -3557455 -4018947 -4220375 -4183465 -3970104 -3657619 -3313262
36930 -3313262 -2978753 -2668724 -2379497 -2101051 -1826283 -1556166 -1303036 -1092946 -963659
36921 -963659 -953883 -1085282 -1346578 -1690200 -2044686 -2336517 -2510688 -2542093 -2436349 -2223884
36911 -2223884 -1951300 -1671099 -1429631 -1255904 -1156232 -1116554 -1108519 -1094418 -1031572 -880452
36901 -880452 -616461 -238043 235612 774600 1346070 1913918 2435078 2861438 3149931 3274405
36891 3274405 3231336 3036886 2718250 2303587 1814469 1264174 662793 25468 -622756 -1249603
36881 -1249603 -1824163 -2326259 -2752099 -3114635 -3439027 -3753999 -4080289 -4419504 -4749419
36872 -4749419 -5031318 -5228391 -5325461 -5337776 -5303676 -5266206 -5253775 -5268284 -5285431 -5267741 -5185297
36861 -5185297 -5033722 -4839107 -4646707 -4499434 -4416980 -4385658 -4363653 -4298829 -4149963 -3901909
36851 -3901909 -3570558 -3198645 -2844225 -2563122 -2389469 -2322659 -2327674 -2348107 -2323669 -2203385
36841 -2203385 -1950856 -1543516 -969973 -228440 672840 1713711 2859518 4058887 5244125
36832 5244125 6337240 7262274 7959389 8392757 8547126 8416212 7993010 7270834 6254745
36823 6254745 4973900 3484746 1862972 190085 -1459099 -3026485 -4478567 -5809237
36815 -5809237 -7032698 -8166342 -9211159 -10139972 -10899046 -11421090 -11642986 -11521556 -11043728
36806 -11043728 -10231233 -9141634 -7865675 -6517891 -5217523 -4061808 -3100607 -2324317
36798 -2324317 -1672888 -1063693 -425745 275611 1033276 1810624 2561642 3248257 3848647
36789 3848647 4355794 4769607 5087746 5299366 5383585 5312535 5058083 4599753 3929758 3052709
36779 3052709 1983191 747620 -608109 -2012664 -3374572 -4599975 -5613910 -6374736
36771 -6374736 -6878026 -7152809 -7254069 -7253248 -7227153 -7245947 -7361518 -7598086 -7947779 -8374104
36761 -8374104 -8824309 -9247537 -9611808 -9912200 -10166449 -10400980 -10635798 -10876572 -11116260
36752 -11116260 -11341474 -11536251 -11679917 -11742025 -11680506 -11447300 -11001202 -10323243 -9427505 -8361112
36742 -8361112 -7192626 -5995511 -4836443 -3773025 -2856523 -2131510 -1628985 -1357094 -1296312
36733 -1296312 -1402995 -1619971 -1889259 -2161453 -2399155 -2576292 -2676952 -2694364 -2626865 -2469320
36723 -2469320 -2204859 -1805253 -1242918 -507721 382982 1387737 2454249 3532011 4575597
36714 4575597 5538952 6369664 7012665 7424055 7586046 7512372 7240851 6818025 6283696 5661191
36704 5661191 4956350 4165332 3287030 2332489 1325396 294623 -734630 -1745109 -2726442
36695 -2726442 -3671917 -4576528 -5438006 -6260600 -7059098 -7858931 -8689628 -9573384 -10514343
36686 -10514343 -11493555 -12470616 -13389969 -14189628 -14811241 -15210691 -15367616 -15290948 -15017097
36677 -15017097 -14599262 -14091339 -13534710 -12955182 -12369148 -11790183 -11228452 -10684687 -10147228
36668 -10147228 -9596975 -9016225 -8394300 -7728529 -7025148 -6303571 -5601322 -4973712 -4485114
36659 -4485114 -4193762 -4135118 -4309343 -4677164 -5166011 -5684868 -6143293 -6468529 -6615149 -6564339
36649 -6564339 -6314711 -5870788 -5236257 -4415980 -3426242 -2308734 -1140888 -34137 884884
36640 884884 1506679 1772251 1691968 1340381 829348 272746 -240708 -657152 -952824 -1125170
36630 -1125170 -1186801 -1160918 -1073741 -943958 -774062 -547578 -232702 208450 805453 1563210
36620 1563210 2451419 3407639 4354200 5219994 5955715 6537364 6961585 7240383 7399655
36611 7399655 7479569 7531106 7605333 7738429 7940611 8196341 8476131 8752021 9006013 9226710
36601 9226710 9399677 9502386 9509930 9407627 9201530 8921323 8616380 8347622 8175917 8147664
36591 8147664 8281608 8563251 8950721 9390458 9836619 10266445 10685052 11117192 11589654
36582 11589654 12112493 12667054 13204735 13656126 13947196 14017143 13831839 13388865 12714349
36573 12714349 11855274 10871705 9831998 8811327 7890562 7150632 6660389 6462342 6564358
36564 6564358 6941779 7546928 8319065 9190567 10090161 10946270 11692171 12272453 12649434
36555 12649434 12808337 12760012 12539538 12199318 11797871 11388912 11015781 10712032 10504015
36546 10504015 10411152 10444406 10607032 10899442 11324609 11888538 12594461 13435292 14390733 15431444
36536 15431444 16526687 17649133 18773442 19870801 20904900 21833151 22612647 23207121
36528 23207121 23590943 23748571 23671306 23355726 22807123 22046261 21112779 20059090 18935290
36519 18935290 17773017 16577844 15334642 14022285 12628700 11157879 9627268 8061630
36511 8061630 6490917 4952751 3492326 2153870 967402 -58745 -933687 -1672763
36503 -1672763 -2289233 -2794498 -3204928 -3549140 -3869677 -4215685 -4627940 -5122796 -5683591
36494 -5683591 -6264204 -6802562 -7237090 -7519123 -7618565 -7524888 -7246876 -6810687 -6252188 -5603114
36484 -5603114 -4879220 -4080876 -3206447 -2266772 -1289233 -311479 626925 1489601 2246207
36475 2246207 2874830 3362603 3703683 3897003 3946826 3866055 3679486 3424018 3143693 2879323
36465 2879323 2655998 2474561 2311624 2127945 1881990 1545007 1112774 607678 67811
36456 67811 -471563 -993018 -1500564 -2013105 -2554028 -3141714 -3782579 -4467345 -5171375 -5858649
36446 -5858649 -6487632 -7017620 -7415077 -7659102 -7743826 -7676017 -7469279 -7139323 -6703773 -6184801
36436 -6184801 -5609187 -5003468 -4388728 -3781413 -3199766 -2668072 -2212605 -1852151 -1591273
36427 -1591273 -1420543 -1321010 -1268287 -1235020 -1193910 -1123197 -1013352 -870002 -707921 -536919
36417 -536919 -348811 -116004 196826 617099 1154827 1801511 2533297 3314778 4102586 4848570
36407 4848570 5502764 6018181 6359552 6513855 6496392 6347618 6121439 5869596 5627083 5402653
36397 5402653 5177416 4912141 4560956 4087478 3479333 2756665 1970436 1189683 482595
36388 482595 -100203 -533665 -816799 -966160 -1010683 -991028 -960373 -980136 -1107699 -1380761
36378 -1380761 -1806106 -2356700 -2976099 -3588637 -4115037 -4490896 -4681272 -4684816 -4527042 -4248439
36368 -4248439 -3893882 -3506043 -3121780 -2769368 -2465466 -2212034 -1994240 -1780667 -1527416
36359 -1527416 -1187687 -726750 -138436 544087 1249988 1886411 2362631 2612747 2607581 2352575
36349 2352575 1876524 1219856 427755 -453507 -1381416 -2323654 -3261626 -4186382 -5087293
36340 -5087293 -5939288 -6696886 -7301040 -7697926 -7859915 -7795205 -7539291 -7134958 -6616285 -6008191
36330 -6008191 -5339924 -4659509 -4035084 -3538356 -3218399 -3081705 -3091085 -3184117 -3300474 -3404605
36320 -3404605 -3495526 -3602380 -3768552 -4029519 -4392284 -4824900 -5260427 -5612782 -5797757 -5753149
36310 -5753149 -5454077 -4919994 -4210324 -3409031 -2603665 -1866652 -1243938 -751629 -378737
36301 -378737 -94060 144730 382124 658540 1008410 1461733 2045477 2780496 3673015 4705349
36291 4705349 5832860 6990502 8106331 9116787 9979385 10679156 11225040 11635715 11921373
36282 11921373 12072406 12062061 11861096 11455959 10861863 10125994 9321077 8533805 7853423
36273 7853423 7362056 7123826 7171304 7494537 8041375 8731677 9477389 10196755 10817675 11275430
36263 11275430 11513764 11493400 11204395 10674883 9970599 9184027 8415953 7754897 7261127
36254 7261127 6960519 6848943 6903004 7091597 7384494 7755872 8181978 8635139 9080051 9477417
36244 9477417 9793376 10007772 10116382 10128313 10061533 9936602 9767861 9555270 9282650 8924471
36234 8924471 8457542 7872577 7182937 6428886 5674362 4994013 4453500 4091789 3914493
36225 3914493 3901361 4023061 4257800 4599363 5053521 5626045 6309659 7077289 7884797 8680666
36215 8680666 9416766 10055935 10576304 10974286 11266257 11486633 11680889 11894937 12163775
36206 12163775 12501501 12894334 13299116 13649889 13872476 13903026 13704086 13272469 12636713
36197 12636713 11846888 10963553 10052269 9184103 8435206 7877296 7558325 7482835 7604865
36188 7604865 7839208 8085081 8249402 8259455 8063754 7628392 6937802 6002904 4870684
36179 4870684 3625015 2373269 1223049 259654 -467148 -945410 -1195250 -1257785 -1180156
36170 -1180156 -999418 -730387 -361937 137689 809465 1689454 2794545 4111135 5590857
36161 5590857 7155844 8711568 10161939 11421985 12426447 13134781 13533216 13634433 13475454
36152 13475454 13113866 12621559 12075142 11543744 11076555 10693411 10382057 10105249 9817850
36143 9817850 9488363 9114976 8728024 8378510 8119249 7986137 7983980 8079755 8207093 8283943
36133 8283943 8237856 8026090 7639585 7091670 6404051 5603516 4731835 3857949 3077195 2490800
36123 2490800 2174064 2151304 2391891 2827971 3382150 3990866 4615010 5236834 5847644 6434013
36113 6434013 6970875 7426367 7775976 8016902 8172119 8279225 8369061 8446984 8489197 8456679
36103 8456679 8317013 8059430 7694430 7240936 6711981 6109069 5427222 4664404 3827326
36094 3827326 2930745 1993577 1036458 82673 -838462 -1688201 -2418602 -2979760 -3333375
36085 -3333375 -3466331 -3396673 -3169363 -2845119 -2487133 -2148515 -1862197 -1635600 -1451963 -1277913
36075 -1277913 -1074268 -806270 -450597 1473 544070 1158973 1818965 2490408 3133736
36066 3133736 3703975 4156397 4459172 4606364 4620194 4537881 4390322 4186028 3909356 3532739
36056 3532739 3035475 2419236 1712265 959896 206576 -520242 -1215037 -1886128 -2541578
36047 -2541578 -3180182 -3794494 -4383014 -4961049 -5560539 -6217692 -6956434 -7778274 -8663728
36038 -8663728 -9581767 -10499067 -11383623 -12203873 -12927817 -13524419 -13966043 -14230625 -14304242 -14184614
36028 -14184614 -13883614 -13426182 -12845351 -12175572 -11446186 -10675574 -9867128 -9009888 -8085895
36019 -8085895 -7081460 -5995258 -4837867 -3624998 -2372545 -1099037 167539 1386735
36011 1386735 2511545 3501410 4336423 5026752 5612573 6152569 6704136 7303193 7951484
36002 7951484 8614875 9231983 9730599 10047871 10148446 10035017 9748801 9360681 8954916
35993 8954916 8608657 8373561 8267607 8281444 8394822 8591620 8863310 9200258 9580292 9965561
35983 9965561 10310676 10575751 10735885 10783472 10724728 10573251 10343848 10050519 9710474 9350588
35973 9350588 9009290 8730353 8551808 8495527 8559943 8716053 8908733 9066913 9122068 9027373
35963 9027373 8767588 8355888 7822696 7204729 6538379 5856644 5188237 4559672 4000200
35954 4000200 3545264 3232567 3090089 3123058 3308827 3602696 3950015 4297695 4601887 4833120
35944 4833120 4980586 5054600 5084231 5108362 5162042 5263253 5406022 5563592 5700666 5789200
35934 5789200 5820841 5811685 5798979 5831937 5959639 6219192 6626965 7174458 7828951 8538711
35924 8538711 9242200 9879312 10400831 10772705 10974732 10996826 10837368 10506330 10031532 9462713
35914 9462713 8868358 8325277 7905779 7667393 7646320 7853387 8272296 8861350 9559513 10296266
35904 10296266 11003738 11628575 12140248 12533388 12824368 13044201 13229502 13412526 13611820
35895 13611820 13825840 14031731 14190154 14255176 14185877 13955353 13554722 12993006 12294422 11492487
35885 11492487 10619861 9696484 8722480 7681825 6557620 5352955 4106092 2889345
35877 2889345 1790303 886879 231756 -148066 -244631 -66291 358879 979570 1723473
35868 1723473 2505973 3242830 3863693 4322730 4602945 4713801 4685355 4562191 4397109 4242727
35858 4242727 4141936 4122068 4196934 4374688 4664050 5073054 5601607 6233909 6934831 7650253
35848 7650253 8310773 8840137 9168764 9248385 9061552 8622917 7974541 7179496 6315650 5467866
35838 5467866 4715967 4119176 3703167 3457521 3346026 3323611 3350053 3395002 3435689 3451722
35828 3451722 3420752 3318093 3122701 2828149 2451732 2033611 1624139 1266135 982025 771617
35818 771617 619773 509360 433806 403958 445918 590753 861535 1264361 1786927 2403741
35808 2403741 3084357 3800871 4532351 5265658 5993430 6710282 7408461 8074781 8690747
35799 8690747 9235974 9692961 10051490 10312653 10492139 10619700 10731958 10861092 11026748
35790 11026748 11235610 11485054 11763687 12047113 12295160 12457954 12490913 12370481 12101000
35781 12101000 11709653 11234334 10711414 10166719 9609660 9031837 8413919 7741916 7026482
35772 7026482 6313706 5679183 5206999 4964129 4982006 5250437 5720894 6313881 6929139 7460711
35762 7460711 7816044 7932597 7784871 7380310 6748274 5927899 4959628 3883839 2746958
35753 2746958 1610014 550793 -346760 -1013620 -1416228 -1563294 -1493148 -1249077 -859140
35744 -859140 -333410 321979 1086816 1918473 2758074 3545889 4236603 4807482 5257920 5602695
35734 5602695 5861637 6047445 6154868 6157583 6017998 5707581 5226906 4614128 3938245 3282429
35724 3282429 2726210 2333423 2148398 2198228 2495946 3039989 3809258 4757170 5809319
35715 5809319 6867952 7824490 8578751 9059510 9237612 9125172 8763416 8209878 7533885
35706 7533885 6818465 6158486 5648008 5360685 5334259 5567941 6033358 6692508 7513160 8474058
35696 8474058 9558130 10738636 11966905 13169296 14256294 15140490 15755337 16066389 16072456
35687 16072456 15800632 15300406 14637685 13886433 13117467 12387481 11731913 11163413 10675964
35678 10675964 10253568 9880329 9547299 9253129 8999754 8787717 8615531 8484098 8403020
35669 8403020 8393490 8484123 8700253 9050834 9518334 10056026 10593779 11048831 11336076 11376424
35659 11376424 11107598 10500629 9576486 8411357 7124451 5853518 4728740 3852409 3286175
35650 3286175 3045087 3097591 3371448 3766917 4178023 4518216 4740869 4844903 4863206 4840748
35640 4840748 4813652 4798299 4792844 4785991 4764390 4713591 4615214 4446972 4188910 3832903 3389272
35629 3389272 2886073 2361300 1853110 1394797 1017302 754840 645697 724235 1007492 1483761
35619 1483761 2109055 2813425 3514991 4136016 4614026 4904240 4976096 4810806 4404204 3772237
35609 3772237 2952816 2001362 983692 -29063 -963786 -1751361 -2337100 -2691589 -2816397
35600 -2816397 -2742456 -2522232 -2217485 -1885402 -1568106 -1290193 -1063789 -895449 -789577 -747873
35590 -747873 -767743 -842164 -961317 -1114953 -1294191 -1491803 -1700588 -1909953 -2101565 -2246548
35580 -2246548 -2308184 -2252559 -2064320 -1759551 -1387588 -1019013 -724429 -553979 -527928 -642270
35570 -642270 -883143 -1237937 -1695506 -2238965 -2840880 -3466571 -4082433 -4662064 -5186156 -5637642
35560 -5637642 -5996634 -6239205 -6341740 -6289556 -6085676 -5754599 -5337876 -4882476 -4426711 -3989349
35550 -3989349 -3565513 -3129808 -2644756 -2071394 -1378932 -551436 408858 1481334 2629864
35541 2629864 3808634 4969378 6067469 7065151 7932321 8646662 9194647 9573938 9796154
35532 9796154 9887597 9885867 9832802 9766683 9716390 9698002 9713746 9754380 9805549 9855182 9896431
35521 9896431 9923368 9923106 9872123 9742093 9513059 9185329 8781513 8337207 7887093 7455439
35511 7455439 7055101 6692884 6376705 6120493 5943404 5862068 5880042 5983607 6150391 6366921
35501 6366921 6642750 7010507 7511215 8173259 8995810 9943870 10956035 11960428 12891908
35492 12891908 13705443 14384132 14941942 15420020 15875013 16360719 16908927 17517499 18151775
35483 18151775 18759888 19295784 19738741 20098954 20406426 20690418 20961538 21204982 21385360
35474 21385360 21457642 21378136 21112383 20640265 19959902 19090556 18071825 16955638 15791260
35465 15791260 14609635 13416156 12196287 10930025 9606067 8228856 6817817 5402167
35457 5402167 4014488 2684342 1432687 268313 -812573 -1823205 -2779349 -3689089
35449 -3689089 -4542307 -5305970 -5930066 -6361885 -6559349 -6495355 -6154074 -5527296 -4617112 -3443553
35439 -3443553 -2050919 -507889 1099447 2679271 4146251 5429800 6476379 7248425
35431 7248425 7724830 7905165 7814835 7506317 7053823 6542592 6056426 5667418 5429995 5378448
35421 5378448 5525109 5857461 6335695 6894344 7450659 7919107 8227932 8331683 8214867
35412 8214867 7886543 7370662 6697836 5900291 5008258 4046901 3036442 1998353 965536
35403 965536 -11168 -867652 -1542641 -1996522 -2221571 -2238875 -2087321 -1814042 -1470601 -1111589
35393 -1111589 -790587 -552866 -428193 -426564 -537626 -734190 -980052 -1239618 -1484006 -1690529
35383 -1690529 -1839099 -1912548 -1903166 -1819684 -1686707 -1534824 -1387425 -1252080 -1119844 -970618
35373 -970618 -780948 -531739 -214477 165525 590434 1035653 1476999 1894415 2269747 2581369
35363 2581369 2801993 2903474 2865832 2683657 2366080 1933102 1413881 848166 285538 -223617
35353 -223617 -644353 -971521 -1232977 -1480264 -1772982 -2163660 -2685647 -3344758 -4117374 -4958345
35343 -4958345 -5817408 -6656643 -7459919 -8229971 -8975921 -9699170 -10386063 -11011433 -11550314
35334 -11550314 -11990086 -12335380 -12602726 -12808034 -12954318 -13027106 -13000002 -12845607 -12543734 -12083140
35324 -12083140 -11460445 -10682217 -9770675 -8766616 -7723055 -6690633 -5703762 -4777286 -3915653
35315 -3915653 -3126685 -2428259 -1842273 -1380555 -1033140 -766366 -530741 -273333 51034
35306 51034 473135 1008062 1658119 2417126 3273082 4207290 5190321 6177506 7107729 7907996
35296 7907996 8503388 8829546 8844725 8539393 7940997 7110453 6128842 5078393 4026305
35287 4026305 3017667 2077049 1214098 430336 -273100 -888342 -1398899 -1786062 -2040485
35278 -2040485 -2171370 -2207723 -2191966 -2170029 -2181660 -2252269 -2386368 -2563644 -2740504 -2859497
35268 -2859497 -2865001 -2719144 -2411653 -1961698 -1413544 -827683 -267715 215148 594645 873773
35258 873773 1080008 1254763 1440530 1667353 1941013 2237849 2510644 2704279 2773586 2695229
35248 2695229 2470732 2123218 1691220 1220659 755185 326572 -51814 -386129 -697156
35239 -697156 -1010994 -1349043 -1721731 -2127974 -2558538 -3000251 -3439841 -3867107 -4275697 -4659714
35229 -4659714 -5008444 -5305208 -5533966 -5690552 -5791064 -5871665 -5979479 -6159128 -6441463 -6839025
35219 -6839025 -7348154 -7953921 -8633930 -9358911 -10089702 -10772276 -11335576 -11697663 -11780928 -11530555
35209 -11530555 -10928756 -10000890 -8812644 -7458384 -6043003 -4663788 -3399298 -2306591
35201 -2306591 -1422063 -760919 -314795 -51232 80390 134747 152898 150943 122502 52496
35191 52496 -68342 -236709 -438210 -653689 -868591 -1083677 -1321554 -1621905 -2024718 -2550579
35181 -2550579 -3190526 -3910736 -4665762 -5408701 -6092435 -6666626 -7079316 -7286276 -7263175 -7013834
35171 -7013834 -6571336 -5991724 -5341155 -4680246 -4053065 -3486769 -2999900 -2610749 -2339084
35162 -2339084 -2201840 -2207463 -2351621 -2614339 -2959371 -3338496 -3701580 -4008671 -4238312 -4389608
35152 -4389608 -4480099 -4542513 -4620863 -4764876 -5022673 -5432624 -6014924 -6763982 -7645087 -8599325
35142 -8599325 -9556431 -10449756 -11226549 -11850762 -12299583 -12556732 -12606731 -12435057 -12036230 -11424891
35132 -11424891 -10640231 -9738046 -8774987 -7796661 -6837559 -5929761 -5109373 -4412643 -3864199
35123 -3864199 -3467239 -3203251 -3040631 -2945979 -2892392 -2862634 -2847845 -2843778 -2846929 -2852629 -2856347
35112 -2856347 -2858457 -2871076 -2923134 -3058774 -3327008 -3766005 -4388853 -5176050 -6075795 -7010331
35102 -7010331 -7886579 -8610273 -9102187 -9312660 -9229014 -8872985 -8290929 -7542764 -6692855 -5801575
35092 -5801575 -4916649 -4067536 -3266537 -2515074 -1809726 -1145826 -521723 54364 559746
35083 559746 962530 1238253 1389398 1455484 1506497 1622107 1866658 2271369 2830969 3514598
35073 3514598 4283534 5104672 5951555 6793891 7585796 8264279 8761170 9021258 9016401 8750450
35063 8750450 8255956 7585051 6795957 5937938 5040966 4116492 3169271 2211840 1271192
35054 1271192 383883 -415140 -1101568 -1664156 -2101851 -2419409 -2624720 -2728776 -2746521 -2695230
35044 -2695230 -2589018 -2432699 -2220370 -1940903 -1587281 -1164796 -694975 -214854 226933
35035 226933 575042 772380 767663 529112 62359 -577359 -1289773 -1953415 -2460277 -2747739
35025 -2747739 -2815892 -2723983 -2567920 -2449648 -2452141 -2627075 -2991993 -3530506 -4194113 -4908766
35015 -4908766 -5586999 -6141508 -6495863 -6592052 -6396709 -5905660 -5144010 -4160524 -3019213
35006 -3019213 -1792651 -558196 606411 1632038 2469918 3098533 3519231 3742956 3777851
34997 3777851 3626013 3289386 2778404 2117434 1345291 512157 -325529 -1111651 -1798568
34988 -1798568 -2356001 -2777523 -3080312 -3296603 -3460961 -3601038 -3736846 -3887043 -4075254
34979 -4075254 -4329318 -4671620 -5106387 -5614160 -6159806 -6710328 -7250581 -7786245 -8332590
34970 -8332590 -8897067 -9466914 -10009121 -10482182 -10852346 -11105747 -11251850 -11318877 -11344447 -11365399
34960 -11365399 -11410965 -11501436 -11649572 -11859334 -12120874 -12407600 -12681118 -12901959 -13038232 -13067426
34950 -13067426 -12973608 -12744853 -12373092 -11855858 -11198478 -10414790 -9525130 -8552912 -7522860
34941 -7522860 -6461567 -5397073 -4354586 -3350811 -2392768 -1483413 -629345 156903 862844
34932 862844 1485218 2033426 2522553 2960355 3338307 3633740 3821492 3886610 3829854 3663789
34922 3663789 3404818 3069786 2681009 2273928 1896578 1596782 1404902 1324069 1332093 1389900
34912 1389900 1450487 1467186 1401882 1231031 946404 551082 55178 -525041 -1165091 -1830981
34902 -1830981 -2481961 -3077377 -3584187 -3980839 -4256166 -4405834 -4429686 -4330750 -4114750 -3790028
34892 -3790028 -3368944 -2869898 -2316313 -1730433 -1125626 -504607 132958 778927 1411701
34883 1411701 2003767 2537103 3014822 3460268 3904714 4372355 4871042 5391434 5912403
34874 5912403 6409460 6863203 7264678 7614893 7918307 8173748 8368163 8477325 8473595 8336536
34864 8336536 8060383 7655133 7142504 6549877 5903338 5219740 4500543 3733014 2901203
34855 2901203 2001322 1052094 94727 -815551 -1621201 -2273920 -2745136 -3034843 -3176852
34846 -3176852 -3237184 -3302475 -3458632 -3765884 -4240625 -4852610 -5538407 -6223940 -6845240 -7358680
34836 -7358680 -7738529 -7967274 -8028120 -7905924 -7595025 -7106890 -6471795 -5734561 -4948309 -4169179
34826 -4169179 -3451545 -2841756 -2370727 -2048814 -1867064 -1805680 -1846181 -1981290 -2217384 -2567493
34816 -2567493 -3037283 -3611081 -4246958 -4886241 -5473933 -5978265 -6397394 -6749940 -7057084
34807 -7057084 -7327851 -7554013 -7713204 -7776187 -7716660 -7523200 -7209570 -6816324 -6399467 -6009667
34797 -6009667 -5671521 -5372426 -5066307 -4691472 -4195704 -3557867 -2796749 -1964419 -1128161
34788 -1128161 -347870 343955 952751 1517999 2095606 2734102 3454802 4242916 5051301
34779 5051301 5814370 6466485 6957207 7257587 7357497 7259350 6973208 6514202 5900668 5152573
34769 5152573 4290970 3337984 2315814 1245473 148785 -944475 -1988370 -2919578 -3668153
34760 -3668153 -4177467 -4424372 -4430274 -4258114 -3996172 -3734658 -3543327 -3457204 -3473532 -3558595
34750 -3558595 -3660459 -3723522 -3702253 -3572795 -3340704 -3041601 -2731669 -2469187 -2294448 -2217803
34740 -2217803 -2220816 -2267485 -2318299 -2341776 -2321805 -2259996 -2172178 -2080640 -2007376 -1972512 -1995026
34729 -1995026 -2087449 -2240554 -2405759 -2490004 -2372034 -1934584 -1096691 167709 1828419
34720 1828419 3809475 6004892 8296043 10568607 12725458 14692126 16415460 17859933
34712 17859933 19004832 19841336 20367666 20584005 20491656 20098561 19428233 18525720 17454610
34703 17454610 16283197 15064702 13821565 12542183 11190340 9721300 8098977 6311621
34695 6311621 4382346 2368613 348584 -1598578 -3407035 -5027037 -6418817 -7544413
34687 -7544413 -8363698 -8838507 -8945255 -8690876 -8123026 -7327766 -6415234 -5500136 -4685035
34678 -4685035 -4050921 -3654490 -3528404 -3681414 -4098590 -4743710 -5564244 -6497156 -7474300
34669 -7474300 -8428041 -9297282 -10032262 -10596571 -10967433 -11136261 -11109451 -10907571 -10562013 -10110209
34659 -10110209 -9590710 -9038429 -8480600 -7935368 -7415115 -6934293 -6518067 -6205994 -6046238
34650 -6046238 -6080823 -6328371 -6773518 -7368822 -8047174 -8736260 -9366517 -9870989 -10183748 -10245637
34640 -10245637 -10019205 -9504839 -8746372 -7820700 -6816192 -5810455 -4855918 -3975644 -3167064
34631 -3167064 -2409881 -1675031 -932767 -159445 656395 1509168 2375950 3224869 4031037
34622 4031037 4790759 5523023 6256318 7010942 7789793 8581754 9371350 10146088 10898097
34613 10898097 11621988 12312417 12963476 13569604 14125664 14624325 15052530 15391559 15622840
34604 15622840 15736066 15734170 15633322 15460408 15250107 15040606 14865897 14745442 14675623 14628354
34594 14628354 14559438 14423601 14188511 13840500 13380707 12816680 12155891 11404118 10567581
34585 10567581 9656393 8687477 7686124 6686230 5729518 4863579 4138032 3598665 3280729
34576 3280729 3202653 3360403 3722577 4228096 4790100 5308290 5687439 5855192 5771597 5427531
34566 5427531 4836482 4028006 3047620 1960028 847829 -199042 -1100466 -1802235 -2284865
34557 -2284865 -2563867 -2684184 -2711198 -2718207 -2769954 -2905783 -3129858 -3413521 -3706906 -3951815
34547 -3951815 -4091256 -4077927 -3885280 -3519080 -3022192 -2466907 -1935650 -1496772 -1184164 -987986
34537 -987986 -859798 -730151 -532290 -223859 200464 709245 1246264 1748409 2162143 2453835
34527 2453835 2613116 2650270 2589210 2458721 2285941 2094551 1905571 1736086 1594079 1473630
34517 1473630 1356987 1225411 1073560 919022 801209 768991 860921 1085076 1407388 1755753
$$ [...]
##END NTUPLES=NMR SPECTRUM
##END=
