##TITLE=31Pdec_DE-46H_DEK
 D2O, 64 sc
 10.10.2024
##JCAMPDX= 6.0         $$ Bruker NMR JCAMP-DX V2.0
##DATA TYPE= NMR SPECTRUM
##DATA CLASS= NTUPLES
##ORIGIN= UXNMR, Bruker Analytische Messtechnik GmbH
##OWNER= root
$$ XWIN-NMR		Version 3.5
$$ Thu Oct 10 14:47:36 2024 Russian Standard Time (UT+4h)  she@DPX200
##.OBSERVE FREQUENCY= 81.013821
##.OBSERVE NUCLEUS= ^31P
##.ACQUISITION MODE= SIMULTANEOUS
##.ACQUISITION SCHEME= undefined
##.AVERAGES= 64
##.DIGITISER RES= 17
##SPECTROMETER/DATA SYSTEM= spect
##.PULSE SEQUENCE= zgpg30
##.SOLVENT NAME= CDCl3
##.SHIFT REFERENCE= (INTERNAL, CDCl3, 0, 198.062)
##AUDIT TRAIL= $$ (NUMBER, WHEN, WHO, WHERE, WHAT)
$$ ##TITLE= Audit trail, XWIN-NMR		Version 3.5
$$ ##JCAMPDX= 5.01
$$ ##ORIGIN= Bruker BioSpin GmbH
$$ ##OWNER= she
$$ F:/spectra/data/she/nmr/P31/2/pdata/1/auditp.txt
$$ ##AUDIT TRAIL=  $$ (NUMBER, WHEN, WHO, WHERE, WHAT)
(   1,<2024-10-10 14:46:02.51 +0400>,<she>,<DPX200>,
      <created by zg, POWCHK disabled, PULCHK disabled
       configuration hash MD5:
       00 E9 B6 7A A2 85 ED C7 34 08 36 98 17 FE 4E 26
       data hash MD5: 32K
       4A F3 38 2D AF 2C 8A 90 25 2B D1 20 63 8C 8F A5>)
(   2,<2024-10-10 14:46:05.12 +0400>,<she>,<DPX200>,
      <Start of raw data processing
       efp BC_mod = 2 LB = 1.5 FT_mod = 6 PKNL = 1 PHC0 = 2603.091 PHC1 = 119.6875 SI = 64K 
       data hash MD5: 64K
       1F BA 9C BD 61 B7 54 F1 6F B0 BD CD CA 18 C0 E6>)
(   3,<2024-10-10 14:47:07.96 +0400>,<she>,<DPX200>,
      <pk PHC0 = 165.5531 PHC1 = 0 
       data hash MD5: 64K
       BF D6 F0 BA 1A 30 DE ED CA 1B 4D 91 79 D0 48 89>)
$$ ##END=
$$ 
$$ hash MD5
$$ 0C F5 3D 09 AF 21 9C 11 35 73 E6 48 8B 53 2F C4
##$RELAX= 
##$RELAX= 
##$RELAX= 
##$RELAX= 
##$RELAX= 
##$RELAX= 
##$RELAX= 
##$RELAX= 
$$ Bruker specific parameters
$$ --------------------------
##$DU= <F:/spectra>
##$EXPNO= 2
##$NAME= <P31>
##$PROCNO= 1
##$TYPE= <nmr>
##$USER= <she>
##$AMP= (0..31)
100 100 100 100 100 100 100 100 100 100 100 100 100 100 100 100 100 100 
100 100 100 100 100 100 100 100 100 100 100 100 100 100 
##$AQSEQ= 0
##$AQ_mod= 1
##$AUNM= <au_zg>
##$AUTOPOS= <>
##$BF1= 81.014009
##$BF2= 200.13
##$BF3= 200.13
##$BF4= 200.13
##$BF5= 200.13
##$BF6= 200.13
##$BF7= 200.13
##$BF8= 200.13
##$BYTORDA= 1
##$CFDGTYP= 0
##$CFRGTYP= 5
##$CHEMSTR= <none>
##$CNST= (0..31)
1 1 145 1 1 1 1 1 1 1 1 1 1 1 1 1 1 1 1 1 1 1 1 1 1 1 1 1 1 1 1 1 
##$CPDPRG= <waltz16>
##$CPDPRG1= <>
##$CPDPRG2= <waltz16>
##$CPDPRG3= <>
##$CPDPRG4= <mlev>
##$CPDPRG5= <mlev>
##$CPDPRG6= <mlev>
##$CPDPRG7= <mlev>
##$CPDPRG8= <mlev>
##$CPDPRGB= <>
##$CPDPRGT= <>
##$D= (0..31)
0 1 0 0 0 0 0 0 0 0.06 0 0.03 2e-05 3e-06 0 0 0.0002 0 0 0 0 0 0 0 0 0 
0 0 0 0 0 0 
##$DATE= 1728557162
##$DBL= (0..7)
120 120 120 11 120 120 24 19 
##$DBP= (0..7)
150 150 150 150 150 150 150 150 
##$DBP07= 0
##$DBPNAM0= <>
##$DBPNAM1= <>
##$DBPNAM2= <>
##$DBPNAM3= <>
##$DBPNAM4= <>
##$DBPNAM5= <>
##$DBPNAM6= <>
##$DBPNAM7= <>
##$DBPOAL= (0..7)
0.5 0.5 0.5 0.5 0.5 0.5 0.5 0.5 
##$DBPOFFS= (0..7)
$$ [...]
##$SUBNAM3= <"">
##$SUBNAM4= <"">
##$SUBNAM5= <"">
##$SUBNAM6= <"">
##$SUBNAM7= <"">
##$SUBNAM8= <"">
##$SUBNAM9= <"">
##$SW= 400.765351723535
##$SWIBOX= (0..15)
0 1 3 0 0 0 0 0 0 0 0 0 0 0 0 0 
##$SW_h= 32467.5324675325
##$TD= 32768
##$TD0= 1
##$TE= 0
##$TE2= 300
##$TE3= 300
##$TEG= 300
##$TL= (0..7)
0 120 53 12 22 120 120 120 
##$TP= (0..7)
150 150 150 150 150 150 150 150 
##$TP07= 0
##$TPNAME0= <>
##$TPNAME1= <>
##$TPNAME2= <>
##$TPNAME3= <>
##$TPNAME4= <>
##$TPNAME5= <>
##$TPNAME6= <>
##$TPNAME7= <>
##$TPOAL= (0..7)
0.5 0.5 0.5 0.5 0.5 0.5 0.5 0.5 
##$TPOFFS= (0..7)
0 0 0 0 0 0 0 0 
##$TUNHIN= 0
##$TUNHOUT= 0
##$TUNXOUT= 0
##$USERA1= <user>
##$USERA2= <user>
##$USERA3= <user>
##$USERA4= <user>
##$USERA5= <user>
##$V9= 5
##$VALIST= <valist>
##$VCLIST= <CCCCCCCCCCCCCCC>
##$VD= 0
##$VDLIST= <DDDDDDDDDDDDDDD>
##$VPLIST= <PPPPPPPPPPPPPPP>
##$VTLIST= <TTTTTTTTTTTTTTT>
##$WBST= 1024
##$WBSW= 4
##$XGAIN= (0..3)
0 0 0 0 
##$XL= 0
##$YL= 0
##$YMAX_a= 23578
##$YMIN_a= -5344
##$ZGOPTNS= <>
##$ZL1= 120
##$ZL2= 120
##$ZL3= 120
##$ZL4= 120
##$ABSF1= 0
##$ABSF2= 0
##$ABSG= 0
##$ABSL= 0
##$ALPHA= 0
##$AQORDER= 0
##$ASSFAC= 0
##$ASSFACI= 0
##$ASSFACX= 0
##$ASSWID= 0
##$AUNMP= <proc_1d>
##$AZFE= 0.1
##$AZFW= 0.5
##$BCFW= 0
##$BC_mod= 2
##$BYTORDP= 0
##$COROFFS= 0
##$CY= -3
##$DATMOD= 1
##$DC= 0
##$DFILT= <>
##$DTYPP= 0
##$F1P= 0
##$F2P= 0
##$FCOR= 1
##$FTSIZE= 65536
##$FT_mod= 6
##$GAMMA= 0
##$GB= 0
##$INTBC= 1
##$INTSCL= 9.790993e-09
##$ISEN= 30
##$LB= 1.5
##$LEV0= 0
##$LPBIN= 0
##$MAXI= 10000
##$MC2= 0
##$MEAN= 0
##$ME_mod= 0
##$MI= 50
##$NCOEF= 0
##$NC_proc= -8
##$NLEV= 6
##$NOISF1= 182.463
##$NOISF2= 159.3651
##$NSP= 0
##$NTH_PI= 0
##$NZP= 0
##$OFFSET= 198.0616
##$PC= 4
##$PHC0= 2768.644
##$PHC1= 119.6875
##$PH_mod= 1
##$PKNL= yes
##$PPARMOD= 0
##$PSCAL= 0
##$PSIGN= 0
##$REVERSE= no
##$SF= 81.0140089999434
##$SI= 65536
##$SIGF1= 159.3651
##$SIGF2= -187.1042
##$SINO= 113.3802
##$SIOLD= 16384
##$SREGLST= <1H.CDCl3>
##$SSB= 0
##$STSI= 65536
##$STSR= 0
##$SW_p= 32467.5324675325
##$SYMM= 0
##$S_DEV= 0
##$TDeff= 32768
##$TDoff= 0
##$TI= <>
##$TILT= no
##$TM1= 0
##$TM2= 0
##$TOPLEV= 0
##$USERP1= <user>
##$USERP2= <user>
##$USERP3= <user>
##$USERP4= <user>
##$USERP5= <user>
##$WDW= 1
##$XDIM= 65536
##$YMAX_p= 343348127
##$YMIN_p= -110137084
$$ End of Bruker specific parameters
$$ ---------------------------------
##NTUPLES= NMR SPECTRUM
##VAR_NAME=  FREQUENCY,     SPECTRUM/REAL,   SPECTRUM/IMAG
##SYMBOL=    X,             R,               I
##VAR_TYPE=  INDEPENDENT,   DEPENDENT,       DEPENDENT
##VAR_FORM=  AFFN,          ASDF,            ASDF
##VAR_DIM=   65536,         65536,           65536
##UNITS=     HZ,            ARBITRARY UNITS, ARBITRARY UNITS
##FACTOR=    0.49542278885378, 1,            1
##FIRST=     16045.7642231865, 0,            0
##LAST=      -16421.768244346, 0,            0
##MIN=       -16421.768244346, -110137084,   0
##MAX=       16045.7642231865, 343348127,    0
$$ Real data points
##PAGE= N=1
##DATA TABLE= (X++(R..R)), XYDATA
$$ [...]
7484G302037K258122O11761M74761J59047k890999n409408j862220N718627Q445747
7475A4807475K716367m574282n814023k245427J53837j84800m75914J09851l75276
7466D117808k178098l109970k161553l32456J897633M618472O277995M928032
7458A4057863J886353P36911K053590K419460k59486l663822m871205m363393
7450G996271m091628l929064k647777p97159R5464K49862J025990K166725K156221
7441B224905J130772Q35458J345006M99544k237202l772589j315484L248438N400006
7432G358854L705186R16011n72918j515849l097368m125170l064595j058061l36917
7423a790827o90910k50573Q39648O16320q35316j052857M97274J204509n1753
$$ plain form
7484 7302037 9560159 10171920 10646681 10805728 7914729 2505321 643101 6361728 14807475
7475 14807475 17523842 12949560 7135537 4890110 5043947 4859147 4383233 4493084 4117808
7466 4117808 1939710 -1170260 -3331813 -3664269 -1766636 2851836 9129831 14057863
7458 14057863 15944216 16681127 18734717 21154177 20894691 17230869 12359664 7996271
7450 7996271 3904643 -24421 -2672198 -3469357 -3373893 -3124031 -2098041 68684 2224905
7441 2224905 3355677 4191135 5536141 6035685 3798483 25894 -1289590 1958848 7358854
7432 7358854 11064040 11980051 11407133 9891284 6793916 2668746 -395849 -1453910 -1790827
7423 -1790827 -2481737 -2732310 -1892662 -1276342 -2111658 -3164515 -2667241 -1462732 -1514485
7414a514485m74429J942993M361688L153318l88194k336616k305640k784405l454696
7405c800466j488943K330827L325956L07469j887251J66945L165859K713215J95061
7396E028672m45609L91970m27995k213752j173032K723534M930046L031224l58881
7387A1486177k440217l563380m161231k675603Q91513K935942R21673k457056
7379I37818k860110q0579K663087L472280K823476J338736l88507q08691O91394
7370G788904J807996L01670j987532j630418O42530R61344r14801p88787K623280
7361H804186M521959J274148l283524l119100J105775L325333J064466j832694
7353A1860549j785481k45355j81085j285474j253780K33096J404768J321923P33297
$$ plain form
7414 -1514485 -1988914 -45921 4315767 7469085 7080891 4744275 2438635 -345770 -3800466
7405 -3800466 -5289409 -2958582 367374 674843 -1212408 -1045463 2120396 4833611 5028672
7396 5028672 4583063 4975033 4547038 2333286 1160254 3883788 8813834 11845058 11486177
7387 11486177 9045960 5482580 1321349 -1354254 -462741 2473201 3394874 937818
7379 937818 -1922292 -2002871 660216 4132496 6955972 8294708 7906201 7097510 7788904
7370 7788904 9596900 9898570 7911038 6280620 6923150 7884494 6969693 6180906 8804186
7361 8804186 13326145 14600293 11316769 8197669 9303444 12628777 13693243 11860549
7353 11860549 10075068 9829713 9648628 8363154 7109374 7342470 8747238 10069161 10802458
7344A0802458L42305p4686q06419j746688k869546m051042m304822k459573P87910
7335d380103K591091R39324k519965m022300k167472N67226J449547J106128J942445
7326d494079L987502M652113K662651n6506j207581q61207k38299M37676J255178
7317F137448J207479n63472k870191l563668k084655L35766K291888K751013J063112
7308D704720j881374l486778k346618l73615j4177n02472M51099K227699J923995
7299G02479q44156l235214l532734k734863j312519J733977N317478N716111J864837
7290C675396k064646k021502O20900J742842R8856k424594m067853m030434j937781
7281a0408816R95068K194174J448301J929615M824904O046975K130212l497230
$$ plain form
7344 10802458 11144763 11070077 10263658 8516970 5647424 1596382 -2708440 -5168013 -4380103
7335 -4380103 -1789012 -849688 -3369653 -7391953 -9559425 -8992199 -7542652 -6436524 -4494079
7326 -4494079 -506577 4145536 6808187 6751681 5544100 4682893 4444594 4882270 6137448
7317 6137448 7344927 6781455 3911264 347596 -1737059 -1401293 890595 3641608 4704720
7308 4704720 2823346 -663432 -3010050 -3383665 -3397842 -3900314 -3449215 -1221516 702479
7299 702479 -141677 -3376891 -6909625 -9644488 -10957007 -9223030 -3905552 1810559 3675396
7290 3675396 1610750 -410752 210148 1952990 2051846 -372748 -4440601 -8471035 -10408816
7281 -10408816 -9413748 -7219574 -5771273 -3841658 983246 7030221 9160433 5663203
7273E663203m961958k361389k60148L59470K141897M183724K232146k932368m612820
7264e48243k91461M007705L044866p9876l91181M94728j471879m285756k777688
7255b298785K037890L737329N04228k157764r5043L591583L792368N00921k284947
7246G327780k274767p46016N8472o38917j823630j734420L32861K926352L861229
7237G288944K753044J117127P6292o68107j574204k473543l230051l730272l067556
7228c508326m10255K894479L833992J280323k254151l409067j666787N57937Q79362
7219a802493o66867j865001p36245K049527L622821K448037N49508P44009K415628
7210F758924K316010n38975l383576l735600k354507j001765K36665J550378J560868
$$ plain form
7273 5663203 701245 -1660144 -1920292 -1560822 581075 4764799 6996945 4064577 -548243
7264 -548243 -839704 3168001 6212867 6132991 5741810 6236538 4764659 478903 -2298785
7255 -2298785 -260895 3476434 3980662 1822898 1727855 5319438 9111806 9612727 7327780
7246 7327780 5053013 4306997 4365469 3726552 1902922 168502 501363 3427715 7288944
7237 7288944 10041988 11159115 11235407 10567300 8993096 6519553 3289502 -440770 -3508326
7228 -3508326 -3918581 -1024102 2809890 4090213 1836062 -1573005 -3239792 -2681855 -1802493
7219 -1802493 -2469360 -4334361 -5070606 -3021079 601742 3049779 3599287 4343296 6758924
7210 6758924 9074934 8535959 5152383 1416783 -937724 -1939489 -1702824 -152446 1408422
7201A408422n77434k737390k290871j87035L38425j125081j420389J130964L771155
7192a689234L066691l29923k789391k531073j124094l61134J70322J487338K725174
7183a375324J987911o21984k532749j949500l27537k85213j716020j787580R46434
7174g661562M193078M743865K455488L4793m37904P12358K095833K743929K057629
7165A0937507k15904l175309m864157m031314j406115J192407K497444K235789
7157C170348P69241r48499j675933j085914l00669k98844k14361J404858L729660
7148D549887L903902J001766k015520k014970j15169M3774k051389k982593j022984
7139g03296P09250q96553l500272k445034J799091L695206P42152k654524j552216
$$ plain form
7201 1408422 830988 -1906402 -4197273 -4384308 -4045883 -5170964 -6591353 -5460389 -1689234
7192 -1689234 1377457 1047534 -1741857 -4272930 -5397024 -5758158 -5587836 -4100498 -1375324
7183 -1375324 612587 -9397 -2542146 -4491646 -4819183 -5104396 -6820416 -8607996 -7661562
7174 -7661562 -3468484 1275381 3730869 3765662 3327758 4040116 6135949 8879878 10937507
7165 10937507 10721603 7546294 2682137 -1349177 -2755292 -1562885 934559 3170348
7157 3170348 3939589 2991090 1315157 229243 -71426 -370270 -584631 820227 4549887
7148 4549887 8453789 9455555 7440035 5425065 5309896 5353670 3302281 319688 -703296
7139 -703296 5954 -890599 -4390871 -6835905 -5036814 -1341608 -599456 -3253980 -4806196
7130d806196K615192M678416L096295R28517L98808L69246m18774j023311n26730
7121E311463L1435l55484o33518N28455K221699K340007L80876k213051l826125
7112C785757l531776j062379K433019M148338K046776k314703m918486l662364
7104c075818m42750J520566J301636N33586Q92265K222210K993597K084925J6701
7095H046918j514282j328847J34866J421176J355534l11996k705409l778669j606869
7086b87578L034578O221195M749492J51819k965890k530150q74947p04822j623390
7077E170307j901352j496082j297922q83481O38312K341648K365187P89381n55216
7068E170782j143810k285570m014224l831966k30361M055979M596072Q93065k519075
$$ plain form
7130 -4806196 -2191004 2487412 5583707 6512224 6911032 7280278 6861504 5838193 5311463
7121 5311463 5342898 4987414 4353896 4882351 7104050 9444057 9824933 7611882 3785757
7112 3785757 253981 -808398 1624621 5772959 7819735 5505032 586546 -3075818
7104 -3075818 -3518568 -1998002 -696366 -162780 729485 2951695 5945292 8030217 8046918
7095 8046918 6532636 5203789 5338655 6759831 8115365 7803369 5097960 1319291 -287578
7086 -287578 2747000 8968195 13717687 13869506 10903616 8373466 7498519 6793697 5170307
7077 5170307 3268955 1772873 474951 -408530 229782 2571430 4936617 5725998 5170782
7068 5170782 4026972 1741402 -2272822 -6104788 -6335149 -2279170 2316902 3209967 690892
7059F90892j492815K481999M086513J063977k700117k322813J347919K839372
7051E994927k06429l629293k739041J019959K437605Q8956k165708j247949J049677
7042F02704J332115o21181k243030j843397p6217J564453K324141K439791K540514
7033F019893K742800K359463R68967o38194j593079k472713m024800m788636k440523
7024c866822K106519M556194K364596k120423m908042m633191k217607J287078
7016g431698M406778M944046K601178L47540N81591J442409j27728l038160l400856
7007C25100o43144J584634R75216n43224n44841L89116N35815L4175K42026J601480
6997C956353L391234M366318L110656m52779l420591k233453K268607M759258
$$ plain form
7059 690892 -801923 1680076 5766589 6830566 4130449 1807636 3155555 5994927
7051 5994927 5788498 2159205 -579836 440123 2877728 2966684 800976 -446973 602704
7042 602704 1934819 1313638 -929392 -2772789 -2849006 -1284553 1039588 3479379 6019893
7033 6019893 8762693 11122156 12091123 11452929 9859850 7387137 3362337 -1426299 -3866822
7024 -3866822 -1760303 2795891 5160487 3040064 -1867978 -6501169 -8718776 -7431698
7016 -7431698 -3024920 1919126 4520304 4867844 5449435 6891844 6764116 3725956 325100
7007 325100 -318044 1266590 2241806 1698582 1153741 1542857 2078672 2112847 2354873 3956353
6997 3956353 7347587 11713905 14824561 14371782 10951191 8717738 10986345 15745603
6989A5745603K164446k109609l214151j730256j843486m015616m014890J31522
6981A113563M297307L658776o56217l224116j488983J641500K494410J353477
6973I189717J075860K507249L368746J650020j621725l789531l685291k336698
6965F358347j193191p65523q04052q13764l81208K51398R9111j212358k278613
6956g39853j363443R54130K033822N64686j654918k156506q22309P02414J687280
6947g94697K820086M254298M697604L007266j40742k786708l531303k481075p18638
6938D326091O55706J076709O82776J63692J15400L24770K2483r15939j542446
6929D909242j126980l09483j36828n10017p67145j260541k608182l620586k283995
$$ plain form
6989 15745603 17910049 15800440 12586289 10856033 9012547 4996931 982041 1113563
6981 1113563 5410870 9069646 8413429 5189313 3700330 5341830 7836240 9189717
6973 9189717 10265577 12772826 16141572 17791592 16169867 12380336 8695045 6358347
6965 6358347 5165156 4399633 3595581 2781817 2400609 2652007 2751118 1538760 -739853
6956 -739853 -2103296 -1149166 884656 1449342 -205576 -2362082 -3184391 -2481977 -794697
6947 -794697 2025389 6279687 10977291 13984557 13843815 11057107 7525804 5044729 4326091
6938 4326091 4981797 6058506 6741282 6904974 7020374 7345144 7367627 6451688 4909242
6929 4909242 3782262 3472779 3335951 2825934 2058789 798248 -1809934 -5430520 -7714515
6920g714515P46664K129387M41580j583187j070583R91554J900781J394176J088852
6911a675291J320319J241997R32340R04658O99604L06012J237851L349127K814689
6902A1131306k609077q135924o959953J359M891445L622005J19251j147897j000109
6893h7594j601361j997034q77090L43361M32836Q40110K393561K918513R94213
6884C359515j239900j745222j550745j403263M81966M076338N258169J966452
6876I203310j442111o59230J630356O23518k312911k424525k848N64435j413817
6867C766177k526485j732681j085067n67145J679223M131579K965290j212114
6859E418777l319920j155754K281521M109163M079012J814634k777272o122954
$$ plain form
6920 -7714515 -6967851 -4838464 -4396884 -5980071 -7050654 -6059100 -4158319 -2764143 -1675291
6911 -1675291 -354972 887025 1819365 2724023 3423627 3729639 4967490 8316617 11131306
6902 11131306 8522229 386305 -6573648 -6572289 -1680844 1941161 2060412 912515 -87594
6893 -87594 -1688955 -3685989 -4563079 -4219718 -3786882 -2946772 -553211 2365302 3359515
6884 3359515 2119615 374393 -1176352 -2579615 -2097649 1978689 7236858 9203310
6876 9203310 7761199 7101969 8732325 9355843 7042932 4618407 4615559 5179994 3766177
6867 3766177 1239692 -492989 -1578056 -2145201 -465978 3665601 6630891 5418777
6859 5418777 2098857 943103 3224624 7333787 11412799 13227433 10450161 4327207
6851D327207m085071R47733K315215q43466k604750n58530N43097k027187l817126
6842e802878j178790K498137L156515K421502K641762J632935j965905l683385
6834b80107k9178M407969L547644m28259j100531J566679K208385l95328k351623
6825G145651k310402k870915m343971l755910q10848R90323K24484n63666J44761
6816f150493O65518L2892j66709R64990K238103K977583L574491L170405N15263
6807G822043k713078l435049k152659k100610l243364k092991J619699L406385
6799b889624J088647j502423n64188K167816K949225J470887l14349j692020k411251
6790a697280j192085J782729L258254J055222k091243k022312J073854L453872
$$ plain form
6851 4327207 242136 1189869 3505084 2661618 56868 -501662 41435 -1985752 -5802878
6842 -5802878 -6981668 -4483531 -1327016 1094486 3736248 5369183 3403278 -280107
6834 -280107 -309285 4098684 7646328 7218069 6117538 7684217 9892602 9497274 7145651
6825 7145651 4835249 1964334 -2379637 -6135547 -6946395 -5956072 -5731588 -6295254 -6150493
6816 -6150493 -5484975 -5452083 -5618792 -4653802 -2415699 561884 4136375 7306780 7822043
6807 7822043 5108965 1673916 -478743 -2579353 -5822717 -7915708 -6296009 -2889624
6799 -2889624 -1800977 -3303400 -3867588 -1699772 1249453 2720340 2405991 713971 -1697280
6790 -1697280 -2889365 -1106636 2151618 3206840 1115597 -906715 167139 3621011
6782C621011L096992J168379p91093k086370j838792L02187K424710J918185q64003
6773F951206k618243j282877J533312K957981K225824P21957l57998j172900k149528
6764F808734k741975k076673o01152M1667p05547j293681l77928R73215J007387
6755A034047K38486M18173J177732N08476j366189j714844K35668J564489Q789
6746B104827k482214k585238l1829K883198M553077M621857K712328r04094m093783
6737F778129m640451l045855j730895j631990j377308L2404J399825R39912j166946
6728d443175k707270j950310K62600J635397J662850K399743M920110O605445
6720H385390M386656k99684l088066k996921l199218m761745m276471j57615L166321
$$ plain form
6782 3621011 6718003 7886382 7095289 5008919 3170127 3472314 5897024 7815209 6951206
6773 6951206 4332963 3050086 4583398 7541379 9767203 10489160 10131162 8958262 6808734
6764 6808734 4066759 1990086 1388934 1430601 725054 -568627 -946555 26660 1034047
6755 1034047 1272533 1690706 2868438 3376914 2010725 295881 531549 2096038 2104827
6746 2104827 -377387 -2962625 -2994454 -111256 4441821 9063678 11776006 10871912 6778129
6737 6778129 2137678 -908177 -2639072 -4271062 -5648370 -5615966 -4216141 -3276229 -4443175
6728 -4443175 -7150445 -9100755 -8838155 -7202758 -5539908 -3140165 1779945 8385390
6720 8385390 12772046 12472362 9384296 6387375 3188157 -1573588 -5850059 -6007674 -2841353
6711b841353J503726j976523j107395L589704N318908J092146m007735m176696
6703b605218j43369L273726L577094J797549m65380k274833k662900j167366J135138
6694D64441K658252L085721K980949K205789K31885k127161k878084j324369O62972
6685E960395P59229r16583k077602j496586p52661j838153l852903l740626m19986
6676h375476L462310M653551K809556j31135k738539m613555m989899k949698
6668a2872885P50257L670767M170012L003758J978778J694456J149051o83323
6660B860871l246563m550087l179605q2752K288969K728315K250211K022365J634531
6651B726255L62945j095483j642926j663578k152937k505385j168293J480579
$$ plain form
6711 -2841353 -1337627 -3314150 -4421545 -831841 4487067 5579213 1571478 -2605218
6703 -2605218 -2748587 525139 4102233 5899782 5434402 3159569 496669 -670697 464441
6694 464441 3122693 6208414 9189363 11395152 11627037 9499876 6621792 5297423 5960395
6685 5960395 6719624 5803041 3725439 2228853 1476192 -361961 -4214864 -7955490 -8375476
6676 -8375476 -4913166 -259615 2549941 2418806 -319733 -4933288 -9923187 -12872885
6668 -12872885 -12122628 -8451861 -4281849 -1278091 700687 2395143 3544194 2860871
6660 2860871 -385692 -4935779 -8115384 -8198136 -5909167 -3180852 -930641 1091724 2726255
6651 2726255 3089200 1993717 350791 -1312787 -3465724 -5971109 -7139402 -5658823
6643e658823K926824J865558J30649J81982J737659K250677M32110j882330j840717
6634A43589R28041L657645L603445J297709k90176L11753J410017R82408l18931
6625A1725500m18197Q72177J595221N50561j133200j694705r64613m23611j486118
6616H623015l829472n268923l784606o9061K729323K506990N42415o20923n15256
6607C13502m45772p87255o65359l2132M3253o62478j116878q76921n79684k39424
6597e049148J047306L024855L779247K376411M13174k58847Q5785K77462M18548
6588F114793J009674J027724q19500l293666l493441r32981J438047J300555Q5767
6579B436972L44052J581643J250215p72395j695914l16955R78945K88541m59225
$$ plain form
6643 -5658823 -2731999 -866441 -735792 -553810 1183849 3434526 3866636 1984306 143589
6634 143589 1071630 4729275 8332720 9630429 9340253 9652006 11062023 12044431 11725500
6625 11725500 11307303 12179480 13774701 14325262 13192062 11497357 10532744 10109133 8623015
6616 8623015 4793543 -475380 -4259986 -4329047 -1599724 907266 1449681 828758 313502
6607 313502 -132270 -919525 -1584884 -1617016 -1573763 -2236241 -3353119 -4230040 -4809724 -5049148
6597 -5049148 -4001842 -976987 2802260 5178671 5591845 5332998 5418783 5696245 6114793
6588 6114793 7124467 8152191 7332691 4039025 545584 -387397 1050650 2351205 2436972
6579 2436972 2781024 4362667 5612882 4840487 3144573 2827618 3806563 4095104 3635879
6570C635879J135134L348444K675492l73182j892491q53267l67395j779075k018932
6561C510607R03856L786445K861639n31171k435955j937988o53101J122174L485945
6552A0112451L955577K93524m483485m850182o34234K487335R96922k325849l394641
6543B157418j893340J59113J362019Q93489j236640k549204j20005M368028N366145
6534H507023J108665l418887l660283j706558j968287m104746m450153k072465
6526a1765691Q32715K970801M391120M163154J544609j289207j357758P30119
6518B19862J806245J026748L08159K87048m76083k064088k453439q77838R57869
6509a265517J625274J318347J64574j918955l260328j481556K547340M768838
$$ plain form
6570 3635879 4771013 8119457 10794949 10421767 8529276 7676009 7308614 5529539 3510607
6561 3510607 4414463 8200908 11062547 10531376 8095421 6157433 5504332 6626506 10112451
6552 10112451 14068028 14361552 9878067 5027885 4393651 6880986 7877908 5552059 2157418
6543 2157418 264078 423191 1785210 2678699 1442059 -1107145 -1227150 3140878 8507023
6534 8507023 9615688 6196801 2536518 829960 -1138327 -5243073 -9693226 -11765691
6526 -11765691 -10932976 -7962175 -3571055 592099 2136708 847501 -510257 219862
6518 219862 2026107 3052855 3361014 3648062 3171979 1107891 -1345548 -2223386 -1265517
6509 -1265517 359757 1678104 1842678 -76277 -3336605 -4818161 -2270821 2498017
6501B498017L183768L24220q17911n97045p84404j372503j376163q61548k12054
6492a5623R47418K334128K279898K98111j369255q84669J06347j078510l870772
6483a252927n105528l204644M61361L628980M542542K344766j556903l456417
6475c598770j307259K103315K748741J143105R19948K328078J873640r75756j975759
6466C259283P71279K835736L84522l039710j788397K578545L282424j193336m665835
6457B424511k384050K486972L804332K51339m216395n211454j321445N057018
6449H90828Q747275O027602o51952m630782l070479l7896O9941j622771k028641
6440C693125j584193j872835r89800L221318P284621N582230p82135m670994l022577
$$ plain form
6501 2498017 5681785 6006005 5188094 4591049 3806645 2434142 1057979 196431 -15623
6492 -15623 931795 3265923 5545821 5843932 4474677 3590008 3696355 2617845 -1252927
6483 -1252927 -6358455 -9563099 -9101738 -5472758 -930216 1414550 -142353 -3598770
6475 -3598770 -4906029 -2802714 -53973 1089132 2009080 4337158 6210798 5235042 3259283
6466 3259283 4030562 6866298 7250820 4211110 2422713 5001258 8283682 7090346 2424511
6457 2424511 40461 2527433 6331765 6583104 2366709 -2844745 -4166190 890828
6449 890828 9638103 15665705 15013753 10382971 7312492 7274596 7344537 5721766 3693125
6440 3693125 2108932 236097 -753703 2467615 9752236 15334466 14552331 9881337 6858760
6431F858760l55001o65974j736477m68174J228500O3508k702946l337032j368490
6422b483326O67203J557307J845629J180196j232997m108671n045138l721463
6414a1341260j689732M75975L238668N600210N227589J654155k365390l355277
6406b555062l97505L823576M988661J376454l370692l663285Q95812M391578K385155
6397G874692k192762l872398k446421j677106k280130j440154J292449K937923
6389a803907K498672K525114L971735M102107J550410p32036k70192Q47154j21470
6380A2567587j641380o78446J735302J807773j117586l768732l901868k727899
6372B274751j984942j481078m85644O73294J506529K169359K388617J194057j051012
$$ plain form
6431 6858760 6503759 5837785 4101308 3633134 4861634 4925142 2222196 -1114836 -2483326
6422 -2483326 -1816123 -258816 1586813 2767009 1534012 -2574659 -7619797 -11341260
6414 -11341260 -13030992 -12555017 -9316349 -3716139 1511450 3165605 800215 -2555062
6406 -2555062 -2952567 871009 5859670 7236124 3865432 202147 1097959 5489537 7874692
6397 7874692 5681930 1809532 -636889 -2313995 -4594125 -6034279 -4741830 -1803907
6389 -1803907 694765 3219879 7191614 11293721 12844131 12112095 11841903 12689057 12567587
6380 12567587 10926207 10247761 11983063 13790836 12673250 8904518 5002650 2274751
6372 2274751 289809 -1191269 -1676913 -1003619 502910 2672269 5060886 6254943 5203931
6363E203931j838362M32324L412743L040487r82130m042243k186910K604328M646862
6354A0291030J557050l099231m587177k434682K07561J158485J170845J707803
6346E971684K624193K604855R53632j595750l531933l879509k959890j700237
6338a512955l88440J088214J883174O38957k064625l395961j698386J203247K639813
6329a606962K573618K509888K398617J230486k64698n20579k96665j713994m015820
6320B93891l738961p0398L245889L080262J167124Q41116J766543R37757k142188
6311E381035m374336l382284n67875J116233R77302P81724J616988K085546M56214
6302D090547k243362k941606n43547K491089L537344L090186L053647L261389
$$ plain form
6363 5203931 3365569 3797893 7210636 10251123 9268993 5226750 3039840 5644168 10291030
6354 10291030 11848080 8748849 4161672 1726990 1934551 3093036 4263881 5971684
6346 5971684 8595877 11200732 12154364 10558614 7026681 3147172 187282 -1512955
6338 -1512955 -1901395 -813181 1069993 1708950 -355675 -3751636 -5450022 -4246775 -1606962
6329 -1606962 966656 3476544 5875161 7105647 6840949 6320370 6023705 4309711 293891
6320 293891 -3445070 -3515468 -269579 2810683 3977807 4818923 6585466 7523223 5381035
6311 5381035 1006699 -2375585 -2943460 -1827227 -849925 -68201 1548787 3634333 4090547
6302 4090547 1847185 -1094421 -1637968 853121 4390465 7480651 10534298 13795687
6294A3795687K042538n92013k820419l715737l778941l116672j537057j97166
6286H0220m66972j234823k43986J826791J934027j77428j044587J015238L066679
6277D755159K259810K03400L0742J595034K414508J609633K03194j223921k765115
6268I082444l954495m169698l464962j828233R58889L596039L498848M57588k096467
6259B079953j591056K4542m06121k278607k576810p00294J223821J915573J841836
6250d67163J226739K4620n92839N83938K493901L143015K712220K723885K703682
6241A4551998P33266k751496m827532m253310l019638k949633l152800j878643
6233g547788R96238M261324O601629O851636M554853J070318j089352p97673N26060
$$ plain form
6294 13795687 15838225 15246212 12425793 8710056 4931115 1814443 277386 80220
6286 80220 -386752 -1621575 -1865561 -38770 1895257 1717829 673242 1688480 4755159
6277 4755159 7014969 7218369 7249111 8844145 11258653 12868286 13071480 11847559 9082444
6268 9082444 5127949 958251 -2506711 -4334944 -3376055 219984 3718832 4176420 2079953
6259 2079953 488897 513439 107318 -2171289 -4748099 -5448393 -4224572 -2308999 -467163
6250 -467163 759576 784196 191357 775295 3269196 6412211 9124431 11848316 14551998
6241 14551998 15285264 12533768 7706236 3452926 433288 -2516345 -5669145 -7547788
6233 -7547788 -6551550 -2290226 4311403 11163039 15717892 16788210 15698858 14901185 15427245
6224A5427245O21092j314070l920652m736580k508065Q77162J767748r04937l938657
6215A370286l966057j717956q3729N44168J960438L993465M117424J490150j588902
6206F119287k943922k771096j932843l86580J638689K784684K029943r8035k239252
6197B200875l102009j848629Q87626K631027J568201p30130j120162O74522J750756
6188B912077M43672j284188p34635J954994M026996K981777r31222m459907m330365
6179E79199j338691J78990j579775k931264o36498K177817P01756l170125l249548
6170i268139R60354L520537J944820P04121K659223M002183J553776j131159J5168
6161D960884K347877J240602j878784k303418j06187O32185j073783k472547k435611
$$ plain form
6224 15427245 16048337 14734267 10813615 6077035 3568970 4446132 6213880 5308943 1370286
6215 1370286 -2595771 -4313727 -4397456 -3853288 -1892850 2100615 6218039 7708189 6119287
6206 6119287 3175365 404269 -1528574 -1915154 -276465 2508219 4538162 4440127 2200875
6197 2200875 -901134 -2749763 -1862137 768890 2337091 1606961 486799 1161321 2912077
6188 2912077 3355749 2071561 1336926 3291920 7318916 10300693 9369471 4909564 579199
6179 579199 -759492 -580502 -2160277 -5091541 -5728039 -3550222 -2848466 -6018591 -9268139
6170 -9268139 -8307785 -4787248 -2842428 -2138307 520916 4523099 6076875 4945716 4960884
6161 4960884 7308761 8549363 6670579 4367161 4260974 4893159 3819376 1346829 -1088782
6152a088782k130303j129283J844692M575273L034966k094290n336242l769581
6144f093550l09071J293717Q18720j42630o34346J66927K607090M579470L124229
6135E410556q73547k894007j007055J481395J258618n10630j153574q08967q96904
6126E885p10043J190621L602548L790676J382668j301036k518178k702561k899687
6117a59107l217797k970018j465806J156354L421416L618788J971474O00827O31753
6108C587884Q02417J1626n59042K75116R23621p81350l457252l389651q8919K462935
6098b12615J368789j029346p51724J871437K824677N46151j665320n17349K363889
6089D798589K651215o18947l821719l806139j778850q49774j509692j640329k17256
$$ plain form
6152 -1088782 -3219085 -4348368 -2503676 2071597 5106563 3012273 -2323969 -6093550
6144 -6093550 -6402621 -5108904 -4290184 -4432814 -5067160 -4900233 -2293143 2286327 5410556
6135 5410556 4537009 1643002 635947 2117342 3375960 2865330 1711756 902789 5885
6126 5885 -704158 486463 4089011 7879687 9262355 7961319 5443141 2740580 -159107
6117 -159107 -3376904 -6346922 -7812728 -6656374 -3234958 383830 2355304 2956131 3587884
6108 3587884 4390301 4401927 3842885 4118001 5041622 4260272 803020 -2586631 -2675550 -212615
6098 -212615 1156174 126828 -624896 1246541 4071218 4617369 2952049 2434700 4798589
6089 4798589 7449804 6830857 3009138 -797001 -2575851 -3425625 -4935317 -6575646 -6792902
6080f792902J314386J559041J083472R66389R09023L5717j228378j356492L42904
6071c166840K780949M063446L040466K17086k395676k740929p26975J453109J743449
6062D268085P61356R16395K902818M331641K719936j028921l468221k745572o06873
6053H050644o470j844234m586712o099449n124929j893130J731667L404821K611158
6044c756634J229664R34426J022231J04886j211965j347919o11589n85543j047573
6035e270016k71696J558855K284020J653365J967862L599794L338222n21997m445871
6026C892538m053062j24004K920838K970781J504811R8099j093155j851310j731218
6017B534318j186914p65314R7703J459702J488007o27146k015768Q6094L269769
$$ plain form
6080 -6792902 -5478516 -3919475 -2836003 -1869614 -960591 -924874 -2153252 -3509744 -3166840
6071 -3166840 -385891 3677555 6718021 6935107 4539431 1798502 1071527 2524636 4268085
6062 4268085 5029441 5945836 8848654 13180295 15900231 14871310 11403089 8657517 8050644
6053 8050644 8044174 6199940 1613228 -4486221 -9611150 -11504280 -9772613 -6367792 -3756634
6044 -3756634 -2526970 -1592544 -570313 -465427 -1677392 -3025311 -3636900 -4222443 -5270016
6035 -5270016 -5541712 -3982857 -1698837 -45472 1922390 5522184 8860406 8338409 3892538
6026 3892538 -160524 -284528 2636310 5607091 7111902 7210001 6116846 4265536 2534318
6017 2534318 1347404 582090 679793 2139495 3627502 3000356 984588 1070682 4340451
6008D340451K969207k60151j419287R00040K503113Q56219r17510K33900K184844
5999A1390826J520384j145575l182517m180854m642863l230056P26454M108394
5991A364193L542357O30306l25939J247166K128746J072609L36001J101489J392565
5982A2489493k29596k171107k613881k243415k411005k574943j511755J86799
5974a079410P01403l95122j489927r24302J123411K909877L011015J720478L82026
5965E959449m29460j240905k095992j927184k86298J483175J892608J074985j98935
5956D231443j922369l705289l655551o73266L056079M279984K758277O83118j198141
5947C854285l708910n759501m567796l30811K848619K445025Q57331J073487J816037
$$ plain form
6008 4340451 7309658 7049507 5630220 6530260 9033373 9889592 8972082 9205982 11390826
5999 11390826 12911210 11765635 8583118 4402264 -240599 -3470655 -2744201 1364193
5991 1364193 4906550 5536856 5210917 6458083 8586829 9659438 9995439 11096928 12489493
5982 12489493 12259897 10088790 7474909 5231494 2820489 245546 -1266209 -1079410
5974 -1079410 -378007 -773129 -2263056 -3187358 -2063947 845930 3856945 5577423 5959449
5965 5959449 5529989 4289084 2193092 265908 -20390 1462785 3355393 4430378 4231443
5956 4231443 2309074 -1396215 -5051766 -5725032 -2668953 1611031 4369308 5052426 3854285
5947 3854285 145375 -5614126 -10181922 -10512733 -7664114 -5219089 -4361758 -3288271 -1472234
5938a472234R2907l306455m404468j592315K388444M200433L378808J655712N74248
5929A515080L38460L9889j103964k157780r20197K820044N571011L849288q77534
5920I074297l508582j800282J048483J185457j039657k722997k896339k927237
5912c586857l384433k990999q10576K281407M643036N194201L675100Q93964j161187
5903D753656q83702Q81902J659560O70049k22592L11334P74556n93427k453860
5894D897476k065272K97522J480393L18434n33973J028502K908655J781097j976357
5885H136477m934992n217248l736585j418306J636602L888965K627196j879185
5877h97076n091038l294999J756388N477340O136239N319675M023953J734045
$$ plain form
5938 -1472234 -1379327 -4685782 -9090250 -10682565 -8294121 -4093688 -714880 940832 1515080
5929 1515080 1853540 1893429 789465 -1368315 -2288512 531532 6102543 9951831 9074297
5920 9074297 5565715 3765433 4813916 5999373 4959716 2236719 -659620 -3586857
5912 -3586857 -6971290 -9962289 -10772865 -8491458 -3848422 1345779 5020879 5914843 4753656
5903 4753656 3869954 4751856 6411416 7081465 6858873 7170207 7944763 7351336 4897476
5894 4897476 2832204 3129726 4610119 4928553 4394580 5423082 8331737 10112834 8136477
5885 8136477 3201485 -2015763 -5752348 -7170654 -5534052 -1645087 982109 -897076
5877 -897076 -5988114 -9283113 -7526725 -2049385 4086854 9406529 13430482 15164527
5869A5164527o86141p17620J946948L939255K370544j457337m246959m938955
5861A1374262m692201l993614k400826o86522n63500j833946k071159j50150J701390
5852c316266Q46787j957697l463679k175907J00378J242412J665008K968765M713647
5843F23448M466579J382507j946776k452507l64632J512060J590811N97353q03060
5834D605783k847301m525621l435758M53805L337176K381102j2972M7191J538207
5825A541612J20049m201816n843601j599938M299768N837658K915597J76582J37742
5816C383653J081164R84160J21140o72372j763983l628975n301410m960669j899317
5807a2656609K303769M818460M365377K710408K167268K061700L8045l026375
$$ plain form
5869 15164527 14478386 13760766 15707714 19646969 22017513 20560176 16313217 11374262
5861 11374262 6682061 2688447 287621 -398901 -962401 -2796347 -4867506 -5017656 -3316266
5852 -3316266 -2469479 -4427176 -7890855 -10066762 -9966384 -8723972 -7058964 -4090199 623448
5843 623448 5090027 6472534 4525758 2073251 1708619 3220679 4811490 5408843 4605783
5834 4605783 1758482 -2767139 -6202897 -5749092 -2411916 -30814 -43786 3405 1541612
5825 1541612 1661661 -2540155 -8383756 -9983694 -5683926 153732 3069329 3245911 3383653
5816 3383653 4464817 5448977 5570117 4897745 3133762 -495213 -5796623 -10757292 -12656609
5807 -12656609 -10352840 -5534380 -1169003 1541405 3708673 5770373 5808418 2782043
5799B782043k959136J191908M259769J854425k777210l156437J024922L925394
5791F145678K373166n52778j489773j416240k292006l050629j774714O74546J851608
5782D68858J071347l03612p85195J35745J567114J436551j093815l305761j665144
5773b473912K681703M508375J770947j440214j266979M07066J9368j457264p28483
5764B020607J522238J425451j546828l330470j260239K101536K438753j092436
5756B278612n166910n764668k101443K278417L017662J91044j681822j02180J619674
5747e431614j86795k998053j554054L468273N689948K432347j373288p30688K393294
5738A709370K814366j61334k549366j780883M45386J298094L17118q24169p23256
$$ plain form
5799 2782043 -177093 1014815 5274584 7129009 4351799 1195362 2220284 6145678
5791 6145678 8518844 7966066 6476293 5060053 2768047 -282582 -2057296 -1382750 468858
5782 468858 1540205 1236593 451398 587143 2154257 3590808 2496993 -808768 -2473912
5773 -2473912 207791 4716166 6487113 5046899 3779920 4186986 4206354 2749090 2020607
5764 2020607 3542845 4968296 3421468 90998 -1169241 932295 3371048 2278612
5756 2278612 -2888298 -8652966 -10754409 -8475992 -5458330 -5267286 -6949108 -7051288 -5431614
5747 -5431614 -5618409 -8616462 -10170516 -6702243 -1012295 1420052 46764 -683924 1709370
5738 1709370 4523736 4362402 1813036 32153 477539 1775633 2092751 1268582 545326
5729E45326L17518J006645Q63513P60897J298544J550527O16907m58547j90323
5720F311007N45802l57264k449012k880452q49858J030256R44471O26032K101984
5711E022966M077710L810870R29031k684691n430126o527308n402712k559898
5703h764158Q784J047257J537084K413081K466506O85151j036141m06076J284796
5694g63716R97134r15366j039434J435652L021316J078091k336374l486632j639238
5685c648567J005804K399887K015992L99117j140998j259587j01278P42635M85459
5676H98464P8644J48141k52926j494653j763611L50304K990569L202088J211719
5667E368739o1355M39582N80075j201107l285845l207010p11323K712914N647139
$$ plain form
5729 545326 862844 1869489 2733002 3493899 4792443 6342970 6959877 6501330 6311007
5720 6311007 6856809 6499545 4050533 1170081 320223 1350479 2294950 2920982 5022966
5711 5022966 9100676 12911546 13840577 11155886 5725760 -801548 -6204260 -8764158
5703 -8764158 -8755374 -7708117 -6171033 -3757952 -1291446 -606295 -1642436 -2048512 -763716
5694 -763716 233418 -681948 -1721382 -285730 2735586 3813677 1477303 -2009329 -3648567
5685 -3648567 -2642763 -242876 1773116 2172233 1031235 -228352 -329630 413005 898464
5676 898464 977108 1125249 872323 -622330 -2385941 -2035637 954932 4157020 5368739
5667 5368739 5307384 5746966 6327041 5125934 1840089 -1366921 -2078244 634670 6281809
5658F281809O693900M402351o11528m604693m288502j181718L1004k290916m668568
5649b36861l622333n06417P73749p09506k310282k203173j450107r99625N97646
5640a0666909M403311P837633P171069K868908n71332p89160n47001k661440m728785
5631B316294k506303K746502M843390J365640k472722j159639L225963M262229
5623A2621354M84087l024110k306047L72658O47947j827338l803479l295578j610695
5614a741201r32410j589413k017787q04473J443062K529134J443807R5510R61320
5605f12451L422631M411728K818735R26616O95713J038314K75796q63084q11108
5596A1302890j65691p65791k612828l830747l269224j467870N42888J981057K389689
$$ plain form
5658 6281809 12975709 17378060 16766532 12161839 7873337 6691619 6722623 4431707 -236861
5649 -236861 -3859194 -4365611 -3591862 -4301368 -6611650 -8814823 -10264930 -11264555 -10666909
5640 -10666909 -6263598 1574035 8745104 11614012 11042680 10253520 9706519 7045079 2316294
5631 2316294 -190009 2556493 7399883 8765523 6292801 5133162 8359125 12621354
5623 12621354 13105441 10081331 7775284 8147942 8795889 6968551 3165072 -130506 -1741201
5614 -1741201 -2673611 -4263024 -6280811 -7085284 -5642222 -3113088 -1669281 -1573771 -612451
5605 -612451 2810180 7221908 10040643 10967259 11662972 12701286 12977082 12113998 11302890
5596 11302890 11137199 10371408 7758580 3927833 658609 -809261 -266373 1714684 4104373
5587D104373K183387K333870K494329R16879k267379l668656j098102K245420
5579G244121J443779l115871o066201m361485n89097J596046J733936R70130m69415
5570a614057k207409k692697j419757k10038k86920N1253K583173N559516N600381
5561E363445K488493l79613l32820J628812K517392P83726k200765l493032j584399
5552D791239J585842K382696j55751k842153k398849J72115J185420l99559j737728
5543B583272o42654J072266N27926j505793j403749J917915M949848M138814N83846
5534A2221691j825993j756813j244775j503364j092768P73170K083855J230648
5526H885651J7683Q40534K495183J791260j512343m342378m627857l292521j862105
$$ plain form
5587 4104373 6287760 8621630 11115959 12032838 9765459 6096803 4998701 7244121
5579 7244121 8687900 5572029 -494172 -4855657 -5444754 -3848708 -2114772 -1144642 -1614057
5570 -1614057 -3821466 -6514163 -7933920 -8143958 -8430878 -8379625 -5796452 -236936 5363445
5561 5363445 7851938 7472325 7139505 8768317 11285709 12069435 9868670 6375638 4791239
5552 4791239 6377081 8759777 8604026 5761873 3363024 3535139 4720559 4321000 2583272
5543 2583272 1940618 3012884 3540810 2035017 631268 2549183 7499031 11637845 12221691
5534 12221691 10395698 8638885 7394110 5890746 4797978 5571148 7655003 8885651
5526 8885651 8903334 9743868 12239051 14030311 12517968 8175590 3547733 255212 -1606893
5517a606893n75736O43376J312873J081930J32700j021757j272324M63610L040037
5508B197816L290047M75631j727970o32620P39875j357833m257924k683847J928105
5499b028720L167865M66002O078L407464M271087l85859l835696n52136M139358
5490H655443K809850j777496j885839K032735K989882m3262j078702J690346K860967
5481A6253924n10376m266649m646425l509445l163819k090979Q07560K965399
5473A839190K723888K622383M508925N429609K312147k580886m869764m141385
5465G844107l000090k132707k14174K428949L519487J933387j094983l444827
5457E839149l485550j146267J229532P80764j910756k924583n23509K097056J677907
$$ plain form
5517 -1606893 -2182629 -1539253 -226380 855550 988250 -33507 -1305831 -842221 2197816
5508 2197816 5487863 5963494 4235524 3602904 4342779 2984946 -1272978 -3956825 -2028720
5499 -2028720 1139145 1605147 1611225 5018689 9289776 8903917 5068221 4516085 8655443
5490 8655443 11465293 9687797 7801958 9834693 12824575 12781313 11702611 13392957 16253924
5481 16253924 15743548 11476899 6830474 3321029 157210 -1933769 -1126209 1839190
5473 1839190 4563078 7185461 11694386 17123995 19436142 16855256 11985492 7844107
5465 7844107 4844017 2711310 2497136 4926085 8445572 10378959 9283976 5839149
5457 5839149 2353599 1207332 2436864 3217628 1306872 -1617711 -2141220 -44164 1633743
5448A633743l55155r55975o06105j576096l009457k140682N40997J750186Q28268
5439c890276M80712J767066K503210J554155O80062O52522m70520k973374l219098
5430b915541R27766N429297M931015M47429k159558n55336J688588J322561l86991
5421H729230j128068j328149k037803k025617j338K253787K078065O611j262987
5412E283731j035427p36474n47474O83387K133310J075311k861983o472577p154684
5403i632880n634345l340037L247M277175P137632O832259M997439M152540L916316
5394A2709346K284613n11173k180352j873115j004719o64124l24598O00074J513403
5385A0549355J404130M4930j696963k483594j877729j081592j311695j700030
$$ plain form
5448 1633743 1278588 322613 -283492 -1859588 -4869045 -7009727 -6468730 -4718544 -3890276
5439 -3890276 -3409564 -1642498 860712 2414867 3094929 3747451 3276931 303557 -2915541
5430 -2915541 -1987775 3441522 8372537 8819966 6660408 6105072 7793660 9116221 8729230
5421 8729230 7601162 6273013 4235210 2209593 2208255 4462042 6540107 6546718 5283731
5412 5283731 4248304 3511830 2964356 3647743 5781053 6856364 3994381 -2478196 -9632880
5403 -9632880 -15267225 -18607262 -18604015 -14326840 -7189208 -356949 4640490 8793030 12709346
5394 12709346 14993959 14482786 12302434 10429319 9424600 8760476 8435878 9035952 10549355
5385 10549355 11953485 11998415 10301452 7817858 5940129 4858537 3546842 1846812
5377A846812o57868Q49378K19500k137603k545573K14053K628639J971442K58358
5368B647138m9709k69845j768620k004495R94353L700798K079000j478841k168971
5359A680808r93882k066493l831984j042179N132383P355593L357033j098834
5351H492445k157977k824903n239246n774396j945141K431632L478689K894105
5343f44792L014664K014336j132367k464978O04036L653632J930515j697709j755322
5334C522015P64716J143308m03110n2276J772840J226041j379777j873460J82887
5325D903184Q61744r09079j833338p16532l76508j762977j905612L39288J747280
5316C47450M03176p08050J256987M157110M288641J864970j4171K8747P50348
$$ plain form
5377 1846812 1188944 2038322 2257822 120219 -2425354 -2211301 417338 2388780 2647138
5368 2647138 2597429 2327584 558964 -1445531 -451178 3249620 5328620 3849779 1680808
5359 1680808 686926 -1379567 -5211551 -6253730 -1121347 6234246 9591279 8492445
5351 8492445 6334468 3509565 -1729681 -7504077 -9449218 -7017586 -3538897 -644792
5343 -644792 2369872 4384208 3251841 786863 1390899 5044531 6975046 5277337 3522015
5334 3522015 4286731 5430039 5026929 4974653 6747493 7973534 6593757 4720297 4903184
5325 4903184 5764928 4855849 3022511 2305979 1929471 166494 -1739118 -1399830 347450
5316 347450 750626 42576 1299563 5456673 9745314 11610284 11596113 11624860 12375208
5307A2375208P62782k20006j852022l405931m081393l815193l199111k474577
5299e910243j556133q48278o93371k69592J363858L346161L807494K335837O2875
5290A638608k103595l471048k710443M82364L562759L764997K037233J395420
5282D596295J978053J371718l95217m91889J434064K046944n0156j688892m44852
5273H356068J266356M09127j625698j789177o77900j032115k468562j947007Q46375
5264A337467K526712J186800o75147r338K233731K575329Q9954k236328j701168
5255E328012K57098J02532k419312l358935j24888M211859M674047J200258j516450
5246H354221q15792Q79901P50748k28315k532M70818j037546l795994m827116
$$ plain form
5307 12375208 13137990 12917984 11065962 7660031 3578638 -236555 -3435666 -5910243
5299 -5910243 -7466376 -8314654 -9008025 -9277617 -7913759 -4567598 -760104 1575733 1638608
5290 1638608 -464987 -3936035 -6646478 -6164114 -2601355 1163642 3200875 4596295
5282 4596295 6574348 7946066 7550849 7058960 8493024 10539968 10489812 8800920 8356068
5273 8356068 9622424 10031551 8405853 6616676 5938776 4906661 2438099 491092 1337467
5264 1337467 3864179 5050979 4375832 4366494 6600225 9175554 9265508 7029180 5328012
5255 5328012 5585110 5687642 3268330 -90605 -215493 3996366 8670413 9870671 8354221
5246 8354221 7538429 8418330 9169078 8940763 8938231 9409049 8371503 4575509 -251607
5237b51607l242594j013626M22670J590260K691053K559170R18595n29933p13154
5228B430834j018491k654958l735049j697539J902598K239774k095254n958096
5220a0586181l548124L987809R551355Q401902K981662r86422r82207Q62245J227619
5211A0909658r01100l596567m068056j751109P55294P79451q58706j218314J06354
5202A56905M72734j123625k088332n69362J388963J550984J501971L543245N773930
5193A0607413M455188K22358k378785j518444j47974o86038j498573m51595J101123
5184I704673M41717k111201l430588j711552J464316L310075K831251J078159
5176A1576850q63083k886287m504428l961541n82907K693122J914999k300268
$$ plain form
5237 -251607 -3494201 -4507827 -4085157 -2494897 196156 2755326 3673921 3143988 2430834
5228 2430834 1412343 -1242615 -4977664 -6675203 -4772605 -2532831 -4628085 -10586181
5220 -10586181 -14134305 -10146496 -595141 7806761 10788423 9802001 8819794 9682039 10909658
5211 10909658 10008558 6411991 2343935 592826 1348120 2127571 1268865 50551 156905
5202 156905 629639 -493986 -2582318 -3151680 -1762717 -211733 1290238 4833483 10607413
5193 10607413 15062601 15284959 12906174 11387730 11239756 10553718 9055145 8603550 9704673
5184 9704673 10146390 8035189 4604601 2893049 4357365 7667440 10498691 11576850
5176 11576850 10713767 7827480 3323052 -638489 -1221396 1471726 3386725 1086457
5168A086457m682230k062695K593894M704227L759162K036193L34065j727075
5160F041998l132999k682637j452739r77490l61436J739493L874367L920702K839348
5151I808607K621147K147385o28061l749372l359496n4818J729024M64784j099211
5142G879989j260592j141985r26078O21570K253458R90476k239930k878119k0796
5133C277993J777009j31302k475423j918063n2616M81064N23062J624248K427686
5124E533658J320292k38642j99213P80863J135504R49756M86984r87140k704611
5115F077451j905593J625346L738624J490819k429888l769046k328759n18887
5107A980067Q44574J938341J678295l49175j698079k56282J948058J335578k013595
$$ plain form
5168 1086457 -3595773 -5658468 -3064574 1639653 5398815 7435008 7769073 6041998
5160 6041998 2908999 226362 -1226377 -2203867 -2565303 -825810 3048557 6969259 9808607
5151 9808607 12429754 14577139 13949078 10199706 6840210 6785392 8514416 8979200 7879989
5142 7879989 6619397 5477412 4551334 5172904 7426362 8416838 6176908 3298789 3277993
5133 3277993 5055002 4923700 2448277 530214 477598 958662 1481724 3105972 5533658
5124 5533658 6853950 6615308 6416095 7196958 8332462 9282218 9769202 8782062 6077451
5115 6077451 4171858 5797204 9535828 11026647 8596759 4827713 2498954 1980067
5107 1980067 2824641 4762982 6441277 6092102 4394023 4137741 6085799 7421377 5407782
5098E407782m464904l207102J385717O418672Q048767M408198j532452m364632
5090A2100046k862042j179230j940292k210216Q56379M418713M051675M32990
5082A3668023k276696k496222j738177r96996l56733n23728j374514p57179K059413
5073E207191L837952J738610j837029k466012N3843K352898K671812J753946J80962
5064A3494173j595752k090848r92022p48673k688805l864917j550793J628422
5056A590785J557224o42879q16758J081834J566358K47124J67865J745384J895454
5047H392391k55716j780967j034966Q6181J16832L09397J603562K641142K162274
5038A2240130P41155q36042k601524m144552m399332l166746j239137Q37258K587834
$$ plain form
5098 5407782 942878 -2264224 -878507 5540165 13588932 17997130 16464678 12100046
5090 12100046 9238004 8058774 6118482 3908266 4764645 9183358 13235033 13668023
5082 13668023 11391327 8895105 7156928 6159932 5803199 5279471 3904957 3147778 5207191
5073 5207191 9045143 10783753 8946724 6480712 6534555 8887453 11559265 13313211 13494173
5064 13494173 11898421 9807573 8815551 8066878 5378073 1513156 -37637 1590785
5056 1590785 3148009 2505130 1688372 2770206 4336564 4583688 4751553 6496937 8392391
5047 8392391 8136675 6355708 5320742 5406923 5523755 5833152 7436714 10077856 12240130
5038 12240130 12981285 12145243 9543719 5399167 999835 -2166911 -3406048 -2568790 19044
5029A9044K977151J781203O02203O23890O78231m21952j359835n82649P17688
5020E034974O55745m4730L88280J684666K737051L798478M663600L247405p59156
5011B1406313l682515l061727j972907l837980o159200m634561n94785J509064
5003a028298J590469K682660M263302L406142J086043O35597J085794j064782
4995A2656927m320772l717398L41489K124919q0220j783352l68178J464457J541098
4986G858970J038580K66100k018650l962291j862912K628153L359756n64669k851219
4977C891818r8394L149407K408055l46316j901745l242281n419669n253745j1800
4968f824670P198216J0778750Q851917L550596k021837n060121m264398j555795
$$ plain form
5029 19044 2996195 4777398 5379601 6003491 6681722 6259770 4899935 4317286 5034974
5020 5034974 5690719 5645989 6034269 7718935 10455986 14254464 18918064 22165469 21406313
5011 21406313 17723798 14662071 12689164 8851184 2691984 -1942577 -2537362 -1028298
5003 -1028298 562171 3244831 7508133 10914275 12000318 12635915 13721709 12656927
4995 12656927 8336155 4618757 4960246 7085165 7004945 5221593 4853415 6317872 7858970
4986 7858970 8897550 9163650 7145000 3182709 1319797 3947950 7307706 6743037 3891818
4977 3891818 3793424 6942831 9350886 9004570 7102825 3860544 -1559125 -6812870 -6824670
4968 -6824670 373546 11152296 20004213 23554809 21532972 16472851 12208453 10652658
4960A0652658o3299J00719R28822J886027P22567j445801j325376K77362n49178
4951A1184501l166879k517381J904211M264148J681090j474196j208408N29792
4943A1196878P80493R4235o97190k458020l852523j376728L985291O140867K902578
4934A6715881k92630J113481M278033M398870J553080j261915k566423k290207
4926B1648170j127534j291573l805785n271890k591396M86915j273311m384859
4918B388737j185861O303142Q207691K983653l68020J832594K699147j123959
4910B1737124l136316J66168K532814K7626j842806P28077K888349J412926O22940
4901B5136902K156365O60617m401807n121680O69326M685443L437462L714440
$$ plain form
4960 10652658 10589359 10690078 11618900 13504927 14227494 12781693 11456317 11733679 11184501
4951 11184501 8017622 5500241 7404452 11668600 13349690 11875494 10667086 11196878
4943 11196878 11977371 12071606 11374416 8916396 5063873 3687145 7672436 13813303 16715881
4934 16715881 16423251 17536732 21814765 26213635 27766715 26504800 23938377 21648170
4926 21648170 20520636 19229063 15423278 10151388 7559992 8046907 6773596 2388737
4918 2388737 1202876 7506018 15713709 18697362 18329342 20161936 22861083 21737124
4910 21737124 18600808 18766976 21299790 21327416 19484610 20212687 23101036 24513962 25136902
4901 25136902 27293267 27953884 23552077 18430397 19099723 23785166 27222628 30937068
4893C0937068O974408M838819k843957l798085M370860P515296L14537l564425
4885D4744521J966412L243458m733985n103686Q002114J3703463L593774K665225
4877F8081296K2407956L1937384J5941631J8431526O8305559R7943398K0299377
4870C43348127j24635181j93097791j23332180j2420059K6370541L093578n612741
4863h6285706J5134761K1563013L033224o641070L575066Q385313j052998l888946
4855d6177343O751393J1379319K129209m525063l47532K261356k255313k544225
4847c3328199M594208O366795p55112l144340M226437P819964N62438n235995
4839a8893804l57808N886313L872955l23520J321152M304522K285721q04506o5277
$$ plain form
4893 30937068 37911476 42750295 39906338 36108253 40479113 47994409 48308946 44744521
4885 44744521 46710933 49954391 45220406 40116720 48118834 61822297 65416071 68081296
4877 68081296 90489252 122426636 138368267 156799793 225105352 323048750 343348127
4870 343348127 218712946 25615155 -97717025 -110137084 -83766543 -80672965 -86285706
4863 -86285706 -71150945 -49587932 -46554708 -53195778 -49620712 -41235399 -42288397 -46177343
4855 -46177343 -39425950 -28046631 -25917422 -30442485 -30790017 -28528661 -30783974 -33328199
4847 -33328199 -28733991 -22367196 -23122308 -26266648 -22040211 -14220247 -13657809 -18893804
4839 -18893804 -19251612 -13365299 -9492344 -9815864 -8494712 -4190190 -1904469 -2708975 -2774252
4830b774252L52481l533742o431536l193511J543486J579073r18855j159809j1516
4821a4548181J61844R79214L337749L788418Q77473j243585j0686J241959M7245
4812e368550r10583J49286Q08204M81279K242980N396975M311671j675396n515631
4803g9765l623209j227449k097757j952778K187848M825035J157140m046758m121369
4794h979062p13190R04900J000469K493302L757668J679340j768775k598000j338939
4785e562287q19000o44832P14688J591213J60914j213331K35054K412771J748184
4776a376626q29052j854200p77807O23199J636519J748093m76025l936074l998608
4767i240581R50092N610302M863554J031629q48947j184122l318965n917113m567900
$$ plain form
4830 -2774252 -2421771 -5955513 -12387049 -15580560 -14037074 -12458001 -13376856 -14536665 -14548181
4821 -14548181 -14386337 -13407123 -10069374 -6280956 -5403483 -6647068 -6657754 -5415795 -5368550
4812 -5368550 -6279133 -6129847 -5321643 -4840364 -2597384 2799591 7111262 5435866 -79765
4803 -79765 -3702974 -4930423 -7028180 -8980958 -6793110 -1968075 -810935 -4857693 -8979062
4794 -8979062 -9692252 -8787352 -7786883 -5293581 -1535913 143427 -1625348 -4223348 -5562287
4785 -5562287 -6381287 -7026119 -6311431 -4720218 -4559304 -5772635 -5537581 -3124810 -1376626
4776 -1376626 -2205678 -4059878 -4837685 -4214486 -2577967 -829874 -1305899 -5241973 -9240581
4767 -9240581 -8290489 -2680187 2183367 3214996 2366049 1181927 -2137038 -8054151 -12622051
4758a2622051L72190L747992L092415R49031j60521l98565r0061J261111K904790
4749i43669L111051J865217O50111k62512j636045k738621j838735O85677K193844
4740A086318J098527j415124l152394l091246j826377p27477n15766m63133L30680
4731h675992J191976R30282K22232O33376J538681R76105m93389l76256J040409
4722c012576Q09561j049841r20011J776317K584959n12418k827335j98007L985653
4713F36302L864767k02174l151526k941772j743335j073896m60954M157j85640
4704e254071J053J566489K922476J961581n19943k392794l616162m920126m761173
4695a5012670j297393L655652O144850M950431K201450J83349J09738K477987
$$ plain form
4758 -12622051 -12249861 -8501869 -5409454 -4460423 -4620944 -5019509 -5109570 -3848459 -943669
4749 -943669 2167382 4032599 4682710 4420198 2784153 45532 -1793203 -1107526 1086318
4740 1086318 2184845 769721 -2382673 -5473919 -7300296 -8027773 -8543539 -9006672 -8675992
4731 -8675992 -7484016 -6553734 -6331502 -5698126 -4159445 -3183340 -3676729 -4052985 -3012576
4722 -3012576 -2203015 -3252856 -4172867 -2396550 188409 -324009 -3151344 -3349351 636302
4713 636302 4501069 4298895 1147369 -1794403 -3537738 -4611634 -5072588 -5068431 -5254071
4704 -5254071 -5253018 -3686529 -764053 1197528 677585 -1715209 -5331371 -10251497 -15012670
4695 -15012670 -16310063 -12654411 -6509561 -1559130 642320 825669 935407 3413394
4687C413394N647282N688903R76955m489015n677372k998951p37124n62148o00743
4678F61181J11009M49318J12885L2512J65455J24252J245781M467861O956492
4669A4326746M927657m52481m061410l787620k508374k749702l416786k851569
4661e73539j589451p13207k44093k24410r57598j525994n65583J052521J025861
4652d315493m39892m45699K039307M310210L786421J248276r66664j782125j310979
4643B123362p1680O45605m25654k373718k598878l36888K172244K835299J988330
4634C958022O11406j438680l866072m615677k259453J396870L101878K098848
4626a012858O21581N53858J117374M92333j198859j753805N1770K400697K665905
$$ plain form
4687 3413394 9060676 14749579 15726534 11237519 5560147 2561196 1824072 1261924 661181
4678 661181 772190 1221508 1334393 1366905 1532360 1656612 2902393 7370254 14326746
4669 14326746 19254403 18801922 14740512 10952892 8444518 5694816 2278030 -573539
4661 -573539 -2162990 -2876197 -3120290 -3344700 -4302298 -5828292 -6393875 -5341354 -4315493
4652 -4315493 -4755385 -5201084 -3161777 1148433 4934854 6183130 5216466 3434341 2123362
4643 2123362 2051682 2697287 2271633 -102085 -2700963 -3037851 -865607 1969692 3958022
4634 3958022 4569428 3130748 -735324 -5351001 -7610454 -6213584 -3111706 -1012858
4626 -1012858 -391277 162581 1279955 1772288 573429 -1180376 -1128606 1272091 3937996
4617C937996J096731L04190R73577O68683j895169m026844k848188J38595J260337
4608c90092R9067o19314R9277K85476j108201k305266j610140K66032J725332
4599c557829K098864J232203p21957k332714j699028Q02847K311097J031679j479943
4590b314781k530825j434236M73098J717582J626217L75298r73746j156948n9470
4581d277811J130913J362446O83621k13788n75489J63907J675845K479221J630435
4572D059300L85330N04174J056670p65898m971276p302305m245121K031351N912538
4563c335237M884708J741948K10259M68093J22088j790434l666675l984707l212741
4554h562698k336997j036371J171517K961157K414474L3707j437666n11084J522468
$$ plain form
4617 3937996 5034727 5338917 6312494 6981177 5086008 1059164 -1789024 -1650429 -390092
4608 -390092 -291025 -910339 -811062 -525586 -1633787 -3939053 -5549193 -5283161 -3557829
4599 -3557829 -1458965 -226762 -948719 -3281433 -4980461 -4177614 -1866517 -834838 -2314781
4590 -2314781 -4845606 -6279842 -5806744 -4089162 -2462945 -2087647 -3061393 -4218341 -4277811
4581 -4277811 -3146898 -1784452 -1100831 -1314619 -1890108 -1726201 -50356 2428865 4059300
4572 4059300 4444630 4948804 6005474 5239576 268300 -7034005 -11279126 -9247775 -3335237
4563 -3335237 1549471 3291419 3501678 3969771 4091859 2301425 -1365250 -5349957 -8562698
4554 -8562698 -10899695 -11936066 -10764549 -7803392 -5388918 -5355211 -6792877 -7303961 -5781493
4545e781493K984477L783889M198658L613301J765671k24611j331501j860327
4537G148064k183503j739672m95951J70808m72517j036025j94699R87269O90345
4528B874119q16795j767864j481855p17591j77153q6600n37509r94669k68097
4519c974014J903158M080429M791356L928089J969470n61675k293486j851681
4511G991646m37527j072947m043398n866855m396504j903958j000451p14410O60023
4502a0784381J956029J645850J120460J926999K389609P66443p59535O79594L711704
4493B652772N157044M977878M451679K185550k748395o231673l925892R86863
4485G505826J570364k284425m098124j555750M22803j285627l005182j063424
$$ plain form
4545 -5781493 -2797016 986873 5185531 8798832 10564503 10339892 9008391 7148064
4537 7148064 4964561 3224889 2728938 2899746 2427229 1391204 1196505 2183774 2874119
4528 2874119 2057324 289460 -1192395 -1909986 -2087139 -2173739 -2711248 -3705917 -3974014
4519 -3974014 -2070856 2009573 6800929 10729018 12698488 12136813 9843327 7991646
4511 7991646 7554119 6481172 2437774 -3429081 -7825585 -9729543 -10729994 -11444404 -10784381
4502 -10784381 -8828352 -7182502 -6062042 -4135043 -1745434 -978991 -1738526 -1058932 2652772
4493 2652772 7809816 12787694 17239373 19424923 16676528 10444855 6518963 7505826
4485 7505826 9076190 6791765 2693641 1137891 1560694 275067 -2730115 -3793539
4477c793539K222586K708007K82104k307030l143275j682550J256294K834390
4469a623013Q54297k326654k363015M26123J636494K37859j42573J733733K551190
4460I84441J081865O81761K518765K501027j522517n151317m060379l32095J797811
4451a500638J930753J405179j78134k364826k332114O9074N13897k467605l708059
4442h632473J27442L879276J897340k381341k098197J946641L720414K243390
4434G02492J239091Q26055j911834n327337m745040j265363n97351k732864j470101
4425a5282252M226978P151622L348629j265521m03243L084688K784679j111941
4417B533639l146551j053838K437965M445601M150811J493465k478253m748316
$$ plain form
4477 -3793539 -1570953 1137054 1419158 -887872 -4031147 -5713697 -4457403 -1623013
4469 -1623013 -768716 -3095370 -5458385 -5032262 -3395768 -3157909 -3300482 -1566749 984441
4460 984441 2066306 2748067 5266832 7767859 6245342 1094025 -2966354 -3298449 -1500638
4451 -1500638 430115 1835294 1657160 -707666 -3039780 -2970706 -2456809 -4924414 -8632473
4442 -8632473 -8505031 -4625755 -2728415 -5109756 -7207953 -5261312 -1540898 702492
4434 702492 1941583 2767638 855804 -4471533 -9216573 -10481936 -11079287 -13812151 -15282252
4425 -15282252 -11055274 -3903652 -555023 -1820544 -2223787 860901 3645580 2533639
4417 2533639 -612912 -1666750 771215 5216816 9367627 10861092 8382839 3634523
4409C634523l093897O99745K844769K172674N97067k54487n47855p60271q05855
4400D486413p37893q71130j119131j123397q56428m59441N9603M89033N34484
4391D02113O76811J735887L001013K399700k87139k020343k35410L176874M017351
4382A2866857J445999j126876j201460n80452k042554m605689m630072j065387
4374i39634K897008L916525K227974J94018j131555k145290k431704p70775K387082
4365D203649M445716L586688R87390p21837l87343R80387J746917J158921l18428
4356A5682060j676051k428139k838956k821241j446027J284740K950679J049043
4348I756108l149023n246783k923757J368295L776236L283872J413207m99279
$$ plain form
4409 3634523 540626 1240371 4085140 6257814 6854881 6600394 6052539 5292268 4486413
4400 4486413 3748520 2877390 1758259 634862 -221566 -681007 -621404 -132371 402113
4391 402113 1078924 2814811 5815824 8215524 7928385 5908042 5672632 8849506 12866857
4382 12866857 14312856 13185980 11984520 11404068 9361514 4755825 125753 -939634
4374 -939634 1957374 5873899 8101873 8295891 7164336 5019046 2587342 1816567 4203649
4365 4203649 8649365 12236053 13223443 12501606 12114263 13094650 14841567 16000488 15682060
4356 15682060 14006009 11577870 8738914 5917673 4471646 5756386 8707065 9756108
4348 9756108 6607085 1360302 -1563455 -195160 3581076 6864948 8278155 7778876
4340G778876j898630k020602l88634J819097K432982P77631j199657q16349K261760
4331H746474N167816M802298J657189p13610n82056k92627k028037l804186k775784
4322A0177477n30642p68332k719246j996773J716105L223965k20630m364679m047509
4313D69736O0565L686242M638907L455613J280390k23834M61565J834511K17844
4304A5881539m204979n908451j727026L643460L840842n63102m003703l874402
4296C084178j943350J52080K109433K929440J948109R24412J437823J623189p06702
4287A1558612l379209k661080O25726K383427J635701R53911J184810O17462p59149
4278A2160211r51349j92043r31530l023158l265039o63297J851421K075549J261155
$$ plain form
4340 7778876 5880246 3859644 3471010 5290107 7723089 8500720 7301063 6484714 8746474
4331 8746474 13914290 18716588 20373777 19660167 19078111 18785484 16757447 12953261 10177477
4322 10177477 9646835 8878503 6159257 4162484 5878589 9102554 8881924 4517245 469736
4313 469736 530301 4216543 8855450 12311063 13591453 13367619 13829184 15663695 15881539
4304 15881539 11676560 5768109 4041083 7684543 11525385 10962283 6958580 3084178
4296 3084178 1140828 1292908 3402341 6331781 8279890 9204302 10642125 12265314 11558612
4287 11558612 8179403 5518323 6144049 8527476 10163177 11117088 12301898 12919360 12160211
4278 12160211 11208862 11016819 10085289 7062131 3797092 3133795 4985216 7060765 8321920
4269H321920J005581P44069l02784j408938j683157r77871Q08588K974850K942368
4260A2424626q59341n223719n047818l60176L378549K789583M53597r2358O18136
4251H081079J93518j390199k346633j971861r21520Q0611M35247j58912q06032
4242A195298j04107J559489J994884K25578k067766k884460k187307j077394j02567
4233c448352O97674J141905J206642J338869J809468K072350J225196p58812k380044
4224B904896j934260j11062p1005l179010n876528l774038J846456N451833N014327
4215B71609L721170L486580K325771j99747r42290O67667N08254k576211l352571
4206C910232Q61710M284060J748224k354627j475222K098040J898952j379185
$$ plain form
4269 8321920 9327501 10071570 9768786 8359848 6676691 5698820 6507408 9482258 12424626
4260 12424626 11565285 6341566 1293748 933572 4312121 7101704 7555301 7462943 8081079
4251 8081079 8274597 6884398 4537765 2565904 1644384 1724995 2160242 2001330 1195298
4242 1195298 1091191 2650680 4645564 4871142 2803376 -81084 -2268391 -3345785 -3448352
4233 -3448352 -2750678 -1608773 -402131 936738 2746206 4818556 6043752 5284940 2904896
4224 2904896 970636 859574 788569 -2390441 -8266969 -12041007 -10194551 -4742718 271609
4215 271609 3992779 7479359 9805130 9605383 8663093 9330760 9839014 7262803 3910232
4206 3910232 4771942 9056002 10804226 8449599 6974377 9072417 10971369 9592184
4198I592184k050491J92546Q73963n97451j257032j501488l466915m675188j701760
4189d591632K062002J110460j992940n74898M051417M624749O59370j455687l23472
4180C569369p07681k980802k266777J390796K529687N35460K01712J877847J495164
4171E644775P0742K022646M683044J688420l915452l351702J720555J460397l933925
4162F089500m463219O56020J791143j819089m82714N803206N942645j09005K34303
4153A3642790P175884O201389l290454m115849N735747O775945l937325l311117
4145B4877010J2714125J5235790k88230J1354159O9004782J05128794M6248269
4138B84274699o9362281j26537264q3020695j3908140N243169j0146611r378590
$$ plain form
4198 9592184 7541693 7734239 8608202 8010751 6753719 5252231 1785316 -2889872 -4591632
4189 -4591632 -2529630 -1419170 -3412110 -3987008 64409 4689158 5348528 3892841 3569369
4180 3569369 2861688 -119114 -2385891 -995095 1534592 2070052 2271764 4149611 5644775
4171 5644775 5715517 7738163 12421207 14109627 10194175 6842473 8563028 10023425 6089500
4162 6089500 1626281 2282301 4073444 2254355 1771641 7574847 13517492 13408487 13642790
4153 13642790 20818674 27020063 23729609 19613760 25349507 32125452 28188127 24877010
4145 24877010 37591135 52826925 52538695 63892854 132897636 238026430 284274699
4138 284274699 214912418 88375154 5354459 -8553681 -3310512 -13457123 -22835713
4131b2835713P712012R293829m061259n906262N452319Q258050q66699m494492
4123g448215J259523K630998l358112m547215J926812N083566J427532k73938
4115c299049K596737K255554k896194m532676l13580J755195j602777l171460
4107i208250J335959N889521M621392J08659k741794l248424k406681m97250O39629
4098e507239j252283m299285m324124j264666J331003K302922K967890K732576
4090g313206N16417j100041O68177K944011J205076k641055l026989K3851J572142
4081g151617N45431N60211K452449K997340J212058k79653l13599j78782K8925
4072a27237R20031Q03636j540153k774073M75009M918480M900630J544622M72165
$$ plain form
4131 -22835713 -15123701 -5829872 -9891131 -15797393 -10345074 -2087024 -2953723 -7448215
4123 -7448215 -6188692 -3557694 -6915806 -11463021 -9536209 -4452643 -3025111 -3299049
4115 -3299049 -702312 1553242 -1342952 -5875628 -6189208 -4434013 -6036790 -9208250
4107 -9208250 -7872291 -1982770 2638622 2747281 5487 -3242937 -5649618 -6146868 -5507239
4098 -5507239 -6759522 -11058807 -15382931 -16647597 -15316594 -13013672 -10045782 -7313206
4090 -7313206 -6796789 -7896830 -7228653 -4284642 -3079566 -5720621 -8747610 -8723759 -7151617
4081 -7151617 -6606186 -6045975 -3593526 -596186 615872 336219 22620 -156162 -127237
4072 -127237 792794 1596430 56277 -2717796 -2242787 2675693 7576323 9120945 9593110
4063I593110J912623R75205k825175m461590k304680m72091j144704j581392j95746
4054e04440Q94909Q18563J373865K262323Q30609k248486k907803m64147J282270
4045A337663O98305J68656M55482m49944j794156k15970K993010K045889l414686
4036A824249n911099j382156M018157L220348j521579l339038j191793M45050
4028c837861m37264j333940j8829K818530N190429N362685K715450r73199k468736
4019G017265r62366O52744j49676k185120k872212j831097l74006Q31747J803665
4010A930944K230014J787225N80509j202490k905017k919993n62087J878417J491147
4001B308669r37771j790845J08177K115123J986104M25946j052368j839097j363271
$$ plain form
4063 9593110 11505733 12480938 9655763 5194173 2889493 2417402 1272698 -308694 -504440
4054 -504440 390469 1209032 2582897 4845220 5675829 3427343 519540 55393 1337663
4045 1337663 2035968 2204624 2660106 2210162 416006 200036 3193046 5238935 1824249
4036 1824249 -4086850 -5469006 -1450849 1769499 247920 -3091118 -4282911 -3837861
4028 -3837861 -4275125 -5609065 -5627894 -2809364 2381065 7743750 10459200 9486001 7017265
4019 7017265 6054899 6707643 6557967 4372847 1500635 -330462 -704468 127279 1930944
4010 1930944 4160958 5948183 6528692 5326202 2421185 -498808 -1060895 817522 2308669
4001 2308669 1370898 -419947 -311770 1803353 3789457 4215403 3163035 1323938 -39333
3992c9333N21337J993364J159219m74801J29202K281790K302675j66553j195365
3983F511535J015780L282518K625326J26798k129715l880381m591140k718657
3975B42064P21486J826873n38410k562940j421496N11963K33886r08397k09307
3966b104278J626041K223303J457056M40955r53463k584621k556160l16932J154658
3957a613441n84436l401782l725453j598186N24014J919019L198286L593013K125764
3948D36798J79712k56775K61039O8207m21694P3682O58578m10377k365625k999336
3938d775791k307894k073226k397035j585336P58159L121375M445840M882065
3930F8157M407715K746492M67880j553618l304883m656244m152432r15190K902004
$$ plain form
3992 -39333 482004 2475368 3634587 3159786 3288988 5570778 7873453 7706900 6511535
3983 6511535 7527315 10809833 13435159 13561957 11432242 7551861 2960721 242064
3975 242064 963550 2790423 2252013 -310927 -1732423 -1220460 -986574 -1894971 -2104278
3966 -2104278 -478237 1745066 3202122 3643077 2689614 104993 -2451167 -2768099 -1613441
3957 -1613441 -2197877 -5599659 -9325112 -10923298 -10399284 -8480265 -5281979 -1688966 436798
3948 436798 616510 359735 620774 688981 267287 340969 999547 589170 -1776455 -4775791
3938 -4775791 -7083685 -9156911 -11553946 -13139282 -12381123 -9259748 -4813908 68157
3930 68157 4475872 7222364 7690244 6136626 2831743 -1824501 -5976933 -6892123 -3990119
3921c990119L910791J672422q30901r38350J060645L009979L153885J231723j546728
3912F733347l401020l398050j959035m8040J386379J400970L735q93155N39759
3903C64890K899331K916303N58594l76197J775784L344337O88439m021716n699787
3894B449978l212216r1192M40949j761691m926004o427449l684778K899995Q370048
3885e942360P646444J675784l386846l390198l01602J333500m4758k039153j791633
3876f240822N56878K010833L61759k776228l725898j429217J440799K414412K044732
3867e342752J831949J663066R06884J13259m0592J54297O35247J814198K524954
3858D260510N50762l140936m010421l51917L223099K100056j573820k562768m22112
$$ plain form
3921 -3990119 -79328 1593094 762193 -176157 884488 3894467 7048352 8280075 6733347
3912 6733347 3332327 -65723 -2024758 -2072798 -686419 714551 718286 -174869 364890
3903 364890 3264221 6180524 6739118 6362921 8138705 11483042 12171481 8149765 2449978
3894 2449978 -762238 -853430 -412481 -2174172 -7100176 -13527625 -17212403 -14312408 -5942360
3885 -5942360 1704084 3379868 -6978 -3397176 -3698778 -2365278 -2410036 -4449189 -6240822
3876 -6240822 -5683944 -3673111 -3311352 -6087580 -9813478 -11242695 -9801896 -7387484 -5342752
3867 -5342752 -3510803 -1847737 -940853 -827594 -868186 -713889 -78642 1735556 4260510
3858 4260510 4811272 1670336 -2340085 -2692002 531097 2631153 1057333 -1505435 -1927547
3849a927547J077390N91974P9863m7066j344906k910619j652320K148877M155786
3840A71432K289277l15777m58193O55323M60898k98372J056989M396741O009083
3831A3967401K861877l393869p392006n615160p22617J458704l10544r50853K908016
3822B810949O693298L961986l616333p896991n351889r01691K21851q52518l44984
3813e276322K012257L507534K507040m56846l741007n078993k986435R59768L262843
3804e290161K961834K545344L394131L384831R11231j744407j892294r98870k395882
3795H75757n621640o461594k718450K702119N301066L992953J588694R32218J634949
3786B226072J270189n72330j111266J500369M371840K908053k560379o223229
$$ plain form
3849 -1927547 -850157 -258183 -178320 -225386 -1570292 -4480911 -6133231 -3984354 171432
3840 171432 2460709 2144932 1686739 2342062 2802960 2504588 3561577 7958318 13967401
3831 13967401 16829278 13435409 6043403 428243 -294374 1164330 853786 -97067 2810949
3822 2810949 9504247 13466233 9849900 1952909 -3398980 -4300671 -4078820 -4931338 -5276322
3813 -5276322 -3264065 243469 2750509 2293663 -1447344 -6526337 -9512772 -8553004 -5290161
3804 -5290161 -2328327 217017 3611148 6995979 7907210 6162803 4270509 3271639 875757
3795 875757 -4745883 -11207477 -13925927 -11223808 -5922742 -1929789 -341095 591123 2226072
3786 2226072 3496261 2923931 1812665 3313034 7684874 10592927 8032548 1809319
3778A809319l970816J349876L703403J257702k146563k341625K61066J650126
3770A572488o70194m437959n173431j731518K224968L119076J977542K069336
3762a049692L589008L744865J582013o31844j240026j357980k220974k962706
3754e47336k301319m42616J714785L461412L679127J453104j860491l235745j595636
3745C25285J050972K758747L705714M297606L743814J860837M5382r40507j971730
3736A4876120l004175k056298J278383L621935J702441l037197o141002n403608
3728A836599k306842Q16314K754024K959971J248952j589458l828720l839945
3720a949105j293349K042501L132603P94832k249238k437527k98149M50024j036925
$$ plain form
3778 1809319 -2161497 -811621 2891782 4149484 2002921 -338704 -77638 1572488
3770 1572488 902294 -3535665 -8709096 -10440614 -8215646 -5096570 -3119028 -1049692
3762 -1049692 2539316 6284181 7866194 7234350 5994324 4636344 2415370 -547336
3754 -547336 -2848655 -3291271 -1576486 1884926 5564053 7017157 5156666 1920921 325285
3745 325285 1376257 4135004 7840718 12138324 15882138 17742975 17788357 16847850 14876120
3736 14876120 11871945 9815647 11094030 14715965 16418406 13381209 7240207 1836599
3728 1836599 -470243 346071 3100095 6060066 7309018 5719560 1890840 -1949105
3720 -1949105 -3242454 -1199953 1932650 2727482 478244 -1959283 -2257432 -1807408 -2844333
3711b844333j192276K001968N217614M550383J006280j963240l782379n755608
3703b761591o667425l950825J144379L819644K029055p64179n16956K135969L358569
3694b173360J503050r20429p64495J520481K460986M93489j482442l21039K061221
3685B377462J065499l092397m666507p00318M283020M875446K251205R50353J229931
3676H573694k64485l800904n825539m642503k131339L82171L410779N746927M186531
3667E635332j384749o280086o523040l319304k36804J366048K057867J955431
3659f729305J131296P64085J584057K292781J443339j59472q02066o69902j269748
3650b414935k500034k358661P7451K815615K896971k09891l624038l729070j01604
$$ plain form
3711 -2844333 -4036609 -2034641 3182973 7733356 8739636 6776396 2994017 -2761591
3703 -2761591 -9429016 -13379841 -12235462 -8415818 -6386763 -7150942 -7667898 -5531929 -2173360
3694 -2173360 -670310 -1590739 -2355234 -834753 1626233 2119722 637280 316241 2377462
3685 2377462 3442961 350564 -4315943 -5016261 -733241 4142205 6393410 7343763 8573694
3676 8573694 8309209 4508305 -1317234 -5959737 -8091076 -7708905 -4298126 1448801 5635332
3667 5635332 4250583 -2029503 -8552543 -11871847 -12108651 -10742603 -8684736 -6729305
3659 -6729305 -5598009 -4833924 -3249867 -957086 486253 326781 -475285 -1145187 -2414935
3650 -2414935 -4914969 -7273630 -7196179 -4380564 -1483593 -1693484 -5317522 -9046592 -9148196
3641i148196L562904L304130l96369l019697j546856J807671K547975m12542l705105
3632g006085m039694k110397j086518k163510l096361j394656K238285M768156
3624a3890780M654445L394750L024541L507329L486216K475308R88303p46400
3616F893712k586895l279172j280448K680171N299920M089791M17814j968356
3608A0266537j362069R1864m15188k326121k456795K05071K469053J113619k493126
3599E092845m252372k908801q87494J93097J362196K853538K541550r3163j730432
3590B170964N804K170628P14044k734942k781809J525778M953307L482633m13773
3581I092634j881962k95799P97806r69482l808202m184722j031967K952716M244558
$$ plain form
3641 -9148196 -5585292 -2281162 -2677531 -5697228 -7244084 -5436413 -2888438 -3300980 -7006085
3632 -7006085 -11045779 -13156176 -14242694 -16406204 -19502565 -20897221 -18658936 -13890780
3624 -13890780 -9236335 -5841585 -2817044 690285 4176501 6651809 7640112 6893712
3616 6893712 4306817 1027645 -252803 2427368 7727288 11817079 12234893 10266537
3608 10266537 8904468 8996332 8581144 6255023 3798228 4003299 6472352 7585971 5092845
3599 5092845 840473 -2068328 -2955822 -2762725 -1400529 1453009 3994559 3901396 2170964
3590 2170964 2176768 4347396 5061440 2326498 -455311 1070467 6023774 9506407 9092634
3581 9092634 7210672 6914873 7712679 6743197 2934995 -1249727 -2281694 671022 4915580
3572D915580K492493O92586R83642J744592L09164k741266m303337l236894j602738
3563g46178j160169r28719P87489L490416M785148L069169n95383l213722k761394
3554B726657m94007N67328l21488q85250R3314N36548j122095k587549j327604
3545b814146O93891l1866k438888k412762L07624J807756O69891k18081O18419
3536c818162R41646j58654j00342J894069K299813o68944l052426j155677K308807
3527a509870K553623P383j498019j270610j419449j810083o15891J076072L56119
3518d130725k083819k474703j15398J652068J177572O08136J159879Q31869j268634
3509d643755k439848p96386J239968P61091j084647j455977m63695r5591j43611
$$ plain form
3572 4915580 7408073 8100659 9084301 10828893 11138057 8396791 4093454 856560 -746178
3563 -746178 -1906347 -2835066 -2047577 1442839 6227987 9297156 8701773 5488051 2726657
3554 2726657 2232650 2799978 2478490 1593240 1686554 2223102 1101007 -1486542 -2814146
3545 -2814146 -2120255 -2152121 -4591009 -7003771 -6696147 -4888391 -4218500 -4436581 -3818162
3536 -3818162 -2876516 -3035170 -3135512 -1241443 1058370 389426 -2663000 -3818677 -1509870
3527 -1509870 1043753 1051136 -446883 -1717493 -3136942 -4947025 -5562916 -4486844 -4130725
3518 -4130725 -6214544 -8689247 -8804645 -7152577 -5975005 -5366869 -4206990 -3375121 -4643755
3509 -4643755 -7083603 -7879989 -6640021 -5878930 -6963577 -8419554 -8883249 -8978840 -9122451
3500i122451J160352L183402L117051L20730k550744l265639k234078m40787J998411
3491g833753M042167L436291M26848p89036K431368N982709L603778l673068p510092
3482A17212l230689L757756N686455K732690Q40146J756281J404287j990650m393620
3473F679868k623707N59536J182412j08551o15850p58287k339217l883586k456372
3464d363754Q45664J802164n41132k507018j386379J289807L038575L568560L210749
3455D957236J254539k190232m916965n107717l432000j283028J115462L250304
3447f352401L147440N3709l227354l292091n33671J884104K645770K953414K846341
3438A25261M26694l979479o069355k708846K914072M476904N14371l784794l416968
$$ plain form
3500 -9122451 -7962099 -4778697 -1661646 -1340916 -3891660 -7157299 -9391377 -9832164 -7833753
3491 -7833753 -3791586 -355295 71553 -717483 1713885 7696594 11300372 7627304 117212
3482 117212 -3113477 644279 6330734 9063424 9903570 11659851 13064138 11073488 6679868
3473 6679868 4056161 4615697 5798109 5689558 5073708 4315421 1976204 -1907382 -4363754
3464 -4363754 -3518090 -1715926 -2257058 -4764076 -6150455 -4860648 -1822073 1746487 4957236
3455 4957236 6211775 4021543 -895422 -6003139 -9435139 -10718167 -9602705 -6352401
3447 -6352401 -3204961 -3151252 -6378606 -9670697 -10204368 -8320264 -5674494 -2721080 125261
3438 125261 551955 -3427524 -9496879 -12205725 -9291653 -4814749 -4300378 -8085172 -11502140
3429a1502140N40862L470736L371104J887097N00805j070912k588019k446057
3421g836524l36818J503128J266574J12959J20934J173300J719860J478259J346873
3412E48545J397066R65465K41334j78956q97842k833912m976116n159307l109379
3403a4003102o41737J219641K982610M256692L332092L44649j610289l34467K334043
3394b119868L165141J821235L45579m79000j668425l207860l245225q98777J878507
3385d408693K456984P19422j003078r31600J93646N11629k59761n90206K49980
3376c061677P38660m62891j691748j92294L275470M526275J747301j440244r03754
3367B535098K067683K761473j61894l314492l922847l009478k313262j333912
$$ plain form
3429 -11502140 -10961278 -7490542 -4119438 -2232341 -1731536 -2802448 -5390467 -7836524
3421 -7836524 -8173342 -6670214 -5403640 -5290681 -5169747 -3996447 -2276587 -798328 548545
3412 548545 1945611 2911076 3152410 2973454 2075612 -758300 -5734416 -10893723 -14003102
3403 -14003102 -14644839 -13425198 -10442588 -6185896 -2853804 -2509155 -4119444 -4453911 -2119868
3394 -2119868 1045273 2866508 3212087 2733087 1064662 -2143198 -5388423 -6287200 -4408693
3385 -4408693 -1951709 -1232287 -2235365 -3166965 -2973319 -2461690 -2721451 -3311657 -3061677
3376 -3061677 -2323017 -2785908 -4477656 -4669950 -1394480 3131795 4879096 3438852 2535098
3367 2535098 4602781 7364254 7202360 3887868 -34979 -3044457 -5357719 -6691631
3359f691631N83920J849355R84119l72160K30358J800791J196149j625263l096137
3350e140499j532189J86128p68260k641345j884733J383681L823052L800531K621118
3341a52516J134947j312417l824780l433774L87714L554509K443582r07422j814967
3332c925124K42270J545599N02663K7057K370615N066792M437279Q89335k046265
3323I110221k729231k660286l075987l014174j468320N63040J457981J259129
3315e57627J276196J911760K076906Q15006j353812l029537l343597k395916p18163
3306e318784J034646J949851J242980p54852k482351k594896j260115M43224J938304
3297e801993L167574L625928K651153Q13577k16118K84993J137148R15054l50337
$$ plain form
3359 -6691631 -6107711 -4258356 -3274237 -3646397 -3416039 -1615248 -419099 -2044362 -5140499
3350 -5140499 -6672688 -6486560 -7254820 -9896165 -11780898 -10397217 -6574165 -2773634 -152516
3341 -152516 982431 -329986 -4154766 -7588540 -7200826 -3646317 -1202735 -2110157 -3925124
3332 -3925124 -3682854 -2137255 -1634592 -1607535 763080 5829872 10267151 11156486 9110221
3323 9110221 6380990 3720704 644717 -2369457 -3837777 -3274737 -1816756 -557627
3315 -557627 718569 2630329 4707235 5522241 4168429 1138892 -2204705 -4600621 -5318784
3306 -5318784 -4284138 -2334287 -1091307 -1846159 -4328510 -6923406 -8183521 -7740297 -5801993
3297 -5801993 -2634419 991509 3642662 4456239 4240121 4525114 5662262 6577316 6226979
3288F226979j727919k615294k569726j005681J651592L345050K467330O5954j597759
3279D240526k205647l112334m086554k877817J069363M735671N019699K577801
3271E360708M35711l4593J21664k32360j292430l019127m754041m512030j037352
3262h963850L380608M657728K050436q84390j325009n53972p70962j202939J2655
3253c599695J977780K255649J014989P05339J719450J535063j136382m077031
3245C95162m677360l222004j676259q64478l52144J21917O14416J538503K913280
3236e208967L655269K808821J067059N6740M18019J417404K130446K178519J482234
3227A0005544N6593j827123l602770m595686m287611k621795j2231L021709N710054
$$ plain form
3288 6226979 4499060 1883766 -685960 -1691641 -40049 3305001 5772331 5838285 4240526
3279 4240526 2034879 -1077455 -5164009 -8041826 -6972463 -2236792 2782907 5360708
3271 5360708 5796419 5761826 5883490 5651130 4358700 1339573 -3414468 -7926498 -8963850
3262 -8963850 -5583242 -925514 1124922 240532 -1084477 -1638449 -2409411 -3612350 -3599695
3253 -3599695 -1621915 633734 1648723 2354062 4073512 5608575 4472193 395162
3245 395162 -4282198 -7504202 -9180461 -10044939 -10397083 -10275166 -9660750 -8122247 -5208967
3236 -5208967 -1553698 1255123 2322182 2378922 2796941 4214345 6344791 8523310 10005544
3227 10005544 10062137 8235014 4632244 36558 -4251053 -6872848 -6885079 -3863370 1846684
3218A846684O343405L164587k665388o378301m466574K67227J603631j850073
3210b134802m716405k473156K363139M232889K123088j42680J77438J837943K372547
3201C640001J209053k47889j45224K074874M523010M369246J530538p12706k93543
3192A5947360M67151j352403m254284m410509j609871N04002k42235k389705l940979
3183a281473m325447l156178l47765K102413J668241p85624j758849l23566Q16744
3174g391504K06105k46955N71310O37036j123013j972906L90745L566908L763701
3165a598573J347699k58156J51407N97974m50567k183136k945387j787581R76973
3156f149347L364549K917482k18136k715705k135740o033R09277M83425L7199
$$ plain form
3218 1846684 8190089 11354676 8689288 2310987 -2155587 -1888360 -284729 -2134802
3210 -2134802 -6851207 -9324363 -6961224 -2728335 -605247 -747927 -570489 1267454 3640001
3201 3640001 4849054 4601165 4455941 6530815 11053825 15423071 16953609 16240903 15947360
3192 15947360 16414511 15062108 10807824 6397315 4787444 5291446 5049211 2659506 -1281473
3183 -1281473 -5606920 -8763098 -9110863 -7008450 -5340209 -6125833 -7884682 -8208248 -7391504
3174 -7391504 -7185399 -7432354 -6861044 -6224008 -7347021 -9319927 -8929182 -5362274 -1598573
3165 -1598573 -250874 -509030 -357623 240351 -210216 -2393352 -5338739 -7126320 -6149347
3156 -6149347 -2784798 132684 -85452 -2801157 -4936897 -4942930 -4033653 -3550228 -3513029
3147c513029p29582k479501l395220j275028K151610K709865k43044k685269j488577
3138a0947775J760784L512072K477582J0270j873133j758813M93780L416199N040620
3129B131586M612256K615397k25469k735998l093841q64093J474163J331929k59694
3120D986236l35820J142410J376898l13315j297740k69180M98598q60975k714605
3111B212507k854722j816190j068098k92180J173422K296591K214885K204029
3103D070244L221742L346368N74676l357587n040813m042385k339572l72646K534846
3094a405127M610030L006886q76342k001808R16936K861887j99351n169396o376197
3085d632482l489268p81770j00702R04659L599940N575456M364147J016047j667307
$$ plain form
3147 -3513029 -4242611 -6722112 -10117332 -11392360 -9240750 -6530885 -6773929 -9459198 -10947775
3138 -10947775 -9186991 -5674919 -3197337 -3187067 -5060200 -6819013 -6325233 -2909034 2131586
3129 2131586 6743842 9359239 9133770 6397772 3303931 2439838 3914001 5245930 4986236
3120 4986236 4650416 5792826 7169724 6856409 5558669 5289489 5788087 4927112 2212507
3111 2212507 -642215 -2458405 -3526503 -3818683 -2645261 -348670 1866215 4070244
3103 4070244 7291986 10638354 11213030 7855443 2814630 -1227755 -3567327 -3939973 -1405127
3094 -1405127 3204903 6211789 5335447 3333639 4250575 7112462 6913111 1743715 -4632482
3085 -4632482 -8121750 -8903520 -9004222 -8099563 -4499623 1075833 5439980 6456027 4788720
3076D788720k405774j473981O85034L076243L693771J452072j884535l239858
3068D691692j594422J097501K039054j7682l783564o008744m029826J015607M426720
3059b163664K916926j450783m048161l469136k036718j064657R51293M490604
3051e874296O615810M698464M79576k090690j873653j034004j201878j503713
3043a784384n18290J546190L033733K325044p04585l962603m507760j692911J756888
3034d508678K973519K323576J992755K235521J426735m74424j195922M50008K566801
3025G789891K600861K80789k701240m580858m295379j755495J544136L154204
3017B036909K010535l51049j560413q52993O76469J579761J356254P65991J025252
$$ plain form
3076 4788720 2382946 908965 1593999 4670242 8364013 9816085 7931550 4691692
3068 4691692 3097270 4194771 6233825 6216143 2432579 -3576165 -7605991 -6590384 -2163664
3059 -2163664 753262 -697521 -4745682 -8214818 -10251536 -11316193 -10364900 -5874296
3051 -5874296 741514 5439978 5919554 3828864 1955211 921207 -280671 -1784384
3043 -1784384 -2302674 -756484 2277249 4602293 3897708 -64895 -4572655 -6265566 -4508678
3034 -4508678 -1535159 788417 2781172 5016693 6443428 5969004 4773082 5223090 7789891
3025 7789891 10390752 10671541 7970301 3389443 -905936 -2661431 -1117295 2036909
3017 2036909 4047444 3696395 2135982 1282989 1959458 3539219 4895473 5661464 6686716
3008F686716K149331K358829K16177k868043l816175j717958J178474K639516
3000F826867K705004K093952N14837j943761l450335k379517L07808K186714K087886
2991H949455M73592j781416l501540l265714j164318M63657j8729q35439O27652
2982e2800L339089L678465R43809j364566o57988J250226J434430K57441J76422
2973I004528J629592K580318J647389l19309j708122j714421n50200O82472N67658
2964A1819905r82824k097766j373887l34580j365189l426293k689416J634538
2956A184488N037447L503157p07789k225277k63892O75999k013402n000171l924735
2947c734175M47651L536338K848399J14447j661962j078433J377321L947016M515367
$$ plain form
3008 6686716 8836047 11194876 11411053 8543010 4726835 3008877 4187351 6826867
3000 6826867 9531871 11625823 12140660 10196899 6746564 4367047 4674855 6861569 8949455
2991 8949455 9423047 7641631 4140091 874377 -289941 173716 154987 -680452 -52800
2982 -52800 3286289 6964754 7908563 6543997 5886009 7136235 8570665 8828106 9004528
2973 9004528 10634120 13214438 14861827 14542518 12834396 11119975 10569775 11252247 11819905
2964 11819905 10837081 8739315 7365428 7030848 5665659 2239366 -450050 1184488
2956 1184488 6221935 9725092 9017303 6792026 6528134 7204133 5190731 190560 -3734175
2947 -3734175 -3286524 249814 3098213 3212660 1550698 472265 1849586 5796602 10311969
2938A0311969K452036m25565j888164j943615k169334k994435l382374k851070
2930b890552j896794n96800J165138K166949Q88033j655647k570809j130094M27352
2921f093224R21344K027463M445704N357383K443453j837191l173549j138914
2913B952469J155179K007998K279161K157191N26899k006024k831128j115821
2905E125924R00610J428053J184750P21529j200316m373410n156158j086184M236951
2896A781749M742862l0634m168398l310796J44207J505839M78991L61581K110161
2887C615562K827731N33289k495370k719803J6128K640540K843040J241285j76269
2878H326133k71260P55455J924692K169045J261237K35355J38603M22065l45698
$$ plain form
2938 10311969 12764005 12338440 10450276 8506661 6337327 3342892 -39482 -2890552
2930 -2890552 -4787346 -5384146 -4219008 -2052059 -1164026 -2819673 -5390482 -6520576 -6093224
2921 -6093224 -5171880 -3144417 1301287 6658670 9102123 7264932 4091383 2952469
2913 2952469 4107648 6115646 8394807 10551998 11078897 9072873 6241745 5125924
2905 5125924 6026534 7454587 8639337 9360866 8160550 3787140 -1369018 -2455202 1781749
2896 1781749 6524611 6493977 2325579 -985217 -841010 664829 1143820 1505401 3615562
2887 3615562 6443293 6976582 4481212 1761409 1777537 4418077 7261117 8502402 8326133
2878 8326133 8054873 8810328 10735020 12904065 14165302 14400657 14539260 14961325 14615627
2869A4615627k109922l083583k326446j104779q30739j056499p68275m52564j214983
2860A667837k594407k989851j932629m08349P91461J517757J395816K84175n31864
2851b800054L89511J990840J531087j263390l144162j783122P76037J072712r09262
2842d139803k236695j492300j04993O60435J419051K651137L146545J777881n62195
2833A119063k068245k127023j310637k55093L49090l56949k109310k868144j071999
2824a0699247J859891K903205J136199j476700k816515k366758l74661K510521
2816i324065M383700L299240L19093r86902N84515J917245L28879k256700k558194
2807d293189j102436o51374j099779o2493K201466K823321J355732M38630Q23292
$$ plain form
2869 14615627 12505705 9422122 7095676 5990897 5160158 4103659 3335384 2882820 1667837
2860 1667837 -926570 -3916421 -5849050 -6257399 -5465938 -3948181 -2552365 -2268190 -2800054
2851 -2800054 -2410543 -419703 1111384 -152006 -3296168 -5079290 -4303253 -3230541 -4139803
2842 -4139803 -6376498 -7868798 -7973791 -7313356 -5894305 -3243168 -96623 1681258 1119063
2833 1119063 -949182 -3076205 -4386842 -4641935 -4292845 -4649794 -6759104 -9627248 -10699247
2824 -10699247 -8839356 -5936151 -4799952 -6276652 -9093167 -11459925 -11834586 -9324065
2816 -9324065 -4940365 -1641125 -1322032 -2308934 -1724419 192826 521705 -1734995 -4293189
2807 -4293189 -5395625 -6046999 -7146778 -7209271 -5007805 -2184484 -828752 -390122 433170
2798D33170J95905j771138j843643J081500L165299J621137n28017M16269K487063
2789E257545J592535j300003j920437j17234O3266k593624m659205l911980k239005
2780i828142j441481l79541J919231L831056L803547K699147J819122J086645
2772C509584N47506J034652J940010J094573j519274k772505j040229R72140M22386
2763D188843j317189j381787j72854J915o44769q2263J240061O58677j951533
2754E39101l199339j065434J962658K326335J94823j066151M96886L014984L212919
2745F416782K39331l607278n622447n189746l276200p03021J841479L028575K123046
2736d749479P11946J049046K595650K577075L98845j169116k34160J454139J503197
$$ plain form
2798 433170 629075 -1142063 -2985706 -1904206 1261093 2882230 2354213 2770482 5257545
2789 5257545 6850080 5550077 3629640 3512406 3575672 982048 -3677157 -7589137 -9828142
2780 -9828142 -11269623 -11649164 -9729933 -5898877 -2095330 603817 2422939 3509584
2772 3509584 4057090 5091742 7031752 8126325 6607051 3834546 2794317 3766457 4188843
2763 4188843 2871654 1489867 1317013 1318928 674159 591896 1831957 2490634 539101
2754 539101 -2660238 -3725672 -1763014 563321 758144 -308007 188879 3203863 6416782
2745 6416782 6656113 3048835 -2573612 -7763358 -11039558 -11742579 -9901100 -6872525 -4749479
2736 -4749479 -4037533 -2988487 -392837 2184238 2583083 1413967 1179807 2633946 4137143
2727D137143J98051r30913j507193j377191K34169K414525K079823j399075l797772
2718E1567j831206J205606J47789l572206l674072J265848N582708M948917J826810
2709E951761M89067R73047P45855q05488k306626k640767j224685J892215M573703
2700G648082L589812j100581n256885n362116k595150j55595Q42413P16516q70519
2691b544023l479693m467363k110059J312191K470312J649427J448950K128631
2683c591627J739442K26235k23319R19789J473888K7708k096735l015757k303889
2674f844265m39638J740962K787994J915941P12504J343613K922959K325417q59456
2665E606031l131201k095036Q2782J74772j395264j776339j80000J428951J586601
$$ plain form
2727 4137143 4335194 3404281 1897088 519897 754066 3168591 5248414 3849339 51567
2718 51567 -1779639 -574033 -426244 -3998450 -7672522 -6406674 -823966 4124951 5951761
2709 5951761 6440828 7413875 8159730 7354242 5047616 2406849 1182164 3074379 7648082
2700 7648082 11237894 10137313 4880428 -481688 -3076838 -3232433 -2390020 -1673504 -2544023
2691 -2544023 -6023716 -10491079 -12601138 -11288947 -8818635 -7169208 -5720258 -3591627
2683 -3591627 -1852185 -1625950 -1849269 -929480 544408 572116 -1524619 -4540376 -6844265
2674 -6844265 -7283903 -5542941 -2754947 -839006 -126502 1217111 4140070 6465487 5606031
2665 5606031 2474830 379794 462576 637348 -757916 -2534255 -2714255 -1285304 301297
2656C01297J025392R32517J079192K85212j795104l641935k887579R46782M891387
2647A137161N073740J175930l160754m915097m679979l930226j759363K933347
2639h125241P502728P471906K648176j847247j929124N45842J063093j262032
2631F068101l256965k757417j246561q53791j111113l72637R80845R83976o35855
2622b201417j831077j304211k07589J28559K20155P42696P65396j25245L03755
2613c508978L724084O957642N025842j208240m801353j840494L200651M033424
2605A1582578J022606q66690j25253K13188j209802j737342L74073K582236J617669
2596A3453263k038261n127041n490500l449296m81013K044091L289695L025339
$$ plain form
2656 301297 1326689 2259206 3338398 3623610 1828506 -1813429 -4701008 -3754226 1137161
2647 1137161 6210901 7386831 4226077 -689020 -5368999 -9299225 -11058588 -8125241
2639 -8125241 -622513 6849393 9497569 7650322 5721198 6267040 7330133 6068101
2631 6068101 2811136 53719 -1192842 -2046633 -3157746 -3530383 -2549538 -1565562 -2201417
2622 -2201417 -4032494 -5336705 -5544294 -5415735 -5195580 -4452884 -3687488 -3812733 -3508978
2613 -3508978 215106 7172748 12198590 10990350 6188997 4348503 7549154 11582578
2605 11582578 12605184 11738494 11613241 11826429 10616627 8879285 9253358 11835594 13453263
2596 13453263 11415002 6287961 797461 -2651835 -3132848 -1088757 2200938 5226277
2588E226277J407718r52420k415780j145489K013969K919580r94864o108905o242145
2579f292059q20846M272674M675278K375336R64021J92985j659409l269779k141038
2570a702837Q28789K465943J982215J099039L76563r94008k115846q66791K084650
2561C157717L162214Q50472k104451k817490k067668k249613l530513m132867
2553i732199l272918j802722l37490J583119M183760O244150N842149K462720
2545E170569j738119l420282j444033J685146K611092R49010q01040q24731N7404
2536B245016K58793j87911N1879J605508L394647L551696J322306j784056l177807
2527G280071j968279L0088O39287k15265j249202j879610k082140j250315P74169
$$ plain form
2588 5226277 6633995 5681575 3265795 2120306 4134275 7053855 6058991 -49914 -6292059
2579 -6292059 -7112905 -2840231 1835047 4210383 5174404 5367389 3707980 438201 -1702837
2570 -1702837 -874048 1591895 3574110 4673149 5049712 4055704 1939858 1073067 3157717
2561 3157717 6319931 7170403 5065952 2248462 180794 -2068819 -5599332 -9732199
2553 -9732199 -13005117 -14807839 -15145329 -13562210 -9378450 -3134300 2707849 5170569
2545 5170569 3432450 12168 -1431865 253281 2864373 3813383 3012343 2187612 2245016
2536 2245016 2503809 2315898 2367777 3973285 7367932 10919628 12241934 10457878 7280071
2527 7280071 5311792 5341880 5981167 5765902 4516700 2637090 554950 -695365 78804
2518G8804K148302Q04033k261410l632468j760412J172900K035323l7433l219301
2509d671662m402081j496895L864137O633880L785253j209396k403335N60747
2501F60648K352752K47559k169258j401677M25588j92394j898770q27703K703251
2492a00004M186694J225559l510324n850064m334766p08244K125959K542542J482267
2483b940381Q98956P74147n67846k673734k401417J069489L667837J792290k213106
2474b593765l460682j471035K57787L40060P87680K485940L525211K618463Q54794
2465C344453n69800j557832j734307o42744N01057Q1500q48940J04488K207478
2456H85353K079635p36968k542181j180925O84274Q1072j638246j282605J318920
$$ plain form
2518 78804 2227106 3031139 769729 -2862739 -4623151 -3450251 -1414928 -1452361 -4671662
2509 -4671662 -9073743 -10570638 -6706501 -72621 3712632 2503236 99901 660648
2501 660648 3013400 3260959 1091701 -309976 115612 -76782 -1975552 -2803255 -100004
2492 -100004 4086690 5312249 1801925 -4048139 -8382905 -9091149 -6965190 -4422648 -2940381
2483 -2940381 -2041425 -1267278 -1835124 -4508858 -6910275 -5840786 -2172949 -380659 -2593765
2474 -2593765 -6054447 -7525482 -7267695 -6927635 -6139955 -3654015 -128804 2489659 3344453
2465 3344453 2774653 1216821 -517486 -1160230 -659173 -577673 -1426613 -1322125 885353
2456 885353 2964988 2228020 -314161 -1495086 -810812 -729740 -2367986 -3650591 -2331671
2447b331671L551831L657712K004573j73486j577653j309837J08583R53875L30890
2438E214817r82257k075598k822783k914658j801582j11994P43891P98059J274971
2429b677134J895973J096187o08773o32097J359961K529562J670221J262213K670813
2420H566926L080454K16547l224863l483167j354160q7492o765O24243J213769
2411E545492k06044k683493l274323j728999l78738J07197R09216J507396K87992
2402H5696j311512R4920L775690M512598R0726m883226n170316j686765Q05393
2393c686796M03615p57769p63250j93589n3605K94454K032791M456672M789729
2384F522252J266470l777623n449629j907972L028540M445463K043860q40870
$$ plain form
2447 -2331671 1220160 4877872 6882445 6708959 5131306 3821469 3930052 4883927 5214817
2438 5214817 4232560 2156962 -665821 -3580479 -5382061 -5494055 -4750164 -3952105 -2677134
2429 -2677134 -781161 315026 -293747 -925844 434117 2963679 4633900 5896113 8566926
2420 8566926 11647380 11863927 8639064 5155897 3801737 3714245 3707480 4331723 5545492
2411 5545492 5339448 2655955 -618368 -2347367 -2726105 -2618908 -1709692 -202296 85696
2402 85696 -1225816 -1130896 2644794 7157392 7248118 2364892 -2805424 -4492189 -3686796
2393 -3686796 -3283181 -4040950 -4804200 -4997789 -5051394 -4756940 -2724149 1732523 6522252
2384 6522252 7788722 4011099 -1438530 -3346502 -317962 4127501 6171361 5330491
2376E330491k342256k994305k545722J24493L597288M283762J437449j397773
2368E493427j353566K63163R85512Q59219J068195J219183K65626j396843k598495
2359D805421k984169k732275k015162j525796j869696j936682j50842K175464
2351f233737J815580j032286k053334O05789K936946J283285j629242j007570
2343e314569K370199L674553J702084Q7489J087054K601098K060565k43648k604526
2334E420299l921807l561376j510022P67954J554568J173909J319400K314112
2326C557037K956212K684803J840032L24586j759913k840864j729891j7115L8389
2317E053276r36526j013773q79399k256094l406223j086312L141576L936946L93473
$$ plain form
2376 5330491 2988235 -6070 -2551792 -2427299 1169989 5453751 6891200 5493427
2368 5493427 4139861 4403024 5388536 6247755 7315950 8535133 8800759 7403916 4805421
2359 4805421 1821252 -911023 -2926185 -4451981 -6321677 -8258359 -8409201 -6233737
2351 -6233737 -4418157 -5450443 -7503777 -6897988 -3961042 -2677757 -4306999 -5314569
2343 -5314569 -2944370 730183 2432267 2519756 3606810 6207908 8268473 8024825 5420299
2334 5420299 1498492 -2062884 -3572906 -2804952 -1250384 -76475 1242925 3557037
2326 3557037 6513249 9198052 11038084 11362670 9602757 6761893 5032002 5014887 5053276
2317 5053276 4116750 3102977 2223578 -32516 -3438739 -4525051 -1383475 2553471 2946944
2308B946944k253900q80160J078445J52287j504069q28786M11149o89059k355815
2299c922964j106732K008195L119411J707874M10150J03091l23482n25614M60061
2290A929990R71299j076662l513989k285878J805233L716585J804533j66193M00235
2281C585153J250398j2189j824733j664801Q6063J454336J485387J5576k552708
2272A822482m101874k393439J078058K181766L54242k02228K595605M885928K892131
2263I112671j094676k566308j497245r69276j500296j244777l44450o89255k033360
2254b826972k180901o55379J087714K506404L797382L618534N58007l461191m776903
$$ plain form
2308 2946944 693044 -187116 891329 1043616 -460453 -1289239 -878090 -1567149 -3922964
2299 -3922964 -5029696 -3021501 97910 1805784 2215934 2319025 1995543 1469929 1929990
2290 1929990 2901289 1824627 -1689362 -3975240 -2170007 1546578 3351111 3184918 3585153
2281 3585153 4835551 4823362 2998629 1333828 1419891 2874227 4359614 4375190 1822482
2272 1822482 -2279392 -4672831 -3594773 -1413007 -1058765 -1260993 1334612 6220540 9112671
2263 9112671 8017995 5451687 3954442 2985166 1484870 240093 -104357 -793612 -2826972
2254 -2826972 -5007873 -5663252 -4575538 -2069134 1728248 5346782 5904789 2443598 -2333305
$$ [...]
##END NTUPLES=NMR SPECTRUM
##END=
