##TITLE=31Pdec_DE-46EA_D2O_b
 D2O, 64 sc
 19.7.2024
##JCAMPDX= 6.0         $$ Bruker NMR JCAMP-DX V2.0
##DATA TYPE= NMR SPECTRUM
##DATA CLASS= NTUPLES
##ORIGIN= UXNMR, Bruker Analytische Messtechnik GmbH
##OWNER= root
$$ XWIN-NMR		Version 3.5
$$ Fri Jul 19 13:53:03 2024 Russian Standard Time (UT+4h)  she@DPX200
##.OBSERVE FREQUENCY= 81.013821
##.OBSERVE NUCLEUS= ^31P
##.ACQUISITION MODE= SIMULTANEOUS
##.ACQUISITION SCHEME= undefined
##.AVERAGES= 64
##.DIGITISER RES= 17
##SPECTROMETER/DATA SYSTEM= spect
##.PULSE SEQUENCE= zgpg30
##.SOLVENT NAME= D2O
##.SHIFT REFERENCE= (INTERNAL, D2O, 0, 198.062)
##AUDIT TRAIL= $$ (NUMBER, WHEN, WHO, WHERE, WHAT)
$$ ##TITLE= Audit trail, XWIN-NMR		Version 3.5
$$ ##JCAMPDX= 5.01
$$ ##ORIGIN= Bruker BioSpin GmbH
$$ ##OWNER= she
$$ F:/spectra/data/she/nmr/P31/2/pdata/1/auditp.txt
$$ ##AUDIT TRAIL=  $$ (NUMBER, WHEN, WHO, WHERE, WHAT)
(   1,<2024-07-19 13:51:37.76 +0400>,<she>,<DPX200>,
      <created by zg, POWCHK disabled, PULCHK disabled
       configuration hash MD5:
       00 E9 B6 7A A2 85 ED C7 34 08 36 98 17 FE 4E 26
       data hash MD5: 32K
       48 28 4E EB 72 30 3C 66 7A 75 BB ED C0 50 8C 98>)
(   2,<2024-07-19 13:51:58.03 +0400>,<she>,<DPX200>,
      <Start of raw data processing
       efp BC_mod = 2 LB = 1.5 FT_mod = 6 PKNL = 1 PHC0 = 2668.231 PHC1 = 16.88698 SI = 64K 
       data hash MD5: 64K
       0C 62 E0 1F 99 82 1B 6E BE 2D 27 95 21 78 10 EC>)
(   3,<2024-07-19 13:52:21.76 +0400>,<she>,<DPX200>,
      <pk PHC0 = 6.921847 PHC1 = 0 
       data hash MD5: 64K
       EA BF 0F 5D F9 AE 52 0D D0 90 A7 D0 6F AF 02 56>)
(   4,<2024-07-19 13:52:25.06 +0400>,<she>,<DPX200>,
      <abs ABSG = 5 
       data hash MD5: 64K
       2D 44 6F EF 77 F8 8B CA 30 30 F1 23 D4 0F E7 AE>)
$$ ##END=
$$ 
$$ hash MD5
$$ 4B D1 76 C7 CB 67 6D A7 90 BD A7 EB C5 15 09 D2
##$RELAX= 
##$RELAX= 
##$RELAX= 
##$RELAX= 
##$RELAX= 
##$RELAX= 
##$RELAX= 
##$RELAX= 
$$ Bruker specific parameters
$$ --------------------------
##$DU= <F:/spectra>
##$EXPNO= 2
##$NAME= <P31>
##$PROCNO= 1
##$TYPE= <nmr>
##$USER= <she>
##$AMP= (0..31)
100 100 100 100 100 100 100 100 100 100 100 100 100 100 100 100 100 100 
100 100 100 100 100 100 100 100 100 100 100 100 100 100 
##$AQSEQ= 0
##$AQ_mod= 1
##$AUNM= <au_zg>
##$AUTOPOS= <>
##$BF1= 81.014009
##$BF2= 200.13
##$BF3= 200.13
##$BF4= 200.13
##$BF5= 200.13
##$BF6= 200.13
##$BF7= 200.13
##$BF8= 200.13
##$BYTORDA= 1
##$CFDGTYP= 0
##$CFRGTYP= 5
##$CHEMSTR= <none>
##$CNST= (0..31)
1 1 145 1 1 1 1 1 1 1 1 1 1 1 1 1 1 1 1 1 1 1 1 1 1 1 1 1 1 1 1 1 
##$CPDPRG= <waltz16>
##$CPDPRG1= <>
##$CPDPRG2= <waltz16>
##$CPDPRG3= <>
##$CPDPRG4= <mlev>
##$CPDPRG5= <mlev>
##$CPDPRG6= <mlev>
##$CPDPRG7= <mlev>
##$CPDPRG8= <mlev>
##$CPDPRGB= <>
##$CPDPRGT= <>
##$D= (0..31)
0 1 0 0 0 0 0 0 0 0.06 0 0.03 2e-05 3e-06 0 0 0.0002 0 0 0 0 0 0 0 0 0 
0 0 0 0 0 0 
##$DATE= 1721382697
##$DBL= (0..7)
120 120 120 11 120 120 24 19 
##$DBP= (0..7)
150 150 150 150 150 150 150 150 
##$DBP07= 0
##$DBPNAM0= <>
##$DBPNAM1= <>
##$DBPNAM2= <>
$$ [...]
##$SUBNAM3= <"">
##$SUBNAM4= <"">
##$SUBNAM5= <"">
##$SUBNAM6= <"">
##$SUBNAM7= <"">
##$SUBNAM8= <"">
##$SUBNAM9= <"">
##$SW= 400.765351723535
##$SWIBOX= (0..15)
0 1 3 0 0 0 0 0 0 0 0 0 0 0 0 0 
##$SW_h= 32467.5324675325
##$TD= 32768
##$TD0= 1
##$TE= 0
##$TE2= 300
##$TE3= 300
##$TEG= 300
##$TL= (0..7)
0 120 53 12 22 120 120 120 
##$TP= (0..7)
150 150 150 150 150 150 150 150 
##$TP07= 0
##$TPNAME0= <>
##$TPNAME1= <>
##$TPNAME2= <>
##$TPNAME3= <>
##$TPNAME4= <>
##$TPNAME5= <>
##$TPNAME6= <>
##$TPNAME7= <>
##$TPOAL= (0..7)
0.5 0.5 0.5 0.5 0.5 0.5 0.5 0.5 
##$TPOFFS= (0..7)
0 0 0 0 0 0 0 0 
##$TUNHIN= 0
##$TUNHOUT= 0
##$TUNXOUT= 0
##$USERA1= <user>
##$USERA2= <user>
##$USERA3= <user>
##$USERA4= <user>
##$USERA5= <user>
##$V9= 5
##$VALIST= <valist>
##$VCLIST= <CCCCCCCCCCCCCCC>
##$VD= 0
##$VDLIST= <DDDDDDDDDDDDDDD>
##$VPLIST= <PPPPPPPPPPPPPPP>
##$VTLIST= <TTTTTTTTTTTTTTT>
##$WBST= 1024
##$WBSW= 4
##$XGAIN= (0..3)
0 0 0 0 
##$XL= 0
##$YL= 0
##$YMAX_a= 4210
##$YMIN_a= -11093
##$ZGOPTNS= <>
##$ZL1= 120
##$ZL2= 120
##$ZL3= 120
##$ZL4= 120
##$ABSF1= 198.0616
##$ABSF2= -202.7028
##$ABSG= 5
##$ABSL= 3
##$ALPHA= 0
##$AQORDER= 0
##$ASSFAC= 0
##$ASSFACI= 0
##$ASSFACX= 0
##$ASSWID= 0
##$AUNMP= <proc_1d>
##$AZFE= 0.1
##$AZFW= 0.5
##$BCFW= 0
##$BC_mod= 2
##$BYTORDP= 0
##$COROFFS= 0
##$CY= -3
##$DATMOD= 1
##$DC= 0
##$DFILT= <>
##$DTYPP= 0
##$F1P= 0
##$F2P= 0
##$FCOR= 1
##$FTSIZE= 65536
##$FT_mod= 6
##$GAMMA= 0
##$GB= 0
##$INTBC= 1
##$INTSCL= 9.790993e-09
##$ISEN= 30
##$LB= 1.5
##$LEV0= 0
##$LPBIN= 0
##$MAXI= 10000
##$MC2= 0
##$MEAN= 0
##$ME_mod= 0
##$MI= 50
##$NCOEF= 0
##$NC_proc= -9
##$NLEV= 6
##$NOISF1= 182.463
##$NOISF2= 159.3651
##$NSP= 0
##$NTH_PI= 0
##$NZP= 0
##$OFFSET= 198.0616
##$PC= 4
##$PHC0= 2675.153
##$PHC1= 16.88698
##$PH_mod= 1
##$PKNL= yes
##$PPARMOD= 0
##$PSCAL= 0
##$PSIGN= 0
##$REVERSE= no
##$SF= 81.0140089999434
##$SI= 65536
##$SIGF1= 159.3651
##$SIGF2= -187.1042
##$SINO= 113.3802
##$SIOLD= 16384
##$SREGLST= <1H.CDCl3>
##$SSB= 0
##$STSI= 65536
##$STSR= 0
##$SW_p= 32467.5324675325
##$SYMM= 0
##$S_DEV= 0
##$TDeff= 32768
##$TDoff= 0
##$TI= <>
##$TILT= no
##$TM1= 0
##$TM2= 0
##$TOPLEV= 0
##$USERP1= <user>
##$USERP2= <user>
##$USERP3= <user>
##$USERP4= <user>
##$USERP5= <user>
##$WDW= 1
##$XDIM= 65536
##$YMAX_p= 452529655
##$YMIN_p= -45271285
$$ End of Bruker specific parameters
$$ ---------------------------------
##NTUPLES= NMR SPECTRUM
##VAR_NAME=  FREQUENCY,     SPECTRUM/REAL,   SPECTRUM/IMAG
##SYMBOL=    X,             R,               I
##VAR_TYPE=  INDEPENDENT,   DEPENDENT,       DEPENDENT
##VAR_FORM=  AFFN,          ASDF,            ASDF
##VAR_DIM=   65536,         65536,           65536
##UNITS=     HZ,            ARBITRARY UNITS, ARBITRARY UNITS
##FACTOR=    0.49542278885378, 1,            1
##FIRST=     16045.7642231865, 0,            0
##LAST=      -16421.768244346, 0,            0
##MIN=       -16421.768244346, -45271285,    0
##MAX=       16045.7642231865, 452529655,    0
$$ Real data points
##PAGE= N=1
##DATA TABLE= (X++(R..R)), XYDATA
$$ [...]
$$ plain form
43272 15558226 13688808 12847183 13248700 10285979 1328815 -7515596 -8370669 -2836716
43264 -2836716 273387 -3536860 -11203548 -18209554 -21685832 -19382511 -12155881 -6358129
43256 -6358129 -7652042 -13315278 -16056510 -13777073 -9652513 -4633762 2841693 10669585
43248 10669585 14277684 14244499 15487404 17993106 15532738 5663887 -5177596 -9211981
43240 -9211981 -5219901 2939952 11079862 16046105 16556651 14682241 13389354 12020157
43232 12020157 7917906 2487648 603382 3069899 4753781 1915597 -3000160 -5499657
43224 -5499657 -3900360 1095197 7298117 10437301 7654591 3152331 4962267 13692179
43216 13692179 19989907 16728157 8633506 5145109 7866586 10870852 10986683 11338844
$$ packed form
43272A5558226j869418q41625M01517k962721q957164q844411q55073N533953
43264b836716L110103l810247p666688p006006l476278K303321P226630N797752
43256f358129j293913n663236k741232K279437M124560N018751P475455P827892
43248A0669585L608099l3185J242905K505702k460368r868851j0841483m034385
43240i211981L992080Q159853Q139910M966243N10546j874410j292887j369197
43232A2020157m102251n430258j884266K466517J683882k838184m915757k499497
43224e499657J599297M995557O202920L139184k782710m502260J809936Q729912
43216A3692179O297728l261750q094651l488397K721477L004266J15831L52161
$$ plain form
43208 11338844 14358290 16509795 12534474 2556175 -7661161 -13294274 -15397701 -18192779
43200 -18192779 -22770948 -26096430 -26115956 -24125562 -20753817 -14274761 -6301964 -4169917
43192 -4169917 -11510408 -20022811 -18450420 -8134612 -1260091 -3787717 -9031921 -9674154
43184 -9674154 -6960905 -4423365 -1071865 3747800 5850502 2789533 -835389 -965203
43176 -965203 -1620671 -7627865 -14323556 -13147355 -5227659 -523824 -3225639 -6030767
43168 -6030767 -1453807 7219361 10290614 3985586 -5154126 -7714248 -1212521 8383230
43160 8383230 14495256 17230558 20524968 23614862 20533465 9456590 -2602526 -7796315
43152 -7796315 -6174410 -2687173 681584 4869984 8617688 8945061 5736833 1472591
$$ packed form
43208A1338844L019446K151505l975321r978299j0217336n633113k103427k795078
43200a8192779m578169l325482j9526J990394L371745O479056P972797K132047
43192d169917p340491q512403J572391J0315808O874521k527626n244204o42233
43184i674154K713249K537540L351500M819665K102702l060969l624922j29814
43176i65203o55468o007194o695691J176201P919696M703835k701815k805128
43168f030767M576960Q673168L071253o305028r139712k560122O501727R595751
43160H383230O112026K735302L294410L089894l081397j1076875j2059116n193789
43152g796315J621905L487237L368757M188400L747704L27373l208228m264242
$$ plain form
43144 1472591 -2633567 -6429015 -8357225 -7512525 -6721210 -8927943 -11735010 -10572516
43136 -10572516 -6331201 -4096184 -4470385 -2591904 2796487 5637370 1324164 -5579268
43128 -5579268 -6803480 -943514 5483361 6403741 2323467 -1796966 -2495358 -951299
43120 -951299 -928797 -3988069 -7157929 -5965950 702485 9801529 17569708 22182348 23320990
43111 23320990 21220221 16895318 12188601 8965339 8486420 10971560 14917985 17513582
43103 17513582 16771365 12769623 6475472 -844570 -6070377 -4961244 2617940 10131110
43095 10131110 10699725 5209991 779604 1840722 6342712 10307307 11760480 9441831
43087 9441831 2078939 -8617782 -17078829 -18650114 -14066586 -7782086 -3118098 -217520
$$ packed form
43144A472591m106158l795448j928210Q44700P91315k206733k807067J162494
43136a0572516M241315K235017l74201J878481N388391K840883m313206o903432
43128e579268j224212N859966O426875R20380m080274m120433o98392J544059
43120i51299K2502l059272l169860J191979O668435R099044P768179M612640J138642
43111B3320990k100769m324903m706717l223262m78919K485140L946425K595597
43103A7513582p42217m001742o294151p320042n225807J109133P579184P513170
43095A0131110N68615n489734m430387J061118M501990L964595J453173k318649
43087I441831p362892j0696721q461047j571285M583528O284500M663988K900578
$$ plain form
43079 -217520 2300894 4846274 5991176 4504103 2635099 5413386 14320485 23317041
43071 23317041 24861747 19222273 13599155 11978296 10867552 6599855 1674585 333811
43063 333811 1711772 1904825 605726 922560 3277643 3999123 1022199 -2237908 -705180
43054 -705180 6067134 13127546 15414987 12643792 8304325 4479586 -473967 -8008412
43046 -8008412 -15065297 -16707275 -12772894 -8526749 -7745877 -8430598 -7262277 -5179928
43038 -5179928 -5352949 -7712315 -9283387 -9049529 -8667148 -8365358 -6073968 -1856706 342139
43029 342139 -2105518 -5973990 -5963349 -1809810 1632631 1155615 -1343436 -2966772 -3989875
43020 -3989875 -5695114 -6675870 -4674747 -884922 1018168 -213525 -2650036 -5053141
$$ packed form
43079b17520K518414K545380J144902j487073j869004K778287Q907099Q996556
43071B3317041J544706n639474n623118j620859j110744m267697m925270j340774
43063C33811J377961J93053j299099L16834K355083P21480k976924l260107J532728
43054g05180O772314P060412K287441k771195m339467l824739m953553p534445
43046h008412p056885j641978L934381M246145P80872o84721J168321K082349
43038e179928j73021k359366j571072K33858L82381L01790K291390M217262K198845
43029C42139k447657l868472J0641M153539L442441m77016k499051j623336j023103
43020c989875j705239r80756K001123L789825J903090j231693k436511k403105
$$ plain form
43012 -5053141 -7675105 -8816843 -5131698 2670726 8423159 7577454 2375331 -2785989
43004 -2785989 -7339595 -12022562 -14036030 -10197731 -2896593 2454675 4499251 5235783
42996 5235783 3955955 -1444084 -7513906 -7088303 207285 5922285 3960851 -2018171
42988 -2018171 -5410232 -5091751 -3014010 1192813 7703009 12468223 11724096 8269382
42980 8269382 7497868 8375181 4203216 -6990733 -17597233 -18227343 -8277127 2989303
42972 2989303 5517948 -1762508 -10452382 -12324925 -8084813 -4244750 -3081240 -959495
42964 -959495 3173289 4507315 702617 -2931055 -1726379 333446 -2642408 -8321154
42956 -8321154 -10607299 -10793626 -14912607 -21302668 -21028673 -12279547 -4959640 -7152637
$$ packed form
43012e053141k621964j141738L685145P802424N752433q45705n202123n161320
43004b785989m553606m682967k013468L838299P301138N351268K044576P36532
42996E235783j279828n400039o069822M25603P295588N715000j961434n979022
42988b018171l392061L18481K077741M206823O510196M765214p44127l454714
42980H269382p71514Q77313m171965j1193949j0606500o30110R950216J1266430
42972B989303K528645p280456q689874j872543M240112L840063J163510K121745
42964i59495M132784J334026l804698l633672J204676K059825k975854n678746
42956h321154k286145j86327m118981o390061K73995Q749126P319907k192997
$$ plain form
42948 -7152637 -14630416 -18388389 -16137721 -11131500 -5248319 441529 2189319 -2679026
42940 -2679026 -10431494 -14849972 -15017511 -14237762 -12840018 -7992142 -575316 3551493
42932 3551493 820821 -5697927 -11005370 -13705829 -14749515 -13737917 -9643718 -4022152
42924 -4022152 -802252 -2532696 -7837294 -12654155 -13634446 -10630022 -6179215 -2531229
42916 -2531229 439091 3911584 7473059 9077429 7488108 3533928 -1004564 -4446819
42908 -4446819 -5193019 -2447833 2235228 5418329 4825585 1330925 -2454053 -4490995
42900 -4490995 -3721952 230846 6253031 11488690 13564134 12861949 11395335 9857697
42892 9857697 7308155 3585117 177617 -1763008 -2610290 -2624049 -689866 3828782 8903880
$$ packed form
42948g152637p477779l757973K250668N006221N883181N689848J747790m868345
42940b679026p752468m418478j67539P79749J397744M847876P416826M126809
42932C551493k730672o518748n307443k700459j043686J011598M094199N621566
42924d022152L219900j730444n304598m816861r80291L004424M450807L647986
42916b531229K970320L472493L561475J604370j589321l954180m538492l442255
42908d446819p46200K745186M683061L183101n92744l494660l784978k036942
42900d490995P69043L952798O022185N235659K075444p02185j466614j537638
42892I857697k549542l723038l407500j940625q47282j3759J934183M518648N075098
$$ plain form
42883 8903880 11213724 9612408 6021374 2829131 495607 -1926423 -4712917 -6647190
42875 -6647190 -6413133 -4727312 -4586347 -8393788 -14529099 -17871382 -14756182 -6943362
42867 -6943362 98228 2371729 317135 -2338475 -1595606 4032096 12264082 18879003
42859 18879003 21572823 21154313 18433597 12307126 3022682 -5072972 -7695573 -6178980
42851 -6178980 -4837118 -3801220 373956 6822821 9086040 3990050 -3358696 -6759463
42843 -6759463 -6696920 -7028470 -7835092 -6452825 -2867158 992354 5427304 11360509 15885440
42834 15885440 14737054 8897886 3930801 2696235 3203098 3555200 3923752 3039367 -1694133
42825 -1694133 -8534799 -10773895 -4879914 4307155 9555680 9484690 7874693 7416301 7640449
$$ packed form
42883H903880K309844j601316l591034l192243k333524k422030k786494j934273
42875f647190K34057J685821J40965l807441o135311l342283L115200P812820
42867f943362P041590K273501k054594k655610P42869N627702Q231986O614921
42859A8879003K693820m18510k720716o126471r284444q095654k622601J516593
42851f178980J341862J035898M175176O448865K263219n095990p348746l400767
42843f759463O2543l31550q06622J382267L585667L859512M434950N933205M524931
42834A5885440j148386n839168m967085j234566N06863L52102L68552q84385m733500
42825a694133o840666k239096N893981R187069N248525p0990j609997m58392K24148
$$ plain form
42816 7640449 7544841 7079322 6532463 6463603 7493609 8710174 7717976 4160404 1725378
42807 1725378 4077678 9331800 11021808 5156511 -4858459 -10914463 -7865119 1133365
42799 1133365 7257788 4970309 -2210240 -6505109 -5400540 -3031933 -2259571 -424058
42791 -424058 4476350 7970960 4509221 -3375030 -6613176 -619932 9199422 13996554
42783 13996554 10614912 2959283 -3353136 -5815390 -5571302 -4868817 -4393846 -2956811
42775 -2956811 440579 4935088 8592380 10183187 9650495 7574151 4854567 2288547
42767 2288547 -86740 -2586295 -4616393 -4900612 -3262322 -1086659 -142438 -2489057
42759 -2489057 -10584488 -23829421 -34752717 -33631864 -19666490 -3563995 4389708 4998045
$$ packed form
42816G640449r5608m65519n46859o8860J030006J216565r92198l557572k435026
42807A725378K352300N254122J690008n865297j0014970o056004L049344Q998484
42799A133365O124423k287479p180549m294869J104569K368607P72362J835513
42791d24058M900408L494610l461739p884251l238146N993244R819354M797132
42783A3996554l381642p655629o312419k462254K44088P02485M74971J437035
42775b956811L397390M494509L657292J590807n32692k076344k719584k566020
42767B288547k375287k499555k030098k84219J638290K175663R44221k346619
42759b489057q095431j3244933j0923296J120853J3965374J6102495P953703O08337
$$ plain form
42751 4998045 4837993 4893024 1600634 -3187275 -2102535 6630907 15492029 18142048 17610023
42742 17610023 20107394 25659096 29794531 31031675 31184587 29998412 24925668 16355470
42734 16355470 8692858 4984245 3372905 295342 -4780621 -9290987 -11093479 -10525692
42726 -10525692 -9056983 -7006530 -3460776 1675991 6732185 10199535 12574254 14750136
42718 14750136 15420053 12369187 6143724 -169962 -5067172 -9592047 -13505530 -14129880
42710 -14129880 -11073912 -8648784 -10168058 -12396504 -9956916 -3923873 -1284468 -5609793
42702 -5609793 -12552446 -15900933 -14466622 -10993926 -7387033 -4009150 -1924945 -2642035
42694 -2642035 -5863845 -9548557 -11941509 -11911638 -8022189 173829 9661392 15294018
$$ packed form
42751D998045j60052N5031l292390m787909J084740Q733442Q861122K650019n32025
42742A7610023K497371N551702M135435J237144J52912j186175n072744q570198
42734A6355470p662612l708613j611340l077563n075963m510366j802492N67787
42726a0525692J468709K050453L545754N136767N056194L467350K374719K175882
42718A4750136O69917l050866o225463o313686m897210m524875l913483o24350
42710a4129880L055968K425128j519274k228446K439588O033043K639405m325325
42702e609793o942653l348487J434311L472696L606893L377883K084205p17090
42694b642035l221810l684712k392952K9871L889449Q196018R487563N632626
$$ plain form
42686 15294018 14819039 10928223 7341758 4958093 3614900 5219113 11379630 18611934
42678 18611934 20175702 13979164 5353197 263639 -949514 -613719 1846378 7900599
42670 7900599 14283964 14960226 9102047 2400836 -886365 -3080968 -8359942 -16458956
42662 -16458956 -23481104 -26113987 -22818731 -13920157 -3417085 2163112 428255 -3324112
42654 -3324112 -2831848 831598 2071598 351463 1222338 7244543 13430003 14196278 10595916
42645 10595916 7234593 5092992 1702872 -2787066 -4134347 347944 7401813 10993109
42637 10993109 8953948 4967377 3918762 6344055 8218839 5817235 -269075 -6061216
42629 -6061216 -7938561 -4909814 1336591 7024938 7817389 2014256 -7232926 -14125428
$$ packed form
42686A5294018m74979l890816l586465k383665j343193J604213O160517P232304
42678A8611934J563768o196538q625967n089558j213153L35795K460097O054221
42670G900599O383365O76262n858179o701211l287201k194603n278974q099014
42662a6458956p022148k632883L295256Q898574J0503072N580197j734857l752367
42654c324112M92264L663446J240000j720135Q70875O022205O185460P66275l600362
42645A0595916l361323k141601l390120m489938j347281M482291P053869L591296
42637A0993109k039161l986571j048615K425293J874784k401604o086310n792141
42629f061216j877345L028747O246405N688347P92451n803133r247182o892502
$$ plain form
42621 -14125428 -15149185 -11447828 -6883922 -4777784 -5835095 -7649776 -6613478 -2051896
42613 -2051896 1861562 375316 -5764797 -10882245 -11253739 -8705247 -6450175 -4317146
42605 -4317146 -297243 5208940 9392670 10532668 9454378 7960710 7468121 8806874
42597 8806874 11751965 14678880 15672611 13934682 9663058 3366282 -3749560 -9442764
42589 -9442764 -11741709 -10515835 -7278142 -3927454 -1867562 -1175297 -153460 2726583
42581 2726583 5643745 4243810 -2710715 -10407711 -13009473 -10204129 -6356930 -4637441
42573 -4637441 -5009762 -6694299 -8580938 -7635263 -1569585 6018322 7870655 2586530
42565 2586530 -2383474 -452311 5320801 7715897 6522706 7934135 13619459 17399973
$$ packed form
42621a4125428j023757L701357M563906K106138j057311j814681J036298M561582
42613b051896L913458j486246o140113n117448l71494K548492K255072K133029
42605d317146M019903N506183M183730J139998j078290j493668m92589J338753
42597H806874K945091K926915R93731j737929m271624o296776p115842n693204
42589i442764k298945J225874L237693L350688K059892O92265J021837K880043
42581B726583K917162j399935o954525p696996k601762K805344L847199J719489
42573d637441l72321j684537j886639R45675O065678P587907J852333n284125
42565B586530m970004J931163N773112K395096j193191J411429N685324L780514
$$ plain form
42557 17399973 14957231 10845277 11331753 14295342 12307462 4480220 -1065305 1843363
42549 1843363 8905652 11048181 5533411 -2493108 -7694324 -9196760 -7728241 -2997089
42541 -2997089 3874905 8874325 9481818 8612841 10603042 14256667 13887138 7584302 456359
42532 456359 -2078241 -875844 -262722 -1339050 -1879912 -1536132 -2675127 -5606758 -7030578
42523 -7030578 -4979884 -2034907 -1119050 -803978 1769186 4974320 3802801 -3239188
42515 -3239188 -11980974 -17910903 -20250367 -19708559 -15894978 -9323173 -3015138 957521
42507 957521 4451096 9659661 14418527 14794283 11124197 7380338 5094256 2378717
42499 2378717 -830246 -1555695 545821 931964 -3403958 -8786146 -9710456 -6424151 -3914299
$$ packed form
42557A7399973k442742m111954M86476K963589j987880p827242n545525K908668
42549A843363P062289K142529n514770q026519n201216j502436J468519M731152
42541b997089O871994M999420O07493q68977J990201L653625l69529o302836p127943
42532D56359k534600J202397O13122j076328n40862L43780j138995k931631j423820
42523g030578K050694K944977R15857L15072K573164L205134j171519p041989
42515c239188q741786n929929k339464N41808L813581O571805O308035L972659
42507I57521L493575N208565M758866L75756l670086l743859k286082k715539
42499B378717l208963p25449K101516L86143m335922n382188r24310L286305K509852
$$ plain form
42490 -3914299 -4642733 -5763618 -3398473 2582222 7940147 7211412 -1299473 -12627753
42482 -12627753 -19120201 -18358609 -14456083 -10393084 -3726431 6663379 14436835 12597463
42474 12597463 3698503 -3394887 -5466687 -6755435 -9347697 -9261665 -3346806 6495887
42466 6495887 17427536 27479968 31909441 25622501 12368500 3562450 3274701 2228989
42458 2228989 -7009755 -16882382 -16139359 -8181204 -6390348 -13731215 -19200531 -15424370
42450 -15424370 -8387527 -5915077 -6083464 -2975760 3024959 7373031 9358013 11643418
42442 11643418 14304644 14730445 12209595 8389402 4113519 -568416 -3917292 -3374025
42434 -3374025 986776 6051485 8701003 8094909 5913124 5511031 9157138 14319361
$$ packed form
42490c914299p28434j120885K365145N980695N357925p28735q510885j1328280
42482a2627753o492448P61592L902526M062999O666653J0389810P773456j839372
42474A2597463q898960p093390k071800j288748k592262Q6032N914859R842693
42466F495887J0931649J0052432M429473o286940j3254001q806050k87749j045712
42458B228989r238744r872627P43023P958155J790856p340867n469316L776161
42450a5424370P036843K472450j68387L107704O000719M348072J984982K285405
42442A1643418K661226M25801k520850l820193m275883m681935l348876N43267
42434c374025M360801N064709K649518o06094k181785m02093L646107N162223
$$ plain form
42426 14319361 14481781 6139228 -6235121 -14645286 -15897296 -12909580 -8960611 -4371006
42418 -4371006 780310 4191868 3556690 -444719 -4994068 -8190990 -10250270 -12254859
42410 -12254859 -14569175 -16290499 -15899576 -12701797 -7835703 -3598379 -1570897 -1422458
42402 -1422458 -1391206 245580 3836956 7821486 9329817 5968671 -1890885 -10055994
42394 -10055994 -12767717 -7924589 -311744 2494708 -1320452 -5350770 -2943800 4526399
42386 4526399 10391739 11733075 11088021 9841895 5729721 -1385174 -6467777 -5359302
42378 -5359302 -143612 4800621 8579594 11841842 12584031 9151171 5420792 7405045
42370 7405045 15041667 21996602 23475431 19898633 13123388 4138705 -4556365 -9107290
$$ packed form
42426A4319361J62420q342553j2374349q410165j252010K987716L948969M589605
42418d371006N151316L411558o35178m001409m549349l196922k059280k004589
42410a2254859k314316j721324L90923L197779M866094M237324K027482J48439
42402a422458L1252J636786L591376L984530J508331l361146p859556q165109
42394a0055994k711723M843128P612845K806452l815160m030318K406970P470199
42386D526399N865340J341336o45054j246126m112174p114895n082603J108475
42378e359302N215690M944233L778973L262248P42189l432860l730379J984253
42370G405045P636622O954935J478829l576798o775245q984683q695070m550925
$$ plain form
42362 -9107290 -8840097 -7142324 -6425941 -5867761 -5441783 -7633386 -12405795 -14533399 -9839675
42353 -9839675 -1390557 4399071 5905320 6725700 9296333 12014127 12534116 10766109
42345 10766109 8268968 6790892 7311004 8740906 8142703 4149863 -609454 -2636544
42337 -2636544 -2203447 -2337470 -3967992 -5125111 -4681105 -3625448 -2339714 79340 2879517
42328 2879517 3184526 1241 -3820172 -5153117 -3816609 -833179 3779230 9237677
42320 9237677 12484767 11507474 8733373 8229600 10547749 13078802 14359410 14669904 13132229
42311 13132229 8400947 2687559 713351 2756248 2654377 -4015852 -12603733 -14438584
42303 -14438584 -8062769 -1169583 -1020753 -6620500 -11648130 -11945876 -7917184 -2034579
$$ packed form
42362i107290K67193J697773P16383N58180M25978k191603m772409k127604M693724
42353i839675Q449118N789628J506249Q20380K570633K717794N19989j768007
42345A0766109k497141j478076N20112J429902n98203l992840m759317k027090
42337b636544M33097j34023j630522j157119M44006J055657J285734K419054K800177
42328B879517L05009l183285l821413j332945J336508K983430M612409N458447
42320I237677L247090r77293k774101n03773K318149K531053J280608L10494j537675
42311A3132229m731282n713388j974208K042897j01871o670229q587881j834851
42303a4438584O375815O893186J48830n599747n027630k97746M028692N882605
$$ plain form
42295 -2034579 2723724 2885114 -3474478 -13532081 -20667894 -20335677 -14325676 -8178669
42287 -8178669 -5103156 -3810674 -2066461 -504125 -1724695 -6368032 -11587247 -13837909
42279 -13837909 -12357854 -9298278 -7063490 -6582383 -8074138 -11942649 -17532838 -21503475
42271 -21503475 -19449868 -10536999 108159 5258853 2501552 -3299663 -4789855 1163903
42263 1163903 11600465 20969184 25310238 23688071 17337946 8265518 -1651679 -10533254
42255 -10533254 -15940654 -15780273 -10725976 -4646615 -929803 1122470 4624289 10558157
42247 10558157 17081085 22687590 26922317 27879256 22835223 12817482 3151112 -2437895
42239 -2437895 -5058334 -6153249 -4031415 1658183 6158421 5453794 2908844 4345109
$$ packed form
42295b034579M758303J61390o359592j0057603p135813L32217O010001O147007
42287h178669L075513J292482J744213J562336j220570m643337n219215k250662
42279a3837909J480055L059576K234788M81107j491755l868511n590189l970637
42271b1503475K053607Q912869J0645158N150694k757301n801215j490192N953758
42263A163903J0436562R368719M341054j622167o350125r072428r917197q881575
42255a0533254n407400J60381N054297O079361L716812K052273L501819N933868
42247A0558157O522928N606505M234727R56939n044033j0017741r666370n589007
42239b437895k620439j094915K121834N689598M500238p04627k544950J436265
$$ plain form
42231 4345109 8839142 10874252 9794598 9352069 8564922 2346849 -7017530 -8872169
42223 -8872169 464536 9882443 7979658 -1390723 -6344045 -4462903 -3076721 -4548154
42215 -4548154 -2118439 8016902 19327057 23511809 20644437 16798191 15405265 14736364
42207 14736364 11939151 6682902 1281189 -1811337 -2935407 -4882090 -8430644 -10133605
42199 -10133605 -7199100 -2484280 -561418 -472979 2253850 6951335 7366915 1056063
42191 1056063 -6563424 -9861540 -9663079 -9443019 -9469859 -8318952 -6553286 -5115402 -2849693
42182 -2849693 830563 3195620 1635056 -1954447 -3396545 -1492957 1485797 3100063
42174 3100063 2401657 118331 -859151 2430711 8213916 10216632 5661253 -235821
$$ packed form
42231D345109M494033K035110j079654m42529p87147o218073r364379j854639
42223h872169R336705R417907j902785r370381m953322J881142J386182j471433
42215d548154K429715J0135341J1310155M184752k867372l846246j392926o68901
42207A4736364k797213n256249n401713l092526j124070j946683l548554j702961
42199a0133605K934505M714820J922862Q8439K726829M697485M15580o310852
42191A056063p619487l298116J98461K20060k6840J150907J765666J437884K265709
42182b849693L680256K365057j560564l589503j442098J903588K978754J614266
42174C100063o98406k283326r77482L289862N783205K002716m555379n897074
$$ plain form
42166 -235821 -1870286 -2179673 -8014009 -18102250 -22686056 -16463990 -5813617 57406
42158 57406 531065 1607412 5231634 6339112 1281367 -5434454 -6244897 -440267 5101684
42149 5101684 5315812 2869009 2417980 2921616 363560 -4204595 -5448596 -2279238 851286
42140 851286 2493538 7334475 17426217 26206175 26199561 18399562 9125980 1621438 -3692366
42131 -3692366 -4453243 914159 7346127 6944142 -1231510 -10316615 -14227223 -12345263
42123 -12345263 -6730618 -328006 2509830 -397849 -4694626 -4083141 758291 3558541
42115 3558541 2440990 1609035 2543254 1440817 -2422877 -3956975 -1849899 -3194020
42107 -3194020 -12705274 -23628027 -26341633 -21482034 -17343086 -17578632 -18926192 -19063075
$$ packed form
42166b35821j634465l09387n834336j0088241m583806O222066J0650373N871023
42158E7406M73659J076347L624222J107478n057745o715821q10443N804630N541951
42149E101684K14128k446803m51029N03636k558056m568155j244001L169358L130524
42140H51286J642252M840937J0091742Q779958o614p799999r273582p504542n313804
42131c692366p60877N367402O431968m01985q175652r085105l910608J881960
42123a2345263N614645O402612K837836k907679m296777O11485M841432K800250
42115C558541j117551q31955R34219j102437l863694j534098K107076j344121
42107c194020r511254j0922753k713606M859599M138948k35546j347560j36883
$$ plain form
42099 -19063075 -19036332 -18307601 -14688953 -10347296 -11447210 -19343363 -27136679 -28188179
42091 -28188179 -24527583 -23235733 -26347639 -27865668 -21110258 -7229206 4785479 6879848
42083 6879848 340695 -5830712 -5295583 -1154354 -781035 -5881388 -10756142 -9861480 -3902171
42074 -3902171 2232253 5059130 4710898 3130208 1586167 -269563 -3409492 -7471939
42066 -7471939 -10164842 -9252279 -4847871 945657 6346580 11116793 15798889 20468838
42058 20468838 24095014 24805807 21355806 14814181 8243257 4268712 3418856 4724474
42050 4724474 6739795 7850862 7178453 5725438 5137253 4897552 2596175 -2428827 -7843955
42041 -7843955 -11508627 -13526212 -14118571 -12310589 -8363824 -4631519 -2043247 1023489
$$ packed form
42099a9063075K6743P28731L618648M341657j099914p896153p793316j051500
42091b8188179L660596J291850l111906j518029O755410J3881052J2014685K094369
42083F879848o539153o171407N35129M141229L73319n100353m874754Q94662N959309
42074c902171O134424K826877l48232j580690j544041j855730l139929m062447
42066g471939k692903R12563M404408N793528N400923M770213M682096M669949
42058B0468838L626176P10793l450001o541625o570924l974545q49856J305618
42050D724474K015321J111067o72409j453015n88185k39701k301377n025002n415128
42041g843955l664672k017585n92359J807982L946765L732305K588272L066736
$$ plain form
42033 1023489 3880274 1513132 -8251880 -18750258 -21247483 -16081106 -11348496 -11252830
42025 -11252830 -11923946 -9515424 -6386224 -6721963 -10451379 -14299348 -15787123 -14140835
42017 -14140835 -10197906 -7164784 -8314027 -12061570 -12601174 -7511113 -1228722 1627177
42009 1627177 2626646 5555205 9504499 10889916 10167455 10879160 12654116 10913238 4460805
42000 4460805 -1890173 -4376698 -5305561 -7826423 -9802407 -7777656 -4626687 -7163906
41992 -7163906 -15841608 -22440685 -20402165 -13050062 -7949830 -6606720 -4889198 -1822304
41984 -1822304 -1567262 -5656250 -9033637 -7035324 -2276384 -620723 -2873567 -4571262
41976 -4571262 -2525485 2345307 7915088 12868841 16007326 16799617 16771035 17744509 19054175
$$ packed form
42033A023489K856785k367142r765012j0498378k497225N166377M732610R5666
42025a1252830o71116K408522L129200l35739l729416l847969j487775J646288
42017a4140835L942929L033122j149243l747543n39604N090061O282391K855899
42009A627177R99469K928559L949294J385417p22461P11705J774956j740878o452433
42000D460805o350978k486525r28863k520862j975984K024751L150969k537219
41992g163906q677702o599077K038520P352103N100232J343110J717522L066894
41984a822304K55042m088988l377387J998313M758940J655661k252844j697695
41976d571262K045777M870792N569781M953753L138485P92291k8582R73474J309666
$$ plain form
41967 19054175 19200714 19381316 21661749 24012572 21596977 13878019 6449154 4344548
41959 4344548 6880281 10311494 11967655 10347727 5218767 -19589 141980 6443378
41951 6443378 12674320 13371460 10440653 8542985 7207836 2574014 -4875343 -9773070
41943 -9773070 -9039897 -5208513 -2018300 -273657 1075753 2563115 3699299 2770901
41935 2770901 -2719865 -12686930 -21483364 -21668472 -12227649 -890014 3187137 -2112915
41927 -2112915 -11098447 -16288255 -14646403 -9531154 -7444200 -11941476 -20241492 -26310822
41919 -26310822 -26826635 -23197520 -18828843 -16311789 -16471788 -17727450 -16681897 -11722245
41911 -11722245 -5710735 -2554257 -1633659 1055937 6469079 11391883 14358558 17716145
$$ packed form
41967A9054175J46539J80602K280433K350823k415595p718958p428865k104606
41959D344548K535733L431213J656161j619928n128960n238356J61569O301398
41951F443378O230942O97140k930807j897668j335149m633822p449357m897727
41943i773070P33173L831384L190213J744643J349410J487362J136184r28398
41935B770901n490766r967065q796434j85108R440823J1337635M077151n300052
41927b112915q985532n189808J641852N115249K086954m497276q300016o069330
41919b6310822n15813L629115M368677K517054j59999j255662J045553M959652
41911a1722245O011510L156478R20598K689596N413142M922804K966675L357587
$$ plain form
41903 17716145 21429531 19689775 8370500 -6779549 -14439252 -9773598 1358255 9807684
41895 9807684 11350122 7640831 2722733 107497 1190867 4786241 8351774 9615993
41887 9615993 6884961 -457350 -9873781 -15622393 -13790321 -7030427 -1557816 334830
41879 334830 1866333 6067454 12043476 17414747 20552272 19089649 10665917 -1830972
41871 -1830972 -9596259 -6994046 891969 4488244 2148685 1008602 5414496 10340971
41863 10340971 8778462 1080279 -6952966 -12437114 -17284097 -22655520 -25983000 -24675802
41855 -24675802 -19904132 -14861748 -10810152 -6737823 -2416799 81130 -1277706 -5478388
41847 -5478388 -8970947 -9237324 -6772735 -3215046 782186 4258068 4192031 -1627887 -9892890
$$ packed form
41903A7716145L713386j739756j1319275j5150049p659703M665654J1131853Q449429
41895I807684J542438l709291m918098k615236J083370L595374L565533J264219
41887I615993k731032p342311r416431n748612J832072O759894N472611J892646
41879C34830J531503M201121N976022N371271L137525j462623q423732j2496889
41871a830972p765287K602213P886015L596275k339559j140083M405894M926475
41863A0340971j562509p698183q033245n484148m846983n371423l327480J307198
41855b4675802M771670N042384M051596M072329M321024K497929j358836m200682
41847e478388l492559k66377K464589L557689L997232L475882o6037n819918q265003
$$ plain form
41838 -9892890 -13495116 -9640250 -3433324 -1131572 -2362105 -2074465 1894571 7246296
41830 7246296 12136878 16986378 20817189 20185791 13836224 5348265 -1110874 -5335893
41822 -5335893 -9145151 -11993616 -11366918 -6610828 48402 5950670 9748624 11263869
41814 11263869 11356909 11649372 12871236 13721944 12660378 10414564 9222340 9701973 9830549
41805 9830549 7107522 725891 -8250346 -17673525 -25134739 -29020369 -29307210 -27284999
41797 -27284999 -24749581 -23357227 -23561148 -23517749 -20405990 -14206487 -9103725 -9307200 -14000029
41788 -14000029 -18243920 -18598217 -15904216 -12543461 -9304796 -6008762 -3364809 -2215668
41780 -2215668 -1370383 1978162 8785435 15876650 18560264 15920042 12080234 10770390
$$ packed form
41838i892890l602226L854866O206926K301752j230533K87640L969036N351725
41830G246296M890582M849500L830811o31398o349567q487959o459139m225019
41822e335893l809258k848465O26698M756090O659230N902268L797954J515245
41814A1263869R3040K92463J221864Q50708j061566k245814j192224M79633J28576
41805I830549k723027o381631q976237r423179p461214l885630k86841K022211
41797b7284999K535418J392354k03921M3399L111759O199503N102762k03475m692829
41788a4000029m243891l54297K694001L360755L238665L296034K643953J149141
41780b215668Q45285L348545O807273P091215K683614k640222l839808j309844
$$ plain form
41772 10770390 9929673 4603371 -4953242 -11872638 -11075141 -5709951 -2407381 -2954575
41764 -2954575 -4388006 -4996821 -5310554 -4119230 1013346 8513333 12911418 11887550
41756 11887550 9212742 8834241 9906377 10045325 9771801 10484728 10959215 9443339 7138033
41747 7138033 6171669 5910168 4745121 3830446 4933340 5581325 1067681 -8087391 -14705580
41738 -14705580 -12754614 -4176331 3436559 4165885 -2099292 -10823878 -16703183 -17602785
41730 -17602785 -15884288 -15440696 -17256442 -18658901 -16759003 -11464286 -5277727 -1381828
41722 -1381828 -1504370 -4008030 -4458849 -95662 6480545 10268973 10178339 9445557 9703857
41713 9703857 8491519 4127582 -650793 -2477475 -1642393 462579 4960050 11989193
$$ packed form
41772A0770390q40717n326302r556613o919396P97497N365190L302570n47194
41764b954575j433431o08815l13733J191324N132576P499987M398085j023868
41756A1887550k674808l78501J072136J38948k73524P12927M74487j515876k305306
41747G138033r66364k61501j165047r14675J102894O47985m513644r155072o618189
41738a4705580J950966Q578283P612890P29326o265177q724586n879305q99602
41730a7602785J718497M43592j815746j402459J899898N294717O186559L895899
41722a381828j22542k503660m50819M363187O576207L788428r0634p32782K58300
41713I703857j212338m363937m778375j826682Q35082K104972M497471P029143
$$ plain form
41705 11989193 15944916 10551352 -978105 -7066300 -1799162 7020781 7932650 390864
41697 390864 -6049451 -5403353 -1812814 -1259057 -2344664 726319 8993461 17100889 20043987
41688 20043987 17709230 12449857 5728013 -1382997 -7140722 -10822275 -13892515 -17463077
41680 -17463077 -19804474 -18551863 -14620936 -11623680 -11464184 -12481463 -12216043 -10394978
41672 -10394978 -8721815 -8790568 -10359638 -10919116 -7586761 -758179 5044884 6119451
41664 6119451 4711065 6327122 11951552 16320713 14939300 9481040 4317192 612400
41656 612400 -3423282 -8389974 -12560760 -13765547 -10517865 -2884834 5739414 9731211
41648 9731211 6872404 1399720 -1203236 -713056 -499844 -1563029 -2547205 -4238067 -8769106
$$ packed form
41705A1989193L955723n393564j1529457o088195N267138Q819943R11869p541786
41697C90864o440315O46098L590539N53757j085607L070983Q267142Q107428K943098
41688B0043987k334757n259373o721844p111010n757725l681553l070240l570562
41680a7463077k341397J252611L930927K997256J59496j017279K65420J821065
41672a0394978J673163o8753j569070n59478L332355O828582N803063J074567
41664F119451j408386J616057N624430M369161j381413n458260n163848l704792
41656F12400m035682m966692m170786j204787L247682P633031Q624248L991797
41648I731211k858807n472684k602956M90180K13212j063185r84176j690862m531039
$$ plain form
41639 -8769106 -14389552 -16228008 -13253421 -9744522 -8523037 -7557565 -5239803 -3986351
41631 -3986351 -5311983 -5632082 -1192947 5757087 9710920 8518335 3761872 -2792611
41623 -2792611 -8889224 -10268229 -4654330 3559150 7337747 5622259 3837058 5911840
41615 5911840 10012055 12606452 12655024 10729442 7608753 5021299 4562152 4580283 1267792
41606 1267792 -5548607 -10518231 -8573104 -507459 8758420 15339887 18233670 18130092
41598 18130092 16437735 14270604 10970492 4778106 -4049151 -12287181 -17058417 -18756378
41590 -18756378 -19661940 -21032433 -22587249 -23549591 -23098400 -20744640 -16970502 -12708431
41582 -12708431 -8177815 -3356466 1013803 4741605 9429922 15303373 17676568 11219929
$$ packed form
41639h769106n620446j838456K974587L508899J221485R65472K317762J253452
41631c986351j325632l20099M439135O950034L953833j192585m756463o554483
41623b792611o096613j379005N613899Q213480L778597j715488j785201K074782
41615E911840M100215K594397M8572j925582l120689k587454m59147J8131l312491
41606A267792o816399m969624J945127Q065645R265879O581467K893783j03578
41598A8130092j692357k167131l300112o192386q827257q238030m771236j697961
41590a8756378r05562j370493j554816r62342M51191K353760L774138M262071
41582a2708431M530616M821349M370269L727802M688317N873451K373195o456639
$$ plain form
41574 11219929 -1698927 -11962585 -14811190 -15040695 -18293119 -22244013 -21066804 -14787490
41566 -14787490 -8540485 -4533307 -145081 6600293 14011044 19041700 19622267 15624746
41558 15624746 10212540 8316006 10546374 11184714 6321831 821940 1216658 4335434
41550 4335434 1105362 -8840609 -15283533 -12137879 -5523695 -3044327 -2687978 1378326
41542 1378326 7857315 10856590 10018287 10292616 12794329 13245583 10040405 7136749 6873154
41533 6873154 5817317 1380615 -2136976 622937 6693995 7331171 186361 -6801960
41525 -6801960 -6379024 -2128165 -2707933 -8778504 -12503367 -10202003 -8023513 -11444049
41517 -11444049 -15504551 -11965019 -2348894 3805015 2432631 -980135 -1430027 -979587
$$ packed form
41574A1219929j2918856j0263658k848605k29505l252424l950894J177209O279314
41566a4787490O247005M007178M388226O745374P410751N030656N80567l997521
41558A5624746n412206j896534K230368O38340m862883n499891L94718L118776
41550D335434l230072r945971o442924L145654O614184K479368L56349M066304
41542A378326O478989K999275q38303K74329K501713M51254l205178k903656k63595
41533F873154j055837m436702l517591K759913O071058O37176p144810o988321
41525f801960M22936M250859n79768o070571l724863K301364K178490l420536
41517a1444049m060502L539532R616125O153909j372384l412766m49892M50440
$$ plain form
41509 -979587 -2615193 -4096562 -2415335 249908 12440 -2192282 -2212376 877331 3934319
41500 3934319 4359924 2323130 -824029 -3618656 -4637158 -3783036 -2710711 -2332367 -1174396
41491 -1174396 2130762 6319487 9230150 10221532 9045527 4782591 -1357062 -4454626
41483 -4454626 -714232 7315488 13533169 15254674 14364286 12734425 10164330 6548649
41475 6548649 2796778 -547691 -3116305 -3580573 -1391398 818007 -613894 -6139919
41467 -6139919 -13459403 -21196333 -28613737 -32341485 -27965732 -15994784 -2706212 6228834
41459 6228834 9930136 9252985 3645577 -6083183 -14615528 -15666462 -8708429 -178964
41451 -178964 2368064 -3235002 -12492878 -18471124 -17335993 -10439103 -1977099 4209881
$$ packed form
41509i79587j635606j481369J681227K665243k37468k204722k0094L089707L056988
41500C934319M25605k036794l147159k794627j018502Q54122J072325L78344J157971
41491a174396L305158M188725K910663R91382j176005m262936o139653l097564
41483d454626L740394Q029720O217681J721505q90388j629861k570095l615681
41475F548649l751871l344469k568614m64268K189175K209405j431901n526025
41467f139919p319484p736930p417404l727748M375753J1970948J3288572Q935046
41459F228834L701302o77151n607408r728760q532345j050934O958033Q529465
41451a78964K547028n603066r257876n978246J135131O896890Q462004O186980
$$ plain form
41443 4209881 5896929 3249751 -117666 573402 5059189 6099531 -2407243 -16488764
41435 -16488764 -25658584 -25117281 -19546906 -14165099 -7816950 1989394 12119986 17104142
41427 17104142 17082572 17230251 19579073 20098285 15257130 7914285 3987360 4969584 6688593
41418 6688593 5381238 2204625 252384 -768838 -3929289 -9801639 -15305109 -18491469
41410 -18491469 -20703568 -21968937 -18280623 -7579101 4383647 9535402 7752495 6110700
41402 6110700 7847770 8106322 2729116 -4069417 -4806459 1582525 9138269 12575705
41394 12575705 12383791 12555857 15369731 18808928 18762122 14003814 8190860 5282048 3957845
41385 3957845 -314871 -7856771 -13379004 -13200165 -10150896 -9166997 -11002292 -12740426
$$ packed form
41443D209881J687048k647178l367417O91068M485787J040342q506774j4081521
41435a6488764r169820N41303N570375N381807O348149R806344J0130592M984156
41427A7104142k1570J47679K348822N19212m841155p342845l926925R82224J719009
41418F688593j307355l176613j952241j021222l160451n872350n503470l186360
41410a8491469k212099j265369L688314J0701522J1962748N151755j782907j641795
41402F110700J737070K58552n377206o798533p37042O388984P555744L437436
41394A2575705j91914J72066K813874L439197m6806m758308n812954k908812j324203
41385C957845m272716p541900n522233J78839L049269R83899j835295j738134
$$ plain form
41377 -12740426 -12161991 -9196383 -4948211 -1459376 -816106 -2646455 -3963289 -2764902
41369 -2764902 -10420 2823739 5536662 7394991 6656380 3718589 1773109 2358852
41361 2358852 3249005 2600449 1608483 809313 -1944309 -6504169 -7867491 -3189945 2426529
41352 2426529 2449877 -1904606 -4642956 -4211438 -3264313 -1640849 2669261 6430406 3458598
41343 3458598 -4701570 -8266862 -2448975 5348970 5658507 -765134 -5315854 -2846767
41335 -2846767 3518914 6885353 3042461 -5667726 -11002309 -5888402 7168719 17552166
41327 17552166 18398908 13632253 10670844 10360967 8732180 5525972 4715394 7288427
41319 7288427 9649136 10526967 14180375 23425092 32775744 32846219 21179715 5741624
$$ packed form
41377a2740426N78435K965608M248172L488835O43270j830349j316834J198387
41369b764902K754482K834159K712923J858329p38611k937791j945480N85743
41361B358852Q90153o48556r91966p99170k753622m559860j363322M677546N616474
41352B426529K3348m354483k738350M31518R47125J623464M310110L761145k971808
41343C458598q160168l565292N817887P797945L09537o423641m550720K469087
41335b846767O365681L366439l842892q710187n334583N113907J3057121J0383447
41327A7552166Q46742m766655k961409l09877j628787l206208q10578K573033
41319G288427K360709Q77831L653408R244717R350652P0475j1666504j5438091
$$ plain form
41311 5741624 -2993819 -1710310 4478967 8569776 7930252 4968748 3590894 5392664
41303 5392664 8144676 7647080 2044038 -5641151 -10545140 -11390556 -10857800 -10523010 -8524210
41294 -8524210 -3344771 3542716 10680788 18206170 23404659 19766892 6529179 -4705980
41286 -4705980 -1431294 12671378 21107955 16200000 7931519 7453474 11053612 7957597
41278 7957597 -2476026 -10573005 -10279201 -4609455 1804304 7586908 11510367 11803760
41270 11803760 10518185 12499189 17468578 18573646 12193261 4469700 3647357 9288097
41262 9288097 14104180 14502604 13810867 15160857 16544621 15042322 12018074 10624168
41254 10624168 10162296 6901711 474703 -4127913 -2600663 2953007 6579431 5404794
$$ packed form
41311E741624q735443J283509O189277M090809o39524k961504j377854J801770
41303E392664K752012m97596n603042p685189m903989q45416N32756L34790J998800
41294h524210N179439O887487P138072P525382N198489l637767j3237713j1235159
41286d705980L274686J4102672Q436577m907955q268481m78045L600138l096015
41278G957597j0433623q096979K93804N669746O413759N782604L923459K93393
41270A1803760j285575J981004M969389J105068o380385p723561q22343N640740
41262I288097M816083L98424o91737J349990J383764j502299l024248j393906
41254A0624168m61872l260585o427008m602616J527250N553670L626424j174637
$$ plain form
41246 5404794 1545163 -2142985 -5178414 -7777757 -8802771 -7082168 -3357558 398354
41238 398354 2482121 1455890 -3477489 -10283692 -13739472 -9887345 -804239 6977196
41230 6977196 9095510 7106890 5579350 6952679 9812798 11089067 9035115 4476963
41222 4476963 -127476 -2773149 -3397989 -3632071 -5209603 -8386213 -11501177 -12150599 -9310631
41213 -9310631 -4526288 -836696 -567194 -4167080 -10419648 -16930527 -20835076 -20149075
41205 -20149075 -14695428 -5617914 5208853 14898079 20410469 21370418 20747104 20810772
41197 20810772 19901467 15852514 11006704 9819428 12015133 12542002 8644222 2441865
41189 2441865 -4275045 -12546438 -21458700 -26158359 -24243781 -19845816 -17321226 -14888605
$$ packed form
41246E404794l859631l688148l035429k599343j025014J720603L724610L755912
41238C98354K083767j026231m933379o806203l455780L852127R083106P781435
41230F977196K118314j988620j527540J373329K860119J276269k053952m558152
41222D476963m604439k645673o24840k34082j577532l176610l114964o49422K839968
41213i310631M784343L689592K69502l599886o252568o510879l904549O86001
41205b0149075N453647R077514J0826767R689226N512390R59949o23314O3668
41197B0810772r09305m048953m845810j187276K195705N26869l897780o202357
41189B441865o716910q271393q912262m699659J914578M397965K524590K432621
$$ plain form
41181 -14888605 -9442457 -4240152 -5535183 -12956143 -19144670 -19082543 -15154216 -12625660
41173 -12625660 -13946483 -17733209 -20048790 -16888844 -8707416 -1940696 -2474132 -8284232
41165 -8284232 -12491219 -12838455 -13241576 -16100065 -18598766 -17791984 -14268184 -8975524 -1175301
41156 -1175301 7983008 14016945 14204792 11046214 8236491 6216387 4054946 2655915
41148 2655915 3345487 5742019 9343212 14582709 19977032 21235264 16384262 9505292
41140 9505292 6147331 6648553 6786489 3551334 -2114702 -6577380 -5335645 3906923
41132 3906923 17011153 24700296 21926126 14208629 10604394 11800907 10057104 833280
41124 833280 -10525614 -15414871 -11754737 -4905669 -886757 -881998 -1851806 -1108111 387150
$$ packed form
41181a4888605N446148N202305j295031p420960o188527O2127L928327K528556
41173a2625660j320823l786726k315581L159946Q181428O766720n33436n810100
41165h284232m206987l47236m03121k858489k498701Q06782L523800N292660P800223
41156a175301R158309O033937J87847l158578k809723k020104k161441j399031
41148B655915O89572K396532L601193N239497N394323J258232m851002o878970
41140I505292l357961N01222J37936l235155n666036m462678J241735R242568
41132C906923J3104230P689143k774170p717497l604235J196513j743803r223824
41124H33280j1358894m889257L660134O849068M018912M759r69808P43695J495261
$$ plain form
41115 387150 -313481 -3520900 -5692174 -3685503 1614205 7313191 12036586 15294229
41107 15294229 15486360 11780716 6798597 4218335 4353148 4825786 4456709 3310443 450782
41098 450782 -3920286 -5109608 1577973 12305078 16433297 9107777 -2799952 -10150467
41090 -10150467 -11929798 -11902995 -9518056 -1169951 10619002 16260210 9776118 -3388587
41082 -3388587 -11861263 -9854673 -1480573 4986634 5200455 1382849 -1554142 -1396171
41074 -1396171 230657 1475499 3346707 8034527 15086517 21080697 23408626 23080405
41066 23080405 22847776 23053542 20694050 13723709 5971532 5488593 15749023 29340370
41058 29340370 33625853 23733139 7454428 -4066045 -7639312 -7592101 -7107157 -5065497
$$ packed form
41115C87150p00631l207419k171274K006671N299708N698986M723395L257643
41107A5294229J92131l705644m982119k580262J34813M72638l69077j146266k859661
41098D50782m371068j189322O687581J0727105M128219p325520j1907729p350515
41090a0150467j779331K6803K384939Q348105J1788953N641208o484092j3164705
41082c388587q472676K006590Q374100O467207K13821l817606k936991J57971
41074a396171J626828J244842J871208M687820P051990N994180K327929l28221
41066B3080405k32629K05766k359492o970341p752177m82939J0260430J3591347
41058B9340370M285483r892714j6278711j1520473l573267M7211M84944K041660
$$ plain form
41050 -5065497 -1229421 686410 -2234482 -7239449 -8957756 -6320055 -3977001 -6887768
41042 -6887768 -15042723 -23623946 -27299009 -24172045 -16308435 -7136628 998709 6531817
41034 6531817 7536606 3375609 -2558503 -4789470 -1935724 1597118 2084167 1723670
41026 1723670 3900390 5827691 1749390 -6722696 -10081900 -3521340 5407449 6429327
41018 6429327 28999 -4501225 -2370968 1952587 3260947 2083775 155616 -4893313
41010 -4893313 -15567534 -28167023 -35199890 -33364223 -25696951 -16303347 -6339730 4247702
41002 4247702 13672662 18541985 16568432 8943294 538295 -3029852 37836 6150163
40994 6150163 10030071 9392968 5430911 457217 -3013153 -2369818 2854135 9016365
$$ packed form
41050e065497L836076J915831k920892n004967j718307K637701K343054k910767
41042f887768q154955q581223l675063L126964P863610R171807Q135337N533108
41034F531817J004789m160997n934112k230967K853746L532842M87049l60497
41026A723670K176720J927301m078301q472086l359204O560560Q928789J021878
41018F429327o400328m530224K130257M323555J308360j177172j928159n048929
41010d893313j0674221j2599489p032867J835667P667272R393604R963617J0587432
41002D247702R424960M869323j973553p625138q404999l568147L067688O112327
40994F150163L879908o37103l962057m973694l470370O43335N223953O162230
$$ plain form
40986 9016365 11289055 8825046 4835796 1704777 -939871 -2752673 -966243 5421672
40978 5421672 12185400 13692403 9342000 3760263 1094776 1546026 3576635 6836589
40970 6836589 11315191 15192380 16070501 14734435 15628351 21632466 29080475 30624720
40962 30624720 23870074 14609984 9524139 8087270 5178846 58917 -2420020 -157490
40954 -157490 2026997 -354386 -4022318 -2112167 6423836 16077982 22259151 24718247
40946 24718247 23555327 17095983 6094115 -3740523 -6876131 -3863529 650509 4258839
40938 4258839 7853232 11109498 11047074 6642829 1930760 1712621 5342324 7452450 4778035
40929 4778035 -69557 -2204377 159112 4975108 9262743 11110816 10012756 7251844
$$ packed form
40986I016365K272690k464009l989250l131019k644648j812802J786430O387915
40978E421672O763728J507003m350403n581737k665487M51250K030609L259954
40970F836589M478602L877189Q78121j336066Q93916O004115P448009J544245
40962C0624720o754646r260090n085845j436869k908424n119929k478937K262530
40954a57490K184487k381383l667932J910151Q536003R654146O181169K459096
40946B4718247j162920o459344j1001868r834638l135608L012602M514038L608330
40938D258839L594393L256266o2424m404245m712069k18139L629703K110126k674415
40929D778035m847592k134820K363489M815996M287635J848073j098060k760912
$$ plain form
40921 7251844 5649435 7261458 11220086 14786109 16018110 14369221 9919352 4255020
40913 4255020 1296466 4158462 10810378 15697841 16596384 17195404 21496054 28058221
40905 28058221 31636397 28707516 19844153 8730377 828382 862556 8560010 17592723
40897 17592723 21117778 18099143 12798075 9252146 8169211 8009640 6718906 3115764
40889 3115764 -1256048 -2412343 1783383 8513027 13542516 16846925 21779274 29270159
40881 29270159 36189311 39620680 39680076 37591558 33893630 29458122 25762018 23031431
40873 23031431 20023744 16383119 13400766 12003812 11961671 13480721 17462480 23485198
40865 23485198 29096896 31339476 27929495 18533465 7671241 4415105 14042796 29997744
$$ packed form
40921G251844j602409J612023L958628L566023J232001j648889m449869n664332
40913D255020k958554K861996O651916M887463Q98543N99020M300650O562167
40905B8058221L578176k928881q863363j1113776p901995L4174P697454R032713
40897A7592723L525055l018635n301068l545929j082935j59571j290734l603142
40889C115764m371812j156295M195726O729644N029489L304409M932349P490885
40881B9270159O919152L431369N9396k088518l697928m435508l696104k730587
40873B3031431l007687l640625k982353j396954m2141J519050L981759O022718
40865B3485198N611698K242580l409981r396030j0862224l256136R627691J5954948
$$ plain form
40857 29997744 39501763 38158354 33489186 32439745 32095510 26793002 18367326 13223889
40849 13223889 13228157 15887835 20719484 28598667 36298282 38633338 36087507 34201119
40841 34201119 34963034 34952595 33205742 34443070 41359067 48939304 50699700 47146611
40833 47146611 43840086 43434158 44040587 44522729 47163056 54088844 63503323 70896145
40825 70896145 73302475 71863248 70713019 73886301 83160163 97832680 115058406 130417655
40817 130417655 140665766 147779105 158460795 177054258 200201176 221389215 239528582
40810 239528582 259165197 282843377 308233143 333842954 362342023 394854468 425449186
40803 425449186 445530531 452529655 451263745 447471104 442436987 433470683 417556202 394553267
$$ packed form
40857B9997744R504019j343409m669168j049441l44235n302508q425676n143437
40849A3223889M268K659678M831649P879183P699615K335056k545831j886388
40841C4201119P61915j0439j746853J237328O915997P580237J760396l553089
40833D7146611l306525m05928O06429M82142K640327O925788R414479P392822
40825G0896145K406330j439227j150229L173282R273862J4672517J7225726J5359249
40817A30417655J0248111P113339J0681690J8593463K3146918K1188039J8139367
40810B39528582J9636615K3678180K5389766K5609811K8499069L2512445L0594718
40803D25449186K0081345O999124j265910l792641n034117q966304j5914481k3002935
$$ plain form
40795 394553267 368046031 342837231 320997955 301035989 281077812 261293803 242760437
40788 242760437 226053937 211951993 201274324 192575830 182135790 167902782 151417532
40781 151417532 134343315 115968269 96727669 81341338 74427163 74288944 74672318 71791196
40773 71791196 66317126 59793913 53575401 50834730 54278695 60435473 61019235 52892096
40765 52892096 43119866 40461990 44119427 45103896 38077380 27657291 21799460 22137588
40757 22137588 23610952 22334949 20460736 22068585 26537365 28780059 25927779 21247470
40749 21247470 20201287 24137578 29252692 30737082 26628926 18637381 10959291 7841454
40741 7841454 10516041 16152332 20519067 21447377 19229536 14811480 9223082 4391529
$$ packed form
40795C94553267k6507236k5208800k1839276j9961966j9958177j9784009j8533366
40788B42760437j6706500j4101944j0677669q698494j0440040j4233008j6485250
40781A51417532j7074217j8375046j9240600j5386331o914175j38219L83374k881122
40773G1791196n474070o523213o218512k740671L443965O156778N83762q127139
40765E2892096r772230k657876L657437R84469p026516j0420089n857831L38128
40757B2137588J473364j276003j874213J607849M468780K242694k852280m680309
40749B1247470j046183L936291N115114J484390m108156p991545p678090l117837
40741G841454K674587N636291M366735R28310k217841m418056n588398m831553
$$ plain form
40733 4391529 2853295 6069121 13163850 20831312 24506924 21381192 13486358 6539395
40725 6539395 4459627 6200770 8861196 11625402 14612933 16188257 14730615 11871005
40717 11871005 10734042 11683245 12750379 13286323 13738850 12735492 8700280 4334146
40709 4334146 4900508 11046445 17485931 20159654 20502795 20675686 18957517 13265975 5987351
40700 5987351 1291199 -572608 -2732594 -6546191 -10158570 -11600264 -10467092 -6597929
40692 -6597929 458744 9987424 19271956 24577421 23036906 14982475 5376921 1361220
40684 1361220 6391995 17072000 26648114 30782554 29188435 23491766 15787903 8710148
40676 8710148 4682182 4403583 6729328 10100794 13758243 17726992 21637300 23395549
$$ packed form
40733D391529j538234L215826P094729P667462L675612l125732p894834o946963
40725F539395k079768J741143K660426K764206K987531J575324j457642k859610
40717A1871005j136963R49203J067134N35944M52527j003358m035212m366134
40709D334146N66362O145937O439486K673723L43141J72891j718169n691542p278624
40700E987351m696152j863807k159986l813597l612379j441694J133172L869163
40692f597929P056673R528680R284532N305465j540515q054431r605554m015701
40684A361220N030775J0680005R576114M134440j594119n696669p703863p077755
40676H710148m027966k78599K325745L371466L657449L968749L910308J758249
$$ plain form
40668 23395549 20193523 12552459 6370234 7753303 15391862 21353065 20743296 17356087
40660 17356087 17650447 22200260 26231500 26475459 23939849 20947462 18755962 17919919
40652 17919919 18364811 18900749 18416037 17405207 16939026 16768663 16003283 14927599 14411617
40643 14411617 14073102 12763915 10675229 9590387 10981628 14344904 17061808 16185679
40635 16185679 11775566 8049853 8729975 11393949 10095629 4207157 66051 1943884
40627 1943884 6371764 8675999 10074094 13483811 16788136 16373176 13959888 13246482
40619 13246482 12474947 7786748 2101858 2176999 6949003 7437115 -39811 -8345051 -9894381
40610 -9894381 -5662705 -779568 2486836 3918290 3442139 3578909 7977813 13848074
$$ packed form
40668B3395549l202026p641064o182225J383069P638559N961203o09769l387209
40660A7356087K94360M549813M031240K43959k535610k992387k191500q36043
40652A7919919M44892N35938m84712j010830m66181j70363p65380j075684n15982
40643A4411617l38515j309187k088686j084842J391241L363276K716904q76129
40635A6185679m410113l725713O80122K663974j298320n888472m141106J877833
40627A943884M427880K304235J398095L409717L304325m14960k413288p13406
40619A3246482p71535m688199n684890P5141M772004M88112p476926q305240j549330
40610i894381M231676M883137L266404J431454m76151J36770M398904N870261
$$ plain form
40602 13848074 12190646 291083 -12344834 -16371084 -14739493 -15180123 -16415008 -11748422
40594 -11748422 -3005944 370930 -3735839 -6503812 -2003516 4353138 5260434 1760850
40586 1760850 -1322755 -3971561 -8267397 -11162578 -7414150 1396138 7191141 5434232
40578 5434232 62957 -2702626 -1373741 1755157 5046127 8089940 9752886 8771112
40570 8771112 6127263 4810290 6904440 11902245 17504014 20740501 18840525 11332027
40562 11332027 2036686 -3053354 -1542040 2789526 4625265 3272054 2227204 3318922
40554 3318922 4114159 2119991 -665900 228208 5399794 9281706 5706509 -4564067
40546 -4564067 -13472816 -13679644 -5732386 4003819 10773239 13804913 12662708 6622351
$$ packed form
40602A3848074j657428j1899563j2635917m026250J631591m40630j234885M666586
40594a1748422Q742478L376874m106769k767973M500296O356654R07296l499584
40586A760850l083605k648806m295836k895181L748428Q810288N795003j756909
40578E434232n371275k765583J328885L128898L290970L043813J662946r81774
40570H771112k643849j316973K094150M997805N601769L236487j899976p508498
40562A1332027r295341n090040J511314M331566J835739j353211j044850J091718
40554C318922P95237j994168k785891Q94108N171586L881912l575197j0270576
40546d564067q908749k06828P947258R736205O769420L031674j142205o040357
$$ plain form
40538 6622351 -820515 -2208341 5172515 14603228 18304419 17168299 17059730 18643160
40530 18643160 17722074 14009511 11838160 11899194 9814609 4549547 1120677 2258342
40522 2258342 3998822 3085704 2552511 5395181 7996473 5213195 -1711505 -7212738
40514 -7212738 -8474166 -6404008 -2603220 867521 1911391 2101678 6155333 14057426
40506 14057426 18459003 14644299 7968530 5362820 4736255 806129 -3096720 609149
40498 609149 9466793 12033408 4444493 -3672164 -2634312 6013639 15007943 20999528
40490 20999528 24571620 26397781 27589562 29524717 30156151 24909452 14082369 4461434
40482 4461434 342439 -1863141 -5965672 -8307842 -3812080 3893342 5484634 -1686771
$$ packed form
40538F622351p442866j387826P380856R430713L701191j136120j08569J583430
40530A8643160r21086l712563k171351O1034k084585n265062l428870J137665
40522B258342J740480r13118n33193K842670K601292k783278o924700n501233
40514g212738j261428K070158L800788L470741J043870J90287M053655P902093
40506A4057426M401577l814704o675769k605710o26565l930126l902849L705869
40498F09149Q857644K566615p588915q116657J037852Q647951Q994304N991585
40490B0999528L572092J826161J191781J935155O31434n246699j0827083r620935
40482D461434m118995k205580m102531k342170M495762P705422J591292p171405
$$ plain form
40474 -1686771 -10105409 -11691764 -6514169 -546300 2068690 2329022 3188391 5179712
40466 5179712 6388441 6482649 8400227 13750317 18291083 16073779 7818197 426289
40458 426289 -2690300 -5323344 -9973050 -11413256 -4089609 7729140 13662046 9977142
40450 9977142 2875915 -1086124 -2316704 -4202193 -6599569 -7026659 -6046832 -7474003
40442 -7474003 -12991518 -19150052 -20946295 -17191402 -11147981 -6642013 -5119420 -6164767
40434 -6164767 -8565458 -10009042 -8065496 -3414941 -377767 -1855307 -4995987 -4520378
40426 -4520378 401432 5023433 4043215 -4385140 -18117630 -31405118 -37146000 -32555564
40418 -32555564 -22161361 -12218948 -3728903 5275599 13094155 16166196 16216678 18376695
$$ packed form
40474a686771q418638j586355N177595N967869K614990K60332Q59369J991321
40466E179712J208729R4208J917578N350090M540766k217304q255582p391908
40458D26289l116589k633044m649706j440206P323647J1818749N932906l684904
40450I977142p101227l962039j230580j885489k397376m27090R79827j427171
40442g474003n517515o158534j796243L754893O043421M505968J522593j045347
40434f164767k400691j443584J943546M650555L037174j477540l140680M75609
40426d520378M921810M622001r80218q428355j3732490j3287488n740882M590436
40418c2555564J0394203R942413Q490045R004502P818556L072041N0482K160017
$$ plain form
40410 18376695 22008383 21002654 14575166 9850742 10921929 13033337 11572599 9472059
40402 9472059 10599850 12422905 10997213 7383109 3252213 -3877789 -14285235 -20785454
40394 -20785454 -17900653 -11444695 -10148384 -11845828 -8113661 -127305 1448479 -6961423
40386 -6961423 -15547096 -14216387 -4181517 6631991 13432543 16630103 18726300 21621173
40378 21621173 23954583 21163183 12294160 5300934 8908767 19532232 24125198 17327943
40370 17327943 7687009 4150496 4652617 2851200 -1107587 -3122289 -3315092 -4726051
40362 -4726051 -6811661 -6482242 -3904096 -1942469 -1048654 438040 1737235 227990
40354 227990 -3277081 -4284283 -902037 2991679 2810249 -694297 -2850565 -1663308
$$ packed form
40410A8376695L631688j005729o427488m724424J071187K111408j460738k100540
40402I472059J127791J823055j425692l614104m130896p130002j0407446o500219
40394b0785454K884801O455958J296311j697444L732167P986356J575784q409902
40386f961423q585673J330709J0034870J0813508O800552L197560K096197K894873
40378B1621173K333410k791400q869023o993226L607833J0623465M592966o797255
40370A7327943r640934l536513N02121j801417l958787k014702j92803j410959
40362d726051k085610L29419K578146J961627Q93815J486694J299195j509245
40354B27990l505071j007202L382246L893716j81430l504546k156268J187257
$$ plain form
40346 -1663308 -203172 -1450287 -3354474 -2252660 65141 -2087324 -8416118 -10434675
40338 -10434675 -3587637 3828932 1258826 -7910327 -10034114 -792124 8637209 7723048
40330 7723048 210701 -3473255 -661285 3259874 4841189 6196200 9989692 15628151
40322 15628151 20332551 21593731 19312636 16500315 15899222 15583764 11463317 4812250
40314 4812250 2330015 6652888 11999762 12371587 8967825 5427743 750002 -7492513
40306 -7492513 -16461389 -20480974 -18320011 -13465370 -8982201 -6021991 -5058349 -4509352
40298 -4509352 -594235 7324339 13996824 15178386 13999738 15304229 17067472 14126820
40290 14126820 8046867 5592508 7982913 9174179 5730885 1694939 1739589 5086592
$$ packed form
40346a663308J460136j247115j904187J101814K317801k152465o328794k018557
40338a0434675O847038P416569k570106r169153k123787R241990R429333r14161
40330G723048p512347l683956K811970L921159J581315J355011L793492N638459
40322A5628151M704400J261180k281095k812321o01093l15458m120447o651067
40314D812250k482235M322873N346874L71825l403762l540082m677741q242515
40306g492513q968876m019585K160963M854641M483169K960210R63642N48997
40298d509352L915117P918574O672485J181562j178648J304491J763243k940652
40290A4126820o079953k454359K390405J191266l443294m035946M4650L347003
$$ plain form
40282 5086592 8513826 10742030 11374565 9319568 4969590 1407582 1187720 3239278
40274 3239278 4007076 804678 -5677001 -11139826 -11282729 -7109253 -4361965 -5641173
40266 -5641173 -6635206 -3757601 -1296733 -5044664 -12137473 -14749056 -12111539 -10746135
40258 -10746135 -13310081 -15805834 -16526807 -18682199 -21752796 -19253563 -9465290 -596173
40250 -596173 184202 -3617607 -4831813 -3308966 -2950942 -2981568 92202 4572355 5130373
40241 5130373 1363146 -1622525 -1201875 -301386 -1712220 -3939697 -4269459 -2721192 -1113561
40232 -1113561 52390 2155058 6086381 9975150 10301986 6289544 1865761 703899
40224 703899 485931 -3649335 -10233896 -11904360 -6564432 -2096564 -5927882 -14683947
$$ packed form
40282E086592L427234K228204O32535k054997m349978l562008k19862K051558
40274C239278P67798l202398o481679n462825j42903M173476K747288j279208
40266e641173r94033K877605K460868l747931p092809k611583K637517J365404
40258a0746135k563946k495753p20973k155392l070597K499233R788273Q869117
40250e96173P80375l801809j214206J522847L58024l0626L073770M480153N58018
40241E130373l767227k985671M20650R00489j410834k227477l29762J548267J607631
40232a113561J165951K102668L931323L888769L26836m012442m423783j161862
40224G03899k17968m135266o584561j670464N339928M467868l831318q756065
$$ plain form
40216 -14683947 -19098883 -15522258 -7403281 1499307 9371704 13464114 10976248 3265100
40208 3265100 -4644571 -8879952 -8684475 -4979558 206191 4501654 8062218 13475157
40200 13475157 20297512 23229838 19234141 12187767 5897311 -2077997 -12617235 -16708752
40192 -16708752 -5757238 12463101 20544000 14666278 8651616 11881763 16004798 10187635
40184 10187635 -1875078 -9865369 -12989850 -16815358 -19902938 -16235999 -8544276 -6729068
40176 -6729068 -12225710 -15081008 -9549141 -2725307 -2611328 -5680253 -3332197 4421065
40168 4421065 9309035 6852715 1658955 615104 5269579 11533909 13880250 9574181
40160 9574181 1345564 -3936175 -1517059 6110335 12113431 12801695 9742331 5125489
$$ packed form
40216a4683947m414936L576625Q118977Q902588P872397M092410k487866p711148
40208C265100p909671m235381J95477L704917N185749M295463L560564N412939
40200A3475157O822355K932326l995697p046374o290456p975308j0539238m091517
40192a6708752J0951514J8220339Q080899n877722o014662L230147M123035n817163
40184A0187635j2062713p990291l124481l825508l087580L666939P691723J815208
40176f729068n496642k855298N531867O823834J13979l068925K348056P753262
40168D421065M887970k456320n193760j043851M654475O264330K346341m306069
40160I574181q228617n281739K419116P627394O003096O88264l059364m616842
$$ plain form
40152 5125489 -1004012 -7835296 -11925315 -10826572 -6152136 -656005 5207814 10779405
40144 10779405 11894592 4948983 -6518325 -14334381 -15438799 -14482332 -15394594 -15443415
40136 -15443415 -10810169 -3781894 150366 -343906 -2698272 -6190869 -12107821 -18675078
40128 -18675078 -21249730 -18768152 -15632085 -15305030 -15511793 -11954949 -4086119 4918510
40120 4918510 11648399 13946152 11192106 5651733 2128175 3881575 9458934 14821641
40112 14821641 17337639 16448460 12470023 7083110 3435226 2894668 2604688 -793750
40104 -793750 -5575729 -6492384 -2238158 2262324 2590638 531356 116251 524592 -2383968
40095 -2383968 -7609982 -7356119 2895363 15818655 18847343 9227594 -2230445 -4219473
$$ packed form
40152E125489o129501o831284m090019J098743M674436N496131N863819N571591
40144A0779405J115187o945609j1467308p816056j104418R56467r12262m8821
40136a5443415M633246P028275L932260m94272k354366l492597n916952o567257
40128a8675078k574652K481578L136067L27055k06763L556844P868830R004629
40120D918510O729889K297753k754046n540373l523558J753400N577359N362707
40112A4821641K515998q89179l978437n386913l647884n40558k89980l398438
40104g93750m781979r16655M254226M500482L28314k059282m15105M08341k908560
40095b383968n226014K53863J0251482J2923292L028688r619749j1458039j989028
$$ plain form
40087 -4219473 2350459 8090077 8308305 7179229 9835620 16199511 23977607 32420824
40079 32420824 39839441 41452044 34405300 23102878 15173529 12750952 11513138 8024318
40071 8024318 3837765 1390475 -243872 -3061155 -6023469 -6085482 -2485735 2109405
40063 2109405 4621851 4436875 3350351 3395404 4467994 3819481 -1148491 -9011528 -14739546
40054 -14739546 -15535904 -14996352 -18883729 -26994982 -32268548 -29276660 -21153992 -15701943
40046 -15701943 -15920709 -17179236 -13668493 -5124699 3689227 8351023 8386067 6543810
40038 6543810 5641875 5996958 5885304 4828381 5348631 9640933 15284065 17332561 14947809
40029 14947809 12364627 12084097 11347240 8092048 6022475 9048212 14239592 16733438
$$ packed form
40087d219473O569932N739618K18228j129076K656391O363891P778096Q443217
40079C2420824P418617J612603p046744j1302422p929349k422577j237814l488820
40071H024318m186553k447290j634347k817283k962314o2013L599747M595140
40063B109405K512446j84976j086524M5053J072590o48513m967972p863037n728018
40054a4739546p96358N39552l887377q111253n273566K991888Q122668N452049
40046a5701943k18766j258527L510743Q543794Q813926M661796L5044j842257
40038F543810r01935L55083j11654j056923N20250M292302N643132K048496k384752
40029A4947809k583182k80530p36857l255192k069573L025737N191380K493846
$$ plain form
40021 16733438 19476161 29873589 45988969 54507932 46707386 30599039 22124966 28154445
40013 28154445 42748756 56500379 63906316 63885214 59358380 56497801 59775824 67000544
40005 67000544 72144261 72741569 71539760 71716105 74081122 78436834 83766542 87168241
39997 87168241 86492258 84126699 84123498 85377029 82426182 74205676 66955743 65771786 67588479
39988 67588479 66254460 61280444 57023037 54875229 50999580 42323937 31590780 24961073
39980 24961073 25669866 30810820 34364250 33528602 31510761 32900795 37118465 39109317
39972 39109317 36511445 32486595 30119766 27896627 23494706 18593392 15918507 14032714
39964 14032714 9901280 5337883 5569872 11055342 15682210 14833039 11345283 11088155
$$ packed form
40021A6733438K742723J0397428J6115380Q518963p800546j6108347q474073O029479
40013B8154445J4594311J3751623P405937k1102m526834k860579L278023P224720
40005F7000544N143717N97308j201809J76345K365017M355712N329708L401699
39997H7168241o75983k365559l201J253531k950847q220506p249933j183957J816693
39988F7588479j334019m974016m257407k147808l875649q675643j0733157o629707
39980B4961073P08793N140954L553430q35648k017841J390034M217670J990852
39972C9109317k597872m024850k366829k223139m401921m901314k674885j885793
39964A4032714m131434m563397K31989N485470M626868q49171l487756k57128
$$ plain form
39956 11088155 15476238 20972997 24112851 24435340 23341043 22039311 20393179 16951881
39948 16951881 10880088 4264357 842417 1399837 2268188 191359 -2807894 -1846458
39940 -1846458 4157908 10788338 13539617 12973861 13251141 16296448 18721426 15260800
39932 15260800 5288592 -5096270 -8879443 -5689874 -1506656 -656432 -1225511 -113112
39924 -113112 988440 -1158846 -4318219 -2759019 3519414 7294630 4088368 -1343763
39916 -1343763 -2139988 1039036 2364479 294868 -838212 1944949 6337655 8249114
39908 8249114 5142578 -4010000 -17268689 -27560205 -27399263 -18116231 -9818524 -9390774
39900 -9390774 -12873143 -12927092 -8929898 -4641717 -205657 6398068 12062364 10621341
$$ packed form
39956A1088155M388083N496759L139854L22489j094297j301732j646132l441298
39948A6951881o071793o615731l421940N57420Q68351k076829k999253R61436
39940a846458O004366O630430K751279n65756K77280L045307K424978l460626
39932A5260800r972208j0384862l783173L189569M183218Q50224n69079J112399
39924a13112J101552k147286l159373J559200O278433L775216l206262n432131
39916a343763p96225L179024J325443k069611j133080K783161M392706J911459
39908H249114l106536r152578j3258689j0291516J60942R283032Q297707M27750
39900i390774l482369n3949L997194M288181M436060O603725N664296j441023
$$ plain form
39892 10621341 2778281 -2917805 -1088275 4032679 5640480 2936012 -307598 -1448246
39884 -1448246 220199 4805043 10217197 12053502 8840059 5165729 5969312 9701180
39876 9701180 10883307 7683200 2929908 -966179 -3643564 -4074484 -1017568 3280939
39868 3280939 4095688 323743 -3710910 -4023147 -1760701 -649940 -1957259 -3732515
39860 -3732515 -3512296 -465936 3809458 5655730 2004157 -6036386 -13081617 -13964496
39852 -13964496 -8188938 -168100 4172275 1738126 -5112734 -10544627 -11277688 -9872946
39844 -9872946 -10238141 -11609335 -10585953 -7858939 -7444845 -8569737 -4533568 7123356
39836 7123356 18709941 21758917 18527550 17870041 21569978 21840426 13190076 536684
$$ packed form
39892A0621341p843060n696086J829530N120954J607801k704468l243610j140648
39884a448246J668445M584844N412154J836305l213443l674330Q03583L731868
39876I701180J182127l200107m753292l896087k677385m30920L056916M298507
39868C280939Q14749l771945m034653l12237K262446J110761j307319j775256
39860c732515K20219L046360M275394J846272l651573q040543p045231q82879
39852a3964496N775558Q020838M340375k434149o850860n431893p33061J404742
39844i872946l65195j371194J023382K727014M14094j124892M036169J1656924
39836G123356J1586585L048976l231367o57509L699937K70448q650350j2653392
$$ plain form
39828 536684 -7335850 -7997361 -5474558 -3119123 -661345 2527569 5219382 6465607
39820 6465607 7524782 9837085 12056915 11082152 6460760 2265785 3027089 8117000
39812 8117000 11847758 9702605 3241299 -1862751 -1492199 3916022 10478554 13551625
39804 13551625 10656491 3793236 -1655052 -2072109 685880 2214802 1359953 802428
39796 802428 2176827 3415593 1845742 -2171107 -5824318 -6508361 -3017251 4063283
39788 4063283 11708945 15780769 15039907 13137424 14699370 19658410 23290683 22137716
39780 22137716 18179860 16158990 17881295 20590354 20720650 17862309 14469278 12650865
39772 12650865 12411609 12844049 13810324 15750856 18255835 19536747 17816345 13707360
$$ packed form
39828E36684p872534o61511K522803K355435K457778L188914K691813J246225
39820F465607J059175K312303K219830r74763m621392m194975P61304N089911
39812H117000L730758k145153o461306n104050L70552N408221O562532L073071
39804A3551625k895134o863255n448288m17057K757989J528922q54849n57525
39796H02428J374399J238766j569851m016849l653211o84043L491110P080534
39788D063283P645662M071824p40862j902483J561946M959040L632273j152967
39780B2137716l957856k020870J722305K709059J30296k858341l393031j818413
39772A2650865k39256M32440R66275J940532K504979J280912j720402m108985
$$ plain form
39764 13707360 11031541 13748385 20761929 25047606 20475163 9376094 667891 -14406
39756 -14406 4501494 8409109 10005383 11054461 12428847 13985812 16597263 20423867
39748 20423867 22591299 20389606 15627125 11985636 9438145 5882975 3019558 4630170
39740 4630170 9086708 10222225 7019812 5498019 8085764 8205858 505143 -9432642
39732 -9432642 -12155806 -7012077 -915637 2403672 4400404 4858774 1385113 -3821903
39724 -3821903 -4417484 683815 4670468 2421378 -2602552 -4212058 -1538402 2405851
39716 2405851 6167000 9501341 10371236 6852729 902794 -3344418 -4552757 -4994049
39708 -4994049 -7136777 -11532572 -17210743 -22155360 -24110081 -22520963 -18912592 -14448000
$$ packed form
39764A3707360k675819K716844P013544M285677m572443j1099069q708203o82297
39756a4406M515900L907615J596274J049078J374386J556965K611451L826604
39748B0423867K167432k201693m762481l641489k547491l555170k863417J610612
39740D630170M456538J135517l202413j521793K587745J20094p700715r937785
39732i432642k723164N143729O096440L319309J996732M58370l473661n207016
39724c821903n95581N101299L986653k249090n023930j609506K673656L944253
39716B405851L761149L334341Q69895l518507n949935m247212j208339m41292
39708d994049k142728m395795n678171m944617j954721J589118L608371M464592
$$ plain form
39700 -14448000 -8970969 -3777000 -2611534 -7161391 -13668354 -17368790 -18774257 -21792669
39692 -21792669 -26507331 -28049210 -23066176 -13749482 -4563390 1930439 4987187 4656431
39684 4656431 2936195 3753684 9189324 16145585 18304695 11788170 -881246 -11901773
39676 -11901773 -14067343 -7191599 1516288 4966782 3501929 2861533 6069675 10765480
39668 10765480 14194820 16301221 16609899 12706673 4791821 -1970531 -3501309 -2519190
39660 -2519190 -4071396 -7503373 -7779479 -3828026 -304560 -453256 -1895726 -1089023 1951954
39651 1951954 5443686 8938382 11992184 12387580 8819421 3872680 1503272 2356661
39643 2356661 3889122 4366638 4346907 4561861 4745976 4883688 5727671 7481979 9255075
$$ packed form
39700a4448000N477031N193969J165466m549857o506963l700436j405467l018412
39692b1792669m714662j541879M983034R316694R186092O493829L056748l30756
39684D656431j720236Q17489N435640O956261K159110o516525j2669416j1020527
39676a1901773k165570O875744Q707887L450494j464853o40396L208142M695805
39668A0765480L429340K106401L08678l903226p914852o762352j530778R82119
39660b519190j552206l431977k76106L951453L523466j48696j442470Q06703L040977
39651A951954L491732L494696L053802L95396l568159m946741k369408Q53389
39643B356661J532461M77516j9731K14954J84115J37712Q43983J754308J773096
$$ plain form
39634 9255075 10206835 10082737 8306281 3897088 -2773083 -8881146 -10998605 -8405202
39626 -8405202 -4200087 -2517225 -4345092 -6670134 -6456685 -4623088 -4283775 -5490023
39618 -5490023 -4734302 -707704 2817046 2614891 1735550 5332106 12200792 15635896 13008093
39609 13008093 9205572 8622354 8770031 5603540 1214650 894596 4470750 6301037
39601 6301037 3986752 1845709 4060756 8686236 11205876 10865942 10046975 9313701 6988823
39592 6988823 3347138 1834552 5081671 11607007 17158504 17787967 11438834 -981210
39584 -981210 -14609983 -22788243 -22733128 -18340606 -15252251 -13916457 -10349746 -3642536
39576 -3642536 1087861 -776317 -6709787 -10066779 -8327040 -5035150 -4005831 -4964483
$$ packed form
39634I255075R51760j24098j776456m409193o670171o108063k117459K593403
39626h405202M205115J682862j827867k325042K13449J833597L39313j206248
39618e490023P55721M026598L524750k02155q79341L596556O868686L435104k627803
39609A3008093l802521n83218J47677l166491m388890l20054L576154J830287
39601F301037k314285k141043K215047M625480K519640l39934q18967p33274k324878
39592F988823l641685j512586L247119O525336N551497O29463o349133j2420044
39584i81210j3628773q178260N5115M392522L088355J335794L566711O707210
39576c642536M730397j864178n933470l356992J739739L291890J029319r58652
$$ plain form
39568 -4964483 -5388268 -3530995 1461443 9361507 16802256 18115081 11349174 2210402
39560 2210402 -1019556 3740619 10935552 14320142 12796053 9263669 6524068 5531323
39552 5531323 5543656 4265805 -745172 -8845702 -15148666 -14674535 -8006783 -1327470 -14787
39543 -14787 -3136954 -5309663 -3340274 620845 2768555 2560820 2364314 3395243 4500037
39534 4500037 4948237 5727410 6921503 6231724 2298436 -2065254 -2607037 985251 4950642
39525 4950642 6669000 7511122 9743574 12695689 13536215 10935425 6716928 4143691
39517 4143691 5244184 9625296 15215274 19562212 20225334 15052896 4373627 -6461976
39509 -6461976 -9425611 -1456341 11253307 19346966 20321813 19778776 22785070 27327378
$$ packed form
39568d964483m23785J857273M992438P900064P440749J312825o765907r138772
39560B210402l229958M760175P194933L384590j524089l532384k739601r92745
39552E531323J2333j277851n010977q100530o302964M74131O667752O679313J312683
39543a4787l122167k172709J969389L961119K147710k07735j96506J030929J104794
39534D500037M48200P79173J194093o89779l933288m363690n41783L592288L965391
39525D950642J718358Q42122K232452K952115Q40526k600790m218497k573237
39517D143691J100493M381112N589978M346938O63122n172438j0679269j0835603
39509f461976k963635P969270J2709648Q093659R74847n43037L006294M542308
$$ plain form
39501 27327378 27763211 22315379 15006150 11134643 12307788 15564044 16696057 14535281
39493 14535281 11555500 9729937 7429524 2702336 -1825018 -1276588 4290250 9497736
39485 9497736 11585758 13865696 18503841 20630156 14541414 2766334 -6698565 -10808811
39477 -10808811 -13327305 -16336202 -16089874 -9727223 -1379303 2235946 -155665 -4155594
39469 -4155594 -6002088 -5853269 -5362051 -5156384 -5421376 -6713204 -8891492 -10494830 -10420332
39460 -10420332 -9471739 -9009476 -8568731 -6384891 -2389808 1004217 1924802 1346928 1079267
39451 1079267 826338 -824606 -3563617 -5981456 -8351161 -11713968 -14256277 -12338852
39443 -12338852 -6338289 -1845662 -2785796 -6404297 -7922338 -7393633 -8231124 -10993784
$$ packed form
39501B7327378M35833n447832p309229l871507J173145L256256J132013k160776
39493A4535281k979781j825563k300413m727188m527354N48430N566838N207486
39485I497736K088022K279938M638145K126315o088742j1775080r464899m110246
39477a0808811k518494l008897K46328O362651Q347920L615249k391611l999929
39469d155594j846494J48819M91218K05667k64992j291828k178288j603338P4498
39460a0420332R48593M62263M40745K183840L995083L394025R20585n77874k67661
39451A079267k52929j650944k739011k417839k369705l362807k542309J917425
39443a2338852O000563M492627r40134l618501j518041N28705q37491k762660
$$ plain form
39435 -10993784 -13182285 -14459969 -17298480 -21639922 -23188544 -19229146 -13260609 -11082740
39427 -11082740 -13664954 -16448694 -15444166 -11783802 -9223748 -8397669 -5687513 1470417
39419 1470417 10077600 14876665 15504036 16905873 21663591 25454916 22849470 15199526
39411 15199526 9386839 9771141 14282848 17964847 17903894 14848510 11775066 10700825
39403 10700825 10183842 7243804 2135844 -1665729 -3312421 -6128001 -10680212 -11377876
39395 -11377876 -4867053 2818472 4288388 2361412 5164545 11646983 11749832 1790536
39387 1790536 -9565889 -13259579 -9752889 -4147764 638495 2075157 -2710711 -10724177
39379 -10724177 -13010502 -6412076 651176 -193211 -6041284 -9445334 -9966409 -10955454
$$ packed form
39435a0993784k188501j277684k838511m341442j548622L959398N968537K177869
39427a1082740k582214k783740J004528L660364K560054Q26079K710156P157930
39419A470417Q607183M799065O27371J401837M757718L791325k605446p649944
39411A5199526n812687L84302M511707L681999o0953l055384l073444j074241
39403A0700825n16983k940038n107960l801573j646692k815580m552211o97664
39395a1377876O510823P685525J469916j926976K803133O482438J02849r959296
39387A790536j1356425l693690L506690N605125M786259J436662m785868q013466
39379a0724177k286325O598426P063252q44387n848073l404050n21075r89045
$$ plain form
39371 -10955454 -10355765 -4493401 2444124 3021439 -897560 -459123 5158388 6183129
39363 6183129 -2766147 -13818318 -16147861 -8882927 380052 5301500 5324249 3878845
39355 3878845 5134506 10330265 15767996 16589568 12780159 8481353 5771492 3243108
39347 3243108 593968 -202860 1290480 3849607 8414277 16255487 22818057 20514288
39339 20514288 9919023 1100654 253040 1851964 -1155775 -6063676 -5915775 -1028653
39331 -1028653 2787369 4236932 6781886 10442027 11161496 8580834 7616512 10944730
39323 10944730 15475295 17948558 19221517 21107299 23272159 25525247 29350955 34351305
39315 34351305 36271622 31990686 24674964 20595110 21441979 22766793 20319956 15330487
$$ packed form
39371a0955454N99689N862364O937525N77315l918999M38437N617511J024741
39363F183129q949276j1052171k329543P264934R262979M921448K2749j445404
39355C878845J255661N195759N437731Q21572l809409m298806k709861k528384
39347C243108k649140p96828J493340K559127M564670P841210O562570k303769
39339B0514288j0595265q818369q47614J598924l007739m907901J47901M887122
39331a028653L816022J449563K544954L660141P19469k580662r64322L328218
39323A0944730M530565K473263J272959J885782K164860K253088L825708N000350
39315C4351305J920317m280936p315722m079854Q46869J324814k446837m989469
$$ plain form
39307 15330487 12019399 11423850 10010122 4529279 -3857604 -11561372 -16973504 -20598249
39299 -20598249 -21749484 -18414713 -11113890 -4062528 -943049 -1466796 -3351898 -5465758
39291 -5465758 -7330373 -7728572 -6119281 -3889353 -2011973 1127659 7267881 14723409
39283 14723409 19506996 19263332 14564912 7755906 2408014 2141626 7264396 13665613
39275 13665613 17442847 19266659 21527913 22966999 20105249 13419385 8120075 8404715
39267 8404715 14030002 22500535 30980111 35596630 33028532 24820877 17264097 14851319
39259 14851319 15805062 15696475 13380984 11171727 10532207 10095865 8022198 4810649 2965045
39250 2965045 3847722 5334440 3734056 -1490635 -6419005 -7296520 -4779407 -1677064
$$ packed form
39307A5330487l311088n95549j413728n480843q386883p703768n412132l624745
39299b0598249j151235L334771P300823P051362L119479n23747j885102k113860
39291e465758j864615l98199J609291K229928J877380L139632O140222P455528
39283A4723409M783587k43664m698420o809006n347892k66388N122770O401217
39275A3665613L777234J823812K261254J439086k861750o685864n299310K84640
39267H404715N625287Q470533Q479576M616519k568098q207655p556780k412778
39259A4851319R53743j08587k315491k209257o39520m36342k073667l211549j845604
39250B965045Q82677J486718j600384n224691m928370q77515K517113L102343
$$ plain form
39242 -1677064 1519807 5532536 7948398 4354902 -5435602 -15520506 -19298134 -14697618
39234 -14697618 -4485982 5434039 8456289 2507734 -6140723 -8467592 -3479728 807506
39226 807506 -1270296 -5711859 -5862998 -1795871 1886931 3727716 5312014 5922378 3267181
39217 3267181 -1111121 -2361360 1456877 7626495 12978714 15758108 13788631 5976409
39209 5976409 -3499803 -7663659 -5511457 -3694545 -6425313 -7997152 -219182 14984136
39201 14984136 25948847 24604135 15042158 7061517 4598864 3833250 1165613 -1250786
39193 -1250786 581049 6028974 10433059 11219851 10003698 8228234 4367793 -2457547
39185 -2457547 -8998158 -11246977 -9720149 -8132101 -7837865 -7130640 -5756579 -6399163 -10862282
$$ packed form
39242a677064L196871M012729K415862l593496r790504j0084904l777628M600516
39234a4697618J0211636R920021L022250n948555q648457k326869M987864M287234
39226H07506k077802m441563j51139M067127L682802J840785J584298O10364k655197
39217C267181m378302j250239L818237O169618N352219K779394j969477p812222
39209E976409r476212m163856K152202J816912k730768j571839P777970J5203318
39201A4984136J0964711j344712r561977p980641k462653p65614k667637k416399
39193a250786J831835N447925M404085P86792j216153j775464l860441o825340
39185b457547o540611k248819J526828J588048K94236P07225J374061o42584m463119
$$ plain form
39176 -10862282 -17591755 -23590296 -26104404 -22300339 -11158413 2943288 12368872 14353875
39168 14353875 13868328 15826431 17830399 14433503 5926979 -1920434 -5672716 -7049181
39160 -7049181 -8231954 -8973905 -9002666 -9108051 -8747052 -6491677 -4067639 -5456199 -9682563
39151 -9682563 -9207389 346978 12447894 16891540 12666182 7793604 7158362 6995137
39143 6995137 2862661 -3001882 -5786650 -5117005 -3708028 -2182334 -28926 252181
39135 252181 -4652926 -12688974 -17290424 -15440152 -10855968 -7751290 -5454738 -1869610
39127 -1869610 1036631 -806663 -7350038 -13702085 -15660585 -13377777 -9276205 -4841532
39119 -4841532 -734061 1554343 278862 -3775086 -5938869 -691473 12516679 26768115
$$ packed form
39176a0862282o729473n998541k514108L804065J1141926J4101701R425584J985003
39168A4353875m85547J958103K003968l396896q506524p847413l752282j376465
39160g049181j182773p41951k8761j05385L60999K255375K424038j388560m226364
39151i682563M75174R554367J2100916M443646m225358m872578o35242j63225
39143F995137m132476n864543k784768O69645J408977J525694K153408K81107
39135B52181m905107q036048m601450J850272M584184L104678K296552L585128
39127a869610K906241j843294o543375o352047j958500K282808M101572M434673
39119d841532M107471K288404j275481m053948k163783N247396J3208152J4251436
$$ plain form
39111 26768115 32991536 28692049 19878163 13312471 8954237 2358169 -7218247 -14972840
39103 -14972840 -17063646 -15324820 -13619660 -11995559 -7273429 1363807 9971213 13643594
39095 13643594 11402417 6612661 3215705 2227170 1787676 6000 -2814842 -4811319
39087 -4811319 -4828019 -3451368 -1868885 -269029 2306382 6534571 11283678 13826869
39079 13826869 12307809 8257345 5871667 8006757 13174108 17026088 16452423 11804106
39071 11804106 5825982 1374107 -120279 1046793 3617119 6224132 7204905 4498058
39063 4498058 -2274940 -9671873 -13179630 -13103489 -14477749 -19089695 -21511933 -17178291
39055 -17178291 -10943613 -11232837 -17220194 -19468185 -14288520 -9703240 -13529442 -22038909
$$ packed form
39111B6768115O223421m299487q813886o565692m358234o596068r576416p754593
39103a4972840k090806J738826J705160J624101M722130Q637236Q607406L672381
39095A3643594k241177m789756l396956r88535m39494j781676k820842j996477
39087d811319j6700J376651J582483J599856K575411M228189M749107K543191
39079A3826869j519060m050464k385678K135090N167351L851980n73665m648317
39071A1804106n978124m451875j494386J167072K570326K607013R80773k706847
39063D498058o772998p396933l507757P6141j374260m611946k422238M333642
39055a7178291O234678k89224n987357k247991N179665M585280l826202q509467
$$ plain form
39047 -22038909 -25709177 -21498039 -13701056 -6307608 -766176 1217102 -626379 -1805892
39039 -1805892 2008688 6949962 4313393 -7200517 -18811712 -23055397 -22043687 -21540448
39031 -21540448 -22084381 -20163279 -14604389 -7549613 -1255299 2716416 3166177 1315776
39023 1315776 1327932 5541631 10766493 12610308 12195565 14932852 22951226 31973227 36128241
39014 36128241 33675969 27748188 23137412 22285817 22922852 19879651 10581361 -1592486
39006 -1592486 -10416114 -12509548 -9061079 -3363044 1815108 5595773 9145840 13299208
38998 13299208 15558388 12431396 6166130 4856224 12221709 21242615 23112067 19066211
38990 19066211 16549102 16241654 11911280 3263028 -872772 4224626 10978246 10129026
$$ packed form
39047b2038909l670268M211138P796983P393448N541432J983278j843481j179513
39039a805892L814580M941274k636569j1513910j1611195m243685J011710N03239
39031b1540448n43933J921102N558890P054776O294314L971715M49761j850401
39023A315776J2156M213699N224862J843815m14743K737287Q018374R022001M155014
39014C6128241k452272n927781m610776q51595O37035l043201r298290j2173847
39006a592486q823628k093434L448469N698035N178152L780665L550067M153368
38998A3299208K259180l126992o265266j309906P365485R020906J869452m045856
38990A9066211k517109l07448m330374q648252m135800N097398O753620q49220
$$ plain form
38982 10129026 3434480 -416367 1885593 6312320 8647866 7507099 2540581 -4398207
38974 -4398207 -7715996 -3277707 5560937 11730421 13091313 12686462 12065206 10072928
38966 10072928 7324340 5669978 3285981 -3362032 -11955134 -15174270 -10865190 -5341955
38958 -5341955 -4173845 -5379246 -4801107 -2860521 -2059510 -2118836 -1536728 -440330 1303131
38949 1303131 4763660 7534344 3750357 -6696082 -13804618 -8677361 4350664 13397884
38941 13397884 14052371 11495090 9798390 7698947 5156794 5691873 9845969 12999515
38933 12999515 12331989 10211247 8383158 5075575 1146108 2678137 12332199 23153638
38925 23153638 26969966 25410667 26323795 31500888 34519925 30433374 21962144 15227261
$$ packed form
38982A0129026o694546l850847K301960M426727K335546j140767m966518o938788
38974d398207l317789M438289Q838644O169484J360892m04851o21256j992278
38966A0072928k748588j654362k383997o648013q593102l219136M309080N523235
38958e341955J168110j205401N78139J940586Q01011n9326N82108J096398J743461
38949A303131L460529K770684l783987j0446439p108536N127257J3028025R047220
38941A3397884O54487k557281j696700k099443k542153N35079M154096L153546
38933A2999515o67526k120742j828089l307583l929467J532029R654062J0821439
38925B3153638L816328j559299R13128N177093L019037m086551q471230o734883
$$ plain form
38917 15227261 13488395 15869762 18756962 17743528 11414883 4106562 2233744 7110926
38909 7110926 13700519 16855866 16349678 15319662 16285767 19301578 21665330 19012438
38901 19012438 9338939 -3331467 -11829791 -13079239 -9900788 -5484821 -185251 4754244
38893 4754244 5224091 -60986 -5440913 -4958194 -1108655 -1337817 -6379903 -8260943 -1683296
38884 -1683296 7882686 10961487 5368503 -3162397 -9087706 -11145166 -9515008 -4252286
38876 -4252286 2086348 4390621 344400 -6395732 -10709246 -11763608 -11638823 -10094283
38868 -10094283 -4779760 3333815 8690045 6997946 -171180 -8182421 -14352562 -18310137
38860 -18310137 -19805038 -19058057 -17772759 -16757638 -13614337 -6111536 2865479 7716990
$$ packed form
38917A5227261j738866K381367K887200j013434o328645p308321j872818M877182
38909G110926O589593L155347n06188j030016R66105L015811K363752k652892
38901A9012438r673499j2670406q498324j249448L178451M415967N299570M939495
38893D754244M69847n285077n379927M82719L849539k29162n042086j881040O577647
38884a683296R565982L078801n592984q530900n925309k057460J630158N262722
38876d252286O338634K304273m046221o740132m313514j054362J24785J544540
38868a0094283N314523Q113575N356230j692099p169126q011241o170141l957575
38860a8310137j494901P46981J285298J015121L143301P502801Q977015M851511
$$ plain form
38852 7716990 7693927 7753940 10510279 11837492 7681484 1667089 1128526 6886515 11733316
38843 11733316 9740479 3504524 551166 4696194 12571703 17565982 15929264 9429321
38835 9429321 2812472 -1020278 -2912978 -4738977 -6543323 -7778730 -9820490 -14521308
38827 -14521308 -20445170 -23219697 -20552845 -15216328 -12267649 -14568172 -21347021 -29447208
38819 -29447208 -35120271 -36008889 -32608739 -27426502 -22506462 -18355266 -14744065 -11091562
38811 -11091562 -6438659 -961451 2726008 2109104 -1394226 -3841070 -4205000 -5097221
38803 -5097221 -7286939 -7471061 -3560881 1467705 3746771 3127110 542021 -5177442
38795 -5177442 -12972183 -15613472 -7248178 6121483 11218301 3976000 -5161031 -5242465
$$ packed form
38852G716990k3063O0013K756339J327213m156008o014395n38563N757989M846801
38843A1733316j992837o235955k953358M145028P875509M994279j636718o499943
38835I429321o616849l832750j892700j825999j804346j235407k041760m700818
38827a4521308n923862k774527K666852N336517K948679k300523o778849q100187
38819b9447208n673063q88618L400150N182237M920040M151196L611201L652503
38811a1091562M652903N477208L687459o16904l503330k446844l63930q92221
38803e097221k189718j84122L910180N028586K279066o19661k585089n719463
38795e177442p794741k641289Q365294J3369661N096818p242301r137031q1434
$$ plain form
38787 -5242465 1801103 6248761 4553591 2176220 4097524 8195521 9108283 5205135
38779 5205135 -34254 -2222212 -594016 1395398 -78322 -4912128 -9467860 -11152218
38771 -11152218 -10924546 -10778268 -10835021 -10289724 -9478869 -9201574 -9077090 -8160097 -6434716
38762 -6434716 -4624126 -3419181 -3517925 -4860814 -5088365 -1007944 6896991 13544770 14643949
38753 14643949 11015088 5886718 645183 -4127030 -6276279 -4612827 -1886588 -1213037
38745 -1213037 -1144574 1333588 4409335 3478977 -765899 -2056401 2617544 9117284 12708318
38736 12708318 13528467 13420423 12330333 10954709 12441616 17493975 21351806 19771368
38728 19771368 14955116 11253817 7927668 1444914 -6926871 -11668236 -10925540 -8777809
$$ packed form
38787e242465P043568M447658j695170k377371J921304M097997R12762l903148
38779E205135n239389k187958J628196J989414j473720m833806m555732j684358
38771a1152218K27672J46278n6753N45297Q10855K77295J24484R16993J725381
38762f434716J810590J204945r8744j342889k27551M080421P904935O647779J099179
38753A4643949l628861n128370n241535m772213k149249J663452K726239O73551
38745a213037O8463K478162L075747r30358m244876j290502M673945O499740L591034
38736A2708318Q20149j08044j090090j375624J486907N052359L857831j580438
38728A9771368m816252l701299l326149o482754q371785m741365P42696K147731
$$ plain form
38720 -8777809 -9040537 -11163435 -12972987 -13201470 -10133611 -2058408 8676334 15463852
38712 15463852 14102718 7714189 3041957 3627027 8006990 12162054 11752461 4606127
38704 4606127 -5915354 -11825029 -8323536 -13220 3887819 178776 -5770985 -8078321
38696 -8078321 -6924592 -5564150 -4624557 -2849833 -1342438 -2819483 -6854743 -9694920
38688 -9694920 -9793161 -10117718 -12948289 -15365191 -13262401 -8033709 -4979276 -5155672 -3282287
38679 -3282287 4446296 14188577 19400021 19726942 20889830 25983047 30661100 28489142
38671 28489142 18911012 8068887 2543152 3643967 7669463 10625183 11849602 12950612
38663 12950612 14282011 14219847 12130967 9900699 8988377 7670097 3453674 -2934390
$$ packed form
38720h777809k62728k122898j809552k28483L067859Q075203J0734742O787518
38712A5463852j361134o388529m672232N85070M379963M155064m09593p146334
38704D606127j0521481n909675L501493Q310316L901039l709043n949761k307336
38696h078321J153729J360442R39593J774724J507395j477045m035260k840177
38688i694920r8241l24557k830571k416902K102790N228692L054433j76396J873385
38679c282287P728583R742281N211444L26921J162888N093217M678053k171958
38671B8489142r578130j0842125n525735J100815M025496K955720J224419J101010
38663A2950612J331399o2164k088880k230268r12322j318280m216423o388064
$$ plain form
38655 -2934390 -8617326 -12807426 -16766525 -19739924 -18803766 -13872209 -9163664 -7523010
38647 -7523010 -6448086 -2602520 2519014 5242723 6096300 8843526 13448351 14680417
38639 14680417 9115483 13868 -6575761 -7794030 -4286806 2480320 10299293 15528193
38631 15528193 15650135 11972804 7381716 2302493 -4315084 -10836766 -13586971 -12148174
38623 -12148174 -10273740 -9994110 -8304161 -2230391 5794433 11026862 12663566 12954318
38615 12954318 11596117 6102815 -2044534 -6821190 -5277414 -1646026 -1179399 -3400048
38607 -3400048 -4787147 -5070171 -6424413 -8249758 -7675720 -4954217 -3816021 -5824223
38599 -5824223 -8403265 -9667459 -11404039 -15236274 -18923453 -18966741 -14704460 -7663698
$$ packed form
38655b934390n682936m190100l959099k973399R36158M931557M708545J640654
38647g523010J074924L845566N121534K723709Q53577K747226M604825J232066
38639A4680417n564934r101615o589629j218269L507224O767126P818973N228900
38631A5528193J21942l677331m591088n079223o617577o521682k750205J438797
38623a2148174J874434K79630J689949O073770Q024824N232429J636704K90752
38615A2954318j358201n493302q147349m776656J543776L631388M66627k220649
38607c400048j387099k83024j354242j825345N74038K721503J138196k008202
38599e824223k579042j264194j736580l832235l687179m3288M262281P040762
$$ plain form
38591 -7663698 836995 8718848 11841787 7467169 -1287570 -7622237 -8289629 -6543623
38583 -6543623 -7371239 -11682178 -16056029 -16828400 -13314802 -7587213 -2031768 2437312
38575 2437312 5615760 6208913 2617112 -3731954 -7842142 -6199551 -1537907 -139860
38567 -139860 -4356603 -9852081 -10581544 -4762036 4305632 11387756 12754880 8492047
38559 8492047 2535877 -810301 -1013947 -666346 -705514 1053842 5436235 8853815 7411813
38550 7411813 2201361 -2538547 -5248137 -7482947 -9079370 -7178392 -1332824 4062813
38542 4062813 4906849 2473663 590952 -422822 -3534737 -9248564 -13623227 -13051007
38534 -13051007 -8539802 -3844585 -1281246 -1198872 -3985338 -9647014 -15279930 -15791816
$$ packed form
38591g663698Q500693P881853L122939m374618q754739o334667o67392J746006
38583f543623q27616m310939m373851p72371L513598N727589N555445M469080
38575B437312L178448N93153l591801o349066m110188J642591M661644J398047
38567a39860m216743n495478p29463N819508R067668P082124J367124m262833
38559H492047n956170l346178k03646L47601l9168J759356M382393L417580j442002
38550G411813n210452m739908k709590k234810j596423J900978N845568N395637
38542D062813Q44036k433186j882711j013774l111915n713827m374663N72220
38534a3051007M511205M695217K563339Q2374k786466n661676n632916n11886
$$ plain form
38526 -15791816 -9116995 422181 6062224 5797049 3723665 3895058 5280444 4565670
38518 4565670 1780185 -241935 -1298764 -4592897 -10930415 -15997570 -16096651 -13635283
38510 -13635283 -13297744 -14766069 -13564477 -8351004 -2874791 -320040 123518 70808 -598813
38501 -598813 -1386995 -83324 3552158 6187903 5585678 3958224 3972248 4451751 3401026
38492 3401026 2403814 3859779 6097492 5806280 3679950 2863441 3140218 2061574 1140205
38483 1140205 4703911 11748331 14997168 10413782 2724782 -1214314 -303656 2331267
38475 2331267 4690607 6309028 6579416 6264891 8337418 14147241 20621841 23687109
38467 23687109 22352927 17541190 10075656 2450714 -1027052 365542 1231155 -3013853
$$ packed form
38526a5791816O674821R539176N640043k65175k073384J71393J385386p14774
38518D565670k785485k022120j056829l294133o337518n067155r9081K461368
38510a3635283L37539j468325J201592N213473N476213K554751M43558n2710o69621
38501e98813p88182J303671L635482K635745o02225j627454J4024M79503j050725
38492C401026r97212J455965K237713k91212k126330q16509K76777j078644r21369
38483A140205L563706P044420L248837m583386p689000l939096R10658K634923
38475B331267K359340J618421K70388l14525K072527N809823O474600L065268
38467B3687109j334182m811737p465534p624942l477766J392594Q65613m245008
$$ plain form
38459 -3013853 -9357051 -11653234 -9167641 -5601444 -1926532 3700836 9835863 11739700
38451 11739700 7910615 1517389 -4989995 -11585530 -16525604 -16060074 -9906148 -2330866
38443 -2330866 3767630 9218185 13398828 11976022 3114620 -7894533 -13653849 -11817338
38435 -11817338 -5054122 3000050 9207549 11339649 9938747 7671923 4978453 -669534
38427 -669534 -9093265 -14757952 -13220091 -7200010 -2434713 -23659 2965847 7336292
38419 7336292 10852683 12528628 13459768 13657401 12103429 10263821 11696025 16806851
38411 16806851 20763166 18420447 10033417 863287 -4245770 -5059066 -4709790 -4816159
38403 -4816159 -3216677 2284896 9555343 14512996 16999013 19902290 22108771 17875055
$$ packed form
38459c013853o343198k296183K485593L566197L674912N627368O135027J903837
38451A1739700l829085o393226o507384o595535m940074M65530O153926P575282
38443b330866O098496N450555M180643j422806q861402j1009153n759316J836511
38435a1817338O763216Q054172O207499K132100j400902k266824k693470n647987
38427f69534q423731n664687J537861O020081M765297K411054K989506M370445
38419G336292L516391J675945R31140J97633j553972j839608J432204N110826
38411A6806851L956315k342719q387030r170130n109057q13296L49276j06369
38403d816159J599482N501573P270447M957653K486017K903277K206481m233716
$$ plain form
38395 17875055 5764048 -6898520 -12382709 -11118446 -7709274 -3015988 3789183 8862341
38387 8862341 6865363 -633506 -6536798 -7610574 -6602334 -5621828 -3985068 -2850202
38379 -2850202 -5188268 -9798447 -11601155 -9591498 -8442663 -10264451 -11222365 -9255219
38371 -9255219 -8567597 -11913735 -14046863 -8718647 1444426 7849069 6676987 1847010
38363 1847010 -1337770 -1197534 802801 1860977 -502847 -5995694 -11221081 -13376374
38355 -13376374 -12919988 -11193296 -7766301 -2349047 2857030 5180949 4159333 559955
38347 559955 -4658452 -8533968 -6693444 1200761 9568759 13661249 15135837 17439727
$$ packed form
38395A7875055j2111007j2662568n484189J264263L409172M693286O805171N073158
38387H862341j996978p498869n903292j073776J008240R80506J636760J134866
38379b850202k338066m610179j802708K009657J148835j821788r57914J967146
38371i255219O87622l346138k133128N328216J0163073O404643j172082m829977
38363A847010l184780J40236K000335J058176k363824n492847n225387k155293
38355a3376374M56386J726692L426995N417254N206077K323919j021616l599378
38347E59955n218407l875516J840524P894205Q367998M092490J474588K303890
$$ [...]
##END NTUPLES=NMR SPECTRUM
##END=
