##TITLE=31Pdec_DE-46EA_D2O
 D2O, 64 sc
 12.7.2024
##JCAMPDX= 6.0         $$ Bruker NMR JCAMP-DX V2.0
##DATA TYPE= NMR SPECTRUM
##DATA CLASS= NTUPLES
##ORIGIN= UXNMR, Bruker Analytische Messtechnik GmbH
##OWNER= root
$$ XWIN-NMR		Version 3.5
$$ Fri Jul 12 15:46:36 2024 Russian Standard Time (UT+4h)  she@DPX200
##.OBSERVE FREQUENCY= 81.013821
##.OBSERVE NUCLEUS= ^31P
##.ACQUISITION MODE= SIMULTANEOUS
##.ACQUISITION SCHEME= undefined
##.AVERAGES= 64
##.DIGITISER RES= 17
##SPECTROMETER/DATA SYSTEM= spect
##.PULSE SEQUENCE= zgpg30
##.SOLVENT NAME= CDCl3
##.SHIFT REFERENCE= (INTERNAL, CDCl3, 0, 198.062)
##AUDIT TRAIL= $$ (NUMBER, WHEN, WHO, WHERE, WHAT)
$$ ##TITLE= Audit trail, XWIN-NMR		Version 3.5
$$ ##JCAMPDX= 5.01
$$ ##ORIGIN= Bruker BioSpin GmbH
$$ ##OWNER= she
$$ F:/spectra/data/she/nmr/P31/2/pdata/1/auditp.txt
$$ ##AUDIT TRAIL=  $$ (NUMBER, WHEN, WHO, WHERE, WHAT)
(   1,<2024-07-12 15:45:01.06 +0400>,<she>,<DPX200>,
      <created by zg, POWCHK disabled, PULCHK disabled
       configuration hash MD5:
       00 E9 B6 7A A2 85 ED C7 34 08 36 98 17 FE 4E 26
       data hash MD5: 32K
       12 EE D0 84 81 04 48 CB 24 E8 AD E9 C0 88 81 3A>)
(   2,<2024-07-12 15:45:19.28 +0400>,<she>,<DPX200>,
      <Start of raw data processing
       efp BC_mod = 2 LB = 1.5 FT_mod = 6 PKNL = 1 PHC0 = 2588.23 PHC1 = 216.887 SI = 64K 
       data hash MD5: 64K
       72 73 7A A1 31 29 F7 10 55 B7 4C B9 CE 38 8A 1D>)
(   3,<2024-07-12 15:45:42.64 +0400>,<she>,<DPX200>,
      <pk PHC0 = -5.349998 PHC1 = 0 
       data hash MD5: 64K
       CD B9 AB 8A 92 75 AF 6E 89 62 CD 4F 8C 8F A3 EE>)
(   4,<2024-07-12 15:45:52.40 +0400>,<she>,<DPX200>,
      <abs ABSG = 5 
       data hash MD5: 64K
       1D E2 66 A7 FA 01 90 9C AD FC 55 DD 96 D5 B8 8C>)
$$ ##END=
$$ 
$$ hash MD5
$$ 0B 50 7E 7A 5F 0F 4D 20 9A 97 73 13 96 CD D9 8E
##$RELAX= 
##$RELAX= 
##$RELAX= 
##$RELAX= 
##$RELAX= 
##$RELAX= 
##$RELAX= 
##$RELAX= 
$$ Bruker specific parameters
$$ --------------------------
##$DU= <F:/spectra>
##$EXPNO= 2
##$NAME= <P31>
##$PROCNO= 1
##$TYPE= <nmr>
##$USER= <she>
##$AMP= (0..31)
100 100 100 100 100 100 100 100 100 100 100 100 100 100 100 100 100 100 
100 100 100 100 100 100 100 100 100 100 100 100 100 100 
##$AQSEQ= 0
##$AQ_mod= 1
##$AUNM= <au_zg>
##$AUTOPOS= <>
##$BF1= 81.014009
##$BF2= 200.13
##$BF3= 200.13
##$BF4= 200.13
##$BF5= 200.13
##$BF6= 200.13
##$BF7= 200.13
##$BF8= 200.13
##$BYTORDA= 1
##$CFDGTYP= 0
##$CFRGTYP= 5
##$CHEMSTR= <none>
##$CNST= (0..31)
1 1 145 1 1 1 1 1 1 1 1 1 1 1 1 1 1 1 1 1 1 1 1 1 1 1 1 1 1 1 1 1 
##$CPDPRG= <waltz16>
##$CPDPRG1= <>
##$CPDPRG2= <waltz16>
##$CPDPRG3= <>
##$CPDPRG4= <mlev>
##$CPDPRG5= <mlev>
##$CPDPRG6= <mlev>
##$CPDPRG7= <mlev>
##$CPDPRG8= <mlev>
##$CPDPRGB= <>
##$CPDPRGT= <>
##$D= (0..31)
0 1 0 0 0 0 0 0 0 0.06 0 0.03 2e-05 3e-06 0 0 0.0002 0 0 0 0 0 0 0 0 0 
0 0 0 0 0 0 
##$DATE= 1720784700
##$DBL= (0..7)
120 120 120 11 120 120 24 19 
##$DBP= (0..7)
150 150 150 150 150 150 150 150 
##$DBP07= 0
##$DBPNAM0= <>
##$DBPNAM1= <>
$$ [...]
##$SUBNAM3= <"">
##$SUBNAM4= <"">
##$SUBNAM5= <"">
##$SUBNAM6= <"">
##$SUBNAM7= <"">
##$SUBNAM8= <"">
##$SUBNAM9= <"">
##$SW= 400.765351723535
##$SWIBOX= (0..15)
0 1 3 0 0 0 0 0 0 0 0 0 0 0 0 0 
##$SW_h= 32467.5324675325
##$TD= 32768
##$TD0= 1
##$TE= 0
##$TE2= 300
##$TE3= 300
##$TEG= 300
##$TL= (0..7)
0 120 53 12 22 120 120 120 
##$TP= (0..7)
150 150 150 150 150 150 150 150 
##$TP07= 0
##$TPNAME0= <>
##$TPNAME1= <>
##$TPNAME2= <>
##$TPNAME3= <>
##$TPNAME4= <>
##$TPNAME5= <>
##$TPNAME6= <>
##$TPNAME7= <>
##$TPOAL= (0..7)
0.5 0.5 0.5 0.5 0.5 0.5 0.5 0.5 
##$TPOFFS= (0..7)
0 0 0 0 0 0 0 0 
##$TUNHIN= 0
##$TUNHOUT= 0
##$TUNXOUT= 0
##$USERA1= <user>
##$USERA2= <user>
##$USERA3= <user>
##$USERA4= <user>
##$USERA5= <user>
##$V9= 5
##$VALIST= <valist>
##$VCLIST= <CCCCCCCCCCCCCCC>
##$VD= 0
##$VDLIST= <DDDDDDDDDDDDDDD>
##$VPLIST= <PPPPPPPPPPPPPPP>
##$VTLIST= <TTTTTTTTTTTTTTT>
##$WBST= 1024
##$WBSW= 4
##$XGAIN= (0..3)
0 0 0 0 
##$XL= 0
##$YL= 0
##$YMAX_a= 5652
##$YMIN_a= -4527
##$ZGOPTNS= <>
##$ZL1= 120
##$ZL2= 120
##$ZL3= 120
##$ZL4= 120
##$ABSF1= 198.0616
##$ABSF2= -202.7028
##$ABSG= 5
##$ABSL= 3
##$ALPHA= 0
##$AQORDER= 0
##$ASSFAC= 0
##$ASSFACI= 0
##$ASSFACX= 0
##$ASSWID= 0
##$AUNMP= <proc_1d>
##$AZFE= 0.1
##$AZFW= 0.5
##$BCFW= 0
##$BC_mod= 2
##$BYTORDP= 0
##$COROFFS= 0
##$CY= -3
##$DATMOD= 1
##$DC= 0
##$DFILT= <>
##$DTYPP= 0
##$F1P= 0
##$F2P= 0
##$FCOR= 1
##$FTSIZE= 65536
##$FT_mod= 6
##$GAMMA= 0
##$GB= 0
##$INTBC= 1
##$INTSCL= 9.790993e-09
##$ISEN= 30
##$LB= 1.5
##$LEV0= 0
##$LPBIN= 0
##$MAXI= 10000
##$MC2= 0
##$MEAN= 0
##$ME_mod= 0
##$MI= 50
##$NCOEF= 0
##$NC_proc= -9
##$NLEV= 6
##$NOISF1= 182.463
##$NOISF2= 159.3651
##$NSP= 0
##$NTH_PI= 0
##$NZP= 0
##$OFFSET= 198.0616
##$PC= 4
##$PHC0= 2582.88
##$PHC1= 216.887
##$PH_mod= 1
##$PKNL= yes
##$PPARMOD= 0
##$PSCAL= 0
##$PSIGN= 0
##$REVERSE= no
##$SF= 81.0140089999434
##$SI= 65536
##$SIGF1= 159.3651
##$SIGF2= -187.1042
##$SINO= 113.3802
##$SIOLD= 16384
##$SREGLST= <1H.CDCl3>
##$SSB= 0
##$STSI= 65536
##$STSR= 0
##$SW_p= 32467.5324675325
##$SYMM= 0
##$S_DEV= 0
##$TDeff= 32768
##$TDoff= 0
##$TI= <>
##$TILT= no
##$TM1= 0
##$TM2= 0
##$TOPLEV= 0
##$USERP1= <user>
##$USERP2= <user>
##$USERP3= <user>
##$USERP4= <user>
##$USERP5= <user>
##$WDW= 1
##$XDIM= 65536
##$YMAX_p= 475620549
##$YMIN_p= -64843645
$$ End of Bruker specific parameters
$$ ---------------------------------
##NTUPLES= NMR SPECTRUM
##VAR_NAME=  FREQUENCY,     SPECTRUM/REAL,   SPECTRUM/IMAG
##SYMBOL=    X,             R,               I
##VAR_TYPE=  INDEPENDENT,   DEPENDENT,       DEPENDENT
##VAR_FORM=  AFFN,          ASDF,            ASDF
##VAR_DIM=   65536,         65536,           65536
##UNITS=     HZ,            ARBITRARY UNITS, ARBITRARY UNITS
##FACTOR=    0.49542278885378, 1,            1
##FIRST=     16045.7642231865, 0,            0
##LAST=      -16421.768244346, 0,            0
##MIN=       -16421.768244346, -64843645,    0
##MAX=       16045.7642231865, 475620549,    0
$$ Real data points
##PAGE= N=1
##DATA TABLE= (X++(R..R)), XYDATA
$$ [...]
42935C0086897m420568k014323j908787l594004l568235j020348J183447M46316
$$ 30086897 25666329 23652006 21743219 18149215 14580980 13560632 14744079 15190395
42927A5190395k987573o432778o131726l54340O736234P257200p76021q678561
$$ 15190395 12202822 5770044 -361682 -716022 6020212 13277412 12501391 3822830
42919C822830o896529K065032O433801P34927p806166j0029211n783875o47820
$$ 3822830 -3073699 -1008667 5425134 6160061 -1646105 -11675316 -17459191 -18107011
42911a8107011K910667N783794P011699M332739r45666m448342m107145j481936
$$ -18107011 -15196344 -9412550 -2400851 1931888 986222 -3462120 -7569265 -9051201
42903i051201J768269M967200O354519M087185k65019k877459k713084j824512
$$ -9051201 -7282932 -2315732 4038787 8125972 7860953 4983494 2270410 445898
42895D45898o33202K457365N964697N174602o18599n531689m811063q38907J891291
$$ 445898 -187304 2270061 8234758 13409360 12790761 7259072 2448009 1609102 3500393
42886C500393L293476M788359M070929j412537q313487j0488131o894559j610032
$$ 3500393 6793869 11582228 15653157 14240620 5927133 -4560998 -11455557 -13065589
42878a3065589K219250L561303J096058m239436o331365o08950P587187R042516
$$ -13065589 -10846339 -7285036 -6188978 -10428414 -16759779 -17368729 -9781542 -739026
42870g39026M166305J513397K900443R24529o138975q807308j801674N839755
$$ -739026 3427279 4940676 7841119 8765648 2626673 -6180635 -7982309 -2142554
42862b142554M800821M43422K823296Q964942P999689k99885n870816n718225
$$ -2142554 2658267 3101689 5924985 14889927 22889616 22589731 16718915 11000690
42854A1000690o835377j0510005q002901L054331J0653823N069630o024789q614955
$$ 11000690 4165313 -6344692 -14347593 -11293262 -639439 4430191 -1594598 -10209553
42846a0209553j678862M558617N048405L923482L905591K144542k046706l838133
$$ -10209553 -11888415 -7329798 -2281393 1642089 5547680 7692222 5645516 1807383
42838A807383m32387M069959M717562K181101J0423r66818k054466k950303k071506
$$ 1807383 1374996 5444955 10162517 12343618 12354041 11387223 9332757 6382454 4310948
42829D310948M03047K404579K534282J173955n04185j505628j524390j281930
$$ 4310948 4713995 7118574 9652856 10826811 10322626 8816998 7292608 6010678
42821F010678j685461k201580j280524R35445J902067o2500l153597m254338k600083
$$ 6010678 4325217 2123637 843113 1778558 3680625 3618125 464528 -3789810 -6389893
42812f389893L28815L272782N371859N039073J663106j915435j964840P19932
$$ -6389893 -6061078 -2788296 2583563 7622636 9285742 7370307 5405467 6125399
42804F125399J568963m90567q13803L022655N255619o70025j0798949j3409186
$$ 6125399 7694362 7203795 6389992 9412647 14668266 13998241 3199292 -10209894
42796a0209894m045739P931345J0753874M052997k524090j892371L420921O017417
$$ -10209894 -14255633 -6324288 4429586 8482583 5958493 4066122 7487043 13504460
42788A3504460K085430n275224r510428p293032k184186m02030k677697l275407
$$ 13504460 15589890 10314666 804238 -6488794 -8672980 -9075010 -11752707 -15028114
42780a5028114J191663N687405L507315l424624o411129j647191N271751P542298
$$ -15028114 -13836451 -8149046 -4641731 -8066355 -14477484 -16124675 -10852924 -3310626
42772c310626N121746K257574Q95314n0428r45821n71578J088730J747355k86188
$$ -3310626 1811120 4068694 4964008 4913580 3967759 3396181 4484911 6232266 5946078
42763E946078k982618k076782L272950P621817M962357k666212o492670k772154
$$ 5946078 2963460 886678 4159628 11781445 16743802 14077590 7584920 4812766
42755D812766J693822j49642m807663m499872m05466l74122m653734m446883L373743
$$ 4812766 6506588 6356946 1549283 -2950589 -3356055 -3730177 -8383911 -12830794 -9457051
42746i457051J0216580Q649757K357772k132318n143015q462547q258054j999303
$$ -9457051 759529 9409286 11767058 9634740 4491725 -3970822 -12228876 -14228179
42738a4228179M000943L426139R04266L852345Q220048M513624m890642p969814
$$ -14228179 -10227236 -6801097 -5896831 -2044486 6175562 10689186 5798544 -2171270
42730b171270k334861J501831j610516l660337R83239N023841J179476m781096
$$ -2171270 -4506131 -3004300 -4614816 -8275153 -7291914 -2268073 -1088597 -5869693
42722e869693l488290L255206O807590N001763J869566j150629m511359n060801
$$ -5869693 -9357983 -6102777 704813 5706576 7576142 6425513 1914154 -3146647
42714c146647o88739K667334j655164r064899r232853k151879K366333J355433
$$ -3146647 -3835386 -1168052 -2823216 -11888115 -21120968 -23272847 -20906514 -19551081
42706a9551081K751353R746272J3027261N403719n221222o522805N57602M344910
$$ -19551081 -16799728 -7053456 5973805 11377524 6156302 -366503 191099 4536009
42698D536009j57640n635873m631909L46124K022152r86185l015909J58881N161014
$$ 4536009 4378369 -1257504 -5889413 -5543289 -3521137 -4507322 -7523231 -7364350 -2203336
42689b203336N215800o05554n556226m066432Q56939K735598J351951J516417
$$ -2203336 3012464 2406910 -3149316 -7215748 -6358809 -3623211 -2271260 -754843
42681g54843L448264K082279k903072m721349q34470J429284l265997q031062
$$ -754843 2693421 4775700 1872628 -2848721 -3683191 -2253907 -5519904 -13550966
42673a3550966l985142M603075N947755r60692m997515m21107N214833M134096
$$ -13550966 -17536108 -12933033 -6985278 -7945970 -12943485 -13364592 -8149759 -4015663
42665d015663k80058r53285J492172K003943P64863J898070M916613M632983n42033
$$ -4015663 -4295721 -5249006 -3756834 -1752891 -988028 910042 5826655 10459638 9917605
42656I917605n805828o480524l513394j211043j711695k669024J31687P246448
$$ 9917605 4111777 -2368747 -5882141 -7093184 -8804879 -11473903 -11342216 -4095768
42648d095768J2666418R248662j627404r638533p816953j408794K85945k658086
$$ -4095768 8570650 17819312 16191908 6553375 -1263578 -2672372 -2386427 -5044513
42640e044513k595344K074943L796712j680918p549306n475707K312035O191805
$$ -5044513 -7639857 -5564914 -1768202 -3449120 -10998426 -16474133 -14162098 -7970293
42632g970293J793714n550236p981911l037908M893374Q317659L096914o119788
$$ -7970293 -6176579 -11726815 -19708726 -22746634 -17853260 -9535601 -6438687 -12558475
42624a2558475q669138L67730J2574901J4795915N029092n055567m676291L493595
$$ -12558475 -21227613 -20859883 -8284982 6510933 11540025 6484458 1808167 5301762
42616E301762Q177511L695046m746471q924240o711510k013907J698834M643608
$$ 5301762 13479273 17174319 12427848 3503608 -3207902 -5221809 -3522975 1120633
42608A120633P362472P226855J531022o538345r213878l579958L606230M255600
$$ 1120633 8483105 15709960 17240982 10702637 1488759 -2091199 1515031 5770631
42600E770631k16676j635258K059262L287181l349463j1581696j1136079j752266
$$ 5770631 5553955 3918697 5977959 9265140 5915677 -5666019 -16802098 -18554364
42592a8554364O547150O623044K003746J32941K542154M831441L601814k31659
$$ -18554364 -12007214 -5384170 -3380424 -3247483 -705329 4126112 7727926 7496267
42584G496267m030763o082813n519839k363082J274593K151320j99650j987029
$$ 7496267 3465504 -2617309 -8137148 -10500230 -9225637 -7074317 -7273967 -9260996
42576i260996J68397M005117M161275J22827k201758J060106N338594L786203
$$ -9260996 -9092599 -5087482 -926207 -803380 -3005138 -1945032 3393562 7179765
42568G179765k528279o163765m421277k367804l133434k138545M345073J0573504
$$ 7179765 4651486 -1512279 -5933556 -8301360 -11434794 -13573339 -9228266 1345238
42560A345238Q462881L19567l701421m93983J850047k978739r807238j0000538
$$ 1345238 9808119 10127686 6426265 5932282 7782329 4803590 -5003648 -15004186
42552a5004186l783014J580204K831156L291484N032297M836167R736o109833
$$ -15004186 -18787200 -17206996 -14375840 -11084356 -6052059 -1215892 -1206156 -7315989
42544g315989p652066l298946K714317N857038N434076L544467J831514M40788
$$ -7315989 -14968055 -18267001 -15552684 -9695646 -4261570 -717103 1114411 1555199
42536A555199m68010K04354L000743O227788P158681M962215J234803k430857
$$ 1555199 1087189 1291543 4292286 10520074 17678755 22640970 23875773 21444916
42528B1444916n722143p915413p095737k944528J164652J500106q81007r60258
$$ 21444916 15722773 7807360 711623 -2232905 -1068253 431853 -449154 -1409412
42520a409412L475642Q127825P133705O56937m835388m291279L5298K165741M49364
$$ -1409412 2066230 10194055 17327760 17984697 13149309 8858030 8893328 11059069 11508433
42511A1508433j199844l71200k72304l807835p060237m173365K616494M616639
$$ 11508433 10308589 9937389 9665085 5857250 -1202987 -5376352 -2759858 1856781
42503A856781m27617m074795L00684O984754O294667q69807m899577k111876J142405
$$ 1856781 1429164 -2645631 -2344947 4639807 10934474 10064667 5165090 3053214 4195619
42494D195619j08854k285834j071473M85132k537597p502111o751189J541475
$$ 4195619 4086765 1800931 729458 1214590 -1323007 -8825118 -15576307 -14034832
42486a4034832J0279724J1750417N524318k801474q100764r364060q085820n067306
$$ -14034832 -3755108 7995309 13519627 10718153 2617389 -6746671 -14832491 -19899797
42478a9899797j52465N076693O700646K840937k620316l874706l85581L193331
$$ -19899797 -20052262 -14975569 -8274923 -5433986 -8054302 -11929008 -12314589 -9121258
42470i121258M155299M374780N019528L845533J94420k308476j648181j365930
$$ -9121258 -4965959 -591179 4428349 8273882 8468302 6159826 4511645 3145715
42462C145715m001421m996734O21113Q599809R854217L360627k559726k097663
$$ 3145715 -855706 -5852440 -5231327 3368482 13222699 16583326 14023600 11925937
42454A1925937J765648M114101M556654M138610J608420l292851o919292o130669
$$ 11925937 13691585 17805686 22362340 26500950 28109370 24816519 17897227 11766558
42446A1766558k991927j781717l328268n003454m647052k315665M86938J997086
$$ 11766558 8774631 6992914 3664646 -1338808 -5985860 -8301525 -7814587 -5817501
42438e817501K108400L252018O663631Q170140K493691p436029j1485741n322226
$$ -5817501 -3709101 -457083 6206548 14376688 16870379 9434350 -2051391 -7373617
42430g373617L620885P142289O863115P844860P766886J397794p745833j0423628
$$ -7373617 -3752732 3389557 10252672 18097532 25864418 27262212 19516379 9092751
42422I092751n748512k544870n401457q527413o282991j215155K614071O273955
$$ 9092751 3344239 799369 -4602088 -13129501 -19412492 -20627647 -18013576 -11739621
42414a1739621J0168389Q867317l85291r168023o995200L577628R966196P025063
$$ -11739621 -1571232 7296085 6910794 -2257229 -9252429 -5674801 4291395 11316458
42406A1316458K421807L029885M920085J675131m122945m692918R01558N373509
$$ 11316458 13738265 16768150 21688235 23363366 19240421 14547503 15449061 20822570
42398B0822570L495868j720933m295441k693562j1413O58359j113879l689219
$$ 20822570 24318438 22597505 18302064 15608502 15597089 16255448 15141569 11452350
42390A1452350m826987l240610N5297K422181K395143J063998L226q59951k020526
$$ 11452350 6625363 3384753 3440050 5862231 8257374 9321372 9324598 8464647 6444121
42381F444121k502171j405423l53715j471681l214372j725912K937700N805534
$$ 6444121 3941950 2536527 2182812 711131 -2503241 -4229153 -1291453 4514081
42373D514081M151566J802950K945750N060491L000380k043150l813021j022030
$$ 4514081 8665647 10468597 13414347 18474838 21475218 19432068 15619047 14597017
42365A4597017L13320l590745q228619p749543l338052k27833K89569Q43447J962929
$$ 14597017 14910337 11319592 3090973 -4658570 -7996622 -8224455 -7934886 -7091439 -5128510
42356e128510J289324j593442l959204l962959k476651o94819R72029J537459
$$ -5128510 -3839186 -5432628 -9391832 -13354791 -15831442 -16526261 -15554232 -14016773
42348a4016773J79325j502004j232833j29777j164300l205370j404277M721181
$$ -14016773 -13837448 -15339452 -16572285 -16702062 -17866362 -21071732 -22476009 -17754828
42340a7754828Q551309N153517j280155l284613l28890K176109K139837K753864
$$ -17754828 -9203519 -4050002 -5330157 -8614770 -8943660 -6767551 -4627714 -1873850
42332a873850N063508M882350l58986o416158p513793l880753m03149K92206k79282
$$ -1873850 3189658 8072008 7713022 1296864 -6216929 -10097682 -10500831 -10208625 -10487907
42323a0487907m46404m49401l12074J077223L575041M760334K817497q34919k971920
$$ -10487907 -10934311 -11383712 -11695786 -10618563 -7043522 -2283188 534309 -300610 -3272530
42314c272530j845076J546380M499645M498481J332877k110946k664629j136887
$$ -3272530 -5117606 -3571226 928419 5426900 6759777 4648831 1984202 847315
42306H47315j663735n396149p425864l118458M238222O534702J609337l686689
$$ 847315 -816420 -6212569 -13638433 -16756891 -12518669 -5983967 -4374630 -8061319
42298h061319k877916J820716L694415R12842k394090k771075q05086J739816
$$ -8061319 -10939235 -9118519 -5424104 -4511262 -6905352 -9676427 -10481513 -8741697
42290h741697M025891M769635K426750j844493m244522k929527l20912M79723
$$ -8741697 -4715806 53829 2480579 636086 -3608436 -6537963 -6858875 -6379152
42282f379152o72076k208219l187339k650689O58635N396611O860522K474801
$$ -6379152 -7051228 -9259447 -12446786 -15097475 -14438840 -9042229 -2181707 293094
42274B93094l630585n259438k407092p76414l064803n118826k364850L417543
$$ 293094 -3337491 -8596929 -11004021 -11780435 -14845238 -19964064 -22328914 -18911371
42266a8911371O396435L969304n87730k130137J027675N470136O041683J554874
$$ -18911371 -12514936 -8545632 -9133362 -11263499 -10235824 -4765688 1275995 2830869
42258B830869l261982l118902J122433L797621K327732j08508q15187j822629
$$ 2830869 -431113 -3550015 -2427582 1370039 3697771 3589263 2774076 951447
42250I51447m773071n785639o82405O903103Q633282K562568m359244o001323
$$ 951447 -3821624 -9607263 -10289668 -3386565 5246717 7809285 3450041 -2551282
42242b551282m208347l907621n497314n887275m321345k864452k052134J56232
$$ -2551282 -6759629 -10667250 -16164564 -22051839 -26373184 -29237636 -31289770 -31133538
42234c1133538M720343R528618J1938875J1539883R409582N853629L68319o039635
$$ -31133538 -26413195 -16884577 -4945702 6594181 16003763 21857392 22225711 16186076
42226A6186076r691520p058455O07584O934290O586226J127822l329269l739172
$$ 16186076 6494556 -563899 43685 6977975 13564201 14692023 11362754 7623582
42218G623582k467710k100948j852211o26256K10870j06747P88053M245291O580949
$$ 7623582 5155872 3054924 1202713 576457 787327 680580 1468633 5713924 12294873
42209A2294873L619017k431363n339714l273520j53091J033880J119749M54437
$$ 12294873 15913890 13482527 8142813 4869293 4716202 5750082 6869831 7324268
42201G324268k720500p470832q625415l400847L779963O372210L183298j913569
$$ 7324268 4603768 -2867064 -11492479 -14893326 -11113363 -4741153 -1557855 -3471424
42193c471424n201887n214092k043305K145378L649170J296046j477065j169235
$$ -3471424 -8673311 -13887403 -15930708 -13785330 -10136160 -8840114 -10317179 -11486414
42185a1486414J072425K048078J486071R18381j25769k381477l127717M68602
$$ -11486414 -10413989 -8365911 -6879840 -5961459 -6087228 -8468705 -11596422 -11127820
42177a1127820N128602M558386o09454k066210M518887J2275447J1538522K184006
$$ -11127820 -5999218 -1440832 -2050286 -4116496 402391 12677838 24216360 26400366
42169B6400366o784103q571883n582922m642216p850503j0177072o323664J650570
$$ 26400366 19616263 11044380 5461458 819242 -7031261 -17208333 -23531997 -21881427
42161b1881427O316554M798714K535715M287059O055105J960896m382967m101575
$$ -21881427 -15564873 -10766159 -8230444 -3943385 2111720 4072616 -310351 -4411926
42153d411926K386727N169496Q61013j899994K562560P181200M795243P20729
$$ -4411926 -2025199 3144297 4005310 2105316 4667876 11849076 16644319 17365048
42145A7365048K327419M349832k073499j1099374q431578N386045J3583393P450742
$$ 17365048 19692467 24042299 21968800 10869426 2437848 7823893 21407286 28858028
42137B8858028k616607n268301l538659m310032m819909l03171M268885J869458
$$ 28858028 26241421 20973120 17434461 13124429 8304520 8001349 12270234 14139692
42129A4139692l726120m378343j732171k896762n923174k848412M412666N144458
$$ 14139692 10413572 6035229 4303058 1406296 -4516878 -7365290 -2952624 2191834
42121B191834k025167n666114l9643N724187L254823j705121l54826M051486K896621
$$ 2191834 166667 -5499447 -5539090 185097 3439920 1734799 1379973 5431459 8328080
42112H328080k363966l165528R88064J927408k888066o136706k876579J945624
$$ 8328080 5964114 2798586 3786650 5714058 2825992 -3310714 -6187293 -4241669
42104d241669K069672r77427k062620o97716j47881j372042k167853o76514L097564
$$ -4241669 -2171997 -3149424 -5212044 -5909760 -6057641 -7429683 -9597536 -10274050 -7176486
42095g176486P411462Q472821L127348n328046p738142j39432Q692789O966683
$$ -7176486 234976 8707797 11835145 6507099 -1231043 -1370475 7322314 14288997
42087A4288997m004344j0538089m687975N459925P425536M50618n935471n760138
$$ 14288997 10284653 -253436 -4941411 518514 7944050 8394668 2459197 -3300941
42079c300941j916201J198620L115538M075198K635977n59120j455485J492745
$$ -3300941 -5217142 -4018522 -902984 3172214 5808191 5249071 3793586 5286331
42071E286331M091857K914754J146439K964809N380685K222904n244218q906272
$$ 5286331 9378188 12292942 13439381 16404190 21784875 24007779 18763561 9857289
42063I857289n558769j155975j154049l039529k161794N35228J602352J716151
$$ 9857289 4298520 3142545 1988496 -1051033 -3212827 -2677599 -1075247 640904
42055F40904L481304N305241L432978j199546l811246l066263k131776k289462
$$ 640904 4122208 9427449 12860427 11660881 7849635 4783372 2651596 362134
42047C62134j092077J779030K288817j432894m695839k246630M104613P835213
$$ 362134 -729943 1049087 3337904 1905010 -2790829 -5037459 -932846 6902367
42039F902367O173339K368924r3269j857479n040753q654137r045043m738072
$$ 6902367 13075706 15444630 15351361 13493882 8453129 -201008 -9246051 -13984123
42031a3984123R37035L341252K028579P77405J688749J890726j662703o365454
$$ -13984123 -13047088 -9705836 -7677257 -6899852 -5211103 -3320377 -4983080 -11348534
42023a1348534o785871k520995J154881J001708l01612L18872J310504J48762
$$ -11348534 -18134405 -20655400 -19500519 -18498811 -18800423 -18481551 -17171047 -17022285
42015a7022285j506338n13626K051303K453016O94237Q43512M481543P764305
$$ -17022285 -18528623 -19042249 -16990946 -14537930 -13843693 -13000181 -8518638 -754333
42007g54333O681871K452299n32590n86101k09380j845461m001134k898691K198383
$$ -754333 5927538 8379837 7847247 7261146 7051766 5206305 1205171 -1693520 504863
41998E04863O768695N546007j214641p832862r747993p806773n203644k728384
$$ 504863 7273558 12819565 11604924 3772062 -5975931 -13782704 -18986348 -21714732
41990b1714732P00061M442311N949512L988122J51510k885870l524140k047310
$$ -21714732 -21014671 -16572360 -10622848 -6634726 -6483216 -9369086 -12893226 -14940536
41982a4940536j68150Q09294J675418L702299N243357L021912j817770k891716
$$ -14940536 -15108686 -14299392 -12623974 -8921675 -3678318 -656406 -2474176 -5365892
41974e365892K775486Q701601O643374j632127o183292k237156M196830N372251
$$ -5365892 -2590406 6111195 12754569 11122442 4939150 2701994 6898824 12271075
41966A2271075J260432k597265k803375o12867R95892L12128j834874k724378
$$ 12271075 13531507 10934242 8130867 7518000 8513892 8826020 6991146 4266768
41958D266768j020110O48743j177013n172524o163187k282023K430692L776242
$$ 4266768 3246658 3895401 2718388 -2454136 -8617323 -10899346 -8468654 -4692412
41950d692412K274671Q65758J082908K988049N552796N737895R73875n867334
$$ -4692412 -2417741 -1551983 -469075 2518974 8071770 13809665 14783540 8916206
41942H916206q209902m509422o71777j173082k860191j348525J499285J706043
$$ 8916206 706304 -3803118 -4474895 -5647977 -8508168 -9856693 -8357408 -6651365
41934f651365O78375K509187O419614P743535M837023L5118m519893p284348n762193
$$ -6651365 -5972990 -3463803 2955811 10699346 15536369 15571487 11051594 3767246 -1994947
41925a994947J46886N082320L874731j304198m451980m177138l108794j601922
$$ -1994947 -1848061 3234259 7108990 5804792 1352812 -2824326 -5933120 -7535042
41917g535042J251537K796295O32380r42039L038961P730362M470635l558688
$$ -7535042 -6283505 -3487210 -2854830 -3796869 -757908 6972454 11443089 7884401
41909G884401l983824M775710R389149K247965o678274o448464k109770m400738
$$ 7884401 3900577 8676287 18065436 20313401 13635127 7186663 5076893 676155
41901F76155j1251306j1890932m328285L140674N453477N301927N035618L222011
$$ 676155 -10575151 -22466083 -26794368 -23653694 -18200217 -12898290 -7862672 -4640661
41893d640661l49021l355986m950803n785151n101478k611706q68961o85503K061767
$$ -4640661 -4989682 -8345668 -13296471 -19081622 -24183100 -26794806 -27663767 -28349270 -26287503
41884b6287503Q817662J2243804O037468l467004n515767j206908M0185k260944
$$ -26287503 -17469841 -5226037 811431 -2655573 -8171340 -9378248 -9338063 -11599007
41876a1599007L18631P784867R203532J044514n830659l374352J996842K274894
$$ -11599007 -11280376 -3495509 5708023 6752537 921878 -2452474 -455632 1819262
41868A819262P17574K636579L487961k758163j0705096j0341276k064300N141007
$$ 1819262 2536836 5173415 8661376 5903213 -4801883 -15143159 -17207459 -12066452
41860a2066452O765514M949775J411429k626987k849731K526053O563485K469042
$$ -12066452 -5300938 -351163 1060266 -1566721 -4416452 -1890399 4673086 7142128
41852G142128m400068l830788K416291L097394l721826p326739k189799L307899
$$ 7142128 2742060 -1088728 1327563 4424957 703131 -6623608 -8813407 -5505508
41844e505508J195817l659434k588013L407897O891027N115090P51840m345780
$$ -5505508 -4309691 -7969125 -10557138 -7149241 -258214 4856876 5608716 1262936
41836A262936r296530j0898804o446992J405942P098643Q154507N447169O9247
$$ 1262936 -8033594 -18932398 -25379390 -23973448 -16874805 -8720298 -3273129 -3203882
41828c203882n898156p873469l160809L942752N912964R53986n227265o589366
$$ -3203882 -9102038 -16975507 -20136316 -16193564 -10280600 -9326614 -14553879 -21143245
41820b1143245k643222K868043O198378N891583L148012P71713M37518P72216
$$ -21143245 -23786467 -20918424 -14720046 -8828463 -5680451 -4908738 -4471220 -3699004
41812c699004o06520l240975l687012K27938O235602R707717Q484055M690522
$$ -3699004 -4305524 -7546499 -11233511 -11005573 -4769971 4937746 13421801 18112323
41804A8112323J606969j55330k097959m205959m398458k228581l47855o03983
$$ 18112323 19719292 19563962 17466003 13260044 8861586 6633005 6285150 5681167
41796E681167j482495j790533l481149o869382o526862J736518J1655416J2021174
$$ 5681167 4198672 2408139 -1073010 -7942392 -14469254 -12732736 -1077320 10943854
41788A0943854K010472o619320n090637J682168L847126q6425l991548l707382
$$ 10943854 12954326 6335006 1244369 2926537 6773663 6687238 2695690 -1011692
41780a011692k46018L828365O259161N159058J264518j402734k81746K191576
$$ -1011692 -1257710 2570655 8829816 13988874 15253392 13850658 13568912 15760488
41772A5760488K489014R56056M7p4755m79687j702572m216486q174722j0309554
$$ 15760488 18249502 19205558 19205605 19130850 18651163 16948591 12732105 4557383 -5752171
41763e752171n874340L240904P941913L918932j672356j176635K172673J374001
$$ -5752171 -11626511 -8385607 -443694 3475238 1802882 626247 2798920 4172921
41755D172921j744627p32120L030256K972046j83107L5479L038814J726825l985230
$$ 4172921 2428294 1696174 4726430 7698476 7515369 7550848 10589662 12316487 8331257
41746H331257o231939l201404j699056l086565N2879Q224281R648825j008689
$$ 8331257 2099318 -1102086 -2801142 -5887707 -5834828 2389453 12038278 11029589
41738A1029589j0604611n372836Q374460J3712693O735096j950899n077665n166054
$$ 11029589 424978 -4947858 3426602 17139295 23874391 21923492 16845827 11679773
41730A1679773m846453l117525k012000o016167j2385884j1423005j68325J1587906
$$ 11679773 6833320 3715795 1703795 -4312372 -16698256 -28121261 -28289586 -16701680
41722a6701680J3279883O094383o32553j502610P22039R45113j779836l825764
$$ -16701680 -3421797 2672586 2040033 537423 1259462 2204575 424739 -3401025
41714c401025j936295K238472M005005K042816k32937j016694l214624p769326
$$ -3401025 -5337320 -3098848 906157 2948973 2716036 1699342 -1515282 -9284608
41706i284608q798234j289219R798442J4786865J1280873M345461k612971r061624
$$ -9284608 -18082842 -19372061 -9573619 5213246 16494119 20839580 18226609 9164985
41698I164985j1364196n354076M636506Q722526N107707J708409K142763L79074
$$ 9164985 -2199211 -7553287 -2916781 5805745 10913452 12621861 14764624 15143698
41690A5143698o465206j0500181n384817K444420L593708m7912m79110K203556
$$ 15143698 8678492 -1821689 -7206506 -4762086 -1168378 -1216290 -1695400 508156
41682E08156J384200l156157m727570j732574j75307k800194m665454k249849
$$ 508156 1892356 -1263801 -5991371 -7723945 -7899252 -10699446 -15364900 -17614749
41674a7614749Q63496J094509Q47903K756739L692032L28431l335523o47772P120688
$$ -17614749 -16751253 -15656744 -14808841 -12052102 -8360070 -8031639 -11367162 -12014934 -4894246
41665d894246J1167432O714713q87243l627206p51542J853303K98679k869560
$$ -4894246 6273186 12987899 12100656 8473450 7721908 9575211 9873890 7004330
41657G004330l135562k5832L148946M011007L184687K019001P47662l91718l88295
$$ 7004330 3868768 3842936 6991882 11002889 14187576 16206577 16954239 16562521 16174226
41648A6174226P68816J152639n62505k747382k784509o61592J102835O79222j406343
$$ 16174226 16943042 18095681 17533176 14785794 12001285 11339693 12442528 13121750 11715407
41639A1715407l380515l605165j413584J855368L116112N95138l480992m885930
$$ 11715407 8334892 4729727 3316143 5171511 8287623 8882761 5401769 515839
41631E15839k146820K085577M343699L556178J031601j085058j071867J078345
$$ 515839 -1630981 454596 4798295 8354473 9386074 8301016 7229149 8307494
41623H307494L124105K660226K01817j179059N7481J596876K16709l820293o725305
$$ 8307494 11431599 14091825 14293642 13114583 13172064 14768940 14985649 11165356 4440051
41614D440051n459704j043237K717294L188321J047873j262246k267270k094718
$$ 4440051 -1019653 -2062890 654404 3842725 4890598 3628352 1361082 -733636
41606g33636j261216k59666j37392j612248l066987j480000L165153O207902L490802
$$ -733636 -1994852 -2254518 -2391910 -4004158 -7071145 -8551145 -5385992 821910 4312712
41597D312712k666678n499691k054176L134030L758419p27761n026990m604660
$$ 4312712 1646034 -3853657 -5907833 -2773803 984616 256855 -4770135 -9374795
41589i374795o29471J979646M52894k768042l084686O30742M483401M179674L50483
$$ -9374795 -10004266 -8024620 -7571726 -10339768 -13424454 -12793712 -8310311 -4130637 -3780154
41580c780154k100158K3492M270502N467238J784847l481812o222350n937156
$$ -3780154 -5880312 -5856820 -1586318 3880920 5665767 2183955 -4038395 -9975551
41572i975551m549386k163379K899263R244241J1196484N576302k484815m742705
$$ -9975551 -14524937 -16688316 -13789053 -4544812 6651672 12227974 9743159 5000454
41564E000454k13921M154638L542574R02264N37777J040404j267761n195093n900718
$$ 5000454 4786533 8941171 12483745 13386009 13923786 14964190 13696429 8501336 2600618
41555B600618j911770L191369N548768M290894P69681k474904k722342J39832
$$ 2600618 688848 3880217 9428985 13719879 14489560 12014656 9292314 9432146
41547I432146K721340K599395K026122L877159N886875L533344k463251o647189
$$ 9432146 12153486 14752881 16779003 20656162 26543037 30076381 27613130 20965941
41539B0965941o610509n222622m851875m501943l454146k662413j472331J851464
$$ 20965941 14355432 9132810 4280935 -221008 -3675154 -6337567 -7809898 -5958434
41531e958434N107688L437686k409549n192101j553860K744665J881086j677010
$$ -5958434 -850746 2586940 177391 -5014710 -6568570 -3823905 -1942819 -3619829
41523c619829k812490k044863j957963l88795N211569J0211862P941582N21122
$$ -3619829 -6432319 -8477182 -10435145 -10823940 -5612371 4599491 12541073 13062195
41515A3062195l595146j980061N9344M381J504393N474899O340899R51281n618599
$$ 13062195 9467049 7486988 7546332 7550713 9055106 14530005 20870904 21822185 16203586
41506A6203586p501640n586411l308729l57042M209957P156410N356439J689931
$$ 16203586 8701946 3115535 -193194 -550236 3659721 10816131 16172570 17862501
41498A7862501P88890J396374r00997n075086n608732j903121J04197k548432
$$ 17862501 18651391 20047765 19146768 14071682 8462950 6559829 6664026 4115594
41490D115594m841871j786720L261178L292703j740555m548296j051779L571512
$$ 4115594 -726277 -2512997 748181 4040884 2300329 -2247967 -3299746 271766
41482B71766K252317l574486n610224n95266M533525K449273l500035l687484
$$ 271766 2524083 -1050403 -6660627 -7255893 -2722368 -273095 -3773130 -7460614
41474g460614L660830R471394O471505j521597o520809o944894n928003l630343
$$ -7460614 -3799784 5671610 12143115 10621518 4100709 -2844185 -8772188 -12402531
41466a2402531J586845O678154O318980J591589p25718J730441M110415K862970
$$ -12402531 -10815686 -4137532 2181448 3773037 3047319 4777760 8888175 11751145
41458A1751145K64892j544842m044077o820969n732938p60510J484859j486014
$$ 11751145 12016037 10471195 6427118 -393851 -6126789 -6887299 -5402440 -6888454
41450f888454k299286L853354Q578186K595745p209776o490267L591083P322966
$$ -6888454 -9187740 -5334386 3243800 5839545 -1370231 -7860498 -4269415 3053551
41442C053551n43997o694664j587023N353409K717957l651741j993047M108755
$$ 3053551 2509554 -4185110 -5772133 -418724 2299233 -1352508 -3345555 763200
41434G63200J887730p811821j0687781j912543O733620O177725K601580M299398
$$ 763200 2650930 -5160891 -15848672 -17761215 -11027595 -4849870 -2248290 2051108
41426B051108P605665M717878k609991o481393m832555j732117N56541K227041
$$ 2051108 9656773 14374651 11764660 5283267 450712 -1281405 -724864 1502177
41418A502177J601076k411696n539837l053980J743849J043637n662728j0183492
$$ 1502177 3103253 691557 -4848280 -7902260 -6158411 -5114774 -10777502 -20960994
41410b0960994p044444j53421L895834L997954L282102L429728L236689J096699
$$ -20960994 -28005438 -28158859 -24263025 -20265071 -16982969 -13553241 -10316552 -9219853
41402i219853k731542n447012l597064K578692P774824P383779L405721J009166
$$ -9219853 -11951395 -17398407 -20995471 -18416779 -10641955 -3258176 147545 1156711
41394A156711O34868j441529n360322o690877m054957j403068o41026J552812
$$ 1156711 1791579 350050 -5010272 -11701149 -15756106 -17159174 -17800200 -16247388
41386a6247388O131861P328530J330891n755410n353619J315761N372634L023753
$$ -16247388 -10115527 -2786997 -1456106 -7211516 -12565135 -11249374 -5876740 -2852987
41378b852987q82736j887317j487500j890309j278787K094277N139475L507927
$$ -2852987 -3735723 -5623040 -7110540 -9000849 -10279636 -8185359 -3045884 462043
41370D62043j856985n389016l844240R0755J823718Q28512R65873M746664Q957133
$$ 462043 -1394942 -6783958 -10628198 -10537443 -8713725 -7885213 -6919340 -2172676 6784457
41361F784457Q170227K421797j721455M53388N058667M577388j857408p204107
$$ 6784457 14954684 17376481 15655026 16108414 21167081 25744469 23887061 16682954
41353A6682954n736937J47722L764348K069891k229964m942297m709607l363581
$$ 16682954 10946017 11093739 14858087 16927978 14698014 9755717 5046110 1682529
41345A682529l237620m617564n853119n611690m066635j778682R50875K918178
$$ 1682529 -1555091 -6172655 -12025774 -17637464 -21704099 -23482781 -22531906 -19613728
41337a9613728K397901K37777J82115L697512O881608N752208K166763J92322
$$ -19613728 -17215827 -16978050 -16795935 -13098423 -6216815 -464607 1702156 1894478
41329A894478r85684m499599p608851l938923N071876R260179L945034k420056
$$ 1894478 908794 -3590805 -11199656 -15138579 -10066703 -806524 3138510 718454
41321G18454n15255O102587P031896O95619m570974l616658l39123L57005o75846
$$ 718454 203199 6305786 13337682 14033301 9462327 5845669 5506546 5863551 5187705
41312E187705m57479J138397K778105M047752M069000J228362l411448n583772
$$ 5187705 4730226 5868623 8646728 12694480 16763480 17991842 14580394 8996622
41304H996622l115509R40838K758330K622093K678074K302377o33309m970815
$$ 8996622 5881113 6821951 9580281 12202374 14880448 17182825 16549516 11578701
41296A1578701o353152k603201L232731O056423L889142n71410l094183k445026
$$ 11578701 5225549 2622348 5855079 11911502 15800644 15229234 12135051 9690025
41288I690025j549933l469161o643196o109362k06247O034223O326169J050216
$$ 9690025 8140092 4670931 -1972265 -8081627 -8287874 -2253651 4072518 5122734
41280E122734k759057R4071O333228P796145J309198p032268q887269l695940
$$ 5122734 2363677 2457748 8790976 16587121 17896319 10864051 1976782 -1719158
41272a719158J225023Q56909j165793Q06734M742284L254823m871680j1149984
$$ -1719158 -494135 362774 -803019 3715 4745999 8000822 3129142 -8020842
41264h020842p614106L252583J1738671J1748334N730264K31442r49603N06804
$$ -8020842 -15634948 -12382365 -643694 11104640 16834904 17066346 16116743 16623547
41256A6623547K01870l439383o638565m674727J579226O092264M964173M74464
$$ 16623547 16825417 13386034 6747469 2072742 3651968 9744232 14708405 15182869
41248A5182869k830078l078015j132591J080143J063462k088929m817097k385659
$$ 15182869 12352791 9274776 8142185 9222328 10285790 8196861 3379764 994105
41240I94105L449473N172020O59366k253816K659351R179407O601666m486521
$$ 994105 4443578 9615598 10274964 8021148 10680499 19859906 26461572 21975051
41232B1975051j2276725r082400J86100N634176L081532l859614q208538n403811
$$ 21975051 9698326 615926 802026 6436202 9517734 5658120 -2550418 -7954229
41224g954229K217144P098068N226117R68273l48610o58609l800001o025084j056872
$$ -7954229 -5737085 1360983 6587100 7555373 7206763 6548154 2748153 -3276931 -4333803
41215d333803P429869R140090L257725j46673K757907K934494n516909j3714094
$$ -4333803 3096066 12236156 15493881 15347208 18105115 21039609 15522700 1808606
41207A808606j0824670l08848O113793M963804K064771J078258K39279j309596
$$ 1808606 -9016064 -9324912 -3211119 1752685 3817456 4895714 5134993 3825397
41199C825397j826891r78349J97572J968868L842256K533396k844936o858683
$$ 3825397 1998506 1020157 1217729 3186597 7028853 9562249 6717313 -141370
41191a41370m839366n23042l38831l655584n634315n855052n902362k272721Q113887
$$ -141370 -4980736 -5503778 -5842609 -9498193 -15132508 -20987560 -26889922 -29162643 -21048756
41182b1048756J7802294J5704150L873858l986504j935430J691189l61939m119199
$$ -21048756 -3246462 12457688 16331546 12345042 10409612 12100801 11738862 7619663
41174G619663m367077l993040o477883p794604l495235K688868M642824L062548
$$ 7619663 3252586 -740454 -7218337 -15012941 -18508176 -15819308 -11176484 -8113936
41166h113936K384068L297231M286963N868613P410593M689905l039125q317528
$$ -8113936 -5729868 -2432637 1854326 7722939 15133532 19823437 16784312 8466784
41158H466784m747638L161265O396468L708771J73568k441817n379851o174698
$$ 8466784 3719146 6880411 13276879 16985650 17159218 14717401 9337550 3162852
41150C162852j695327L754588K894923k553000l941222m3411R50378m032853o834507
$$ 3162852 1467525 5222113 8117036 5564036 1622814 1579403 2529781 -1503072 -8337579
41141h337579j354665O024816O277570J437266N29144N677646J0080693Q419546
$$ -8337579 -9692244 -3667428 2610142 4047408 4576552 10254198 20334891 28754437
41133B8754437K632331k736397n486825n099410j597927K876512M209981M69189
$$ 28754437 31386768 28650371 23163546 18064136 16466209 19342721 23552702 24021891
41125B4021891n116714p077786l585634J495479K762231r73918n739551p093145
$$ 24021891 18905177 11827391 8241757 9737236 12499467 11525549 5785998 -1307147
41117a307147m542086n76284L184383O796462R501013R071764M655179j369277
$$ -1307147 -5849233 -6425517 -3241134 3555328 13056341 22128105 26783284 25414007
41109B5414007n631799p009953o544133m799373j026871M270506P258560L905802
$$ 25414007 19782208 12772255 6228122 1428749 401878 4672384 11930944 15836746
41101A5836746l797428p542055k046681O761737P818346n71229q089624o527006
$$ 15836746 12039318 4497263 2450582 9212319 17030665 16459436 8369812 1842806
41093A842806k64158K237852J673943M630104J0227431R875353J282001o268797
$$ 1842806 1578648 3816500 5490443 10120547 20347978 30223331 31505332 25236535
41085B5236535m616494J920439L189958l030387r515712r810423m931895j08626
$$ 25236535 20620041 22540480 25730438 22700051 13184339 3373916 -1557979 -1666605
41077a666605J363626M6157j783313k901377l827235m909326m629285j341939
$$ -1666605 -302979 -256822 -2040135 -4941512 -8768747 -13678073 -18307358 -19649297
41069a9649297L531609O122109M495902P72457j654563j422058P43097L561367
$$ -19649297 -16117688 -9995579 -5499677 -4727220 -6381783 -7803841 -7060744 -3499377
41061c499377N891978O844905N798022K316658k855689o255075l793354L302419
$$ -3499377 2392601 9237506 15035528 17352186 14496497 8241422 4448068 7750487
41053G750487P415250L284045m340526o642248k684828N35367q12619l276580
$$ 7750487 15165737 18449782 14109256 7467008 4782180 5317547 4504928 1228348
41045A228348l851996m367882n639506m362136J95118K744845K05357k128863
$$ 1228348 -2623648 -6991530 -12631036 -16993172 -16798054 -14053209 -13847852 -15976715
41037a5976715J544693P925952R239054M338527j134788l540691l987043l514284
$$ -15976715 -14432022 -6506070 2732984 7071511 5936723 2396032 -1591011 -5105295
41029e105295j452697J443188K914328K504057J700092J518472K778936O752933
$$ -5105295 -6557992 -5114804 -2200476 303581 2003673 3522145 6301081 13054014
41021A3054014J1908338J2583810N699472l464315p638399p592506r265146j2385464
$$ 13054014 24962352 37546162 43245634 39781319 32142920 24550414 15285268 2899804
41013B899804j0093321q56852P109173O565108M59540l217772j252346L583971
$$ 2899804 -7193517 -8050369 -941196 5623912 6083452 2865680 1613334 5197305
41005E197305P361444P639537M231513K22366l33664K023810J872175l466920
$$ 5197305 12558749 20198286 24429799 24652165 24318501 26342311 28214486 24747566
40997B4747566r380899j0247029p192162n391362n593492l239912L844070J1018897
$$ 24747566 15366667 5119638 -2072524 -7463886 -13057378 -16297290 -12453220 -1434323
40989a434323J2007349O486983M08194r88633J208711K074281l7315j603926q9522
$$ -1434323 10573026 17060009 17468203 16479570 17688281 19762562 19725247 18121321 18031799
40980A8031799J314254j534646o350575o626263r56316M671931M950007J205462
$$ 18031799 19346053 17811407 11460832 4834569 3878253 8550184 13500191 14705653
40972A4705653k531118n268364p908571r386347p473298k267413L453154O736520
$$ 14705653 12174535 6906171 -1002400 -10388747 -17862045 -20129458 -16676304 -9939784
40964i939784O377404L621965J459501J485182J463618j470083n508064n947420
$$ -9939784 -3562380 59585 1519086 3004268 4467886 2997803 -2510261 -8457681
40956h457681k546077j62479o90198n0299L879835O321939L433343k33390J276091
$$ -8457681 -11003758 -11166237 -11856435 -11906734 -8026899 -1704960 1728383 1494993 2771084
40947B771084M849711K956822l062670l326526N674936J4387163J2167532N51617
$$ 2771084 7620795 10577617 7514947 4188421 9863357 24250520 36418052 36969669
40939C6969669r775282j1812311p705553l159949o42672J181797L514989M766869
$$ 36969669 27194387 15382076 7676523 4516574 3873902 5055699 8570688 13337557
40931A3337557K593403j829842l761592q01415L046326K177676k851603n988211
$$ 13337557 15930960 14101118 10339526 9538111 12584437 14762113 11910510 5922299
40923E922299l829395P64713L660200M028943K677602k27885l541979m583056
$$ 5922299 2092904 2857617 6517817 10546760 13224362 12996477 9454498 4871442
40915D871442k829649j379473k065152k047781J303012M841378L548481j496674
$$ 4871442 2041793 662320 -1402832 -3450613 -2147601 2693777 6242258 4745584
40907D745584m145206k097129K01674j235962m356956m917861k204627J803675
$$ 4745584 600378 -1496751 -1295077 -2531039 -6887995 -11805856 -14010483 -12206808
40899a2206808N719098P897477N313106k187052q279139o043732K634118Q399458
$$ -12206808 -6487710 1409767 6722873 4535821 -3743318 -9787050 -7152932 1246526
40891A246526N955892l53569l830281l310966j172118J604342M034811K746728
$$ 1246526 7202418 6848849 3018568 -292398 -1464516 139826 4174637 6921365
40883F921365l374254q450758n595941L049214P985324M433800k468010n518656
$$ 6921365 3547111 -4903647 -10499588 -7450374 534950 4968750 2500740 -3017916
40875c017916l591017k78025J289647K58059j877169j540715L194833Q315582
$$ -3017916 -6608933 -6886958 -5597311 -5339252 -7216421 -8757136 -5562303 2753279
40867B753279P566319J505762k246476L49487M511048M826338K598480P88956
$$ 2753279 10319598 11825360 9578884 9928371 14439419 19265757 21864237 22653193
40859B2653193k250338p858674j0876962n923778L032694O720791K627900l463075
$$ 22653193 20402855 12544181 1667219 -4256559 -1223865 5496926 8124826 4661751
40851D661751o444579n804205j992682L886230P243983M179693j199576p80290
$$ 4661751 -1782828 -7587033 -9579715 -5693485 1550498 5730191 4530615 3750325
40843C750325N478493Q851088M793394r77037k159060m13890q6735n41276J087458
$$ 3750325 9228818 18079906 22873300 21896263 19737203 19323313 19236578 18695302 19782760
40834A9782760L801462M250404J506623l021009p405544q426118l137684N555847
$$ 19782760 23584222 27834626 29341249 26320240 18914696 10488578 7350894 12906741
40826A2906741R243011M022770l604652n244210j463023Q75737p28713k195782
$$ 12906741 22149752 26172522 22567870 17323660 15860637 16736374 16007661 13811879
40818A3811879k26473L235530M310951J736909k210434l740809j281932J903556
$$ 13811879 13585406 16820936 21131887 22868796 20658362 16917553 15635621 17539177
40810A7539177Q98841m156815p697517o301406k452864J031689M869502Q371136
$$ 17539177 18438018 14281203 6583686 282280 -2170584 -1138895 3730607 12101743
40802A2101743O865132m89764n941876l249627K070920P83283n474744p193573
$$ 12101743 18966875 18477111 12535235 9285608 11356528 12139811 6665067 -528506
40794e28506k531897P71721o39788o05983M768492R795277Q591294M021319J372001
$$ -528506 -3060403 -2288682 -2928470 -3534453 1234039 11029316 19620610 23641929 25013930
40785B5013930p51951o453238j3447715j4759611q123941J273781O879797O366873
$$ 25013930 24261979 17808741 4361026 -10398585 -18522526 -17248745 -10368948 -4002075
40777d002075K188290q31465L44590L275076K409395l002346o314115k013126
$$ -4002075 -1813785 -2645250 -2300660 974416 3383811 381465 -5932650 -7945776
40769g945776N690094P281996J95731p676760p640167k76699N974880M892122
$$ -7945776 -2255682 5026314 5222045 -2454715 -10094882 -10371581 -4396701 495421
40761D95421r04600l850729p60997L795004M134128R60038p05678N06711J045854
$$ 495421 -409179 -4259908 -5020905 -1225901 2908227 3868265 3162587 3669298 4715152
40752D715152m82530j98461M165649P455732L225863n891500r473758k469609
$$ 4715152 4232622 4034161 8199810 15655542 18881405 12989905 3516147 1046538
40744A046538P006171O777642l911158j2659082r337495R59942N201194K38314
$$ 1046538 8052709 14830351 10919193 -1739889 -11077384 -10117442 -4916248 -4677934
40736d677934m088422n01380N676040O681352M415146M367303L978525k057645
$$ -4677934 -8766356 -9267736 -3591696 3089656 7504802 11872105 15850630 13792985
40728A3792985q857329o511455K691605N691037q25557n166418o36429L153775
$$ 13792985 4935656 -1575799 1115806 6806843 5981286 814868 178439 3332214
40720C332214k533956r439772n220405O460025J1865321P469952J370577j895360
$$ 3332214 798258 -8641514 -13861919 -7401894 4463427 11933379 13303956 11408596
40712A1408596n016801p952638o761358k919763k778920o213921n673920J508074
$$ 11408596 6391795 -1560843 -8322201 -11241964 -14020884 -20234805 -25908725 -24400651
40704b4400651Q865314J0906437Q992392N241645n54814n374972l449373L830473
$$ -24400651 -15535337 -4628900 4363492 9605137 9050323 3675351 225978 4056451
40696D056451O933045J678572m243971l463672J43343o32671m156170l692088
$$ 4056451 10989496 12668068 8424097 4960425 5103768 4471097 314927 -3377161
40688c377161J043115M043699K505411n78319k149525j976839n61854J565032
$$ -3377161 -2334046 1709653 4215064 3636745 1487220 -489619 -1051473 513559
40680E13559L148738L824481M915273O187981M638420l26633l787483j627579
$$ 513559 3662297 7486778 12402051 18590032 23228452 22901819 19114336 17486757
40672A7486757K808931L096371j274173m996980m554122j175398K620861M985278
$$ 17486757 20295688 23392059 22117886 17120906 12566784 11391386 14012247 18997525
40664A8997525M028023n22642n157180n706586k441039R06348K407346L105782
$$ 18997525 23025548 22502906 17345726 11639140 9198101 10104449 12511795 15617577
40656A5617577L832622M127005L666505J990000j973220p231298r511098o404800
$$ 15617577 19450199 23577204 27243709 29233709 27260489 20029191 10518093 4113293
40648D113293j828896r94058k734327k064209J004216J537741j425551k739979
$$ 4113293 2284397 1290339 -1443988 -3508197 -2503981 -966240 -2391791 -5131770
40640e131770M27104M135470M425886L145231L217589K599338k013106q021643
$$ -5131770 -4704666 -569196 3856690 7001921 10219510 12818848 10805742 2784099
40632B784099q764748k238645N993992R365817P067070L091483M54755j522205
$$ 2784099 -5980649 -8219294 -2225302 7140515 14207585 17299068 17753823 16231618
40624A6231618m244107o260646m754858k26111L015492K156626p47112k438066
$$ 16231618 11987511 5726865 972007 745896 3761388 5918014 5170902 2732836
40616B732836k815691k902517j267934L174321O638411M142230k580714o290669
$$ 2732836 -82855 -2985372 -4253306 -1078985 5559426 9701656 7120942 830273
40608H30273m128448q91843p36572j139177J557621N300726N685201L100387J543867
$$ 830273 -3298175 -4190018 -4926590 -6065767 -4508146 792580 6477781 9578168 11122035
40599A1122035J854814R82984k131991m254781k631198R48562K693158J794203
$$ 11122035 12976849 13959833 11827842 7573061 4941863 5890425 8583583 10377786
40591A0377786J007735K607786N238631N602856K729600q38141k503596k527105
$$ 10377786 11385521 13993307 19231938 24834794 27564394 26726253 24222657 21695552
40583B1695552k085442m17967L099117N304216K034284n042104q957944o640392
$$ 21695552 19610110 19192143 22291260 27595476 29629760 24587656 15629712 8989320
40575H989320l146677l581149m986340j382619N813216Q889949N090180K28264
$$ 8989320 5842643 2261494 -2724846 -4107465 1705751 10595700 15685880 15914144
40567A5914144p83217p88016l499963m918427J240239J1478929J4134993M942525
$$ 15914144 15130927 14342911 10842948 5924521 7164760 18643689 32778682 37721207
40559C7721207o191128q311787l351929m60702j117395P57910N388785M845390
$$ 37721207 31530079 23218292 19866363 19405661 18288266 19046176 24434961 29280351
40551B9280351k971412q162928k996364N623498O115389r51601n395883l357064
$$ 29280351 26308939 18146011 15149647 20773145 26888534 25936933 20541050 17183986
40543A7183986n78817p45120m91407K532524N223221N286405M948950N795675
$$ 17183986 16605169 15860049 15368642 17901166 23124387 28410792 33359742 39155417
40535C9155417O062518N319653N711669O441601L636233j837121l599553j54171
$$ 39155417 45217935 50537588 56249257 62690858 66327091 64489970 60890417 60736246
40527F0736246J354665l713146r737146r724381n222815j048194L358195R640375
$$ 60736246 62090911 58377765 48640619 38916238 33693423 32645229 36003424 45643799
40519D5643799J3252694R418617K545394P86159L893283N124501K913477J455779
$$ 45643799 58896493 68315110 70860504 71646663 75539946 80664447 83577924 85033703
40511H5033703J181909j437437m497194j071291R003566J6765298J6608316J3199243
$$ 85033703 86215612 84778175 80280981 79209690 88213256 104978554 121586870 134786113
40503A34786113J2453757J3170624J2169365J1060797J2332875J3808845J2797328
$$ 134786113 147239870 160410494 172579859 183640656 195973531 209782376 222579704
40496B22579704J2097279J6269022K4229969L0411461L1819481L0044471K7545430
$$ 222579704 234676983 250946005 275175974 305587435 337406916 367451387 394996817
40489C94996817K5326410K3206423J9546472J1909783O34644r557581j4331613
$$ 394996817 420323227 443529650 463076122 474985905 475620549 466062968 451731355
40482D51731355j5203337j7538604k3535035k9601547l0841480k6467287k0438279
$$ 451731355 436528018 418989414 395454379 365852832 335011352 308544065 288105786
40475B88105786j7496300j8592013k0120098j8135499j2938843q364324p222110
$$ 288105786 270609486 252017473 231897375 213761876 200823033 192458709 185236599
40468A85236599r427064j3868505j8886541k0831490j6289351p468607j738971
$$ 185236599 175809535 161941030 143054489 122222999 105933648 98465041 96726070
40461I6726070l195735p666437r082050p858716q659065j1716510j1947513p294704
$$ 96726070 93530335 85863898 76781848 68923132 60264067 48547557 36600044 29305340
40453B9305340k760830l171453n516039l129784L732106O948218J905030n011122
$$ 29305340 26544510 23373057 17857018 14727234 18459340 25407558 27312588 22301466
40445B2301466m776404J456528M302054K26650l894141k547930j66969k479784
$$ 22301466 17525062 18981590 23283644 23510294 19616153 17068223 16901254 14421470
40437A4421470n684432k257189O306620J1440790J0397013Q078083O301583R83041
$$ 14421470 8737038 6479849 12786469 24227259 34624272 42702355 49003938 49986979
40429D9986979p888655j2713551r005835k265153N89360J97463J81128k12547
$$ 49986979 42098324 29384773 20378938 18113785 18703145 18900608 19081736 18869189
40421A8869189k758666m563489k483039L28444j076096m961492n463183j950539
$$ 18869189 16110523 11547034 9063995 9392439 8316343 3354851 -2108332 -4058871
40413d058871N75297q0737m00141K604593O894424Q472167N936270J066224l204671
$$ -4058871 -3483574 -3564311 -3964452 -1359859 5534565 14006732 19943002 21009226 17804555
40404A7804555n076346n150261m905168l901099q37107K451963K176308r03837
$$ 17804555 12728209 7577948 2672780 -1228319 -2065426 386537 2562845 1659008
40396A659008j236863K638641M692511J041112k986057j432360K121185P72985
$$ 1659008 422145 3060786 7753297 8794409 5808352 4375992 6497177 7270162
40388G270162l561755l299571K021251N514832M405320K282718J88252m490589
$$ 7270162 3708407 408836 2430087 7944919 12350239 14632957 14821209 10330620
40380A0330620r082953o273121K874571O781242K0470o853241k022293R862231
$$ 10330620 1247667 -5025454 -2150883 4630359 4650829 -2202412 -4224705 5637526
40372E637526J4094569O338268l023576m468525n99564P41663j618861k044504
$$ 5637526 19732095 26070363 23046787 18578262 17978698 18720361 17101500 15056996
40364A5056996K286384O317206L517766m642997r216748m835901L262614O528047
$$ 15056996 17343380 23660586 27178352 22535355 13318607 8482706 11745320 18273367
40356A8273367M324899K488273K641570N17147m446064o170234k269067J18533
$$ 18273367 22598266 25086539 27728109 28245256 23799192 17628958 15359891 15478424
40348A5478424n130899j2295465j1019765j263103O719789O518735K458169J200418
$$ 15478424 10347525 -1947940 -12967705 -14230808 -7511019 -992284 1465885 2666303
40340B666303K588633J922915k329856o558495o639912k505233J960554L132559
$$ 2666303 5254936 7177851 4847995 -1710500 -8350412 -10855645 -8895091 -5762532
40332e762532J638660J346979L969756O307294M390342j012780n178747n004041
$$ -5762532 -4123872 -2776893 1192863 7500157 11890499 10877719 5698972 694931
40324F94931j715469J592868L016133K279840l8840k856924m807787m688213k003613
$$ 694931 -1020538 572330 3588463 5868303 5829463 2972539 -1835248 -6523461 -8527074
40315h527074K330808N879257O337329L706270J27443k329716k753726j011661
$$ -8527074 -6196266 -317009 6020320 9726590 9854033 7524317 4770591 3758930
40307C758930J751387K797985O16996k245487k314515q33735k014016n307112
$$ 3758930 5510317 8308302 8925298 6679811 4365296 3531561 1517545 -3789567
40299c789567m957684P27860N549421M623494J836731K644326M336556Q84977
$$ -3789567 -8747251 -8019391 -2469970 2153524 3990255 6634581 10971137 11856114
40291A1856114n592393o835760j433119K632371K54374l353788j148011N350943
$$ 11856114 6263721 -572039 -2005158 627213 881587 -2472201 -3620212 1730731
40283A730731Q741941N557230p18124m645857l700812P13091M686969M851737
$$ 1730731 10472672 16029902 15311778 10665921 6965109 7678200 12365169 17216906
40275A7216906J423903k341240m039173m037343l461087k585367j853211k086470
$$ 17216906 18640809 16299569 12260396 8223053 4761966 2176599 323388 -1763082
40267a763082k798173k622471k110571l222710n061763l651915K002456P034307
$$ -1763082 -4561255 -7183726 -9294297 -12517007 -17578770 -21230685 -19228229 -12193922
40259a2193922O773020K838665p6599q70355j476076j785279o8965K305970J705841
$$ -12193922 -5420902 -2582237 -2658836 -3529191 -5005267 -6790546 -6859511 -4553541 -2847700
40250b847700j590824k661735R49102N184154M765255l59310o076575r058893
$$ -2847700 -4438524 -7100259 -6151157 -967003 3798252 3438942 -2637633 -11696526
40242a1696526q232248l699179K581685O375611M737212j94082l410660k824391
$$ -11696526 -19928774 -23627953 -21046268 -14670657 -9933445 -10127527 -13538187 -16362578
40234a6362578n52404J234402K836980M756667N617193M127415J635172Q40553
$$ -16362578 -16914982 -15680580 -12843600 -8086933 -2469740 1657675 3292847 4133400
40226D133400K264879L271541J072163l502419n905976k694980L497671N868022
$$ 4133400 6398279 9669820 10741983 7239564 1333588 -1361392 2136279 8004301
40218H004301J635158l950790m297729R4597L738900M720496N445678N413822
$$ 8004301 9639459 5688669 1390940 1485537 5224437 9944933 15390611 20804433
40210B0804433N52920q060278j2039548o871947O94855K370528L75781K353878
$$ 20804433 21357353 13297075 1257527 -5614420 -4919565 -2549037 -2173256 180622
40202A80622P826326Q540599J395218p289239j1050889r507595m394932L011258
$$ 180622 8006948 16547547 17942765 10653526 -397363 -9904958 -14299890 -11288632
40194a1288632Q504739O590013r31812m661870j16334N553391M347370q21805
$$ -11288632 -2783893 3806120 2874308 -1787562 -1903896 3649495 7996865 7175060
40186G175060j713080K120835L499410p30650n509969n706993k683957o87466
$$ 7175060 5461980 7582815 11082225 10351575 4841606 -865387 -3549344 -4236810
40178d236810n52024K27817K704491M255187K016716k214320k764790K567451
$$ -4236810 -4788834 -4561017 -1856526 2398661 4415377 2201057 -563733 2003718
40170B003718Q124357O947624K87472m411500m348512l716129m455668k438514
$$ 2003718 10128075 17075699 17363171 12951671 8603159 4887030 431362 -2007152
40162b007152L752193P634627L983754k569967m243089q13429K534429L927702
$$ -2007152 1745041 9379668 13363422 10793455 6550366 5736937 8271366 12199068
40154A2199068M768712M390811J542601j254651j002593M96003K39376k34842
$$ 12199068 16967780 21358591 22901192 21646541 20643948 21139951 21379327 21144485
40146B1144485J366754K348251j65206k733239j646049j082403n959115j0864253
$$ 21144485 22511239 24859490 24694284 21961045 20314996 19232593 13273478 2409225
40138B409225p380460P15609K565831j110188P67310Q924543J0324543O3174q870451
$$ 2409225 -4971235 -4255626 -1689795 -2799983 -2032673 6891870 17216413 17279587 8409136
40129H409136n763238J539697R99524m261388l365915L564408O896858L075142
$$ 8409136 2645898 4185595 5185119 923731 -2442184 1122224 8019082 11094224
40121A1094224k692224o359589p693553n383040J181573O798863N491747m88936
$$ 11094224 8402000 2042411 -5651142 -11034182 -9852609 -3053746 2438001 1949065
40113A949065l938339l227424k288362k098210j76489K601180K655581P22130
$$ 1949065 -1989274 -5216698 -7505060 -9603270 -9779759 -7178579 -4522998 -3800868
40105c800868P58491K242936J133740j619387n76406M299153O240526K271695
$$ -3800868 -3042377 -799441 334299 -1285088 -1861494 2437659 8678185 10949880
40097A0949880k048860j367682K300804M422382M403832L550478J229252k906211
$$ 10949880 8901020 7533338 9834142 14256524 18660356 22210834 23440086 20533875
40089B0533875o156327n869758l120458o92956O05128J528376K166902K031061
$$ 20533875 14377548 8507790 5387332 4694376 5299504 6827880 8994782 11025843
40081A1025843J097592k88220j398325q77202J769888M526226M674640K086853
$$ 11025843 12123435 11835215 10436890 9559688 11329576 15855802 20530442 22617295
40073B2617295j110183l307762l739290j623994K006241L422344R54217j303443
$$ 22617295 21507112 18199350 14460060 12836066 14842307 18264651 19218868 17915425
40065A7915425O65078L248771n4796p324084r369827l205996L409777L501590
$$ 17915425 18580503 21829274 21774478 14450394 5080567 1874571 5284348 8785938
40057H785938l90009k756999l418930m051672k490114K893592P375244N369518
$$ 8785938 8395929 5638930 2220000 -1831672 -4321786 -1428194 5947050 11316568
40049A1316568q47091m301488l351516k242935k812625k233765O73090K933408
$$ 11316568 10469477 6167989 2816473 573538 -2239087 -4472852 -3799762 -866354
40041h66354K638490J599544R33197j416726o113177r181618o772716p89178L655381
$$ -866354 1772136 3371680 4304877 2888151 -3225026 -12406644 -19179360 -19968538 -16313157
40032a6313157M994972O014486Q246619Q880983M470846m172242j2152279j4643521
$$ -16313157 -11318185 -5303699 2942920 11823903 16294749 12122507 -29772 -14673293
40024a4673293j0140575r52935P988270J1719614Q845409K893309j304467k557647
$$ -14673293 -24813868 -25766803 -17778533 -6058919 2786490 5679799 4375332 1817685
40016A817685l041808l546999k132507J557450M154774L291572J646906K866034
$$ 1817685 -1224123 -4771122 -6903629 -5346179 -1191405 2100167 3747073 6613107
40008F613107N580611N608206K743189N80473j84172l093217r168043j3431351
$$ 6613107 12193718 17801924 20545113 21125586 20941414 17848197 8680154 -4751197
40000d751197j1052469l972317J600362K528165J013675P09352K900963O106816
$$ -4751197 -15803666 -19775983 -18175621 -15647456 -14633781 -13924429 -11023466 -4916650
39992d916650P611833N269164r66917q484361j2962365j0746277j991624P960677
$$ -4916650 2695183 7964347 6997430 -1486931 -14449296 -25195573 -27187197 -19226520
39984a9226520J2214078Q910914K891870m54738p98679m91516K22927J906634
$$ -19226520 -7012442 1898472 4790342 4335604 3536925 3045409 3268336 5174970
39976E174970K450851j82826l308000k850302l15817p01726l903127m559604j047651
$$ 5174970 7625821 7442995 4134995 1284693 968876 267150 -3635977 -8195581 -9243232
39967i243232J895715J129499n34470j67085R33423J286130K035138L105535K144852
$$ -9243232 -7347517 -6218018 -6752488 -6919573 -5986150 -4700020 -2664882 440653 2585505
39958B585505k22724l13930Q09728k929191j0910699j2282232j062521J2501979
$$ 2585505 2362781 2048851 2858579 -70612 -10981311 -23263543 -24326064 -11824085
39950a1824085J4401359N285343k809890l964005k591282k612852k663347j843332
$$ -11824085 2577274 7862617 5052727 1088722 -1502560 -4115412 -6778759 -8622091
39942h622091j302095L63288N380385J0205253Q500920J232578l964068m098804
$$ -8622091 -9924186 -9560898 -4180513 6024740 14525660 15758238 11794170 7695366
39934G695366l441431m032784k617551Q55661J105004k315538j854574N513164
$$ 7695366 4253935 221151 -2396400 -1540739 -435735 -2751273 -4605847 907317
39926I07317J0912292N959220m111052p996809m282814j039239k131795k850576
$$ 907317 11819609 17778829 13667777 5670968 1388154 348915 -1782880 -4633456
39918d633456Q00689N966519P858636N565302J028881l951886p730378q333747
$$ -4633456 -3832767 2133752 9992388 15557690 16586571 12634685 4904307 -3429440
39910c429440m863429J293621O940163Q561321M810884j240503m076911j810368
$$ -3429440 -8292869 -6999248 -59085 8502236 13313120 12072617 7995706 6185338
39902F185338J428718J246119r94563r38244J777539L334368J952968J29737r7470
$$ 6185338 7614056 8860175 7865612 6927368 8704907 12039275 13992243 14121980 14024510
39893A4024510n46667l712693q426469j0760081q445752l064462J856804M091308
$$ 14024510 13477843 9765150 1338681 -9421400 -17867152 -20931614 -19074810 -14983502
39885a4983502L994948L037360J861155N14206o7598J338124L831492M587615
$$ -14983502 -10988554 -7951194 -6090039 -5575833 -5643431 -4305307 -473815 4113800
39877D113800K552112K24332L33010K190409K972801J524693o52256j444182j83846
$$ 4113800 6665912 6890244 7223254 9413663 12386464 13911157 13258901 11814719 11630873
39868A1630873J408234J54920m622282p966978l950018N037447Q617635J877758
$$ 11630873 13039107 13194027 8571745 604767 -3345251 1692196 10309831 12187589
39860A2187589o352155m931035L507929O379994j52809o134543l608953K087246
$$ 12187589 5835434 904399 4412328 10792322 10639513 4504970 896017 2983263
39852B983263K159578k361609m695234m037984m386455m945170j303354M591065
$$ 2983263 5142841 2781232 -1914002 -5951986 -10338441 -15283611 -16586965 -11995900
39844a1995900N212490k20424l148607J088199N568583K821968l298366m042116
$$ -11995900 -6783410 -7003834 -10152441 -9064242 -3495659 -673691 -3972057 -8014173
39836h014173P08614L527977J469670j316966k167193k852523l130987O32362
$$ -8014173 -7305559 -3777582 -2307912 -3624878 -5792071 -8644594 -11775581 -11143219
39828a1143219P706587J0869718O083963j216968l824070j995183l92281j19825
$$ -11143219 -3436632 7433086 13517049 12300081 8476011 6480828 6088547 5968722
39820E968722O87353J515328N08199j076228p58763K16787j284993m829796p435770
$$ 5968722 6656075 8171403 8679602 7603374 6844611 7061398 5776405 946609 -6489161
39811f489161q414182q235230m734318L182406R668455P562003j37878k656602
$$ -6489161 -14903343 -23138573 -27872891 -24690485 -15022030 -7460027 -7597905 -10254507
39803a0254507L224149Q633932O453700J305538O61231L372105L750202J358823
$$ -10254507 -7030358 1603574 8057274 9362812 10024043 13396148 17146350 18505173
39795A8505173o23248k489027n818392p469833l787198J288695O83728m074861
$$ 18505173 17881925 15392898 9574506 2104673 -1682525 -393830 289898 -3784963
39787c784963m316059J743245N231444O5413p459739p571198k2384P446267R975036
$$ -3784963 -8101022 -6357777 -1126333 -1060920 -8520659 -16091857 -16114241 -8667974 1307062
39778A307062R061926P068247L980325o5763l244893m316548m052701l523679
$$ 1307062 10368988 17437235 21417560 21351797 18106904 13790356 9737655 6213976
39770F213976k681220j301923J22988J268977K701978M623518N282728K074325
$$ 6213976 3532756 2230833 2353821 3622798 6324776 10948294 16231022 18305347
39762A8305347m731568j0050606q035877P42508Q134159P013980K7908l604285
$$ 18305347 13573779 3523173 -4512704 -3770196 4363963 11377943 11405851 7801566
39754G801566R2276N382766N603575J928690k75336l21427j827811m859162m931901
$$ 7801566 7893842 13276608 18880183 20808873 20533537 20212110 18384299 13525137 8593236
39745H593236j119836Q91149k719946p205124n912111j95324L253191K785003
$$ 8593236 7473400 8364549 5644603 -1560521 -7472632 -7667956 -4414765 -1629762
39737a629762K462748K938284j9676n737411n948488K723534J0835278Q497669
$$ -1629762 832986 3771270 3751594 -1985817 -7934305 -5210771 5624507 14122176
39729A4122176L27457j665737L050484L325053m782672j0988959o852201J755855
$$ 14122176 14449633 12783896 15834380 19159433 14376761 3387802 -3464399 -1708544
39721a708544N184689M392009N808034Q093920M731834k987414o255374k377248
$$ -1708544 3476145 7868154 13676188 21770108 26501942 23514528 17259154 14881906
39713A4881906J098544j762229o656941n862578J354985Q541355R073011J418159
$$ 14881906 15980450 14218221 7561280 1698702 3053687 11595042 20668053 22086212
39705B2086212r428325j4374933p768034N528546J3637466J0110457L64347n433462
$$ 22086212 12657887 -1717046 -9485080 -3956534 9680932 19791389 20155736 14722274
39697A4722274k916022M247649R366384Q225598K354479j730129P82055O237634
$$ 14722274 11806252 16053901 25420285 33645883 36000362 34270233 35052288 41289922
39689D1289922O089196j631301q951094q362065j855526L917627O826505Q471327
$$ 41289922 47379118 45747817 36796723 28434658 26579132 30496759 37323264 45794591
39681D5794591P948570L184247k776553l500672J924003P017501O540542K522899
$$ 45794591 53743161 56927408 54150855 50650183 52574186 59591687 66132229 68655128
39673F8655128m26078j678086l076924l800347j284058L253392M515415J17886
$$ 68655128 68229050 66550964 63474040 59673693 58389635 61643027 66158442 66276328
39665F6276328m954499m022309K135911N603389J852449l845970l811974J042342
$$ 66276328 61321829 57299520 59435431 65038820 66891269 63045299 59233325 60275667
39657F0275667K752489j962306p430411p817649m457457j458369O51792K337739
$$ 60275667 63028156 61065850 53635439 45817790 41360333 39901964 40553756 42891495
39649D2891495P55071n625098j0959279p860078J432029O703285L287467k737540
$$ 42891495 43646566 38021468 27062189 19202111 20634140 27337425 30624892 27887352
39641B7887352m613803l344430k448677n17252M967203J0196944Q412949j50016
$$ 27887352 23273549 19929119 17480442 16963190 21930393 32127337 40540286 40390270
39633D0390270p674046q816860o426657n568125o122302m457992J1825L559412
$$ 40390270 32716224 23899364 17472707 11904582 5782280 1324288 1336113 4895525
39625D895525L082899k38913k780111k456137j74332J835890K350365J990251
$$ 4895525 7978424 7739511 4959400 2503263 2328931 4164821 6515186 8505437
39617H505437K120636K918073K678525l72514n385871q837370q052114m292017
$$ 8505437 10626073 13544146 16222671 15850157 10464286 1626916 -6425198 -10717215
39609a0717215j110991J35988J408874M225689O944158P340793O092497N248266
$$ -10717215 -11828206 -11692218 -10283344 -6057655 886503 8227296 14319793 19568059
39601A9568059M432699J763573j769991k667352o74719k48557l660914o059634
$$ 19568059 24000758 25764331 23994340 21326988 20652269 20403712 16742798 10683164
39593A0683164j712606O623046R731467L664830n227532q696420o058308k578993
$$ 10683164 8970558 15593604 25325071 28989901 23762369 15065949 9007641 6428648
39585F428648j646827k306678k707409j968673P06117M933185P128784L455078
$$ 6428648 4781821 2475143 -232266 -2200939 -1494822 3438363 10567147 14022225
39577A4022225m232562q949144o894353k150683p03473k502854k882863k29156
$$ 14022225 9789663 840519 -6053834 -8204517 -8907990 -11410844 -14293707 -14522863
39569a4522863J906118O09813j970961j826622J074295K347215j156348o405551
$$ -14522863 -12616745 -12006932 -13977893 -15804515 -14730220 -12383005 -13539353 -19944904
39561a9944904o474031J257234J0423619J1889777M757048k232394j788686L169682
$$ -19944904 -26418935 -25161701 -14738082 -2848305 1908743 -323651 -2112337 1057345
39553A057345N042996K392620R4978M68495M50963j898504l807576k708794j85237
$$ 1057345 6100341 8492961 8587939 9056434 9507397 7608893 3801317 1092523 907286
39544I07286J415266K421489L356500K753305N22654J24690L679804P525762O595041
$$ 907286 2322552 4744041 8100541 10853846 11376500 11501190 15180994 22706756 29301797
39535B9301797J431818k878048l422086j665628j86155n02956k868894m929610
$$ 29301797 30733615 27855567 24433481 22767853 22581698 22078742 19209848 14280238
39527A4280238k292376N511168J1276689P596832k448824p859164l799415K619541
$$ 14280238 11987862 17499030 28775719 36372551 33923727 26064563 22265148 24884689
39519B4884689K760962k749960p175466p197472m753770k235274o25384r28710
$$ 24884689 27645651 24895691 17720225 10522753 5768983 3533709 2908325 1979615
39511A979615l033845l813730m61835M347939M669711n38713n184295l842115
$$ 1979615 -1054230 -4867960 -5329795 -981856 3687855 3149142 -2035153 -5877268
39503e877268J130006K984191n24242m633813l951694J008367M817158L665403
$$ -5877268 -4747262 -1763071 -2287313 -6921126 -10872820 -9864453 -5047295 -1381892
39495a381892m66630k489053k41043L324146M202847K137511j01487j174033k208287
$$ -1381892 -1848522 -4337575 -4578618 -1254472 2948375 5085886 4984399 3810366 1602079
39486A602079l161504j550686K971002N699059K561777k822865l025150J978847
$$ 1602079 -1559425 -3110111 -139109 5559950 8121727 5298862 2273712 4252559
39478D252559L588259k507319q160407l664705O964041R969038Q98639q848371
$$ 4252559 7840818 5333499 -2826908 -6491613 472428 10441466 11340105 2491734
39470B491734p757939N32082L561703k547639q978071o783859K197365Q664702
$$ 2491734 -5266205 -4734123 -1172420 -3720059 -12698130 -19481989 -17284624 -8619922
39462h619922O899337M39110k576360J128642O059771M997627r67019l489794
$$ -8619922 -1720585 -1281475 -3857835 -2729193 3330578 8328205 7361186 3871392
39454C871392R49510N400781K683809l711227n338300k078682j483981n552301
$$ 3871392 4820902 10221683 12905492 9194265 3855965 1777283 293302 -5258999
39446e258999p048952j411128N552526O540358L360439K773140N711769P072600
$$ -5258999 -12307951 -13719079 -8166553 -1626195 1734244 4507384 10219153 17291753
39438A7291753M385889N69187j845738l933531o652262q024061o023058j676523
$$ 17291753 21677642 22246829 20401091 16467560 9815298 1791237 -4231821 -5908344
39430e908344K449652M940853N253688K725356j909505n113807l365374K182912
$$ -5908344 -3458692 1482161 6735849 9461205 7551700 2437893 -927481 1255431
39422A255431N852085L465774k821037o885196n065672Q63974O101656O529063
$$ 1255431 7107516 10573290 7752253 867057 -4198615 -3334641 2767015 9296078
39414I296078J238686n891309p951335k166218M754968L468049m625765p316624
$$ 9296078 10534764 4643455 -3307880 -5474098 -719130 2748919 -1876846 -9193470
39406i193470J292974J0491335P185441m734936r514750k052009O267347N911850
$$ -9193470 -7900496 2590839 9776280 5041344 -4473406 -6525415 -258068 5653782
39398E653782J852633K416507N268131L079755l160755o058434l990957k470900
$$ 5653782 7506415 9922922 15191053 18270808 15110053 9051619 5060662 2589762
39390B589762m070599m834212j800655K175358L241787J767642M76852K25588
$$ 2589762 -1480837 -6315049 -8115704 -5940346 -2698559 -930917 -454065 -228477
39382b28477l13964k012676l424712j723206L462359P268778L903819m792939
$$ -228477 -542441 -2555117 -5979829 -7703035 -4240676 3028102 6931921 2138982
39374B138982r270641m056650M556689P393129M809673L445862L831862L70492
$$ 2138982 -7131659 -11188309 -6631620 761509 5571182 9017044 12848906 13219398
39366A3219398o806292r724292m811703J383004K841828K620263M962873N769051
$$ 13219398 6413106 -3311186 -8122889 -6739885 -3898057 -1277794 3685079 9454130
39358I454130r27329j0986111j3494900n276226N303892R572859P315794L063437
$$ 9454130 8526801 -2459310 -15954210 -21230436 -15926544 -6353685 962109 4025546
39350D025546m43514k337367j764223M47814J037282j568310m306558l464658
$$ 4025546 3582032 1244665 -519558 -71744 965538 -602772 -4909330 -8373988
39342h373988O7806K434586K322092J551373R82468l94529k024372j302746J961569
$$ -8373988 -8306182 -5871596 -3549504 -1998131 -1015663 -1410192 -3434564 -4737310 -2775741
39333b775741L878876J585794k539839m406314l707522k763765j888478r649J247170
$$ -2775741 1103135 2688929 149090 -4257224 -7964746 -10728511 -12616989 -12626638 -11379468
39324a1379468j024167n193531n454076L99041P431854R709578O611931J315530
$$ -11379468 -12403635 -17597166 -23051242 -22652201 -15220347 -5510769 1101162 2416692
39316B416692l261477m680438j100472N345307Q362696M442363k296394n519798
$$ 2416692 -844785 -5525223 -6625695 -1280388 7082308 11524671 9228277 3708479
39308C708479m397254k348815r31079M48228R03225p14101k160320k27726L892608
$$ 3708479 -688775 -3037590 -3968669 -3520441 -2617216 -3331317 -5491637 -5719363 -1826755
39299a826755O097910N293991L314302K36149m763010q695941p156800j738677
$$ -1826755 4271155 9565146 12879448 13115597 8352587 -343354 -7500154 -9238831
39291i238831J079290o01855j900505J04796J941369P94963j39209K585379O386613
$$ -9238831 -8159541 -8761396 -10661901 -10557105 -8615736 -7820773 -7959982 -5374603 1012010
39282A012010O560319K957731j160572l931218m984254l567233j40094K430698
$$ 1012010 7572329 10530060 9369488 5438270 454016 -3113217 -3253311 -822613
39274h22613K319682J234547J065795Q18297n69120j531209j100194j674402m932815
$$ -822613 1497069 2731616 3797411 4615708 4046588 2515379 1415185 -259217 -5192032
39265e192032p762019o286483j861797R23784P16311K56190J881877N132476P758364
$$ -5192032 -12954051 -19240534 -21102331 -20178547 -19462236 -19206046 -17324169 -12191693 -4433329
39256d433329P015963J865344m136786n013376q2758L785725J071551m570699
$$ -4433329 2582634 4447978 311192 -4702184 -4784942 -999217 72334 -4498365
39248d498365n667596j157121L656167N089103L865312J567638n69059m53345
$$ -4498365 -10165961 -11323082 -7666915 -2577812 1287500 2855138 2286079 1832734
39240A832734K462779M600542K623698r87423j689102o88882l031523q409716
$$ 1832734 4295513 8896055 11519753 10532330 8843228 8154346 5122823 -3286893
39232c286893j0246112m968162L108413P644423O892936L416509P39665Q14694
$$ -3286893 -13533005 -18501167 -15392754 -7748331 -855395 2561114 3300779 4115473
39224D115473J925593q1750n346408p320527j638444N307579M157833k940872
$$ 4115473 6041066 5959316 612908 -6707619 -8346063 -3038484 1119349 -1821523
39216a821523m931247J173102O254285M121129j67712j415540l157259q400161
$$ -1821523 -6752770 -5579668 674617 4795746 4628034 3212494 55235 -8344926
39208h344926j0837965m698406L544887L686264k570284m975182q18586L137424
$$ -8344926 -19182891 -23881297 -20336410 -16650146 -19220430 -24195612 -25014198 -21876774
39200b1876774L730695N334987R206862R124107J743444o582716q352076m507965
$$ -21876774 -18146079 -12811092 -3604230 5519877 7263321 680605 -7671471 -12179436
39192a2179436o27365J719639M418766O876174O216361K185683k469355n855247
$$ -12179436 -12806801 -11087162 -6668396 207778 6424139 8609822 6140467 285220
39184B85220p621599o582033j652344M523048O718078L531766j50728P44168N004804
$$ 285220 -7336379 -13918412 -15570756 -11047708 -4329630 -797864 -948592 -204424 4800380
39175D800380P453413O295832M532163M095158K752453j234083n035122n394745
$$ 4800380 12253793 18549625 23081788 27176946 29929399 28695316 23660194 18265449
39167A8265449m247216n477236p418058m433373L298897P697819L660861k863212
$$ 18265449 14018233 8540997 1122939 -3310434 -11537 7686282 11347143 8483931
39159H483931k571162M312978Q331392L301524o254711j1107120p420379N44603
$$ 8483931 5912769 10225747 18557139 21858663 15603952 4496832 -2923547 -2378944
39151b378944N800659N243962J515469r79614j239116j626585k997956k892430
$$ -2378944 3421715 8665677 10181146 9201532 7962416 6335831 3337875 445445
39143D45445j61350J775821l59183l937405l641539N16994L082973J450681l84566
$$ 445445 284095 2059916 1700733 -2236672 -5878211 -5361217 -2278244 -827563 -1212129
39134a212129J633734N116808M674164l995l192849n45346N148894P275032L562584
$$ -1212129 421605 5538413 10212577 10208582 7015733 6470387 11619281 18894313 22456897
39125B2456897j160033j325126J978647K752085j000746m060278j955046J397387
$$ 22456897 21296864 19971738 21950385 24702470 23701724 19641446 17686400 19083787
39117A9083787j287928r323527j3350325p476302K490667O304647J948707l190474
$$ 19083787 17795859 8472332 -4877993 -12354295 -9863628 -3558981 -1610274 -4800748
39109d800748k901339O82001K017223N83809N66514L348199M900145K201552j470460
$$ -4800748 -7702087 -7020086 -5002863 -4419054 -3852540 -504341 4395804 6597356 5126896
39100E126896j100561K422234L588080N45538k531535k067464L71973J890945
$$ 5126896 4026335 6448569 10036649 10582187 8050652 5983188 6355161 8246106
39092H246106K496422K960273K114489n02565k302644j316321M81476Q53887J257605
$$ 8246106 10742528 13702801 15817290 15314725 13012081 11695760 12177236 13031123 14288728
39083A4288728L028207K847729k359498q263835p588374j133940K577997m07800
$$ 14288728 17316935 20164664 17805166 9541331 1952957 819017 3397014 2989214
39075B989214m329097l239886O21422K069865J479257K541123M545863L000555
$$ 2989214 -1339883 -4579769 -3958347 -1888482 -409225 2131898 6677761 9678316
39067I678316k473547o127327l570925K216871M871010K800861M19657J371846
$$ 9678316 7204769 1077442 -2493483 -276612 4594398 7395259 7814916 9186762
39059I186762L612365L095443N5133j920424k147186l505607o005614m913011
$$ 9186762 12799127 15894570 15949703 14029279 11882093 8376486 2370872 -2542139
39051b542139J690023Q063043P986057L197707m42672k041997m649092p345372
$$ -2542139 -852116 7210927 15196984 18394691 17952019 15910022 11260930 3915558
39043C915558n770642m40941K372583p05795o231644r608368r353875n184515
$$ 3915558 -1855084 -2296025 76558 -629237 -6860881 -16469249 -25823124 -31007639
39035c1007639K202473Q432762Q594034M288783J494840P65044k769932q217328
$$ -31007639 -28805166 -20372404 -11778370 -7489587 -5994747 -5229703 -7999635 -16216963
39027a6216963p253913K231260J0135023Q194962J910100O41755L018539J675513
$$ -16216963 -23470876 -21239616 -11104593 -2909631 -999531 -357776 2660763 4336276
39019D336276k909454m021951j289448j128683n201646p750518n208931o42272
$$ 4336276 1426822 -2595129 -3884577 -5013260 -10214906 -17965424 -23174355 -23816627
39011b3816627K459053M047247M321748K967100K247701M718324P465678N279579
$$ -23816627 -21357574 -17310327 -12988579 -10021479 -7773778 -3055454 4410224 9689803
39003I689803J70374J59196O562535J0156497L963990o549053j1149193q035240
$$ 9689803 9860177 10019373 16581908 26738405 30702395 24153342 13004149 4968909
38995D968909l912252l774720n964538o585017m664555k089466l12299J646898
$$ 4968909 1056657 -2718063 -8682601 -15267618 -19932173 -22021639 -22333938 -20687040
38987b0687040N303524Q912171P972023J608539m221119l862528j74062k70477
$$ -20687040 -15383516 -6471345 1500678 3109217 -1111902 -4974430 -5148492 -5418969
38979e418969m365221n464520m67955N424242P236809O461618N759656L655106
$$ -5418969 -9784190 -15248710 -15716665 -10292423 -3055614 3406004 9165660 12820766
38971A2820766j184889n346684n127868k110553j92077q8172k94182l69130N7399
$$ 12820766 11635877 6289193 1161325 -949228 -1141305 -1229477 -1523659 -1892789 -1835390
38962a835390K215863M885659L934012j213281m768869k591318J232781J065967
$$ -1835390 380473 5266132 9200144 7986863 3217994 626676 1859457 2925424
38954B925424j185894l18354K122550J27318n637678p287074j417678N737646
$$ 2925424 1739530 1421176 3543726 3671044 -1966634 -9253708 -10671386 -4933740
38946d933740P161716L398849n11752j609004L27397M472416P900445O020245
$$ -4933740 2227976 5626825 5115073 3506069 3833466 8305882 16206327 22226572
38938B2226572k105713j0494309j1658855m982615K531571L976678l85381m157274
$$ 22226572 20120859 9626550 -2032305 -7014920 -4483349 -506671 -892052 -5049326
38930e049326k250295L576017P296379O031546K676810P40063j58541j331537
$$ -5049326 -7299621 -3723604 3572775 9604321 12281131 13021194 12862653 11531116
38922A1531116q31219L422514Q082365P206791P32842m799315n125059l303354
$$ 11531116 10699897 14122411 22204776 29411567 30144409 25345094 20220035 16916681
38914A6916681l822757n778743n243039j749447J254911J336043n48368k275312
$$ 16916681 13093924 7315181 2072142 322695 1577606 2913649 2365281 89969
38906H9969k758979j673727J145142M937148P272866N390339o49230o388672o429582
$$ 89969 -2669010 -4342737 -3197595 1739553 9012419 14402758 13753528 7364856 935274
38897I35274o18637M867511M523953R3914k490208j331754J75015q151N45678
$$ 935274 316637 5184148 9708101 9802015 7311807 5980053 6155068 6146917 6692595
38888F692595L474410N439907K537701l511307p089054n616783j795791Q14342
$$ 6692595 10167005 15606912 18144613 14633306 7544252 1927469 131678 946020
38880I46020J786190K685258L770644L399731O71703k409840k718537k46223J059367
$$ 946020 2732210 5417468 9188112 12587843 13259546 10849706 8131169 7884946 8944313
38871H944313j667198n573172n214361r3153M097544K800708j624262l391627
$$ 8944313 7277115 1703943 -3510418 -3603571 493973 3294681 1670419 -1721208
38863a721208o26423L103590L660662O08113l305109n337693m854561k910629
$$ -1721208 -2347631 755959 4416621 5024734 1719625 -3618068 -8472629 -11383258
38855a1383258o42903J288829K070187J227386M12388K575507P540130J0471771
$$ -11383258 -12026161 -10737332 -8667145 -7439759 -7027371 -4451864 3088266 13560037
38847A3560037P614628J873560r51378k22095l22362l098261n646249o121672
$$ 13560037 21174665 23048225 22096847 21874752 21552390 18454129 12807880 6686208
38839F686208o307595o875680n433287j636968Q31876K40681k45811J192831J256866
$$ 6686208 378613 -6497067 -11930354 -13567322 -12735446 -12494765 -12740576 -11547745 -10290879
38830a0290879j712234k723605K158708P700663O206984p97942m987084l197539
$$ -10290879 -12003113 -14726718 -12568010 -4867347 1339637 541695 -4445389 -7642928
38822g642928N51224L509368O456237P730833L660938l354433n296460l44357
$$ -7642928 -7091704 -3582336 2873901 10604734 14265672 10911239 5614779 5270422
38814E270422K764669l261873j3251260j5733599p034571N126094J0513664O152028
$$ 5270422 8035091 4773218 -8478042 -24211641 -31246212 -26120118 -15606454 -9454426
38806i454426j526513l212864K966945Q364727M546294m254471n764038L050377
$$ -9454426 -10980939 -14193803 -11226858 -2862131 1684163 -2570308 -8334346 -5283969
38798e283969J1388329J0063049L292989j11018J69174r74276l639464m079015
$$ -5283969 6104360 16167409 19460398 19349380 19518554 18544278 14904814 10825799
38790A0825799k814674l204214l956963j117309L552320L933757q02665m980390
$$ 10825799 8011125 4806911 849948 -267361 3284959 7218716 6416051 1435661
38782A435661n065090k911269k93520K775181L798966m80450o562071o129743
$$ 1435661 -3629429 -6540698 -6834218 -4059037 -260071 -740521 -7302592 -13432335
38774a3432335J709679P506407M490922k470359n457625m128669j820672K522718
$$ -13432335 -11722656 -4216249 274673 -2195686 -7653311 -11781980 -13602652 -11079934
38766a1079934J0354119J5731477J0947863j145293r040029p627929l705236m208426
$$ -11079934 -725815 15005662 25953525 24808232 15768203 8140274 4435038 226612
38758B26612o168073l152372L358080N656938J403747k728907o07614M759929
$$ 226612 -5941461 -9093833 -5735753 -78815 1324932 -1403975 -2011589 2748340
38750B748340N814322J179291l036304k634431p65591j400624k088484J635367
$$ 2748340 8562662 9741953 6705649 4071218 3305627 1905003 -183481 1451886
38742A451886P466957Q513065L689885o69580n86546O82164k56003j418599p56068
$$ 1451886 8918843 17431908 21121793 20452213 19865667 20547831 20291828 18873229 18117161
38733A8117161j064833m525060p150100m573796K35365J181911j743193l710011
$$ 18117161 17052328 12527268 5377168 803372 1038737 2220648 477455 -3232556
38725c232556l481217l986853n413363m322936p9251L510904L908427K556445
$$ -3232556 -6713773 -10700626 -16113989 -20436925 -20516176 -17005272 -13096845 -10540400
38717a0540400J209267j84994j334761j215443k68261K63622O96438J282756l4244
$$ -10540400 -9331133 -9516127 -10850888 -12066331 -12334592 -12070970 -11374532 -10091776 -10126020
38708a0126020l720523m789429Q45603P863176P199226j69573l808036O17483
$$ -10126020 -13846543 -18635972 -17790369 -9927193 -2727967 -2897540 -6705576 -6088093
38700f088093N384858L214235k944845o854794p695337o629334k091931N244113
$$ -6088093 -703235 2511000 -433845 -7288639 -14983976 -21613310 -23705241 -18461128
38692a8461128R091501N713623J58625j779578k128919m476742n128817Q33199
$$ -18461128 -9369627 -3656004 -3497379 -5276957 -7405876 -11882618 -17011435 -16178236
38684a6178236R164929J1439454P465599L709711J749619k152283p283771q155253
$$ -16178236 -7013307 4426147 11891746 15601457 17351076 15198793 7915022 -240231
38676b40231m208575q25462R9771J824013M019539J789354m164738n671213N27023
$$ -240231 -4448806 -5274268 -5174497 -3350484 669055 2458409 -1706329 -7377542 -6850519
38667f850519O718516N585340N07020j143216J152661L210389M110347N074240
$$ -6850519 -132003 5453337 5960357 4817141 5969802 9180191 13290538 18364778
38659A8364778L874045k338363r970174j1338625m658671L072129M421930l50839
$$ 18364778 22238823 19900460 9930286 -1408339 -6067010 -2994881 1427049 1076210
38651A076210m784602l864441J257363N719563O901375O506941O518176N574323
$$ 1076210 -3708392 -7572833 -6315470 -595907 6305468 12812409 19330585 24904908
38643B4904908J621783l959376q080711r835166q923864l017197P415570J4050161
$$ 24904908 26526691 22567315 14486604 4651438 -4272426 -7289623 125947 14176108
38635A4176108Q891463k632998o100792K313100J0132922O456386l851796r961033
$$ 14176108 23067571 20434573 14333781 16646881 26779803 33236189 29384393 19423360
38627A9423360j0361307r952132q777880l733928K537740M251496J923400O74470
$$ 19423360 9062053 -890079 -9667959 -13401887 -10864147 -6612651 -4689251 -4014781
38619d014781Q86869r40794l328778q79530N579513Q510768M693648r16063l964629
$$ -4014781 -3127912 -4068706 -7397484 -8277014 -2697501 5813267 10506915 9590852 5626223
38610E626223n803989p533018o502532k523107r05728m353978p022428k358796
$$ 5626223 -177766 -7710784 -14213316 -16736423 -17642151 -21996129 -29018557 -31377353
38602c1377353O503173J0014002M582942l210703m990916L04551O640865Q057749
$$ -31377353 -24874180 -14860178 -10277236 -13487939 -18478855 -18174304 -11533439 -3475690
38594c475690M181996p46707k797547j263074K473132O521801Q303648N563030
$$ -3475690 706306 -40401 -2837948 -4101022 -1627890 4893911 13197559 18760589
38586A8760589m57272n011007n112423k678778n55754J406937L528077L372364
$$ 18760589 18303317 13292310 8179887 5501109 4945355 6352292 9880369 13252733
38578A3252733p3404k788127j412560P50395o30935k775972q51061J826061j763553
$$ 13252733 13179329 10391202 8978642 9729037 9098102 6322130 5471069 7297130 5533577
38569E533577q923053r273678j542048L012050j950644p589348l817567N266047
$$ 5533577 -3389476 -12663154 -14205202 -11193152 -13143796 -20733144 -24550711 -19284664
38561a9284664Q556206M543324J343572L043972M722724J108879o021708j0327571
$$ -19284664 -10728458 -6185134 -4841562 -1797590 2925134 4034013 -1987695 -12315266
38553a2315266p556852N80967P614765Q289251M002605K30641j058240k022379
$$ -12315266 -19872118 -19291151 -11676386 -3387135 615470 846111 -212129 -2234508
38545b234508k058361K724859J0673581J2704963M319362o530873r414533m336841
$$ -2234508 -4292869 -1568010 9105571 21810534 26129896 19599023 10184490 5847649
38537E847649J116250K819893J926705l34002l115186m261251l653276m575270
$$ 5847649 6963899 9783792 11710497 11376495 8261309 4000058 346782 -4228488
38529d228488o736435l458183P450170J6049995J2378377J030148o341364q217841
$$ -4228488 -10964923 -14423106 -6972936 9077059 21455436 22485584 16144220 7926379
38521G926379j1011047j3547133q231444K854177P874191L694292N49180M171035
$$ 7926379 -3084668 -16631801 -24863245 -22009068 -14134877 -10440585 -9891405 -5720370
38513e720370O738568J853177m079687l841726j965027n414580j0308321q566439
$$ -5720370 1018198 2871375 -1208312 -5050038 -7015065 -12429645 -22737966 -31304405
38505c1304405j593376K953367L427146L613505L792999J948888R29838M793656
$$ -31304405 -32897781 -29944414 -26517268 -22903763 -19110764 -17161876 -16232038 -11438382
38497a1438382R734863P921119k31403o178690n648094k821193j536159k24260
$$ -11438382 -1703519 6217600 5986197 -192493 -5840587 -8661780 -10197939 -10422199
38489a0422199K563539M394560L206353K06177l061585n734224m956156J982538
$$ -10422199 -7858660 -3464100 -257747 -51570 -3113155 -8847379 -13803535 -11820997
38481a1820997J1132635J3368001N366869n471466j0053395p606509l791223k468595
$$ -11820997 -688362 12679639 18046508 12575042 2521647 -5084862 -8876085 -11344680
38473a1344680k806960k244594N77563M447068N689389J626057n141591q623147
$$ -11344680 -14151640 -16396234 -15818671 -11371603 -5682214 -4056157 -9197748 -17820895
38465a7820895o615898k719591q75L106308Q049853J1551481R854832M718157
$$ -17820895 -24436793 -27156384 -27157259 -24050951 -16001098 -4449617 5405215 10123372
38457A0123372Q01683r90993l127112n630105n364949j278751L564349N920447
$$ 10123372 10925055 9934062 6806950 1176845 -4188104 -5466855 -1902506 4017941
38449D017941N365043K965666l2070j698192p92640M15429k041018p670889j0479241
$$ 4017941 9382984 12348650 12316580 10618388 9825748 10241177 8200159 529270 -9949971
38440i949971o564780J23290L059035J984901J982128M546236N028518O57493
$$ -9949971 -16514751 -16391461 -13332426 -11347525 -9365397 -4819161 209357 866850
38432H66850l666963j551287N514167R578749O551855Q74183j113298J087069
$$ 866850 -2800113 -4351400 1162767 10741516 17293371 18167554 17054256 18141325
38424A8141325L231495K730718Q92436l84008j159364k060652k457694j493668
$$ 18141325 21372820 24103538 24995974 24611966 23452602 21391950 18934256 17440588
38416A7440588N6816N51240m8954k6752J179749J430292j141059m520052m585570
$$ 17440588 17497404 18048644 17999690 17972938 19152687 20582979 19441920 14921868 10336298
38407A0336298n76407L782708N365121M980288M102521J600059l179930o882466
$$ 10336298 9759891 13542599 18907720 23888008 27990529 29590588 26410658 19528192
38399A9528192o035775k732856j635018k391342n50007M068965O004618K582890
$$ 19528192 13492417 10759561 9124543 6733201 6183194 10252159 16256777 18839667
38391A8839667j979473l236066k139033j355865j002103j122136l388787o799230
$$ 18839667 16860194 13624128 11485095 10129230 9127127 8004991 4616204 -2183026
38383b183026o789324k579334J46369j425199j569218L852971Q158084L759135
$$ -2183026 -8972350 -11551684 -11405315 -12830514 -14399732 -10546761 -2388677 1370458
38375A370458m017627m224586J866464K945508k975097n100314J490461P041455
$$ 1370458 -2647169 -6871755 -5005291 -2059783 -5034880 -10135194 -8644733 -1603278
38367a603278L157443l723722l482554J718546K468807k519944n853018l403354
$$ -1603278 1554165 -2169557 -5652111 -3933565 -1464758 -3984702 -9837720 -13241074
38359a3241074J523175M576401M274460O95910m197988o248899l863808j174511
$$ -13241074 -11717899 -7141498 -2867038 -2171128 -6369116 -12618015 -16481823 -17656334
38351a7656334j890445k826659Q75716O756835P845649K920288k477461m290652
$$ -17656334 -19546779 -22373438 -21497722 -14740887 -6895238 -3974950 -6452411 -10743063
38343a0743063k985394O61332O051678R385290O825843J574293Q67900M889255
$$ -10743063 -13728457 -13067125 -7015447 2369843 9195686 10769979 11637879 16527134
38335A6527134N856472J56408n980744o427098m001575m376594o565016n581512
$$ 16527134 22383606 22540014 16559270 10132172 6130597 1754003 -4811013 -10392525
38327a0392525j257968J706189J157007j71289M24870K352487L989196N381594
$$ -10392525 -11650493 -9944304 -8787297 -8958586 -8533716 -6181229 -2192033 3189561
38319C189561P397863R272964Q127243J836974p052208j1770553q059920K21683
$$ 3189561 10587424 19860388 27987631 29824605 22772397 11001844 2941924 3163607
38311C163607N075428L465091r16912m380133o861485q104710n759632m9669M071774
$$ 3163607 8239035 11704126 10787214 6407081 -454404 -8559114 -14318746 -14368415 -10296641
38302a0296641K824993j503818m303553m041967j528500K266556M692957K105552
$$ -10296641 -7471648 -8975466 -13279019 -17320986 -18849486 -16582930 -11889973 -9784421
38294i784421m070782o431460j540256L789227K372108j552054J115980Q535984
$$ -9784421 -13855203 -20286663 -21826919 -18037692 -15665584 -17217638 -16101658 -7565674
38286g565674R023391j107221j0775354r360538o41755M600557M101637M579689
$$ -7565674 1457717 350496 -10424858 -19785396 -20427151 -15826594 -11724957 -7145268
38278g145268R240018J2548526Q690997j7886o108009o006883l336351l416994
$$ -7145268 2094750 14643276 23334273 23316387 17208378 11201495 7865144 4448150
38270D448150o563970q295644n589860p28123K085722J933253R35906L50913k24643
$$ 4448150 -2115820 -10411464 -16001324 -16729447 -14643725 -12710472 -11774566 -11423653 -11648296
38261a1648296n72830O2481Q64309N73155N32205K884596N555218L676502k439155
$$ -11648296 -12221126 -12158645 -11294336 -10721181 -10188976 -7304380 -1749162 1927340 -511815
38252e11815n589498j184328N549732O351036J227011k252465L8055L784519L056745
$$ -511815 -6101313 -7285641 -1735909 4615127 5842138 3589673 3627728 7412247 10468992
38243A0468992k312382q146430j1348081j1153851p254679k40153O428455Q121089
$$ 10468992 8156610 10180 -11337901 -22491752 -29746431 -29986584 -23558129 -15437040
38235a5437040M058880j176684k746105r87601J25727r67050j827597p75744K27980
$$ -15437040 -11378160 -12554844 -15300949 -16288550 -16162823 -17129873 -18957470 -19733214 -19505234
38226a9505234m44695j87785M127105J0101720J1695283P001752J79164m818571
$$ -19505234 -19949929 -20137714 -16010609 -5908889 5786394 12788146 12967310 8148739
38218H148739q177662j0411491r045576k595202M880567P279689L754837o04714
$$ 8148739 -28923 -10440414 -19485990 -22081192 -17200625 -9920936 -6166099 -6770813
38210f770813j278975R91034K457197J501892L79609J943064N123411M934349
$$ -6770813 -8049788 -7058754 -4601557 -3099665 -2720056 -776992 4346419 9280768
38202I280768j557719j0081025j2627600o436186L018059Q545558P903900L307958
$$ 9280768 7723049 -2357976 -14985576 -21421762 -18403703 -9858145 -1954245 1353713
38194A353713j839666l791783M767O904935R698175M944696j944294l874160j606496
$$ 1353713 -485953 -4277736 -4272969 2631966 12330141 17274837 15330543 11456383 9849887
38185I849887j170309l816575m737947j619569J578710R03477k270467m154841
$$ 9849887 8679578 4863003 125056 -1494513 84197 987674 -1282793 -5437634
38177e437634l102228M64235N314768Q864173Q389016M573320J276639L97746
$$ -5437634 -8539862 -8075627 -2760859 6103314 14492330 19065650 20342289 20740035
38169B0740035l26225l076557o434323p783250o637161m018242j009708Q49221
$$ 20740035 20413810 17337253 10902930 3119680 -3517481 -7535723 -8545431 -7696210
38161g696210N96010L91481L468913Q090781Q023336J709377l774194k171433
$$ -7696210 -7100200 -6708719 -3239806 4850975 12874311 14583688 10809494 8638061
38153H638061K666167K508674l157104p178998n598752j932568k51428J06400
$$ 8638061 11304228 13812902 10655798 3476800 -2121952 -4054520 -4305948 -4199548
38145d199548J293919L096888M329513M705762L914128J806543J58873Q06764
$$ -4199548 -2905629 191259 4520772 9226534 13140662 14947205 15106078 15912842
38137A5912842J681046r34672n448160n639598l45079L258382k58076o398431
$$ 15912842 17593888 16659216 11211056 5571458 5226379 8484761 8226685 1828254
38129A828254p606279l884466n78561Q35599K550688L255702o00034o415772o452786
$$ 1828254 -5778025 -9662491 -10241052 -9405453 -6854765 -3599063 -4199097 -10614869 -17067655
38120a7067655Q19952P512875P269642K897832l95946k774006n805178o721140
$$ -17067655 -16247703 -8734828 -1465186 1432646 1036700 -1737306 -7542484 -14263624
38112a4263624l152876Q71644O99436p56584J733246N271033K850291l446050
$$ -14263624 -17416500 -16544856 -15845420 -16602004 -14868758 -9597725 -6747434 -10193484
38104a0193484l714428L834081Q692211M030443k736445k007488L417401M561517
$$ -10193484 -13907912 -10073831 -1381620 2648823 -87622 -2095110 1322291 5883808
38096E883808J322100J036177M730859N359100J81422m484301l418739M01262
$$ 5883808 7205908 8242085 12972944 18332044 18513466 14029165 10610426 11011688
38088A1011688K526938M102316P058997P486911O46473r585679j3175391o800340
$$ 11011688 13538626 17640942 24699939 32186850 32833323 23247644 10072253 3271913
38080C271913J019681O84130n839830p764263n61739O963104M286359n679647
$$ 3271913 4291594 4975724 -864106 -8628369 -9190108 -2227004 2059355 -3620292
38072c620292r717732k609000N371938L161273n579799q698848l027341L191604
$$ -3620292 -13338024 -15947024 -10575086 -7413813 -12993612 -21692460 -24719801 -21528197
38064b1528197M067727L132172M965705P631164P109694L693446K66362j753274
$$ -21528197 -17460470 -14328298 -9362593 -1731429 5378265 9071711 9338073 7584799
38056G584799k036211o71446K76865j157638j911690L154715J1270625J1902000
$$ 7584799 5548588 4877142 5154007 3996369 2084679 5239394 16510019 28412019
38048B8412019J212628j0531002j2087196n692559j089827o13795M60749K313528
$$ 28412019 29624647 19093645 7006449 1313890 224063 -389732 71017 2384545
38040B384545J81221m850923n120677J187581N671388J716618n961278q380479
$$ 2384545 2565766 -2285157 -7405834 -6218253 -546865 1169753 -4791525 -13172004
38032a3172004l785322K601742O534056P689919O895060M686202K037095j47093
$$ -13172004 -16957326 -14355584 -7821528 -131609 6763451 11449653 13486748 13339655
38024A3339655j899622l258572l571193k867748k567900l588547m844845m529349
$$ 13339655 11440033 8181461 4610268 1742520 -825380 -4413927 -9258772 -13788121
38016a3788121j904291K470689O844009Q454212N674491P12272j780231O1453
$$ -13788121 -15692412 -13221723 -6377714 2076498 7750989 8463261 6683030 6744483
$$ [...]
##END NTUPLES=NMR SPECTRUM
##END=
