##TITLE=31Pdec_DE-46EA2_D2O
 D2O, 64 sc
 22.7.2024
##JCAMPDX= 6.0         $$ Bruker NMR JCAMP-DX V2.0
##DATA TYPE= NMR SPECTRUM
##DATA CLASS= NTUPLES
##ORIGIN= UXNMR, Bruker Analytische Messtechnik GmbH
##OWNER= root
$$ XWIN-NMR		Version 3.5
$$ Mon Jul 22 15:49:50 2024 Russian Standard Time (UT+4h)  she@DPX200
##.OBSERVE FREQUENCY= 81.013821
##.OBSERVE NUCLEUS= ^31P
##.ACQUISITION MODE= SIMULTANEOUS
##.ACQUISITION SCHEME= undefined
##.AVERAGES= 64
##.DIGITISER RES= 17
##SPECTROMETER/DATA SYSTEM= spect
##.PULSE SEQUENCE= zgpg30
##.SOLVENT NAME= D2O
##.SHIFT REFERENCE= (INTERNAL, D2O, 0, 198.062)
##AUDIT TRAIL= $$ (NUMBER, WHEN, WHO, WHERE, WHAT)
$$ ##TITLE= Audit trail, XWIN-NMR		Version 3.5
$$ ##JCAMPDX= 5.01
$$ ##ORIGIN= Bruker BioSpin GmbH
$$ ##OWNER= she
$$ F:/spectra/data/she/nmr/P31/2/pdata/1/auditp.txt
$$ ##AUDIT TRAIL=  $$ (NUMBER, WHEN, WHO, WHERE, WHAT)
(   1,<2024-07-22 15:47:46.70 +0400>,<she>,<DPX200>,
      <created by zg, POWCHK disabled, PULCHK disabled
       configuration hash MD5:
       00 E9 B6 7A A2 85 ED C7 34 08 36 98 17 FE 4E 26
       data hash MD5: 32K
       CC 62 2F 1A 8E B0 42 E3 E1 35 75 BB 3A 66 BE 18>)
(   2,<2024-07-22 15:48:41.78 +0400>,<she>,<DPX200>,
      <Start of raw data processing
       efp BC_mod = 2 LB = 1.5 FT_mod = 6 PKNL = 1 PHC0 = 2735.004 PHC1 = -61.51303 SI = 64K 
       data hash MD5: 64K
       C4 C3 38 14 49 F2 B6 45 CE 13 09 87 86 23 93 07>)
(   3,<2024-07-22 15:49:01.75 +0400>,<she>,<DPX200>,
      <pk PHC0 = -22.84011 PHC1 = -8.4 
       data hash MD5: 64K
       FF C2 FF 0C D1 EE 03 B9 66 03 80 72 CC 3A B6 06>)
(   4,<2024-07-22 15:49:15.45 +0400>,<she>,<DPX200>,
      <abs ABSG = 5 
       data hash MD5: 64K
       81 2D 8A 0C 5A 56 B3 07 EA 95 AA D4 E8 67 A5 A2>)
$$ ##END=
$$ 
$$ hash MD5
$$ E2 F0 A4 DD C7 C6 05 18 95 A9 20 36 AC E5 46 EA
##$RELAX= 
##$RELAX= 
##$RELAX= 
##$RELAX= 
##$RELAX= 
##$RELAX= 
##$RELAX= 
##$RELAX= 
$$ Bruker specific parameters
$$ --------------------------
##$DU= <F:/spectra>
##$EXPNO= 2
##$NAME= <P31>
##$PROCNO= 1
##$TYPE= <nmr>
##$USER= <she>
##$AMP= (0..31)
100 100 100 100 100 100 100 100 100 100 100 100 100 100 100 100 100 100 
100 100 100 100 100 100 100 100 100 100 100 100 100 100 
##$AQSEQ= 0
##$AQ_mod= 1
##$AUNM= <au_zg>
##$AUTOPOS= <>
##$BF1= 81.014009
##$BF2= 200.13
##$BF3= 200.13
##$BF4= 200.13
##$BF5= 200.13
##$BF6= 200.13
##$BF7= 200.13
##$BF8= 200.13
##$BYTORDA= 1
##$CFDGTYP= 0
##$CFRGTYP= 5
##$CHEMSTR= <none>
##$CNST= (0..31)
1 1 145 1 1 1 1 1 1 1 1 1 1 1 1 1 1 1 1 1 1 1 1 1 1 1 1 1 1 1 1 1 
##$CPDPRG= <waltz16>
##$CPDPRG1= <>
##$CPDPRG2= <waltz16>
##$CPDPRG3= <>
##$CPDPRG4= <mlev>
##$CPDPRG5= <mlev>
##$CPDPRG6= <mlev>
##$CPDPRG7= <mlev>
##$CPDPRG8= <mlev>
##$CPDPRGB= <>
##$CPDPRGT= <>
##$D= (0..31)
0 1 0 0 0 0 0 0 0 0.06 0 0.03 2e-05 3e-06 0 0 0.0002 0 0 0 0 0 0 0 0 0 
0 0 0 0 0 0 
##$DATE= 1721648866
##$DBL= (0..7)
120 120 120 11 120 120 24 19 
##$DBP= (0..7)
150 150 150 150 150 150 150 150 
##$DBP07= 0
##$DBPNAM0= <>
##$DBPNAM1= <>
$$ [...]
##$SUBNAM4= <"">
##$SUBNAM5= <"">
##$SUBNAM6= <"">
##$SUBNAM7= <"">
##$SUBNAM8= <"">
##$SUBNAM9= <"">
##$SW= 400.765351723535
##$SWIBOX= (0..15)
0 1 3 0 0 0 0 0 0 0 0 0 0 0 0 0 
##$SW_h= 32467.5324675325
##$TD= 32768
##$TD0= 1
##$TE= 0
##$TE2= 300
##$TE3= 300
##$TEG= 300
##$TL= (0..7)
0 120 53 12 22 120 120 120 
##$TP= (0..7)
150 150 150 150 150 150 150 150 
##$TP07= 0
##$TPNAME0= <>
##$TPNAME1= <>
##$TPNAME2= <>
##$TPNAME3= <>
##$TPNAME4= <>
##$TPNAME5= <>
##$TPNAME6= <>
##$TPNAME7= <>
##$TPOAL= (0..7)
0.5 0.5 0.5 0.5 0.5 0.5 0.5 0.5 
##$TPOFFS= (0..7)
0 0 0 0 0 0 0 0 
##$TUNHIN= 0
##$TUNHOUT= 0
##$TUNXOUT= 0
##$USERA1= <user>
##$USERA2= <user>
##$USERA3= <user>
##$USERA4= <user>
##$USERA5= <user>
##$V9= 5
##$VALIST= <valist>
##$VCLIST= <CCCCCCCCCCCCCCC>
##$VD= 0
##$VDLIST= <DDDDDDDDDDDDDDD>
##$VPLIST= <PPPPPPPPPPPPPPP>
##$VTLIST= <TTTTTTTTTTTTTTT>
##$WBST= 1024
##$WBSW= 4
##$XGAIN= (0..3)
0 0 0 0 
##$XL= 0
##$YL= 0
##$YMAX_a= 6631
##$YMIN_a= -10944
##$ZGOPTNS= <>
##$ZL1= 120
##$ZL2= 120
##$ZL3= 120
##$ZL4= 120
##$ABSF1= 198.0616
##$ABSF2= -202.7028
##$ABSG= 5
##$ABSL= 3
##$ALPHA= 0
##$AQORDER= 0
##$ASSFAC= 0
##$ASSFACI= 0
##$ASSFACX= 0
##$ASSWID= 0
##$AUNMP= <proc_1d>
##$AZFE= 0.1
##$AZFW= 0.5
##$BCFW= 0
##$BC_mod= 2
##$BYTORDP= 0
##$COROFFS= 0
##$CY= -3
##$DATMOD= 1
##$DC= 0
##$DFILT= <>
##$DTYPP= 0
##$F1P= 0
##$F2P= 0
##$FCOR= 1
##$FTSIZE= 65536
##$FT_mod= 6
##$GAMMA= 0
##$GB= 0
##$INTBC= 1
##$INTSCL= 9.790993e-09
##$ISEN= 30
##$LB= 1.5
##$LEV0= 0
##$LPBIN= 0
##$MAXI= 10000
##$MC2= 0
##$MEAN= 0
##$ME_mod= 0
##$MI= 50
##$NCOEF= 0
##$NC_proc= -10
##$NLEV= 6
##$NOISF1= 182.463
##$NOISF2= 159.3651
##$NSP= 0
##$NTH_PI= 0
##$NZP= 0
##$OFFSET= 198.0616
##$PC= 4
##$PHC0= 2712.164
##$PHC1= -69.91303
##$PH_mod= 1
##$PKNL= yes
##$PPARMOD= 0
##$PSCAL= 0
##$PSIGN= 0
##$REVERSE= no
##$SF= 81.0140089999434
##$SI= 65536
##$SIGF1= 159.3651
##$SIGF2= -187.1042
##$SINO= 113.3802
##$SIOLD= 16384
##$SREGLST= <1H.CDCl3>
##$SSB= 0
##$STSI= 65536
##$STSR= 0
##$SW_p= 32467.5324675325
##$SYMM= 0
##$S_DEV= 0
##$TDeff= 32768
##$TDoff= 0
##$TI= <>
##$TILT= no
##$TM1= 0
##$TM2= 0
##$TOPLEV= 0
##$USERP1= <user>
##$USERP2= <user>
##$USERP3= <user>
##$USERP4= <user>
##$USERP5= <user>
##$WDW= 1
##$XDIM= 65536
##$YMAX_p= 302579401
##$YMIN_p= -107877985
$$ End of Bruker specific parameters
$$ ---------------------------------
##NTUPLES= NMR SPECTRUM
##VAR_NAME=  FREQUENCY,     SPECTRUM/REAL,   SPECTRUM/IMAG
##SYMBOL=    X,             R,               I
##VAR_TYPE=  INDEPENDENT,   DEPENDENT,       DEPENDENT
##VAR_FORM=  AFFN,          ASDF,            ASDF
##VAR_DIM=   65536,         65536,           65536
##UNITS=     HZ,            ARBITRARY UNITS, ARBITRARY UNITS
##FACTOR=    0.49542278885378, 1,            1
##FIRST=     16045.7642231865, 0,            0
##LAST=      -16421.768244346, 0,            0
##MIN=       -16421.768244346, -107877985,   0
##MAX=       16045.7642231865, 302579401,    0
$$ Real data points
##PAGE= N=1
##DATA TABLE= (X++(R..R)), XYDATA
$$ [...]
44343 -34971432 -25190092 -11919846 7298657 26532543 32099304 19842041 3864616
44336 3864616 195006 7093730 9900052 1951092 -8267848 -10451954 -5356829 -1760264
44328 -1760264 -4116691 -6089866 2406645 20891330 34068069 27684045 7629619 -5166635
44320 -5166635 -415411 10804665 15140532 15473180 21122674 28602330 25334910 9217374
44312 9217374 -7653382 -14967005 -14610453 -14118245 -17080031 -21402887 -21947821 -14661153
44304 -14661153 -2108474 6578640 5571276 -318047 -2948404 -2092732 -3325801 -8055170
44296 -8055170 -12791431 -15743750 -16893791 -14118626 -7112269 -2684835 -7134224 -14622771
44288 -14622771 -12566955 1191652 15427021 20813209 20154563 21528122 27639883 33474748
44280 33474748 30015759 11636185 -14647961 -30394940 -24101679 -5384506 8388525
44273 8388525 15776627 28732952 48464121 60347087 56630019 48887227 50090171 56162611
44265 56162611 54419081 41597939 24807190 10952547 2499101 -1565713 -6058132 -15379742
44257 -15379742 -25110351 -25304385 -16546198 -13588609 -26276816 -45135314 -53502884 -46440000
44249 -46440000 -30064233 -10698670 5505335 10010965 1352121 -7520664 -3375157 8853577
44241 8853577 13399270 7069840 2335516 6572431 11309363 6766389 -3073506 -6971961
44233 -6971961 -2286204 2353249 -1728102 -13476471 -22989734 -20380084 -4871715 13266310
44225 13266310 20205760 9637052 -11567541 -27759543 -26884997 -11776706 2096656
44218 2096656 3747712 -700041 1776675 11178999 14863212 7766160 -527370 -3221076
44210 -3221076 -7513489 -19393834 -28655464 -21908097 -3530166 9365710 8841414 1247817
44202 1247817 -6287177 -12488385 -16439396 -16437754 -14356081 -12780468 -9669866 -4264171 -4309028
44193 -4309028 -16017896 -29816704 -29506736 -15152383 -3543857 -5194206 -14554881 -24884484
44185 -24884484 -37649948 -51744623 -57605908 -51079752 -42720716 -43853768 -50756319 -51093735
44177 -51093735 -40334453 -24403660 -10672073 -2636257 148317 1645607 5572784 9609937
44169 9609937 8243535 2719237 754953 4066109 5111495 -13557 -5392155 -7684631
44161 -7684631 -14404887 -31273428 -49757355 -56895789 -51152827 -39555072 -25836469 -11792726
44153 -11792726 -4411967 -9161130 -18690305 -19532414 -9317771 2061682 7322453 8390529
44145 8390529 8612573 7758058 5917940 4736108 3543862 386258 -2866067 -2064252 3164098
44136 3164098 10199726 18255193 26324654 29310020 23926146 15727578 11514180 7548714
44128 7548714 -4198499 -20173121 -28042335 -25390086 -22618398 -25509981 -28458985 -28522502
44120 -28522502 -31885758 -40156337 -44219497 -40372907 -39108773 -46450285 -49157633 -33763989
44112 -33763989 -10924122 -2833530 -11210360 -16442057 -8197718 1336869 -1152268 -11622973
44104 -11622973 -19396149 -23849085 -30456808 -38345374 -41718043 -39293821 -34412893 -28562684
44096 -28562684 -20856472 -11377839 -121969 14354291 30351067 40268190 37768099 25342961
44088 25342961 10186922 -4383461 -18400993 -30029778 -37616090 -43711611 -49108096
44081 -49108096 -45861191 -27051939 -3182587 4041130 -10984264 -28074672 -27040578
44074 -27040578 -13853072 -9687882 -19808888 -27570960 -19428878 -2502146 8116934
44067 8116934 9758279 11616894 19097695 27677418 31638499 31409409 29432620 23323577
44059 23323577 8232962 -13859026 -31270397 -32893822 -20907359 -8959656 -5796755
44052 -5796755 -5181462 3312992 17368339 23893391 17666174 8958644 8840419 14586316
44044 14586316 16174176 11717315 8079075 8903615 11132624 13666025 20652799 32699436
44036 32699436 41616798 39414141 28673572 18489191 12190447 4778070 -7490479 -20248500
44028 -20248500 -25955601 -22290479 -12670037 -439417 13662539 28165625 38475944
44021 38475944 39995450 32386279 19342225 5443535 -5359550 -10368274 -10683876 -12187579
44013 -12187579 -19585842 -28681317 -28933517 -16018661 1856090 13289907 15989799 15556281
44005 15556281 14917837 11326654 3902980 -1824278 559820 11760374 27448582 42024039
43997 42024039 49698205 46002220 32620061 18781268 13207170 14615669 13730823 5127110
43989 5127110 -6406935 -12763242 -12744480 -12526475 -16974433 -23145418 -23012078 -11885839
43981 -11885839 5550670 17192240 13314559 -3202798 -17373941 -15949768 -1000116
43974 -1000116 13126786 16198398 10934756 4436096 -2646060 -13157017 -24702956 -31906436
43966 -31906436 -35354253 -39536531 -41717468 -32451455 -10434188 11981409 23608284 27183489
43958 27183489 30390780 31340423 22990356 7608048 -4744112 -11106718 -17541561 -24692771
43950 -24692771 -23039439 -7876045 10270575 17933887 15609510 14682077 21174246 30110154
43942 30110154 34220617 31193466 22619842 12232147 6314928 10214807 21547203 30167899
43934 30167899 27807801 16471570 5742818 2763566 5880121 7360941 1440816 -10367572
43926 -10367572 -21933185 -29944890 -36863190 -45522882 -53169042 -53789863 -45423606 -32014635
43918 -32014635 -18232102 -5786958 4532891 10699288 11353325 7725505 1961720 -4495595
43910 -4495595 -9441756 -9722812 -5426153 -1897487 -3468385 -6365061 -2647198 8673530
43902 8673530 19655096 24240308 25748071 29861743 34728840 33954691 27129600 20824950
43894 20824950 19351405 20712527 22540065 25489422 28172159 25214835 15447695 7382740
43886 7382740 10074231 20443690 25446363 16410705 -3100862 -22859368 -34821649 -36955822
43878 -36955822 -33101985 -29649576 -28838793 -25901682 -17042538 -8788042 -12247202 -26754586
43870 -26754586 -36718423 -28979720 -7577964 13861594 29096724 40928810 48680859
43863 48680859 44062409 23220750 -3289543 -19041396 -19419240 -15884948 -20858497 -32010378
43855 -32010378 -36079925 -27230561 -15068696 -11095030 -13057666 -10079028 -306851 6151913
43847 6151913 2699247 -5042751 -9828122 -13073774 -18013632 -20384247 -15275242 -8210125
43839 -8210125 -8851439 -16086569 -20259794 -19797209 -23672368 -34111366 -38036120 -22994514
43831 -22994514 5708395 31575942 45728395 51363583 52684010 48020715 34435727
43824 34435727 13164548 -10609339 -29613964 -36790252 -30775749 -19464701 -13354938
43817 -13354938 -14555210 -16777750 -16252306 -15979066 -16802257 -11868985 3505798 21276788
43809 21276788 28151202 22063855 13656076 11753668 15353469 20925597 28166929 33957568
43801 33957568 29514752 12037590 -6436785 -11571477 -5253984 -1573901 -5576684 -7518048
43793 -7518048 -298408 9126669 11775143 10409293 12759709 18032768 20040688 19212556
43785 19212556 20746238 22702540 16980601 3401587 -6914142 -5701742 2318602 7086118
43777 7086118 4482430 -3900074 -15729192 -26934296 -30661328 -24210067 -14788002 -12002440
43769 -12002440 -15327864 -14870426 -5318727 6212528 9187219 3345190 -692006 5505859
43761 5505859 18003880 26232199 27259254 29025322 37126083 44108118 38828219 23583916
43753 23583916 12372077 11042421 9481144 -1239851 -13365798 -13626983 -4118669 -553763
43745 -553763 -11027721 -27072793 -36951212 -38240695 -34369418 -27658115 -20921813 -18785103
43737 -18785103 -21021777 -19760495 -9879966 1805921 4636297 -1619585 -7975348 -9555264
43729 -9555264 -8813789 -5429955 6442884 25662020 37122505 26622654 144562 -20366878
43721 -20366878 -21482238 -11532087 -6399763 -8376929 -5986940 7218616 21709522 23276525
43713 23276525 10735612 -3019437 -6710567 -2550094 -1117201 -8172251 -19601029 -27644798
43705 -27644798 -28672025 -24518132 -18800770 -13883560 -11128050 -12144215 -17255430 -21965467
43697 -21965467 -18294815 -4254995 8974028 6056107 -13450582 -31112208 -30071964
43690 -30071964 -14619033 -2262195 -671458 -2868087 -3590051 -7073313 -14823314 -18315183
43682 -18315183 -12071496 -4084371 -2973526 -2971240 5664704 17275208 17084787 4680165
43674 4680165 -5016022 -5790056 -8555563 -20039750 -29088495 -24879758 -15986649 -17459953
43666 -17459953 -27404727 -31078101 -23283778 -12074965 -2518892 8663016 21693723 30396266
43658 30396266 32966328 34613585 36488589 33259584 25507517 22697563 27651823 29039986
43650 29039986 17408240 -996667 -15641420 -27359273 -40085683 -44454435 -26421499
43643 -26421499 8298242 33975202 33922878 18780240 9860765 13139241 17563819 13361965
43635 13361965 2631885 -7565915 -15034918 -21837818 -26915920 -24125444 -10195390 7218980
43627 7218980 14802800 9399623 3711392 10825352 26590531 34928036 28905829 17043487
43619 17043487 7638797 -2254321 -16577758 -28535896 -28995467 -21498487 -18029572 -21143596
43611 -21143596 -20917740 -11732810 -2440900 -3934461 -12637727 -13766193 825068 23986058
43603 23986058 42260286 48388758 43701699 33062320 21598997 14464653 14926726 21070649
43595 21070649 26561890 25999439 18354472 5428740 -9413826 -19380674 -16111852 828421
43587 828421 18388653 20704365 5911552 -13321222 -26166592 -32785818 -35017354 -28038140
43579 -28038140 -9298893 11295519 21064636 21497924 24589825 32888138 35022294 24196409
43571 24196409 10292798 7075037 15119069 24593050 28745898 26536091 16683620 -980418
43563 -980418 -19269888 -27485409 -23164569 -14497014 -10228294 -11670531 -14243233 -11496734
43555 -11496734 1871412 24254048 43655553 47151797 35929734 24032213 19838775
43548 19838775 17337666 10532901 6647090 14567104 26151566 22357180 -2029169 -31025266
43540 -31025266 -46977636 -47395769 -38940891 -25618791 -10859307 -2972493 -7201450 -15407697
43532 -15407697 -14091421 -2405576 7071559 6621276 3204719 6532142 15541422 22515042
43524 22515042 24497567 23732891 20932247 15528097 10368492 8904311 8521873 3457342
43516 3457342 -5672721 -11861676 -11840185 -9482805 -7691526 -4014553 2670210 7839581
43508 7839581 8020745 6097369 5234606 3055692 -2445952 -6356320 -3268915 3462855
43500 3462855 6187935 3797779 791085 -1740443 -6017494 -10624137 -12719551 -15867354
43492 -15867354 -25675323 -38016930 -42932650 -41600605 -46700908 -61372252 -70341570 -59863461
43484 -59863461 -36171938 -15057242 -2161798 6266544 11609654 14388971 21035795 35000438
43476 35000438 44889298 36516276 15961782 5364617 13327702 23944112 20579867 7427437
43468 7427437 -1111274 -2141528 -4253252 -11176121 -16086510 -11493710 2148793 17961920
43460 17961920 28463498 29882921 23655823 14243918 5389846 -312360 258105 8291696
43452 8291696 18636357 22718086 17111612 5183349 -9391801 -24371630 -33894197 -30443537
43444 -30443537 -15725276 -2437906 -682180 -8708686 -20702995 -35473534 -51120483
43437 -51120483 -58902367 -51579951 -33742112 -16459805 -5616049 -1709240 -5068422 -12512584
43429 -12512584 -14330365 -5263781 5135468 4114736 -5246691 -8854674 -3917120 -2488998
43421 -2488998 -10920477 -19567079 -18280053 -10506106 -4879553 -2238994 924363 3500659
43413 3500659 2920362 2296387 6351906 13518446 18988671 22631688 26969868 29655581
43405 29655581 25464116 15376739 6934378 4382085 3788607 -179293 -7002170 -12592695
43397 -12592695 -15653215 -17756617 -18022138 -12348945 -322137 10507340 12340173 8251896
43389 8251896 8942523 16374084 18320809 5419177 -12390429 -15579621 1496937 25590243
43381 25590243 41112605 42543006 32437274 19237840 17832543 38593749 70545523
43374 70545523 87064950 75631300 52580603 41169683 44290027 47346855 39439889
43367 39439889 21623630 1180214 -12012567 -9630067 3907283 10094575 -2538519
43360 -2538519 -21274135 -25252204 -13211624 -692202 6073895 15201321 27751124 30613930
43352 30613930 17290996 -77884 -8690969 -12710675 -22842159 -38128596 -48799932
43345 -48799932 -50123772 -43456219 -29502865 -10732862 3880015 6727728 1837530 -1486368
43337 -1486368 -2962247 -9979779 -22971306 -31955547 -29617112 -20026204 -11336674 -6006795
43329 -6006795 -1974585 1198455 1939009 106221 -3070656 -7753215 -15187709 -24387892
43321 -24387892 -31516721 -34130544 -34953878 -39202351 -47866605 -55953282 -58427392 -55012428
43313 -55012428 -47045861 -33836298 -17481910 -7978666 -14758193 -32315546 -42671603
43306 -42671603 -35769954 -20871586 -13476258 -16798136 -21195516 -16962095 -2323970 16958076
43298 16958076 30505652 29857619 17805570 7700488 8142069 12636424 10604019 3672904
43290 3672904 2662171 12048751 26559350 40067977 47502759 40772539 16691244 -9685736
43282 -9685736 -14110477 8173723 33915468 39147758 25086182 8860939 -898837 -6654926
43274 -6654926 -7503210 1699338 16810683 23654098 14831199 -1926621 -15810420 -25031658
43266 -25031658 -32476289 -36956246 -35290690 -28348473 -19172901 -8812741 799404 4418243
43258 4418243 1261148 1763487 16824426 40190949 51391084 39720511 17102264 1893623
43250 1893623 -2681451 -6415059 -14318468 -21204730 -22213459 -18855414 -13959246 -9590128
43242 -9590128 -11370864 -24708671 -42391250 -45903829 -27097648 -1201925 11365100
43235 11365100 10811318 14099225 27678162 37416137 28968645 7186594 -11540444 -19045798
43227 -19045798 -19800923 -20213067 -22340713 -27364324 -36689549 -46102174 -44488413 -24600327
43219 -24600327 5850782 29237877 35892025 32948872 32656289 36372822 36126874 29150021
43211 29150021 21984099 19553714 19767282 22424967 33140145 50874364 60674321 50152500
43203 50152500 27756211 12590114 9428428 6720396 -2086229 -9530803 -8283281 -750203
43195 -750203 9567064 23746833 38668325 44125391 36159333 23712925 15211339 8768427
43187 8768427 3295693 7068494 22890400 34840014 25868278 3448743 -8403168 -1024611
43179 -1024611 10324749 10756157 3787821 395061 2126078 2442938 -2526955 -10900130
43171 -10900130 -18032136 -18442011 -9016646 6183973 17689295 19634644 14221866 6424839
43163 6424839 -1678642 -9955543 -17263679 -20960254 -17615699 -5896055 7715575 9493192
43155 9493192 -7634530 -31457125 -39995745 -25367529 -1493039 13309427 14056858 7218207
43147 7218207 -790135 -7857495 -13830027 -19126213 -23821884 -25947042 -22860726 -14796794
43139 -14796794 -4273348 6907407 16117370 18261189 12586224 8510772 15422375 28611297
43131 28611297 36886662 42797920 59353682 83630004 91931055 71074562 38907255
43124 38907255 20240025 15390748 9002203 -459125 -669130 9296636 14731877 8998166
43116 8998166 4183451 11654754 24447948 26733835 13448338 -5253701 -14669695 -8180216
43108 -8180216 6498380 13315735 4775083 -8970039 -14057861 -12013859 -14470359 -21506993
43100 -21506993 -19860820 -5112622 9100900 11074336 7983537 12982699 24132125 27406818
43092 27406818 16294336 -1325767 -14035927 -17304331 -14118374 -10627185 -10474466 -10577148
43084 -10577148 -5002533 4918973 9372147 2710036 -8210264 -13671026 -13650530 -13800753
43076 -13800753 -13730302 -8608421 -460238 1931375 -4301227 -11547859 -12652551 -10064345
43068 -10064345 -10243041 -13707517 -15618519 -13946277 -11810283 -11066248 -7808500 2164250
43060 2164250 14810837 19740200 12680366 1566723 -4312977 -7159260 -14935799 -24984614
43052 -24984614 -24414076 -9671411 4874295 4518199 -7925344 -19728227 -26128359 -30434517
43044 -30434517 -32268151 -28575613 -24125105 -27664289 -36386637 -36668249 -24091833 -11498869
43036 -11498869 -11023409 -17727632 -19221275 -14117021 -11026408 -13342645 -15309495 -12700046
43028 -12700046 -8600647 -6740919 -5910714 -4295249 -4627001 -10836558 -21593329 -30544899
43020 -30544899 -32580007 -27923813 -20470564 -14050727 -10702886 -10840823 -13486287 -16641321
43012 -16641321 -18788472 -20176987 -21442861 -21055582 -16414760 -8482080 -2572113 -1862868
43004 -1862868 -2189175 2874353 12644726 19356828 17774181 10300136 1293450 -8780125
42996 -8780125 -20187756 -28766103 -29104836 -22154501 -15607882 -15880053 -21702456 -26000210
42988 -26000210 -23056794 -14385024 -8325676 -12103727 -22702529 -28070215 -20412351 -6029799
42980 -6029799 2362040 1154559 -2611342 -4738900 -10109918 -21402912 -29784692 -25561008
42972 -25561008 -13884300 -9481137 -16011013 -21178691 -15788376 -7888332 -10339599 -20781202
42964 -20781202 -24023163 -12658092 4018848 13171863 13087551 11428101 14352730 21773795
42956 21773795 30150512 35308081 33385318 22933522 7659807 -4073045 -4617083 5758767
42948 5758767 16764304 16620037 5386317 -3365721 1638461 15040252 22483098 20023446
42940 20023446 17187184 20974635 27136519 30059967 30678129 28938837 18746403 -667334
42932 -667334 -16603790 -16988980 -6788866 848080 4696494 13527107 27462828 36878571
42924 36878571 40513655 48632196 63429562 71270883 62847354 48540746 42812331 42899567
42916 42899567 35567491 18784821 3694017 -2139901 -1644306 640613 3759080 6395510
42908 6395510 7225234 9909223 18574512 27208132 23436262 5972213 -10959179 -15239888
42900 -15239888 -10596788 -7117679 -6099358 -2362557 4313596 9487205 12552420 15777870
42892 15777870 16478166 9496440 -2199425 -8617615 -6867669 -5838753 -12615542 -21607436
42884 -21607436 -23296549 -18224366 -14726679 -15776997 -16026870 -11743167 -6803995 -6805615 -11690512
42875 -11690512 -16448534 -16596024 -11917342 -6924355 -7703418 -15754746 -25203690 -29003104
42867 -29003104 -27009034 -23753414 -19239712 -8817399 5819449 12771571 3054450 -16081161
42859 -16081161 -27221361 -21385124 -6057161 4801105 4311127 -4400295 -14687474 -22531391
42851 -22531391 -26751147 -25947310 -18467041 -6467658 3285197 6746963 8978545 17749980
42843 17749980 31295258 39278887 37210986 32168616 30660629 28592533 19268088 4786941
42835 4786941 -8021036 -17973514 -27758600 -35710686 -37924621 -35861016 -33346384 -28136660
42827 -28136660 -15272923 2459099 16072855 21467160 20788101 14845657 4367959 -2821815
42819 -2821815 1387370 10302882 7422148 -9836024 -24376700 -23144172 -13988427 -10673484
42811 -10673484 -12620678 -10619689 -4072022 -207659 -1035148 -2038354 -760519 2457160
42803 2457160 8990608 18289010 22953237 16661393 4552825 -3104941 -4988503 -7154582
42795 -7154582 -10220099 -9419196 -6752190 -10988161 -23316965 -33841290 -36095997 -35240560
42787 -35240560 -36926803 -37375466 -31646725 -24265978 -22596756 -24038457 -19339587 -7577077
42779 -7577077 850760 -2048315 -11913549 -19178355 -20865201 -20057119 -17098088 -9027038
42771 -9027038 1543071 4988959 -2709921 -11776888 -11085337 -5499778 -10466964 -28949602
42763 -28949602 -44722656 -42724678 -26330179 -8445691 4921818 13318717 12613032 -272467
42755 -272467 -17298769 -26078047 -25237051 -22275063 -17994074 -6295677 9132597 11925358
42747 11925358 -6488903 -33110057 -47276477 -41760729 -24269643 -5145969 8469121
42740 8469121 11274196 2352460 -10756545 -16795145 -11210946 666248 10378566 13693238
42732 13693238 11897499 8623110 6036228 2956919 -3850878 -16664500 -34918281 -54842298
42724 -54842298 -69987865 -74441620 -68352548 -58806845 -52253376 -47610433 -39998690 -28807749
42716 -28807749 -17358789 -6846479 3157490 9356447 7003427 -1910602 -9007304 -8732594
42708 -8732594 -1475118 11570208 27920807 37264109 26265591 -4133466 -33750849
42701 -33750849 -42313824 -29161067 -9463136 3308794 5603504 536319 -5603433 -6400659
42693 -6400659 -1564040 1496973 -2786820 -9771505 -11084634 -6435113 -2405767 -1653144
42685 -1653144 -1122662 -1101174 -7899844 -23621919 -38343161 -38303799 -21854136 -3761979
42677 -3761979 -1188592 -15516719 -30437437 -29795297 -15138884 -2001460 -382845 -4619842
42669 -4619842 -3195437 7705881 23346865 37619661 46351160 46810890 38975456 26776156
42661 26776156 15890717 11038277 15033362 26586131 38193568 40867516 32799337 19486912
42653 19486912 5410388 -7545083 -12836814 -1268946 23770546 42509201 39584893
42646 39584893 22516878 10108145 7933171 6453461 -78144 -5866069 -5462200 -1898472
42638 -1898472 674432 3689386 8853416 12499388 10296142 4171473 1043428 6514584
42630 6514584 20779380 37887921 48656739 48152976 41337299 37660795 39044229 37286203
42622 37286203 25530023 8824242 -241392 4504892 15803980 20645219 13996321 3185413
42614 3185413 -2293628 -2816527 -6275601 -14711917 -20179352 -16708619 -9897780 -8927741
42606 -8927741 -13404210 -14791470 -8806379 -380841 2931757 -1825122 -11003327 -16029517
42598 -16029517 -9984913 2948921 7971204 -4343377 -24888293 -35362258 -29299861
42591 -29299861 -17257722 -11790867 -14052090 -16339398 -12624755 -4448267 1495715 1336561
42583 1336561 -330464 3835234 12028734 14077506 7212813 1930384 5457479 9359347
42575 9359347 4450534 -1121000 6300287 22321172 30491011 28892419 31121134 39630805
42567 39630805 39017545 22770546 7686163 9986220 21964734 26181446 21866350 22150347
42559 22150347 31505740 40363574 40106460 32276875 23298239 18003675 17723859 18894687
42551 18894687 15359239 7133942 3592443 11636387 23607261 24580016 11340671 -2488612
42543 -2488612 -2143282 11208962 21518183 15428374 -2749544 -16059355 -15372670 -9615981
42535 -9615981 -11037391 -16519262 -13405894 -157101 11889812 17004566 20997690 26392227
42527 26392227 27216919 24199643 28953674 43073781 47963638 29578658 2108114 -8655044
42519 -8655044 2126817 17793812 26195709 29772987 32311943 31808462 28079592 25054161
42511 25054161 23111271 18155928 9160282 -938723 -10765844 -19303261 -21886898 -16437362
42503 -16437362 -10732775 -13150220 -18814566 -16692079 -8820325 -9204681 -22482442 -36417657
42495 -36417657 -39029053 -32511414 -26144718 -24351209 -25833361 -27472074 -26249893 -23246322
42487 -23246322 -26038026 -39660166 -55526589 -58627527 -46468058 -31367445 -23087508
42480 -23087508 -19525437 -16189076 -13574082 -11691868 -7731164 -3048149 -2697185 -4874444
42472 -4874444 -1853751 5005178 4226133 -5634287 -8481637 6702554 27492353 34727435
42464 34727435 28582088 24122530 27067876 29018620 24761856 20001704 19583508 18815045
42456 18815045 10730573 -4376593 -19513691 -26770447 -21639441 -6228939 10432741
42449 10432741 18713219 16115474 7015199 -3838187 -13818747 -19292290 -15454615 -2507429
42441 -2507429 10047361 9550721 -6619165 -25192513 -28843936 -15559966 -1149951 1242050
42433 1242050 -2643765 -546896 4303097 -2211252 -19845469 -30032221 -22152990 -8776676
42425 -8776676 -5806866 -10071717 -8266377 1602729 11037287 16941742 23246086 29615751
42417 29615751 30292433 23298785 12108473 95650 -9154773 -9993616 -2188529 3730367
42409 3730367 -1330347 -11126774 -13312666 -8992892 -10062417 -18807250 -24430021 -20873224
42401 -20873224 -14198806 -9382554 -3288214 4472024 6541976 555477 -4218471 -987838
42393 -987838 3141784 -1430717 -11651799 -17258200 -15670261 -12644445 -12321064 -14676745
42385 -14676745 -19282495 -23858273 -22152734 -11002625 2716261 9627556 10663517 14869089
42377 14869089 25200665 33993953 33332877 23663960 10935884 647707 -3924874 -2736727
42369 -2736727 -282049 -1829558 -6373855 -6774865 1316011 13907063 23849650 28493238
42361 28493238 30118070 31572236 33826871 35361731 31603706 18052572 -2058878 -15582741
42353 -15582741 -10879237 7983570 23792966 25050286 17119912 10809038 5591238 -7174726
42345 -7174726 -25814776 -33906139 -19561771 7598139 26083920 26070861 16562937 11039042
42337 11039042 13775694 21067054 28111270 30458137 23729132 7566058 -11409893 -24220807
42329 -24220807 -27003386 -22576330 -16259250 -12096131 -11584459 -13451596 -14957787 -14858062
42321 -14858062 -14257453 -13365763 -9347482 -212350 10195003 14839853 11886011 7144400
42313 7144400 6341038 8116731 8271447 8577981 15267019 27874434 36175481 32625977
42305 32625977 22654488 15747489 10099884 -3897957 -25139582 -38499319 -34981934 -25032105
42297 -25032105 -23192051 -27119265 -23171213 -8897431 2606484 1449635 -6633000 -9861351
42289 -9861351 -4626771 3313588 5988116 -881372 -13537950 -20073861 -11194108 6485475
42281 6485475 14776654 5092833 -11211758 -17832463 -12219986 -3556608 2225143 7731302
42273 7731302 16847651 28629398 38067560 39602958 31553993 19440066 11750252 9840259
42265 9840259 6229966 -4076666 -16074363 -22919579 -25507829 -27765210 -28521199 -26280319
42257 -26280319 -26483713 -33080717 -36178653 -21124604 9036679 31966494 30783117 11383809
42249 11383809 -8643505 -19446809 -22144035 -21023771 -20185468 -23144493 -28879632 -30901490
42241 -30901490 -24949972 -14422062 -3987851 7816048 23749837 38921210 43536682
42234 43536682 33884278 15674539 -2569601 -15179639 -20209708 -19817586 -18736015 -17634714
42226 -17634714 -9842716 9184210 30634595 38856300 30309870 17800745 12644570 10902076
42218 10902076 3304537 -8486328 -15003033 -14739894 -16164347 -23256486 -28331558 -22969044
42210 -22969044 -9339796 3859477 11595303 13863341 11484292 6465568 3344593 3784012
42202 3784012 2205477 -5850732 -12493769 -4262757 17459720 32199946 23251509 -1004587
42194 -1004587 -16424481 -11063507 3626524 9106877 494175 -10956543 -11750297 129559
42186 129559 14008833 18121745 12379200 7410519 9822471 13156297 8270345 -1674799
42178 -1674799 -5066773 386373 3205513 -5964522 -22014998 -33191193 -34616111 -28824244
42170 -28824244 -18564524 -5762283 5827920 13356001 18361314 22544913 22723730 15821552
42162 15821552 6705928 4217806 9689206 15368183 14566673 8265744 1736419 -73208
42154 -73208 5923791 17662318 25572575 20488403 5976210 -3842638 -1506863 5623489
42146 5623489 8136469 7664371 10330688 13595214 9559133 -1189421 -9023406 -8987318
42138 -8987318 -6166150 -5193696 -2748706 4935029 13777726 17521380 17608904 20443525 26534220
42129 26534220 29210610 24470860 15899012 7878972 -421590 -10584907 -19065208 -21370440
42121 -21370440 -19743525 -20498164 -24280806 -25426750 -21668949 -16809613 -10475236 6051994
42113 6051994 35440821 61787782 64603713 44772985 24850602 20693547 24078844 19615691
42105 19615691 8299410 3367136 8998351 15883092 16764975 14834765 14580983 13890510
42097 13890510 9602504 4108970 1552423 1878953 2715127 3533575 4054657 1321041 -7577895
42088 -7577895 -20909079 -32935381 -38491433 -36070261 -28166986 -19538052 -13279369 -7977226
42080 -7977226 -544165 8585360 16169635 21395091 25758776 27641631 22968800 13045889
42072 13045889 5495893 4132012 4103722 1954090 4439280 19696514 42780799 58027492
42064 58027492 55638830 39993825 21808164 8284440 2068095 3772341 11365333 19223627
42056 19223627 21236583 15957326 8759899 8069591 17242826 29791249 35692348 33541067
42048 33541067 32250700 38009081 44265646 39846765 23960636 7055590 -2251510 -5719631
42040 -5719631 -10743767 -21001588 -32324602 -35944741 -27018685 -11460184 -1469537 -2419428
42032 -2419428 -8541550 -13796385 -19520400 -25637070 -23007280 -5490522 15935618 24211662
42024 24211662 19131035 15987581 21623945 25982529 20285613 9937381 3514176 387873
42016 387873 -3512822 -6668191 -5725900 -1159942 6102492 16159932 23860198 20389158
42008 20389158 6913856 -2981913 -1283960 3960314 3869467 3306378 9417067 15943070
42000 15943070 12938461 4810487 3822399 10326948 13949219 11056462 6629016 1399960
41992 1399960 -7542290 -14455098 -9389172 3839945 10018830 6000821 6150591 19079060
41984 19079060 33945641 37508292 31277387 22657710 11608548 -2604093 -11973142 -10341280
41976 -10341280 -6073163 -10510247 -18484227 -14479385 2886441 15709645 8670825 -13715109
41968 -13715109 -35035941 -44356829 -41462268 -30856802 -16873395 -3754711 3615714
41961 3615714 1684313 -7962431 -17540856 -18863780 -11669144 -3743429 -1346329 -2780857
41953 -2780857 -3659348 -4315250 -7230880 -9558611 -4155002 10840535 26817914 31283389
41945 31283389 20003936 2607410 -5782424 -1016026 4307132 -3230161 -18454305 -23492853
41937 -23492853 -13639114 -4715596 -8624954 -14591180 -6919817 8694530 13605407 6260398
41929 6260398 4939325 19214281 36507077 42585333 39207595 32648662 19927247 -17637
41921 -17637 -13088200 -5383735 13439443 19192969 4787069 -12737451 -18606075 -18044904
41913 -18044904 -21356766 -25237316 -20331006 -9034502 -3385046 -8609039 -19345789 -30566599
41905 -30566599 -41634991 -48546075 -42572146 -21916619 1691195 13942697 12398707
41898 12398707 5841566 2261481 2394898 3584451 4657082 5938099 7990966 12132279
41890 12132279 19999831 30383908 37376198 34357809 21163210 5768938 -3505737 -6882120
41882 -6882120 -10937123 -17631142 -21340767 -19927698 -21697834 -33068135 -44088903 -38631067
41874 -38631067 -19091308 -7401927 -16262899 -31507185 -31820448 -16111135 -369347
41867 -369347 4696755 -182741 -13329519 -33290822 -50497766 -52343673 -39261579 -24650259
41859 -24650259 -17173835 -14366937 -14785666 -22096459 -32172245 -30528938 -11907929 8640877
41851 8640877 14593267 8965811 5494228 6382809 1974617 -10989788 -23349600 -25705673
41843 -25705673 -17199930 -2050472 14264830 24602312 23452133 12844578 438658
41836 438658 -8803395 -14967095 -17852860 -14530910 -3554108 11290529 22448574 23660481
41828 23660481 15745428 7791137 8376149 14424278 14622571 5799712 -2423709 -3725703
41820 -3725703 -5903033 -17005175 -29291530 -28871552 -15955906 -3282659 2150829 3673608
41812 3673608 3833719 1280619 -2282424 -4040748 -8246990 -20390663 -34122113 -37586355
41804 -37586355 -33006539 -35011035 -47279481 -56527473 -54075346 -47192968 -41924409 -31105356
41796 -31105356 -10814537 5375103 3373437 -9584738 -14970464 -9003087 -4665349 -10804938
41788 -10804938 -21838224 -27559136 -23146958 -9581711 7626996 19926334 22264898
41781 22264898 18212853 14834565 14830838 17081391 20306838 21594165 16560476 6143520
41773 6143520 -2603095 -7546068 -15400089 -28007694 -34635130 -28344632 -20438193 -24666354
41765 -24666354 -34918736 -35379766 -27302930 -25894147 -31883273 -27558755 -5664802 16973511
41757 16973511 22906401 15117190 5377698 -3350067 -10804681 -8687404 8339184 28219296
41749 28219296 33149326 22735455 13120168 14358744 19655909 17507139 5441052 -9940622
41741 -9940622 -20091074 -20459913 -14009356 -8788680 -8155150 -5362786 6868973 23657478
41733 23657478 32119712 28094861 21377872 22408132 30067785 36002123 36076760 32920273
41725 32920273 29740863 26498357 22231567 17503628 12680786 5826022 -4372127 -13276703
41717 -13276703 -12228801 -73703 9635815 255149 -26952437 -49747463 -47877383 -25135462
41709 -25135462 -2911806 5021114 3699134 3711935 5900203 3956972 -3391210 -9907669
41701 -9907669 -10732408 -8064157 -6261591 -5257671 -2157774 2733348 5796100 6050440
41693 6050440 6917238 10267602 12746463 11318178 8839510 9184817 9801808 6194347 2699181
41684 2699181 9627692 26557131 36658032 24488160 -4874970 -31220728 -41449933
41677 -41449933 -39888852 -37080579 -35440617 -29573156 -17418102 -6310321 -6170398 -17674494
41669 -17674494 -29799268 -31039387 -21422331 -10387920 -4466538 -2364558 -2035109 -5347722
41661 -5347722 -12480178 -17878889 -16966117 -12531852 -9341311 -6569732 -1846503 549301
41653 549301 -6609870 -22110142 -35461319 -38653467 -33911625 -28845303 -28155358 -31167989
41645 -31167989 -33798549 -31435645 -22368548 -9555535 2085043 9805434 13644998 14909810
41637 14909810 15842877 18445328 21346316 20428675 14666188 7517028 -92019 -12410567
41629 -12410567 -29401681 -40786853 -37855136 -27230716 -23572263 -30847570 -40333946 -45613831
41621 -45613831 -48824565 -51478832 -49784067 -42013825 -32112523 -23578112 -17379682 -16852497
41613 -16852497 -25344236 -37457779 -42958198 -41764709 -43759328 -50403263 -49720545 -35798585
41605 -35798585 -19917272 -13165843 -10696516 -4988872 -2693627 -12535829 -25223999 -23794749
41597 -23794749 -10182925 -3353106 -10862760 -19245360 -16102657 -6724518 -2377007 -3778365
41589 -3778365 -3950298 294956 6568205 11663132 13504048 12048664 10320757 10582039
41581 10582039 9849133 5315992 2737117 9760952 20666540 19917503 4844801 -7473890
41573 -7473890 -3202228 9528675 14983219 13542120 17545529 28477632 33339863 24726832
41565 24726832 11965639 7530812 11049049 12956438 8813719 3200754 614480 -1929086
41557 -1929086 -10710927 -25442996 -36805760 -35993522 -25778667 -19023583 -25394213 -42013977
41549 -42013977 -57955356 -64620013 -60112613 -47600518 -33487452 -24836411 -23767387 -24544194
41541 -24544194 -19863328 -10518103 -5710928 -12275220 -25520222 -32995082 -27206508 -12585598
41533 -12585598 1341783 11166101 19465629 24175476 16299699 -6277364 -29282113 -36062546
41525 -36062546 -28539330 -23834410 -30423113 -38919140 -38596562 -31209896 -23472253 -17061159
41517 -17061159 -13205393 -16611331 -25574094 -27763647 -17096580 -6412492 -9962236 -20031159
41509 -20031159 -16983874 877193 14803257 13307672 5210976 1141366 -1421192 -6743685
41501 -6743685 -8772100 -1784858 6849268 6592390 2966 -2416694 394724 -933464
41493 -933464 -10884762 -22200748 -25119462 -16603621 60506 18608183 31659536 34423012
41485 34423012 28348873 18393288 7063845 -5394624 -16124387 -20419163 -18372748 -16007887
41477 -16007887 -17321814 -18480462 -13027919 -1319534 8388291 8777915 1442498 -5769338
41469 -5769338 -8767499 -11379091 -17318863 -21107965 -12823360 7547387 26288973 29723052
41461 29723052 18018163 2335714 -7640894 -9331306 -4847813 454277 -1079195 -13039125
41453 -13039125 -29144276 -39178238 -41070002 -41471413 -43613496 -41627681 -30692902 -17007158
41445 -17007158 -11440481 -15923902 -22278234 -23910812 -22706798 -22772598 -22448389 -16569179
41437 -16569179 -4621814 7164428 11872470 7696063 -2163903 -12617524 -18662608 -16796279
41429 -16796279 -7381988 4206316 10419768 6710140 -5397994 -19686947 -30036534
41422 -30036534 -35291018 -39567865 -46246597 -51883599 -49101286 -36502051 -22055084 -14066293
41414 -14066293 -12162505 -10812406 -8397825 -7561448 -8983160 -11112670 -14687370 -20304921
41406 -20304921 -21924452 -11621474 6904072 18539013 15708643 9591345 15002844 29474003
41398 29474003 36455458 27423848 12116978 5458641 10501835 17047865 14019094 1097218
41390 1097218 -11110030 -12356309 -4011255 3386599 4024402 2983327 5548908 6700599
41382 6700599 -1721937 -17312221 -29049200 -31530793 -29059974 -26016234 -22063008 -18109278
41374 -18109278 -17539769 -17768678 -9540833 8824721 23476216 19885025 1960508 -12304851
41366 -12304851 -13037959 -7931324 -8237912 -13039227 -12142781 -516126 15409120 25032269
41358 25032269 23688782 15355728 7724173 5179056 5227550 1658195 -7561655 -16235393
41350 -16235393 -16565026 -9848188 -6024257 -10155127 -14693137 -11286484 -6141855 -13459573
41342 -13459573 -33191689 -46693198 -40003685 -21879758 -9783417 -5095467 5878059
41335 5878059 29061482 52922733 62804304 55228926 36061680 13828878 -1712829
41328 -1712829 -3280687 5722254 12542842 9808567 4164127 6046509 16560501 29930398
41320 29930398 43186144 55376775 60425362 50168248 25985787 1328603 -9970393
41313 -9970393 -5327882 6974505 16666363 19111048 16614317 14167878 14520888 17849243
41305 17849243 24517678 33968966 40206800 34125472 14742778 -5662538 -13247648 -7754707
41297 -7754707 -977434 -1682517 -8096886 -15138011 -21851892 -28267759 -30111763 -22527177
41289 -22527177 -8074895 3709828 6276646 2838354 728628 678065 -3807767 -15183972
41281 -15183972 -25328978 -25664578 -20404921 -21327051 -29512491 -32337135 -22544061 -10385325
41273 -10385325 -8739970 -14132672 -13848270 -7040421 -5189798 -12080515 -16984915 -11269405
41265 -11269405 256620 10404616 21070045 34923595 44345888 40075806 26472489
41258 26472489 16850287 14878253 10933913 -2103832 -18697382 -29293667 -31836561 -30591836
41250 -30591836 -28775963 -26792218 -24694217 -22795346 -21256255 -20323466 -18853561 -12944617
41242 -12944617 -595133 11836169 14194122 6198051 -24828 4310996 12568972 12860936
41234 12860936 4924617 -1694887 -2767579 -2677065 -3628835 -2070416 2183444 2658763 -3989276
41225 -3989276 -12226426 -15748773 -15047859 -13189322 -10533385 -7838566 -8049574 -10053297
41217 -10053297 -7163991 2297501 9112316 4733985 -6498619 -13734362 -13266189 -8708880
41209 -8708880 -2871689 2288244 2425620 -3647034 -9547407 -10881524 -13017116 -18828088
41201 -18828088 -16409338 5447452 34585208 46752127 38082722 26991417 23086495
41194 23086495 16267456 1964702 -6250240 -1025219 2647643 -8261806 -21566804 -19307497
41186 -19307497 -6319295 903766 2586007 10485415 21818443 22264666 12684067 9954494
41178 9954494 19354797 26524220 20874114 8573326 -2967478 -16009448 -30518817 -36937898
41170 -36937898 -30311178 -19446587 -13248566 -8723335 -1035611 5035160 3705523 2485
41162 2485 2550422 9853093 12748499 6998382 -3548741 -13228461 -18466493 -18392830 -15755198
41153 -15755198 -14443848 -14145166 -11787708 -8879513 -10245909 -14030996 -11906593 -2282972
41145 -2282972 6200121 8359903 9192100 11450930 7932821 -5544199 -19884970 -25481128
41137 -25481128 -26123308 -29331769 -31605466 -26255101 -18822725 -20002880 -27341536 -28597462
41129 -28597462 -21429255 -15668892 -16104240 -16444314 -12307383 -8287401 -8713097 -10770826
41121 -10770826 -10005715 -5507212 1597771 7847398 6211893 -6381274 -20922810 -25219925
41113 -25219925 -20597887 -19421633 -26183869 -33006852 -34832581 -35345317 -34550199 -25407307
41105 -25407307 -9775636 -3377256 -13983645 -26019337 -19963898 685363 15244612
41098 15244612 13550755 4239884 -2417098 -6359677 -10741395 -14338169 -15369194 -15531510
41090 -15531510 -15796212 -13058757 -5108055 3823969 6109810 -920293 -11262311 -15809617
41082 -15809617 -12215032 -7867811 -10192302 -15013227 -10256008 7286857 25513872 31677838
41074 31677838 27869937 25908322 31100054 37997922 39585249 33849048 22990500 12547620
41066 12547620 9725680 15997143 22645836 20443130 12348061 8667793 10464857 7840731
41058 7840731 -2910794 -10341204 -2154414 17809307 33406547 33758737 22200880 10237639
41050 10237639 6556271 10323501 12800807 7227962 -2377688 -6115686 -2351162 -424344
41042 -424344 -6174322 -11973585 -7469581 5233636 15029521 17116798 16672409 19072956
41034 19072956 24889570 34185516 46943540 57612655 57678551 47253271 36949370 33642927
41026 33642927 30888421 19709378 3632328 -5318597 -3322467 1285763 1536025 1020171
41018 1020171 5289423 10027063 4984632 -11558824 -28827961 -36032630 -34163322 -31739222
41010 -31739222 -32197817 -31255897 -26101479 -20534283 -18387334 -17557482 -15291420 -14841393 -20235751
41001 -20235751 -27188782 -27135187 -19854831 -13975497 -13566607 -12350363 -4414254 7031064
40993 7031064 16388223 24153595 32319172 37124906 34057960 26300979 20910327 19584455
40985 19584455 19974241 22291675 26258128 25017747 12689191 -3289995 -8608908 -1643468
40977 -1643468 4670733 2749314 264289 5428479 14152639 19815270 25859563 38054640
40969 38054640 50807607 52565902 42057707 29816297 25158863 29084109 37529017 43697575
40961 43697575 39607829 24274351 8996704 5171362 7270760 -1721755 -26044092 -48468665
40953 -48468665 -50469840 -32930742 -10892269 5810601 19133637 33256386 45855454
40946 45855454 50033505 41956108 25942084 12270921 8327338 11579951 13648957 10959878
40938 10959878 7025804 3685656 -3295383 -15545757 -24225913 -18169525 857872 16954387
40930 16954387 15780883 -1527086 -20801318 -28273616 -20678122 -5158812 8065035
40923 8065035 13973151 16389766 23869782 40174919 58153517 65227035 56913057 43006921
40915 43006921 36949807 40171039 41803927 34194551 22388705 15156857 12645668 8612543
40907 8612543 637191 -8595782 -17270949 -24315179 -24900284 -14020637 4921362 21608569
40899 21608569 29354352 28460886 20285719 6017082 -8843539 -18406268 -26410390 -41875352
40891 -41875352 -61131036 -65487992 -44209123 -10784739 12202358 16858213 9867460
40884 9867460 -2901062 -18657550 -29302650 -25647919 -11141168 -111710 -253482 -5949305
40876 -5949305 -10106036 -12410309 -13002435 -8208168 1962380 10086183 11012914 8651105
40868 8651105 7351170 3432790 -7034035 -17643316 -18500289 -11080752 -6649104 -10076362
40860 -10076362 -14416125 -13393231 -10500290 -11317748 -14158062 -14950500 -16329595 -23606015
40852 -23606015 -33591890 -35844797 -26286804 -12751019 -4455481 -2007112 -1654212 -3890049
40844 -3890049 -11595638 -22209127 -27717598 -22283297 -6735571 12624141 26522344 27865433
40836 27865433 19934311 15758755 22060762 27686975 18519126 1471424 -956154 17306731
40828 17306731 34960876 32631291 19049511 14924136 21481319 22303623 11444020 1273360
40820 1273360 1261899 5356938 5645476 5062127 8558262 11689884 7577740 -643624 -3426071
40811 -3426071 1557144 6408628 2976152 -9148442 -24592621 -38512724 -49686108 -58183232
40803 -58183232 -60988944 -52560298 -32437157 -10016565 3411429 7069572 10056947 18404661
40795 18404661 28601464 34525250 34090976 27330565 15095150 2808658 -1643257 1693867
40787 1693867 3094845 -2907536 -8357900 -3561415 7839132 14245852 12737675 10423055
40779 10423055 10444696 6850360 -4466150 -18005236 -25864086 -27107664 -25832623 -23675149
40771 -23675149 -18314997 -7758452 6327873 18268985 20456156 8676077 -12118758
40764 -12118758 -29189151 -32239398 -22511746 -10378255 -4133023 -2568618 1201700 10289131
40756 10289131 20311489 25122942 23984634 21067593 19130623 16772433 12207742 6921038
40748 6921038 4409325 7034753 14257796 21654605 22312532 13478082 2221198 -851295
40740 -851295 4958009 9663761 8234649 8903126 18941086 29443213 25448810 7908982
40732 7908982 -6835455 -9726407 -8567766 -11402797 -12818838 -5308723 4684683 3399436
40724 3399436 -11191617 -27032066 -33906149 -33243656 -31351734 -30389130 -28648922 -24633954
40716 -24633954 -18246053 -11403826 -8842336 -14470436 -25422253 -33485577 -34006417 -29579498
40708 -29579498 -23673735 -15879256 -6269788 1378664 5722034 11858598 22240337 28231453
40700 28231453 20673319 6881057 4959538 18816726 30934391 26439351 13585248
40693 13585248 10058033 17077349 20766830 15833814 13133247 21601757 34865681 40624206
40685 40624206 34369750 19160383 -118213 -17125993 -26005646 -28293020 -31196249 -34285846
40677 -34285846 -26535988 -3888898 18914454 24452966 14121888 2176875 -5816036
40670 -5816036 -14349979 -21280554 -17179316 -3806893 3083753 -3899466 -12351314 -9796506
40662 -9796506 -2667997 -3875421 -10892440 -10465517 61859 10763702 16818934 23831652
40654 23831652 33553232 37544639 30717908 20921389 17542926 17934956 13561000 4865960
40646 4865960 857711 5069118 9895956 6547512 -4421641 -14365928 -15195956 -5865723
40638 -5865723 6902472 13710472 11172749 6258545 9137734 21046969 32678929 35867063
40630 35867063 32789791 30733490 31538634 31094193 27400798 23530983 22034405 20967107
40622 20967107 17346438 11619819 6977402 6271641 10647560 18885841 26842340 29864296
40614 29864296 27489514 24022440 22846995 21573995 14415780 -1173193 -20595587 -34087655
40606 -34087655 -33674554 -20740860 -6077983 751708 1284792 3292090 7627809 7362787
40598 7362787 928143 -2970387 1945732 10238908 14843818 18733048 27210583 34569669
40590 34569669 30163941 15258873 2215264 -2819796 -5227278 -8782480 -8594595 -1101758
40582 -1101758 8398261 13488754 14809333 15811265 16446062 15235474 12191534 6620912
40574 6620912 -1966433 -8434945 -5474786 3771858 5373442 -7138885 -22398857 -26572639
40566 -26572639 -21732612 -19903630 -24696034 -29156040 -28519579 -25020536 -20985961 -15449033
40558 -15449033 -7642006 2066877 13574169 24388707 28549392 24192096 18875841 20613439
40550 20613439 26897204 29632788 26830653 21052253 10931273 -4718006 -17444309 -16583520
40542 -16583520 -5834132 -144636 -5084117 -11442301 -12244881 -12247779 -16157661 -19301273
40534 -19301273 -16136324 -8287273 1545238 14168014 26598822 29993649 21953004 12063384
40526 12063384 7848508 3869580 -7237585 -21585178 -31165898 -36125623 -39474323 -36765034
40518 -36765034 -23271831 -6789102 -1046340 -8584003 -20206132 -28321631 -30398303 -22892235
40510 -22892235 -4712967 14218409 20685422 15650062 12577867 16714570 17673120 6087993
40502 6087993 -12938834 -27703595 -32369819 -27183739 -14898286 -2427842 1399740 -4095851
40494 -4095851 -9012315 -5488830 2119049 3919500 -3524379 -15648203 -25273366 -26173637
40486 -26173637 -17149408 -6409623 -5429983 -13690201 -16515152 -4517621 11776746 15649221
40478 15649221 7324821 2336517 8408505 15363658 10859742 -2585537 -11785452 -9599561
40470 -9599561 -2162493 -259144 -6418087 -11275182 -2707589 20983844 47376061 60257128
40462 60257128 53713694 36263896 22406723 20279572 25836710 28338913 22244788 12433374
40454 12433374 5610602 -330457 -12051638 -26983958 -32997994 -25131185 -14143473 -12303144
40446 -12303144 -17716014 -20772104 -20511387 -24260254 -33186679 -38556748 -33540885 -20866574
40438 -20866574 -7062369 4201970 11129802 12312197 8951596 4031793 -2629528 -13942884
40430 -13942884 -28291841 -37693053 -36569106 -28960935 -23572242 -23628032 -24510070 -20530047
40422 -20530047 -11976680 -5079174 -4898311 -8379556 -6661590 3954124 15926407 18652283
40414 18652283 10653505 -136871 -5850401 -3612958 6317926 20327818 30448566 31477897
40406 31477897 29470016 34694549 44501864 43001660 22874800 -1323543 -9830874 -1810511
40398 -1810511 6539225 5113409 1157856 6157963 19444243 29301556 26905802 15319026
40390 15319026 5465171 5622259 15379206 28231580 37369746 38032367 27972490 10601864
40382 10601864 -3566562 -4969751 4075478 12100084 13925736 16417611 24710165 30430805
40374 30430805 22544185 6046447 -737165 11352635 30822235 39793203 33562967 21366125
40366 21366125 11894591 4413656 -5546935 -16356551 -19720071 -10112737 7162825 19420471
40358 19420471 18464248 7644762 -3495075 -9773156 -13745406 -19498071 -25702202 -26499626
40350 -26499626 -19217876 -9581516 -6621233 -11512640 -14626567 -7128996 6538741 12766945
40342 12766945 5119654 -8496782 -15752137 -12049514 -1802384 6747731 6012863 -5476421
40334 -5476421 -18606375 -20343184 -9020225 2562744 3985539 751138 3952206 12089090
40326 12089090 13098096 2388739 -10796083 -15572387 -10251891 -113909 8666457 11512299
40318 11512299 8140515 4405907 6098083 10002907 7139127 -3735926 -12281140 -8909532
40310 -8909532 4450840 18653946 27194028 28725189 24825145 19190552 15168805 10689905
40302 10689905 -237836 -17374322 -30441928 -31095831 -25034675 -24914169 -32365308 -34761924
40294 -34761924 -21813158 964370 19464531 27370867 29672434 31719963 31935914 27942088
40286 27942088 24216399 27501175 36282701 41072009 36175220 26191973 19012025 17088767
40278 17088767 18500088 22390080 29307320 38636808 48717641 57159908 59456664 51834365
40270 51834365 38250350 29001324 28085375 27787884 21272065 13822615 13559207 17171338
40262 17171338 15481942 9002738 6246378 9171988 12936889 18885649 33529272 52845017
40254 52845017 62009701 55891697 47438654 49220902 57277396 60134001 54171339 42858577
40246 42858577 29889026 20954896 23934587 38603276 52863676 57033141 55252914 55370722
40238 55370722 55365772 49109111 38695239 30537418 24107067 14449334 1942920 -9173086
40230 -9173086 -17518402 -21561609 -16012645 -1202310 10249676 8193033 1046051 3539889
40222 3539889 12538289 10869496 -5641146 -20867015 -20276271 -6121006 12080647 28281703
40214 28281703 36333983 28794391 7026244 -16025613 -28605377 -28510991 -16903309 4970628
40206 4970628 28793535 41494992 42162559 45934745 62198394 78505486 76610152 56868353
40198 56868353 35426795 22644084 15777448 9682026 3320544 -3610320 -10683532 -12663796
40190 -12663796 -3532375 13778230 27711103 29830736 22401988 14190523 12376576 17977323
40182 17977323 25472112 27598976 23748322 22050623 29365489 40906770 44451461 34537326
40174 34537326 19039164 11953983 21670065 44400601 66635878 76434181 74896365 73655116
40166 73655116 79186908 85336970 85718181 86512346 98275793 119237093 136735760 143746498
40158 143746498 144548679 144791033 146159698 151665991 165169373 181987267 189927419 185266897
40150 185266897 179511985 184059300 195661271 204597479 210482955 220109245 233505096 242881382
40142 242881382 245099608 245761634 249037533 251175862 247414877 239654160 233762913 233417624
40134 233417624 239380535 250520609 261970988 266211387 260726339 252157128 248176038 247327592
40126 247327592 242769975 235316728 235246326 247965609 263784848 267914512 258037157 245754274
40118 245754274 241062334 241965120 241712436 240138437 241909619 246462742 247170320 241815555
40110 241815555 237615244 241571345 249796512 252289825 246873466 241672729 242278369 243065489
40102 243065489 236158179 224479173 218743251 222866285 229888863 233515555 236091726 241060633
40094 241060633 243959620 237744822 223682589 210011480 201640072 198403706 202597722 219061181
40086 219061181 244775869 266321616 273570551 270925399 268929749 268974972 264289835 254359413
40078 254359413 249070768 255777858 269145686 278384750 279704587 276142697 268757515 255732965
40070 255732965 240166463 230876835 231390266 233172656 225574337 210512100 201741078 209466158
40062 209466158 230048628 251418270 264221369 266169834 259859352 249839436 240004847
40055 240004847 231451620 223688430 217876263 215579890 213645696 205149787 188247211 169961058
40047 169961058 157920710 152559444 151235782 154705233 163056324 169364288 165687220 153875483
40039 153875483 142827372 135946277 129121132 120619610 113979585 109722179 103308530 94657048
40031 94657048 91275821 96858678 103679645 102369016 94082159 86739578 82881047 77488970
40023 77488970 66220699 51197608 39532131 38490575 49671472 65561510 74823596
40016 74823596 73420412 67257458 62044385 55865874 45623789 35344137 31528802 32842866
40008 32842866 30644553 19561132 3783246 -6869738 -5335735 6533945 19016148
40001 19016148 24501642 26722519 34964772 48686600 56267651 52465137 47401039 50913159
39993 50913159 56771749 52944202 41177324 34022234 35620356 37860292 34866300 29712555
39985 29712555 26028480 23681905 24372859 31268495 40683259 43782132 39303963 34958740
39977 34958740 33171335 26511392 13038970 5271152 14226253 31910931 40569803 35696638
39969 35696638 29576034 32931603 42422420 48130354 46196516 40386019 35470063 33073354
39961 33073354 32342884 31387094 28090090 22135221 17407206 19898656 29839858 37154748
39953 37154748 30452455 12294224 -680723 2696320 14388564 19903286 19180766 23873443
39945 23873443 36004380 42411082 33568477 17037763 6734297 7280426 14594493 23966568
39937 23966568 30561392 28710122 19060554 12218440 17683163 31971168 43766441 47329337
39929 47329337 44560573 37927396 29357291 23565748 24249234 28170040 30316635 33072334
39921 33072334 41664173 51793950 52428816 42451242 33731627 33364470 33184133 24286332
39913 24286332 13138472 12490405 21321366 26081034 21025726 15121231 15512657 15138551
39905 15138551 4137679 -14085678 -27713272 -33377073 -37862677 -43614122 -43073219 -31051984
39897 -31051984 -14584229 -4515975 -2139668 99118 7665682 18730773 27647526 29416245
39889 29416245 23060258 14628921 14021217 23955703 34514494 33907572 22656734 11683595
39881 11683595 8276177 9990220 11035908 8223603 1083199 -7828309 -12941308 -11348277
39873 -11348277 -7408526 -6248408 -5147700 1409734 10876671 16132069 17776248 21792821
39865 21792821 25761342 20558412 7482121 -350611 1958241 3611618 -2779746 -8530899
39857 -8530899 -4737282 1829998 549867 -5515459 -6549455 -2011841 3037600 9729157
39849 9729157 19397522 22627458 10387432 -7549222 -11141029 4273654 25001713 39803787
39841 39803787 48228692 48971107 37669885 20122226 11819077 18117765 27894871 32265641
39833 32265641 35644761 40919222 38207944 20487358 -4765 -4653103 7719046 21480413
39825 21480413 24846157 19404191 11669832 5697407 4425692 10193676 21889805 35511340
39817 35511340 46911097 50852602 41143283 18343385 -4653146 -12461610 -3538886 9147095
39809 9147095 14761803 15950854 20769286 28255385 27610265 11553582 -13196626 -31105919
39801 -31105919 -33028613 -24368630 -17317299 -17148028 -18971887 -16740245 -10917775 -6065758
39793 -6065758 -4688724 -5929827 -7822604 -8372350 -6161984 -2210192 -336081 -3942379
39785 -3942379 -12317665 -20008445 -19735213 -8389517 7334637 14362224 7659055 -735687
39777 -735687 5542555 25818476 42887775 46707935 46599678 53563269 60898213 53882530
39769 53882530 32900926 14010210 7785396 9331272 10265657 9301895 7262891 1729899
39761 1729899 -6878534 -11209425 -6323686 1721664 3918503 1429576 2870742 10307772
39753 10307772 16399694 16222744 13731490 12837008 8844855 -4664640 -23517005 -34538935
39745 -34538935 -30326559 -17945645 -11068495 -16026190 -27382313 -35650922 -37336127 -37202409
39737 -37202409 -41435844 -49629149 -54875094 -51688287 -41494322 -29440827 -19111026 -12784395
39729 -12784395 -12893349 -18156944 -20967211 -14957529 -3895976 3415468 5627219 8013996
39721 8013996 10139458 5621777 -3443078 -4254321 8201463 21793990 25112734 24117660
39713 24117660 29707438 38273242 39133708 34342926 34190531 36424733 28149201 9344254
39705 9344254 -2794472 2586317 16730401 26548268 29157125 25035821 10879674 -11112622
39697 -11112622 -27814282 -29334265 -20866064 -12430857 -5445963 1915091 5156419 522891
39689 522891 -4734748 -533875 11317165 20104172 20734412 17064405 14283039 15819172
39681 15819172 23913022 35170292 39246954 29924695 13894025 1276769 -7389016 -16203806
39673 -16203806 -22296872 -20931553 -17935342 -23723543 -36293215 -42958807 -39235549 -33582596
39665 -33582596 -31734778 -28485257 -18732697 -5998714 5015907 15478164 26443890
39658 26443890 32695424 28259779 14134695 -2600648 -13630495 -12431082 1709252
39651 1709252 20506246 32469327 33747300 29334958 24092520 18795426 14969255 15873893
39643 15873893 20829136 25203843 27522470 29940529 31052972 26805193 20469987 21905859
39635 21905859 32189736 37872064 27490010 7532010 -5264030 -3590971 4655984
39628 4655984 7677685 1594376 -7984465 -12999341 -11505097 -8581580 -7013261 -1249289
39620 -1249289 12306986 22569714 13526113 -12099254 -31961689 -31912767 -22586658 -20775948
39612 -20775948 -25884812 -25796061 -17200586 -7122635 624074 7751811 12438753 9397629
39604 9397629 -572205 -9417932 -10683993 -4059136 6697847 14370722 10555766 -4583687
39596 -4583687 -17476028 -14512409 1449249 15542177 18958917 13798517 3504678 -9570127
39588 -9570127 -18268155 -15753897 -8653346 -12118019 -27271230 -35958806 -25139761 -5389969
39580 -5389969 4923504 5234418 9810425 23553980 34737891 33653872 26979096 26936659
39572 26936659 32483261 29802060 11337399 -12243927 -23018055 -15849414 -2234416
39565 -2234416 5815848 9260772 15317311 22651783 21551074 8341469 -8226850 -17612639
39557 -17612639 -18612650 -16198067 -11974152 -3081878 11276871 26944378 38621523 43636011
39549 43636011 41588183 33051492 20556476 9544724 5091072 6150346 5810863 996009
39541 996009 -102111 13087021 36357458 50522500 43017300 22819749 7376107 1212315
39533 1212315 -3620252 -11477385 -19176377 -25131867 -29803772 -27981255 -14225649 2812305
39525 2812305 6180672 -5109229 -12289652 -4255162 5763617 1307818 -12878901 -21463359
39517 -21463359 -22768684 -25346176 -27128177 -17178090 2711730 15946173 14047378 7328882
39509 7328882 8002398 14934894 20890091 24008108 24872606 20868710 11651061 4555628
39501 4555628 7116246 17475824 27546707 32618414 33544283 32609220 31419027 30609870
39493 30609870 28987354 25822504 25600608 35563648 55192939 72629873 75820143 64168436
39485 64168436 46016992 28428556 13293541 -2070 -12513372 -24217418 -31536711
39478 -31536711 -29139314 -17076654 -3194033 4115915 2538434 -5806033 -16815090 -22792351
39470 -22792351 -16043438 405509 12589163 13193259 12885420 25014613 44501940 53670207
39462 53670207 46875950 37079940 36549892 41793735 41618200 32325434 20347196 14497187
39454 14497187 18446474 27392212 31271118 24737263 13165014 4709504 -673512 -7652768
39446 -7652768 -14355121 -14662617 -10249140 -8879876 -10126105 -5261764 5837056 10972940
39438 10972940 4563025 -2326294 820881 7940320 7760476 1747823 -949290 814930
39430 814930 1739547 1831745 4159671 4601919 -3682804 -17314747 -25583490 -25193028 -21555825
39421 -21555825 -16695418 -7234444 5736706 16375786 24807733 36783444 50287943
39414 50287943 53635929 41360908 23152145 12657304 14441242 24315948 34307781 35143995
39406 35143995 23519140 10267716 11216284 25669260 34904605 27780179 15782361 13656012
39398 13656012 16759080 10850003 -3901537 -14008025 -13642421 -9165349 -3361877 9769220
39390 9769220 30885948 48307769 51479388 43466565 34528287 29358188 25684844 20678113
39382 20678113 14141278 8682469 9295335 18136331 27124818 22257732 945537 -20116520
39374 -20116520 -21917754 -5272471 11547070 15482636 9778039 1802610 -8947870 -24013053
39366 -24013053 -35641899 -34244589 -23099742 -14593392 -11619893 -4003178 13152365 28917300
39358 28917300 31896563 26610740 23864042 22247169 13442187 2162542 3579580 18236368
39350 18236368 25735957 11231437 -14614232 -31947428 -37084224 -39210244 -40165613 -33009603
39342 -33009603 -17913757 -4808366 1122015 4747806 9461782 10975676 6394186 465040
39334 465040 -1668006 -470321 3147408 11092927 21067322 24009105 15736310 5319403
39326 5319403 4156023 11313446 17814940 21124040 24907082 26361912 16382595 -4396576
39318 -4396576 -20528010 -19581510 -7824823 -499301 -1775406 -3270913 466320 5161783
39310 5161783 6281438 6219440 8443614 11213460 11571401 10528268 9897298 8571029 6826378
39301 6826378 10040021 22128396 38275667 49964412 54189938 51432175 38767745 15309805
39293 15309805 -6595661 -8018563 13929537 38960906 45330278 32638697 17071279
39286 17071279 9268328 4579087 -6399814 -23868737 -36688663 -32723794 -12250133
39279 -12250133 9266030 15708837 8073764 2141904 7224413 15119479 14487560 7841595
39271 7841595 5872358 10242340 11976392 5482869 -4372238 -9692762 -7539174 459162
39263 459162 11276178 21574900 28304889 29015290 21666390 7508454 -4580916 -2630296
39255 -2630296 14813630 34419383 42649446 39666633 33137353 25064574 14053026 5026527
39247 5026527 4261294 6593595 -50733 -16506272 -29793676 -30629927 -23327982 -15736466
39239 -15736466 -9567013 -4858663 -4630644 -9082562 -11824633 -7287956 2867151 13896073
39231 13896073 22883735 26942762 23569619 16916116 17267694 29265600 45309726 54347821
39223 54347821 52565602 43043025 31286057 24225928 26309978 32154798 30254416 18870118
39215 18870118 10450182 14205789 22829574 25173095 24252615 30946428 44793158 54331005
39207 54331005 55261475 55273179 58792658 58807321 49153672 35880032 29276331 30424634 33087662
39198 33087662 35427148 41543182 51279334 56226306 50083691 38570461 33112358 35876127
39190 35876127 37358220 30239674 19310866 13614577 14525443 18304394 25996383 41350341
39182 41350341 60143613 71493328 71522955 67488713 66540955 68909394 74361008 85269764
39174 85269764 98492265 103959702 98355874 91924335 93821992 98283459 94549424 84223799
39166 84223799 78307945 81109585 87415304 93174024 99364766 106558557 113886984 121993002
39158 121993002 129998339 132888999 129938699 130596096 140433481 145705276 127904596 93924392
39150 93924392 74394373 86181234 111754832 124888326 123313796 122710072 128134573 128460025
39142 128460025 117136201 103559049 100561527 110521067 127399623 144420617 155137008
39135 155137008 153518175 139645969 122761734 113469773 113802652 118379165 123522955 130299156
39127 130299156 138779707 144932452 145670907 142921597 139411739 133755913 123855722 112425087
39119 112425087 103798402 96848513 87218675 76066285 69305664 66652778 59197998 42389261
39111 42389261 25432444 21731344 33394322 50538792 63267928 69028220 69888848 67988944
39103 67988944 64094686 57749478 48723216 38958047 31014058 24343937 17224147 12943895
39095 12943895 17532069 28767287 35230574 31376072 25764872 27231108 30780272 27295028
39087 27295028 20652608 22205715 31584333 36901358 33929117 31619270 36354228 43568351
39079 43568351 49359321 58129245 71278088 78116597 67534430 43038751 17883831
39072 17883831 -681953 -14436137 -24390455 -26825864 -20335897 -10795342 -6013634 -7408142
39064 -7408142 -9163825 -5452242 2920573 9965711 11204895 6048089 -5427953 -21717601
39056 -21717601 -33753834 -27983071 -3429896 20039769 21018969 1884930 -15255307
39049 -15255307 -16259062 -6842628 3263647 13802029 26184602 34468110 33392815 27819130
39041 27819130 25156671 23417748 15185024 423176 -12245357 -16227580 -13763488 -12257932
39033 -12257932 -16299710 -22060079 -19131609 -1921949 19826783 27893104 16040012 -2034646
39025 -2034646 -9179659 -3784611 2521659 1068956 -6163746 -12013406 -11584384 -5582476
39017 -5582476 248966 812306 -1264196 2069456 12571828 21352498 20124838 12172807
39009 12172807 7550555 11320410 20827957 30492842 34903821 31624210 25752948 27088688
39001 27088688 37537359 46327817 43793655 34508931 28997722 27496979 22254241 13389717
38993 13389717 10858317 19047065 28998729 29808643 21358771 12197453 9482293 13989758
38985 13989758 21247606 24641476 19827110 8465671 -3108491 -9041884 -6920892 2394911
38977 2394911 14806595 24314034 28193369 30046310 33858427 36191065 29692173 14941914
38969 14941914 3174731 4147960 14610756 22076969 18579831 8334706 2605285 8904085
38961 8904085 24943120 41268091 48766717 44713721 34145557 26884334 31193234 46709883
38953 46709883 63136164 68690128 60998745 47928213 37643930 30845795 23836953 16130237
38945 16130237 12244228 16428568 26770994 35195998 34985673 28930711 26702993 31740548
38937 31740548 35243616 28243245 15271246 8433505 10892486 15241830 16322496 15102033
38929 15102033 10429171 -675743 -12238366 -11366680 3749307 18398939 19514454 9860094
38921 9860094 -745353 -7794369 -9673839 -3773373 7450505 16353479 23050745 37441417
38913 37441417 60352297 75212133 69362850 51775013 37114058 24322721 6616903
38906 6616903 -8104748 -6128868 8936384 20592407 23716044 27361700 36015688 44822405
38898 44822405 51779690 58404099 59496494 48440558 32028822 24159947 25464425 25013864
38890 25013864 20621535 19634712 20806188 15774755 9406233 16219766 32462186 35335958
38882 35335958 18570996 5926031 16366409 36041896 41018829 31055930 22501950
38875 22501950 20542248 18224212 15363939 19811224 32793313 47415780 59859958 70585707
38867 70585707 76799252 74564899 67273454 63153572 64832396 67348302 64671390 53513935
38859 53513935 33943876 10813760 -8494356 -20508651 -25827374 -22956075 -10707245
38852 -10707245 2052536 1191387 -13380108 -25402101 -25644707 -24543409 -32729352 -42343875
38844 -42343875 -39948354 -26828041 -13099186 -1407979 9459050 14005623 9017887
38837 9017887 5839125 16732243 33870915 38667023 28558831 17517169 11970853 4308779
38829 4308779 -8442268 -16779982 -14156907 -6201870 658062 7742072 15754171 18588006
38821 18588006 12379691 3267976 -120245 2766632 5427394 2238784 -6985840 -17287053
38813 -17287053 -22462732 -21013018 -17177828 -14115923 -9957881 -3962564 -569891 -1615174
38805 -1615174 -1135227 4668591 9617759 8869429 9524921 17391227 21546206 9121021
38797 9121021 -9880491 -12262162 5020922 21184584 23051798 19639783 19923412 16416845
38789 16416845 1428293 -16856996 -26922105 -29818305 -30819110 -26765048 -14305430
38782 -14305430 -934376 5676700 12044487 29199265 53669681 70763099 73681085
38775 73681085 67983881 59425841 48705833 37853885 31400348 29336005 26380955 19989011
38767 19989011 13524059 10532289 10638947 11832370 12811465 12535090 10548815 7879719
38759 7879719 5434958 2495608 -910938 -1646724 3665967 13959388 23471392 25388029
38751 25388029 16027386 -1136409 -14936190 -14999121 -3663637 4873202 993576 -8515652
38743 -8515652 -9500487 1484050 13087313 12365913 -1410454 -16020932 -17781300 -4807583
38735 -4807583 10443511 13769650 4376939 -5717840 -6823658 -261886 9047796 20649258
38727 20649258 34121529 43217548 42374569 35935199 32978846 33789724 29061954 14417874
38719 14417874 -401161 -1534866 11682229 23829564 19809311 2292349 -11132364
38712 -11132364 -9123256 384248 3162966 -385691 2409852 13641322 17331141 1884401
38704 1884401 -19710568 -23976288 -7675057 7711298 3921558 -11939014 -19080346 -9938570
38696 -9938570 3891153 11297046 16945151 31160758 51193819 63135017 62067327 59160281
38688 59160281 64163037 71038100 69758381 64365439 67040515 78288128 86136466 84197397
38680 84197397 77930593 72103547 64543359 54859757 47178473 40428737 27876771 11091114
38672 11091114 2223295 6264695 13328379 16200583 22500521 38264093 51097583 44274945
38664 44274945 20242814 -4180614 -20650891 -33053248 -42531642 -44682761 -41752283
38657 -41752283 -42985485 -49307001 -49055890 -33716879 -9751606 9305368 16224210 12471111
38649 12471111 3068760 -7209389 -16019973 -24427233 -33960953 -42499035 -45229881 -39212636
38641 -39212636 -25410248 -8203230 5595183 11176413 11869406 15973401 24005201 25466172
38633 25466172 13894863 -1513821 -7161760 -2440064 2664715 2138036 -3676933 -15566643
38625 -15566643 -33600293 -49947456 -54759386 -48489466 -38842000 -27917667 -13693228
38618 -13693228 -1884945 -2155306 -11562847 -15664106 -9240289 -3074428 -5777091 -11176913
38610 -11176913 -9738962 -1796969 6915221 13227691 13876683 4854266 -9058046 -13237187
38602 -13237187 -589015 17155650 24056538 19250322 12520894 6872155 -2829359 -16202558
38594 -16202558 -23749497 -19063121 -7577253 -557770 -4110603 -15185993 -25644509 -29564433
38586 -29564433 -28010595 -26639580 -28692678 -32216479 -34038268 -33193659 -29962183 -25389997
38578 -25389997 -22738108 -25408384 -32226427 -38316979 -40651728 -38208847 -27913034 -8266444
38570 -8266444 12164107 19144910 9547337 -4103111 -10234289 -11592547 -16504964 -24464872
38562 -24464872 -28173268 -24975786 -19036878 -15249220 -15925127 -19452081 -18158668 -3674030
38554 -3674030 19880350 34422990 26946736 4964583 -13880237 -21817833 -22742505 -20499720
38546 -20499720 -16206761 -13483241 -15201258 -16324820 -9479159 3449183 13828517 18480066
38538 18480066 20395860 19707229 14382820 8345186 7617316 9120848 5287599 -493235
38530 -493235 2902088 13679354 15133963 116402 -17014299 -21388115 -17115393 -14672198
38522 -14672198 -11219516 1233720 16337651 19522149 10807442 5242872 9786997 14290212
38514 14290212 8780568 -3188024 -13853899 -22922998 -32700095 -39840429 -39835990 -34176724
38506 -34176724 -26317758 -15690679 -2755954 4781650 -503058 -13994691 -22455100 -18521974
38498 -18521974 -5849443 8132263 17062609 14934919 547000 -15413659 -17041683
38491 -17041683 -1559469 15949743 20775411 15058731 10729970 12481817 15378833 15204582
38483 15204582 12943800 10593926 9386662 11245078 16190924 19491738 16993163 11724657
38475 11724657 9183966 7898572 2012042 -7560654 -12589608 -8953000 -1297480 5063647
38467 5063647 10024530 14799388 18700879 21687829 24359421 24650671 21053612 18931238
38459 18931238 24708394 32962849 30268743 15087112 2068867 915864 3031460 -2334609
38451 -2334609 -10436884 -11335769 -7661283 -6929507 -3232129 15145107 41269775 51086085
38443 51086085 34082491 7971844 -4606043 -3012709 -3294696 -13616064 -25488386
38436 -25488386 -27271743 -17906667 -5705577 1435004 1402540 -4692627 -15840326 -28533718
38428 -28533718 -33336501 -21559431 1460591 16093636 7813374 -16208590 -35113426
38421 -35113426 -35594951 -19994846 1677912 19437223 26552004 25199323 28117857 45194855
38413 45194855 68138032 77546251 66167236 46452320 34108386 33600605 41624823 54042773
38405 54042773 64233946 63304635 48684342 27906325 10435890 727117 325784 8459912
38397 8459912 17796495 18736306 12062285 8328250 10544416 8412778 -3746859 -15190107
38389 -15190107 -14767151 -7953946 -5219752 -2664339 9951481 27840112 35480213 30535506
38381 30535506 26273951 28959070 29880329 24194291 21044247 26542128 30905119 23937681
38373 23937681 12482608 9457523 13069460 10902203 624517 -7437636 -7760073 -6480794
38365 -6480794 -8542696 -9788289 -6763881 -4516809 -7571263 -10470929 -5602491 4287546
38357 4287546 10210620 11331823 16369956 30081019 45981754 54764009 53743197 45070405
38349 45070405 30394111 12060022 -3965199 -11309692 -8298690 2228686 15472536
38342 15472536 24986402 24883470 15997066 6433562 1758543 -1284291 -6233018 -7946002
38334 -7946002 -1361290 4786041 -4444584 -28198694 -47363911 -47418407 -32855956 -14703140
38326 -14703140 3868847 21264915 28398913 18880056 1744498 -8932124 -13149614
38319 -13149614 -20765030 -30717724 -29243549 -10740568 12856070 28234849 35170145 38954510
38311 38954510 38412807 29895905 16721286 6399182 2333332 4491380 13767207 28559555
38303 28559555 40749545 43144765 39245723 38250149 41216006 39496310 27307776 9037776
38295 9037776 -7432070 -18634793 -24531693 -25059140 -21191595 -16186423 -13011292 -12728843
38287 -12728843 -16411516 -24800320 -34063340 -36095247 -26702480 -10897967 3144267 12815210
38279 12815210 20187544 25075141 24291466 17701641 10570297 8439840 11878969 16822932
38271 16822932 18393999 14665473 8665409 6151465 9087531 11928010 7146249 -5854031
38263 -5854031 -20169697 -29300671 -32197873 -30570373 -25629753 -19282877 -15114011 -15493549
38255 -15493549 -19080994 -22362349 -22406060 -18267685 -11955029 -7510584 -6080199 -2963869
38247 -2963869 5711400 14305669 12815045 2114786 -3835821 5087599 23255593 39330270
38239 39330270 50741314 60655231 67057765 65107461 57144137 50207685 44760621 35293135
38231 35293135 21801734 11173433 6266985 2892297 -454736 720687 6749748 8887647
38223 8887647 240900 -14376897 -24886037 -27788942 -27058735 -27067258 -28741475 -29758727
38215 -29758727 -25795547 -15092671 -3850986 -2310559 -12459288 -24271647 -27515205
38208 -27515205 -22911184 -18272840 -18211285 -21569910 -24940384 -24815788 -19685231 -12672315
38200 -12672315 -7837085 -2183248 11607378 30926145 40374261 30454251 12345976 5179484
38192 5179484 13298950 25082366 30311167 28688380 23381650 16655084 12270552 13206864
38184 13206864 15583697 12180923 3010054 -4479300 -6341594 -5864000 -5046427 -244581
38176 -244581 10176315 19925247 20925854 12100273 -651235 -10518515 -14161102 -12484645
38168 -12484645 -8206668 -1590674 9582272 23284469 30360427 24363781 11591177 3741863
38160 3741863 2260979 -885327 -7147970 -7406080 2321251 11793226 10582425 3826484
38152 3826484 5094160 17171373 28259638 26911716 14904983 4295142 4686183 13899547
38144 13899547 20151588 14187343 -690732 -12763540 -15486417 -12781688 -10490576 -8530945
38136 -8530945 -4498745 340631 3509450 6274545 11232591 17275414 21748159 26040350
38128 26040350 33745260 42821552 44161657 31007311 8739955 -7512955 -7193806 4217281
38120 4217281 11379973 8078753 5138681 14607453 30930333 37111020 28064902 16508414
38112 16508414 13126998 12605280 6266299 -1541151 -786567 6154524 6100994 -5884629
38104 -5884629 -19395458 -22604110 -15265178 -4690685 4743701 13084372 18981106 17395933
38096 17395933 4097287 -18460138 -40112763 -49086854 -41135763 -22981862 -5869523
38089 -5869523 3891910 7282087 7114977 3177632 -5850216 -16560209 -19487921 -7125018
38081 -7125018 15375214 31065557 27224053 9138471 -6580797 -10944422 -8870619 -7765857
38073 -7765857 -8772969 -11715810 -19619879 -32404903 -42675826 -44422350 -41053127 -38655824
38065 -38655824 -36343919 -30573231 -24452355 -23528685 -24383172 -16979227 655210 17700095
38057 17700095 22806720 16028494 6886688 4609029 11453807 22107679 28111430 24662935
38049 24662935 13685989 479130 -9762921 -11410388 -300119 19237842 33951225
38042 33951225 34244204 24033445 13068084 4315329 -3978617 -8945504 -6289291 -582983
38034 -582983 -1456746 -9232261 -14283282 -11953650 -8574702 -10273717 -14617441 -16690991
38026 -16690991 -15876440 -13078566 -7680104 -432325 5914098 10458251 13293541 11410189
38018 11410189 3266160 -3410264 742577 10110992 7644597 -11180011 -30813368 -38026593
38010 -38026593 -38368816 -41094395 -40956623 -28979337 -12002765 -5306101 -9862342 -11482852
38002 -11482852 -1173695 15922751 30683526 37376730 31818172 14551063 -2901969
37995 -2901969 -6196534 4859835 16597214 20140746 20013717 22193919 24210379 21537504
37987 21537504 15111116 7745026 443071 -3759711 -203880 8213437 9754051 -2223302
37979 -2223302 -19883720 -30823962 -31676438 -26950165 -21242404 -19245759 -26616709 -41589224
37971 -41589224 -50342245 -41119399 -21180350 -9617449 -12885415 -17076952 -7627937 11138902
37963 11138902 21586518 13658355 -5140483 -19432669 -21355996 -14777757 -6321240 3386951
37955 3386951 16045781 26110930 23262978 7539504 -5900605 -4498100 4583877 4416637
37947 4416637 -7799738 -18024239 -16474205 -9186099 -4372388 1534203 15842367 34918132
37939 34918132 47258660 48063522 42272224 34234193 22066392 3691081 -16595888 -29890907
37931 -29890907 -29713963 -18002179 -5402948 -2938468 -10632447 -17088074 -13243994 -2851126
37923 -2851126 4688980 7240279 9246591 11910401 12429204 11386250 12232761 13591829
37915 13591829 10611660 4413040 1057385 -242173 -7603120 -21622336 -30481238 -26140711
37907 -26140711 -16330845 -12458751 -13251578 -9835892 -1341193 4726834 4099772 -1923853
37899 -1923853 -13081070 -29237935 -44268971 -50530630 -49302235 -47780653 -45742952 -35091972
37891 -35091972 -14349090 6201780 17628590 22468906 27284353 32054935 32165417 25802325
37883 25802325 14636196 1158253 -10739712 -16157693 -13728735 -7228693 -1109387 2181054
37875 2181054 665551 -4864428 -6289236 4941669 22574128 27270134 11266602 -7417160
37867 -7417160 -6506088 10609970 19916384 10089374 -3622949 -2625390 10418706 18858531
37859 18858531 16080321 11259516 13357920 19989456 24936099 28356521 32962465 34946016
37851 34946016 27808560 14852756 8364449 12659459 16627322 10192210 643578 1863916
37843 1863916 12233506 17038400 12125779 10102028 18910711 28131863 24327966 8873996
37835 8873996 -8176731 -21832583 -29758815 -25944165 -9977269 3856485 804030 -14261582
37827 -14261582 -23612389 -20731066 -14404952 -10556772 -4861770 4590931 10959465 9615164
37819 9615164 4685209 131123 -5864358 -12682085 -12855124 -2615278 9675126 11813648
37811 11813648 450025 -17847980 -33415070 -38815964 -32614235 -20194487 -6427903
37804 -6427903 11890224 38823490 65452393 74792037 63471333 47224600 40198805
37797 40198805 40114220 39621904 39458009 40757825 35962278 20203361 3580345 -927003
37789 -927003 4399133 8486483 9890859 14435444 19109967 14737162 3878260 285027
37781 285027 8617525 18976048 24438945 29586520 36406207 35741608 21454153 2210797
37773 2210797 -10716998 -19130638 -30730803 -41881257 -39294382 -18757315 5912370
37766 5912370 14858910 631296 -24554660 -38571119 -29396123 -7390688 5755240
37759 5755240 1246192 -9616021 -14369038 -16291495 -25079335 -37993400 -41552650 -30175243
37751 -30175243 -13356226 -3407359 -3217104 -7063179 -7495648 -737750 9291911 12372782
37743 12372782 3321860 -8456185 -8098926 5556409 18606878 22127832 23664549 32817908
37735 32817908 44454920 46244713 37738294 30628281 31181238 33405957 32188257 33674229
37727 33674229 46235339 66110812 78707600 73316330 52659106 28287684 9748868
37720 9748868 -715803 -4495791 -625529 13062299 31742510 41340960 31088669 8041977
37712 8041977 -7685355 -4748783 7619323 12696159 5781035 -4217242 -8176251 -4931402
37704 -4931402 2076737 9506286 14749915 16665489 16880152 17456866 17295829 13756963 7331448
37695 7331448 1702323 29194 4003255 14263741 27073797 32793660 24497472 8121315
37687 8121315 -2726928 -3404563 -3335776 -12269211 -27383807 -37347099 -34452118 -19586107
37679 -19586107 368519 16414736 22236378 18819773 12711910 8783872 7676756 9707119
37671 9707119 14940451 18190927 11632668 -3826171 -16527192 -17984467 -12575262 -8560692
37663 -8560692 -6408726 -2610170 1287150 1669372 311937 832089 1602606 52606 -182886
37654 -182886 4585714 8509894 3162859 -8057212 -13561942 -11191724 -10761957 -17184170
37646 -17184170 -22031130 -16390488 -3435997 7269188 11693610 12281638 11555314 9970553
37638 9970553 8232071 8400175 12551072 19726830 23338612 15327673 -2975411 -18171211
37630 -18171211 -19374429 -11920676 -8642610 -11135028 -10251496 -3159725 2811022 4296382
37622 4296382 7058294 13516991 16846572 12627833 6392830 4435863 6132143 9494409
37614 9494409 14375641 16001353 7043253 -7862462 -11914435 1510398 18110643 23401200
37606 23401200 21737555 22872064 22074873 10075849 -5838667 -9082355 1499947 10748131
37598 10748131 9505741 2820229 -3065361 -6661646 -3782389 10293124 27931719 32205908
37590 32205908 17869434 -1727323 -12885287 -15957426 -16860444 -15156949 -8077818 1077472
37582 1077472 5984802 4851580 711386 -2352399 -1629576 916334 -2426425 -16278253
37574 -16278253 -32142963 -35886092 -26794631 -19553480 -23743016 -31001578 -28197802 -15043925
37566 -15043925 -1611630 5543430 7889663 9765849 14143352 19961412 20082678 6900982
37558 6900982 -15942914 -32724627 -31279833 -15153460 3434467 16845430 23352801
37551 23352801 21463794 10578833 -5005651 -18025911 -22667544 -15244157 4157063
37544 4157063 26959468 39274300 35963092 27105776 24722941 27690506 26370704 17803690
37536 17803690 8170914 2394779 -830337 -3902889 -6558701 -8016038 -8778247 -9796300
37528 -9796300 -11521913 -12135843 -6082368 10624845 31303021 41710762 37366213 30820029
37520 30820029 34287659 41587295 37545257 21028935 6624368 4029069 6845291 3766762
37512 3766762 -7967102 -22854885 -33944697 -37443989 -36424885 -40491110 -55163358 -71527879
37504 -71527879 -74620333 -63315288 -52691883 -53279624 -57113532 -50562312 -33869415 -20034155
37496 -20034155 -18088722 -24772511 -31130435 -31121475 -23748367 -11585293 1347729 12525189
37488 12525189 22518773 32784690 42329541 47807702 47008838 41951485 38261069 39985430
37480 39985430 43873186 41291381 29401944 18646102 23162978 42458704 58235317
37473 58235317 53593008 32460870 15458875 17206461 31843320 42462505 41776866 38902579
37465 38902579 44400153 53257850 49451745 27603546 2422523 -8094107 -3048408 4513808
37457 4513808 6650610 7167931 10702923 15440210 19087927 23381142 28037431 26899034
37449 26899034 15866846 446605 -10081131 -13441883 -14831232 -18739710 -24568328 -28959896
37441 -28959896 -28714733 -22501695 -13181780 -7322804 -8354546 -10590460 -4866190 8339362
37433 8339362 16162901 8089888 -9283301 -18574723 -12999796 -3910581 -2747860 -3199493
37425 -3199493 8573179 29704820 40315103 29858606 10773445 -591003 -4488511
37418 -4488511 -8950508 -11068412 -1912428 15531361 28971644 35482569 42586092 50487718
37410 50487718 48653058 33704241 16688585 6556850 -1346550 -12747062 -20972101
37403 -20972101 -15634344 1875121 20251245 31586583 36295291 37964249 38296437 35139797
37395 35139797 24036512 5793990 -7830549 -3720019 15924892 34756456 41567792
37388 41567792 38833293 30912402 17153393 1515987 -5270878 -1764873 -1210200 -10792517
37380 -10792517 -17990852 -9911584 5612390 13251549 14483266 21320949 32933054 37443344
37372 37443344 33750654 32994110 38317816 40128809 33488283 25159397 20400604 16255619
37364 16255619 11383914 10231691 13529888 15282026 12275186 6613456 -2787337 -19320922
37356 -19320922 -36080318 -36294768 -12829513 20473616 41243490 36731370 10052930
37349 10052930 -22242979 -39000302 -32274457 -17622013 -15801319 -25030406 -25679834 -11969535
37341 -11969535 259242 1374371 2247483 11121880 16830246 9973015 2940463 9920059
37333 9920059 20772973 15915880 -2465578 -15984353 -20492424 -28059137 -40590592 -44457863
37325 -44457863 -34642306 -23907631 -21379285 -19162243 -8711424 3906127 9093385 8812356
37317 8812356 10070704 11706136 8333270 1970117 -476549 1391860 1545880 -1353706
37309 -1353706 -155322 11359906 28845710 39411134 33333740 14284760 -2571000
37302 -2571000 -4769403 5068767 13282790 11139046 3320694 372662 6825419 18165259
37294 18165259 26083160 25214188 17869988 13608545 20926308 37377238 50253115 48544037
37286 48544037 32429135 11091166 -5095927 -9582042 -2058719 10677747 19219092
37279 19219092 19935486 16980338 14676498 12067166 7969085 6476322 11447286 18608864
37271 18608864 20757415 20066652 26548235 41836401 53103643 49264943 36602753 29365487
37263 29365487 28863412 23321293 8508835 -4089142 -4842131 -637079 -2734586 -8080488
37255 -8080488 -4882258 7058766 14260082 7616903 -8476931 -25752025 -39785831 -46436140
37247 -46436140 -42415043 -33355137 -29913970 -30863199 -22403560 -1701865 12327604 4086380
37239 4086380 -14006902 -18071299 -6787369 -89610 -6085156 -9521815 1711873 15903212
37231 15903212 14020382 -3981887 -21055762 -25745924 -22533412 -21261277 -24764600 -28456601
37223 -28456601 -27085642 -19393447 -8027442 2986515 10346539 12581327 11551888 12863807
37215 12863807 20974910 32113143 36494490 30938578 24136095 23654530 22918117 10546951
37207 10546951 -9492127 -18330227 -5576552 16677801 28569648 25600536 21217544
37200 21217544 28509185 44292198 52882652 44549046 27595362 18592088 21501325 23513855
37192 23513855 13931626 -2105228 -15364233 -27870804 -44228681 -55347115 -47980429
37185 -47980429 -28299730 -17825645 -23402966 -28676833 -21412118 -12390211 -16410439 -27809346
37177 -27809346 -28518740 -12897671 7381400 18394530 14456217 -1804162 -20908671
37170 -20908671 -31474044 -31002612 -28553084 -31462353 -34878853 -30521606 -19452319 -8693191
37162 -8693191 -1120673 3288323 2060259 -5034049 -11061225 -10769212 -9132168 -11569734
37154 -11569734 -11625924 -609915 14708971 18229788 7679237 -1968250 -320452 5266990
37146 5266990 2582816 -9013774 -20386357 -24370584 -21142577 -15773423 -13059177 -12558576
37138 -12558576 -9571932 -4024247 -4213930 -14756228 -24734708 -18514150 2288622 18745686
37130 18745686 18388278 8585190 2718973 3283208 5124722 7540479 14407469 25150882
37122 25150882 32511140 30100354 19856191 11526925 13976627 25717297 36054144 37700585
37114 37700585 34249759 31079897 24817897 10306498 -6319059 -12722509 -7269794 20664
37106 20664 2867812 3572181 2696627 -2473720 -7160463 -1699364 10113176 10566883 -5686802
37097 -5686802 -19497306 -13426739 2259700 5108354 -6624684 -13938590 -6572961 4311406
37089 4311406 4712339 -4412905 -12590942 -14014089 -11204641 -9576415 -11919370 -16074090
37081 -16074090 -17359410 -14625663 -11626806 -10182449 -6503992 1280867 7302068 6729269
37073 6729269 5975334 15019238 31697570 43103366 42409138 35440479 29779773 26101201
37065 26101201 22549967 19669486 17254656 12671446 6420756 4372207 10075916 18209516
37057 18209516 19772117 12215119 1631740 -4399529 -4601457 -4657348 -10023381 -18476458
37049 -18476458 -22324022 -18670935 -12995991 -9939858 -6480074 221338 4502584 1118256
37041 1118256 -1819664 8820809 30116057 42776280 34901561 15093808 -2051405
37034 -2051405 -12112623 -16326143 -12716092 -2549149 2489618 -7713287 -26240771 -37021361
37026 -37021361 -35834427 -32034248 -30372416 -24318234 -10969188 -622418 -3485658 -14139404
37018 -14139404 -17888578 -9049285 4453962 12683213 12982393 8344135 3075817 1300928
37010 1300928 4668897 9730620 11346662 9787402 10209265 13867485 15304893 11229420
37002 11229420 6585144 6895838 9525112 9031470 6935655 7849907 9179663 5354257
36994 5354257 1134499 7695510 22866778 29258119 19282816 9010511 15436848 30235344
36986 30235344 31205363 13671548 -6157590 -17022429 -24557965 -34960308 -42663439 -41036418
36978 -41036418 -33305256 -25212725 -16174092 -4968178 4095252 8214200 12267528 20815633
36970 20815633 30368098 36119633 39022202 38732105 27943696 4325015 -18636474 -25366841
36962 -25366841 -18944568 -15506466 -20603037 -25098730 -24183230 -24533684 -27797683 -21583771
36954 -21583771 3052938 34397396 51233220 46532669 30975795 16391436 5463105
36947 5463105 -2487683 -4948607 48679 7989702 10593582 4913739 -2022219 645873
36939 645873 15798761 33561101 40359841 32360573 17468585 4853735 -3200943 -8803820
36931 -8803820 -13558394 -18643553 -24382816 -26042378 -15803615 5008541 20626341 16702784
36923 16702784 -335708 -9419256 -1296755 10786372 10728274 734584 -4738022 147417
36915 147417 7825649 11236911 12164497 13682013 13043482 7480897 1598066 2211812 7763397
36906 7763397 9228939 2542250 -4642279 -1473297 13104265 29019786 36156500 33394321
36898 33394321 25221822 12945302 -5259859 -25263714 -34656050 -25173444 -4516565
36891 -4516565 10794879 13807821 12028138 13827401 17886107 19037757 16710522 11991767
36883 11991767 3058385 -8926765 -14703441 -7105210 6425592 11126444 3700730 -5492288
36875 -5492288 -8524724 -7725132 -6290822 -2663424 1563851 -757222 -9886141 -13940497
36867 -13940497 -5106140 6471900 5502250 -6830173 -14992436 -9918808 3297513 17412674
36859 17412674 31268883 43874087 50057460 46802348 37986200 29105419 21580270 14539964
36851 14539964 7838646 1239231 -5342658 -9411088 -8240808 -4870271 -6278272 -13332557
36843 -13332557 -18118961 -14649957 -7019682 -2306142 343701 7574829 20644761 31939955
36835 31939955 33113327 23485011 9923516 202063 -3641952 -6366056 -13240371 -22549951
36827 -22549951 -26915802 -23251456 -17806834 -17889433 -21155911 -18156029 -5379808 9039512
36819 9039512 14739481 11050030 6379204 7339843 12550672 17915509 23916906 34082812
36811 34082812 48288567 62072479 71946417 76419834 71963636 55133482 31284013
36804 31284013 13385452 6507814 489489 -14105038 -29465053 -31456550 -22906831 -21592365
36796 -21592365 -34409635 -47835610 -48518852 -40507319 -34901069 -33483355 -32040856 -31544104
36788 -31544104 -35479207 -41070599 -42315708 -38146754 -30239145 -17287185 550124 15727629
36780 15727629 20245153 15303607 6973446 -2817835 -12661902 -15390763 -7362626 485925
36772 485925 -4949418 -17322028 -17109136 -853326 11820543 5712508 -9981009 -17699689
36764 -17699689 -15368948 -13127940 -14671382 -13972889 -6723272 4977641 17487472 27448643
36756 27448643 30398195 24341290 13741704 4700650 -2286966 -9976000 -16959499 -18104463
36748 -18104463 -11323373 546222 13420433 23878805 29621915 32127953 36396173 43700450
36740 43700450 47649516 42813779 34063474 30291924 30966877 27230882 16301238 6311469
36732 6311469 4737532 9330734 13546337 14216551 9825230 -2211545 -19955393 -32611963
36724 -32611963 -29242835 -11377108 8330345 19872711 23424105 22901040 18177172 7722718
36716 7722718 -4331739 -9233979 -2530723 10866241 21506752 23264795 15522673 328164
36708 328164 -19258568 -38207208 -50087639 -50963958 -42935168 -33288747 -29376484 -32879768
36700 -32879768 -38317023 -38290790 -31125805 -22014877 -15800471 -11243878 -4718886 3379158
36692 3379158 10007753 15095011 20622624 25406896 26890673 27889270 34565942 46132639
36684 46132639 53118108 48221893 32787925 10830012 -14837559 -36359473 -40478958
36677 -40478958 -23404774 -50965 10978457 7845528 2398564 990128 -791294 -6268662
36669 -6268662 -12358857 -17280143 -23144976 -28268794 -26434681 -17844191 -12547762 -17801819
36661 -17801819 -28148844 -32698377 -27079514 -14415135 -177156 9478113 9783404 3154804
36653 3154804 -1387856 346757 1030181 -7900187 -22871335 -31378305 -26586134 -13184415
36645 -13184415 -112556 7280020 8552458 6455869 4111924 1073321 -6394505 -17954778
36637 -17954778 -24802628 -18065413 -718252 14267816 17773315 11529628 1155524 -11417687
36629 -11417687 -25668638 -37854907 -43827303 -44465093 -43708225 -41633792 -33884085 -19254326
36621 -19254326 -3858531 5997753 13203720 26852770 48603533 67012651 69759216
36614 69759216 58671804 47245321 44428930 46906882 47722622 45491141 41799698 35558343
36606 35558343 25886791 17734230 18599134 29463442 42452310 47908783 42252240 29855070
36598 29855070 19070514 15694871 18956422 24103296 27871977 28861338 24386832 13249541
36590 13249541 2120872 1137848 9717511 15099062 10857113 7932030 17399060 29963727
36582 29963727 27140116 9799543 -1115771 4896336 12830554 6022900 -7975981 -8407155
36574 -8407155 8985610 27280742 31742230 25345234 18828883 15722672 12902275 9372871
36566 9372871 7424434 7462092 7519676 7644856 10062231 13889683 13763185 6725420 -1765030
36557 -1765030 -2647010 5893690 15649317 17470624 10402905 364870 -7364939 -11606892
36549 -11606892 -13194760 -12978307 -12028397 -11878603 -14102821 -19380530 -25208400 -25005934 -13956734
36540 -13956734 2679012 12581114 11407259 8939707 14347784 21720726 19995727 12589307
36532 12589307 13636163 24993418 31822484 25587565 17347188 19287276 25089607 21607130
36524 21607130 11956814 11366147 22450459 29849738 22352150 8535720 5063023 17317105
36516 17317105 36441528 49254923 46865152 29998708 11695303 9587334 28006055
36509 28006055 49698454 52000331 31319835 6439655 -2892973 4481161 14594267
36502 14594267 16068244 9459794 1117528 -5800950 -11301528 -13323067 -8165713 2762603
36494 2762603 10568380 6811344 -6804513 -19064259 -19739413 -8280506 7103380 16766037
36486 16766037 16223997 8538318 2108810 4744988 17389132 32497489 38871867 29498893
36478 29498893 7135296 -16156404 -26693182 -20167887 -6326913 -463154 -8602787
36471 -8602787 -22583142 -30772926 -30700529 -27982208 -25588076 -20658259 -12919930 -9187091
36463 -9187091 -13833331 -18875225 -11672027 7226071 21593337 18466834 3746888 -6625046
36455 -6625046 -7138084 -7166461 -15875942 -30077528 -39646995 -39770476 -33666364 -25907632 -17550650
36446 -17550650 -7828933 2496032 11013352 15841866 16499271 12635633 3833330 -7502938
36438 -7502938 -14758918 -12947866 -6494704 -6055958 -14879650 -23502656 -22411235 -14566927
36430 -14566927 -8663558 -5189645 806734 6383158 3204442 -5754910 -5718313 8565619
36422 8565619 23174191 24283245 16362931 11671246 11318251 8882523 5517402 7694435
36414 7694435 14422616 20505439 28911845 44158757 54864010 41721665 7500710 -18453515
36406 -18453515 -15113331 4911802 16126265 13331700 8933342 6758394 -1604389 -15894426
36398 -15894426 -21573357 -10612031 6008129 14341467 15614358 19056507 24180700 21577548
36390 21577548 8725028 -5587977 -13740620 -17687768 -21580328 -22555499 -14380352 2847746
36382 2847746 21768264 35389111 41404816 39527591 29675132 15015331 3271755 1031304
36374 1031304 6981963 13117909 12967113 7099973 154274 -5726886 -12462457 -21309720
36366 -21309720 -29258387 -32291970 -30584250 -26667845 -18798774 -1964570 21541805 38459167
36358 38459167 38220547 27074941 20595731 23519845 26423562 23370278 22035290 30923036
36350 30923036 45389060 54225038 54080754 49109377 40832868 27478658 11418321 -999532
36342 -999532 -6934658 -8557448 -8070893 -6268180 -3853764 973558 12616027 29325359
36334 29325359 39383940 35686926 29966420 39495362 60473152 69057891 52447617 26142776
36326 26142776 14092405 21815860 35761958 40421090 29128164 5989553 -15041297
36319 -15041297 -19283744 -6960700 5323592 4579571 -3391812 -5390998 -330631 1801611
36311 1801611 -4131434 -12868340 -17099493 -14361077 -7642862 -4250054 -10285607 -21362757
36303 -21362757 -24561462 -15727867 -7447761 -11032862 -18080015 -11892178 8276363 27787454
36295 27787454 37554876 39811183 35289078 21408458 4819635 -822813 5154095 6973175
36287 6973175 -4589487 -18789169 -22109072 -16540864 -11351907 -7677801 -2553190 498151
36279 498151 -2861538 -7651625 -6879154 -4351498 -8665529 -17784120 -21125253 -15196083
36271 -15196083 -6302306 1130535 7964298 12184988 8558810 -1459450 -9070171 -9900807
36263 -9900807 -7949236 -6005473 -1827740 3087939 1440213 -7477311 -12820172 -7289877
36255 -7289877 918975 545644 -4966720 -3521037 5448219 9461931 2249964 -6993667
36247 -6993667 -7583076 -1502224 2421366 2176766 3030542 7007246 8874918 3769580 -4979430
36238 -4979430 -8160975 -1033830 9360917 9776599 -3726938 -18141954 -16947638 -878440
36230 -878440 12062481 9781625 1092500 1345885 10220889 13961738 6456094 -3318600
36222 -3318600 -5550219 -663774 7189501 18015938 31169047 39975852 38978038 32388653
36214 32388653 28228966 26909249 22417272 12704787 1776108 -7559797 -15692927 -20647270
36206 -20647270 -18145167 -9972437 -5807629 -11815335 -21293916 -22198282 -12791546 -4818692
36198 -4818692 -9671178 -24309790 -33656193 -26665804 -7735181 9048305 14890678 12416279
36190 12416279 8054732 3971136 7202 -1541891 1280713 4728078 2570472 -5385396
36182 -5385396 -12568847 -13663896 -9214502 -2086088 5857363 12118771 13052179 7853691
36174 7853691 663517 -3500787 -3470019 -1701821 -1265454 -3700056 -7719755 -9458989 -6232160
36165 -6232160 -473115 2433216 445473 -3585410 -6357618 -6581436 -3240926 3752331
36157 3752331 10208045 10334257 5106762 2716198 7247753 12150968 9961754 3869912
36149 3869912 2787494 7875071 12048990 12228665 13368248 17889543 19042549 10430712
36141 10430712 -2789724 -8794620 -2924811 9316718 21499919 31223323 35168941 27569198
36133 27569198 8850637 -9660540 -16470935 -12566855 -7005964 -2832869 3833112 11554563
36125 11554563 11528560 1594529 -7376112 -5530710 3278768 10208455 15404905 23665945
36117 23665945 32031883 33306812 28610733 24450055 19427760 7337566 -6561577 -7660111
36109 -7660111 5393701 14637669 7070837 -7263323 -11099601 -3139149 6570592 15846916
36101 15846916 29803052 44353630 45514590 28013872 4259826 -9266644 -8044267
36094 -8044267 784924 9085946 14600526 19986121 27292742 33063910 30382315 17515257
36086 17515257 1829310 -7867080 -9896879 -7512415 -3047874 -45174 -5974143 -23007285
36078 -23007285 -37856100 -32005115 -4853078 22363791 30502536 23547942 20111073 29258490
36070 29258490 42269398 46562957 40036743 28912262 16579346 897610 -17147688
36063 -17147688 -28320577 -24354115 -10281955 -714812 -2673411 -8440816 -7862416 -931931
36055 -931931 6138074 10626558 12842718 11816486 8741409 9174555 13122236 8547685
36047 8547685 -13404657 -39965544 -47544936 -31769401 -13173799 -9374417 -14651431 -13916876
36039 -13916876 -5243265 2020355 4145976 6386474 11863647 16643586 16551100 12705343
36031 12705343 9048033 8001273 9243154 10527325 9387186 5020032 -1549878 -8471990
36023 -8471990 -12738557 -10527197 -1487035 8339395 12375293 11669115 12196700 14936202
36015 14936202 15247351 12145035 10534068 12832229 16038047 18874134 23403382 27213688
36007 27213688 24003398 16416697 17728354 33512119 51152251 56549932 52730952 51349349
35999 51349349 53448852 51748834 46992427 47454909 53387602 55555133 50601928 45853055
35991 45853055 46096293 46474014 42790428 39879153 44793168 58500674 77995333 99384465
35983 99384465 114645578 113053736 92977571 67932471 54307808 55044357 59894604 59227253
35975 59227253 52506879 44640740 39541063 38662295 42411872 49965815 57545778 58918482
35967 58918482 50525977 37026709 28711731 30479022 35487763 33411590 23271825 13706975
35959 13706975 11922536 17923828 29456903 46108557 65885460 82301980 88563009
35952 88563009 83510574 72643902 64407377 63847535 66758649 62105327 44989987 25312729
35944 25312729 17428731 22917773 31459591 37508893 45253405 55315899 58960430 51804939
35936 51804939 42549285 39224676 35856174 23912890 9972431 8444057 19889114 30267097
35928 30267097 31579187 29830967 29846298 25468813 11909586 -2213014 -4633950 4274827
35920 4274827 13568596 16726198 16392883 15649029 12825134 6768256 1248137 499390 2916898
35911 2916898 1967577 -6997642 -21426203 -32362901 -30999875 -16400221 2510335 13701050
35903 13701050 11660794 645752 -10427288 -15037787 -12114740 -4859437 2337250 7153653
35895 7153653 10717215 15431318 21280028 25152359 24108505 18402414 11003742 5132942
35887 5132942 2377288 1684786 -229745 -5409162 -10377651 -7766625 5068015 20497534
35879 20497534 27039638 21205602 10348109 4269813 7249200 17634352 29981998 36007398
35871 36007398 29081708 12234495 -1858435 -3743756 2288716 5275971 2451446 84408
35863 84408 169735 -4991444 -20787643 -38726351 -43102321 -27901303 -3280661 14078439
35855 14078439 14767859 2369236 -11528867 -18080277 -18374874 -19419376 -23190715 -23271092
35847 -23271092 -14396097 -1190090 7199456 8365325 6735219 4096026 -2450205 -11960818
35839 -11960818 -16764654 -12257403 -3749151 1670162 4971290 9946312 12217627 3319807
35831 3319807 -14304462 -26252014 -23648579 -13875164 -9041297 -10727220 -12539734 -11643784
35823 -11643784 -9149752 -3188778 8171785 18289354 16471213 2527060 -12138023
35816 -12138023 -19850185 -23722129 -26353145 -22330238 -9214931 2950279 3385908 -3112961
35808 -3112961 -1704198 12941264 31483352 43030818 45015695 40318855 32799880 27116125
35800 27116125 26428233 28387960 27957696 24697547 22941261 25351230 30949614 37819578
$$ [...]
##END NTUPLES=NMR SPECTRUM
##END=
