##TITLE=31Pdec_DE-46EA1_D2O
 D2O, 64 sc
 22.7.2024
##JCAMPDX= 6.0         $$ Bruker NMR JCAMP-DX V2.0
##DATA TYPE= NMR SPECTRUM
##DATA CLASS= NTUPLES
##ORIGIN= UXNMR, Bruker Analytische Messtechnik GmbH
##OWNER= root
$$ XWIN-NMR		Version 3.5
$$ Mon Jul 22 15:57:27 2024 Russian Standard Time (UT+4h)  she@DPX200
##.OBSERVE FREQUENCY= 81.013821
##.OBSERVE NUCLEUS= ^31P
##.ACQUISITION MODE= SIMULTANEOUS
##.ACQUISITION SCHEME= undefined
##.AVERAGES= 64
##.DIGITISER RES= 17
##SPECTROMETER/DATA SYSTEM= spect
##.PULSE SEQUENCE= zgpg30
##.SOLVENT NAME= D2O
##.SHIFT REFERENCE= (INTERNAL, D2O, 0, 198.062)
##AUDIT TRAIL= $$ (NUMBER, WHEN, WHO, WHERE, WHAT)
$$ ##TITLE= Audit trail, XWIN-NMR		Version 3.5
$$ ##JCAMPDX= 5.01
$$ ##ORIGIN= Bruker BioSpin GmbH
$$ ##OWNER= she
$$ F:/spectra/data/she/nmr/P31/2/pdata/1/auditp.txt
$$ ##AUDIT TRAIL=  $$ (NUMBER, WHEN, WHO, WHERE, WHAT)
(   1,<2024-07-22 15:56:27.76 +0400>,<she>,<DPX200>,
      <created by zg, POWCHK disabled, PULCHK disabled
       configuration hash MD5:
       00 E9 B6 7A A2 85 ED C7 34 08 36 98 17 FE 4E 26
       data hash MD5: 32K
       47 29 E7 C6 C7 A0 0F AF D0 78 8D 64 33 97 26 13>)
(   2,<2024-07-22 15:56:30.03 +0400>,<she>,<DPX200>,
      <Start of raw data processing
       efp BC_mod = 2 LB = 1.5 FT_mod = 6 PKNL = 1 PHC0 = 2712.164 PHC1 = -69.91303 SI = 64K 
       data hash MD5: 64K
       92 BF 2C AE 3A C4 75 8B 4B ED 8B 2D DB 5C 1B D0>)
(   3,<2024-07-22 15:56:48.07 +0400>,<she>,<DPX200>,
      <pk PHC0 = 2.476504 PHC1 = -18.2 
       data hash MD5: 64K
       21 63 D6 81 84 E5 3A C3 77 CE 43 4F A0 AE EC DF>)
$$ ##END=
$$ 
$$ hash MD5
$$ EB 2F D3 36 28 1B FB 7A DA F4 6A AF 10 D4 FB C0
##$RELAX= 
##$RELAX= 
##$RELAX= 
##$RELAX= 
##$RELAX= 
##$RELAX= 
##$RELAX= 
##$RELAX= 
$$ Bruker specific parameters
$$ --------------------------
##$DU= <F:/spectra>
##$EXPNO= 2
##$NAME= <P31>
##$PROCNO= 1
##$TYPE= <nmr>
##$USER= <she>
##$AMP= (0..31)
100 100 100 100 100 100 100 100 100 100 100 100 100 100 100 100 100 100 
100 100 100 100 100 100 100 100 100 100 100 100 100 100 
##$AQSEQ= 0
##$AQ_mod= 1
##$AUNM= <au_zg>
##$AUTOPOS= <>
##$BF1= 81.014009
##$BF2= 200.13
##$BF3= 200.13
##$BF4= 200.13
##$BF5= 200.13
##$BF6= 200.13
##$BF7= 200.13
##$BF8= 200.13
##$BYTORDA= 1
##$CFDGTYP= 0
##$CFRGTYP= 5
##$CHEMSTR= <none>
##$CNST= (0..31)
1 1 145 1 1 1 1 1 1 1 1 1 1 1 1 1 1 1 1 1 1 1 1 1 1 1 1 1 1 1 1 1 
##$CPDPRG= <waltz16>
##$CPDPRG1= <>
##$CPDPRG2= <waltz16>
##$CPDPRG3= <>
##$CPDPRG4= <mlev>
##$CPDPRG5= <mlev>
##$CPDPRG6= <mlev>
##$CPDPRG7= <mlev>
##$CPDPRG8= <mlev>
##$CPDPRGB= <>
##$CPDPRGT= <>
##$D= (0..31)
0 1 0 0 0 0 0 0 0 0.06 0 0.03 2e-05 3e-06 0 0 0.0002 0 0 0 0 0 0 0 0 0 
0 0 0 0 0 0 
##$DATE= 1721649387
##$DBL= (0..7)
120 120 120 11 120 120 24 19 
##$DBP= (0..7)
150 150 150 150 150 150 150 150 
##$DBP07= 0
##$DBPNAM0= <>
##$DBPNAM1= <>
##$DBPNAM2= <>
##$DBPNAM3= <>
##$DBPNAM4= <>
##$DBPNAM5= <>
##$DBPNAM6= <>
##$DBPNAM7= <>
##$DBPOAL= (0..7)
0.5 0.5 0.5 0.5 0.5 0.5 0.5 0.5 
##$DBPOFFS= (0..7)
$$ [...]
##$SUBNAM3= <"">
##$SUBNAM4= <"">
##$SUBNAM5= <"">
##$SUBNAM6= <"">
##$SUBNAM7= <"">
##$SUBNAM8= <"">
##$SUBNAM9= <"">
##$SW= 400.765351723535
##$SWIBOX= (0..15)
0 1 3 0 0 0 0 0 0 0 0 0 0 0 0 0 
##$SW_h= 32467.5324675325
##$TD= 32768
##$TD0= 1
##$TE= 0
##$TE2= 300
##$TE3= 300
##$TEG= 300
##$TL= (0..7)
0 120 53 12 22 120 120 120 
##$TP= (0..7)
150 150 150 150 150 150 150 150 
##$TP07= 0
##$TPNAME0= <>
##$TPNAME1= <>
##$TPNAME2= <>
##$TPNAME3= <>
##$TPNAME4= <>
##$TPNAME5= <>
##$TPNAME6= <>
##$TPNAME7= <>
##$TPOAL= (0..7)
0.5 0.5 0.5 0.5 0.5 0.5 0.5 0.5 
##$TPOFFS= (0..7)
0 0 0 0 0 0 0 0 
##$TUNHIN= 0
##$TUNHOUT= 0
##$TUNXOUT= 0
##$USERA1= <user>
##$USERA2= <user>
##$USERA3= <user>
##$USERA4= <user>
##$USERA5= <user>
##$V9= 5
##$VALIST= <valist>
##$VCLIST= <CCCCCCCCCCCCCCC>
##$VD= 0
##$VDLIST= <DDDDDDDDDDDDDDD>
##$VPLIST= <PPPPPPPPPPPPPPP>
##$VTLIST= <TTTTTTTTTTTTTTT>
##$WBST= 1024
##$WBSW= 4
##$XGAIN= (0..3)
0 0 0 0 
##$XL= 0
##$YL= 0
##$YMAX_a= 11375
##$YMIN_a= -14862
##$ZGOPTNS= <>
##$ZL1= 120
##$ZL2= 120
##$ZL3= 120
##$ZL4= 120
##$ABSF1= 0
##$ABSF2= 0
##$ABSG= 0
##$ABSL= 0
##$ALPHA= 0
##$AQORDER= 0
##$ASSFAC= 0
##$ASSFACI= 0
##$ASSFACX= 0
##$ASSWID= 0
##$AUNMP= <proc_1d>
##$AZFE= 0.1
##$AZFW= 0.5
##$BCFW= 0
##$BC_mod= 2
##$BYTORDP= 0
##$COROFFS= 0
##$CY= -3
##$DATMOD= 1
##$DC= 0
##$DFILT= <>
##$DTYPP= 0
##$F1P= 0
##$F2P= 0
##$FCOR= 1
##$FTSIZE= 65536
##$FT_mod= 6
##$GAMMA= 0
##$GB= 0
##$INTBC= 1
##$INTSCL= 9.790993e-09
##$ISEN= 30
##$LB= 1.5
##$LEV0= 0
##$LPBIN= 0
##$MAXI= 10000
##$MC2= 0
##$MEAN= 0
##$ME_mod= 0
##$MI= 50
##$NCOEF= 0
##$NC_proc= -7
##$NLEV= 6
##$NOISF1= 182.463
##$NOISF2= 159.3651
##$NSP= 0
##$NTH_PI= 0
##$NZP= 0
##$OFFSET= 198.0616
##$PC= 4
##$PHC0= 2714.641
##$PHC1= -88.11304
##$PH_mod= 1
##$PKNL= yes
##$PPARMOD= 0
##$PSCAL= 0
##$PSIGN= 0
##$REVERSE= no
##$SF= 81.0140089999434
##$SI= 65536
##$SIGF1= 159.3651
##$SIGF2= -187.1042
##$SINO= 113.3802
##$SIOLD= 16384
##$SREGLST= <1H.CDCl3>
##$SSB= 0
##$STSI= 65536
##$STSR= 0
##$SW_p= 32467.5324675325
##$SYMM= 0
##$S_DEV= 0
##$TDeff= 32768
##$TDoff= 0
##$TI= <>
##$TILT= no
##$TM1= 0
##$TM2= 0
##$TOPLEV= 0
##$USERP1= <user>
##$USERP2= <user>
##$USERP3= <user>
##$USERP4= <user>
##$USERP5= <user>
##$WDW= 1
##$XDIM= 65536
##$YMAX_p= 335562632
##$YMIN_p= -26343892
$$ End of Bruker specific parameters
$$ ---------------------------------
##NTUPLES= NMR SPECTRUM
##VAR_NAME=  FREQUENCY,     SPECTRUM/REAL,   SPECTRUM/IMAG
##SYMBOL=    X,             R,               I
##VAR_TYPE=  INDEPENDENT,   DEPENDENT,       DEPENDENT
##VAR_FORM=  AFFN,          ASDF,            ASDF
##VAR_DIM=   65536,         65536,           65536
##UNITS=     HZ,            ARBITRARY UNITS, ARBITRARY UNITS
##FACTOR=    0.49542278885378, 1,            1
##FIRST=     16045.7642231865, 0,            0
##LAST=      -16421.768244346, 0,            0
##MIN=       -16421.768244346, -26343892,    0
##MAX=       16045.7642231865, 335562632,    0
$$ Real data points
##PAGE= N=1
##DATA TABLE= (X++(R..R)), XYDATA
$$ [...]
42820E34762J203652J188298O91370k62114r64970j216110j504555j566686m27298
$$ 534762 1738414 2926712 3618082 3355968 2390998 1174888 -329667 -1896353 -2323651
42811b323651J458360J934538J59061j703940j273900P52818J708533O08440r13672
$$ -2323651 -865291 1069247 1228308 -475632 -1749532 -996714 711819 1320259 406587
42802D06587j080292Q565J012063J042760L05577n15649j069496j413558j449272
$$ 406587 -673705 -665140 346923 1389683 1695260 1179611 110115 -1303443 -2752715
42793b752715q21577K74454Q02293J94593n15490L5676J406477J788795O14672
$$ -2752715 -3574292 -3299838 -2497545 -2302952 -2818442 -2782766 -1376289 412506 1027178
42784A027178o35234n70553L88890R47723N60410m18050j340722j555817q48225
$$ 1027178 391944 -178609 210281 1158004 1718414 1300364 -40358 -1596175 -2444400
42775b444400P0281K59457j17147p0303N44513Q10276L86454L9998J84413K64115
$$ -2444400 -2374119 -2114662 -2231809 -2302112 -1757599 -947323 -560869 -520871 -336458 -72343
42765g2343P5788K60025Q42750P86434j69924p11467l616Q95252Q39959L77432
$$ -72343 3445 263470 1106220 1892654 1722730 1011263 1007647 1902899 2742858 3120290
42755C120290L52702J80539p72099j349956k36866J462156J525158M0040p93048
$$ 3120290 3472992 3653531 2881432 1531476 1294610 2756766 4281924 4321964 3528916
42746C528916k33033M769j156799k260264j637760K0755Q44644M74284J01968
$$ 3528916 3295883 3300652 2143853 -116411 -1754171 -1733416 -888772 -414488 -312520
42737c12520L37613M47109k21712j145416j404488r18953l29384P2398O30136
$$ -312520 25093 472202 250490 -894926 -2299414 -3218367 -3547751 -3475353 -2845217
42728b845217J443212J842013J248204J75938k94704J16278P32966J027339J079276
$$ -2845217 -1402005 440008 1688212 1864150 1569446 1685724 2418690 3446029 4525305
42719D525305R36106M25878k33750n70512q01680j572796k427480j836563M92476
$$ 4525305 5461411 5887289 5653539 5083027 4281347 2708551 281071 -1555492 -1063016
42710a063016K531588K255611J91041j483939j697950j163739p98360p03662n84642
$$ -1063016 1468572 3724183 3915224 2431285 733335 -430404 -1228764 -1932426 -2517068
42701b517068k29971M01140R92105J021680N64390M26346R54229J390719J074261
$$ -2517068 -2747039 -2345899 -1353794 -332114 232276 658622 1612851 3003570 4077831
42692D077831M93318L23448K50934k23418n97693j74049O02215Q28253N75709
$$ 4077831 4571149 4894597 5145531 4922113 4324420 4150371 4752586 5580839 6156548
42683F156548M01334N5251r22596j846200j644710o36288o5500j66317j67307
$$ 6156548 6557882 6613133 5690537 3844337 2199627 1563339 1497839 1331522 1164215
42674A164215P4531M7329j4570O00429J442694J222847j03831j158821j176868
$$ 1164215 1238746 1286075 1271505 1871934 3314628 4537475 4433644 3274823 2097955
42665B097955o68698J2701J051613J928252J597726K92826n62283o08860r23076
$$ 2097955 1429257 1441958 2493571 4421823 6019549 6312375 5750092 5141232 4218156
42656D218156j716798j699594m83418L89872j34010j015130j060145o77478m51396
$$ 4218156 2501358 801764 318346 708218 574208 -440922 -1501067 -2178545 -2629941
42647b629941K01849J428037J721313J35329j746994j946201q81285q9723M73483
$$ -2629941 -2428092 -1000055 721258 856587 -890407 -2836608 -3717893 -3807616 -3334133
42638c334133J503722J894174J19936k412927k473892K21039K180793J013968
$$ -3334133 -1830411 63763 183699 -2229228 -4703120 -4482081 -2301288 -1287320
42630a287320j324195j604117K86315J867056J795429J096833R87782J144274
$$ -1287320 -2611515 -4215632 -3929317 -2062261 -266832 830001 1817783 2962057
42622B962057N71867p28538j640604j336940l77636p9885q32259j556688j153512
$$ 2962057 3533924 2805386 1164782 -172158 -549794 -629679 -1461938 -3018626 -4172138
42613d172138J01756J204932J840404K162009J673675j94677k403789k832232
$$ -4172138 -4070382 -2865450 -1025046 1136963 2810638 2615961 212172 -2620060
42605b620060j062047P89781R06311J23295J86466Q06955L23058j172046j497551
$$ -2620060 -3682107 -2892326 -1986015 -1862720 -1676254 -869299 -546241 -1718287 -3215838
42596c215838L74799K544469K679748J010356m54584p90260p10816p24758m42216
$$ -3215838 -2841039 -296570 2383178 3393534 2938950 2148690 1437874 713116 270900
42587B70900J38926K23731l41622n45469R9499N43487q8563q42511l70866P29731
$$ 270900 409826 633557 291935 -253534 -154035 389452 300889 -541622 -912488 -182757
42577a82757O33695r53325k329367k138736p86439O22991J406031J158122p7276
$$ -182757 450938 -502387 -2831754 -4970490 -5756929 -5133938 -3727907 -2569785 -2647061
42568b647061j098870m37552J447697K254508Q85230r64852j259284l13587L03835
$$ -2647061 -3745931 -4183483 -2735786 -481278 403952 -560900 -1820184 -2133771 -1829936
42559a829936M13299J016923K036044K078207N64296j280781j928921j198993
$$ -1829936 -1416637 -399714 1636330 3714537 4278833 2998052 1069131 -129862
42551a29862j60093O2634o86991j400829r08406O24555J668315J246633K35455
$$ -129862 -289955 -227321 -914312 -2315141 -3223547 -2598992 -930677 315956 551411
42542E51411M7210O63348R01289J53129j105887k134378k296036j075391J163323
$$ 551411 598621 1261969 2163258 2316387 1210500 -923878 -3219914 -4295305 -3131982
42533c131982K783660K431457P68046m71234q22835j141285j561931j162440Q1453
$$ -3131982 -348322 2083135 2851181 2379947 1557112 415827 -1146104 -2308544 -2227091
42524b227091P22833k6051r83284p81922J23025L37106l28377p37782j08974J153750
$$ -2227091 -1504258 -1530309 -2513593 -3295515 -3172490 -2835384 -3163761 -3901543 -4010517 -2856767
42514b856767K179923K422093J744151L77818j031716j734542j473553o77889
$$ -2856767 -676844 1745249 3489400 3867218 2835502 1100960 -372593 -1050482
42506a050482J4399L53453N26599O84905O95723N67377P69599J515947J913034
$$ -1050482 -1036083 -682630 -156031 528874 1224597 1791974 2561573 4077520 5990554
42497E990554Q20087j245742k254217j361267k37426n86045j495074r50607P93548
$$ 5990554 6810641 5564899 3310682 1949415 1711989 1125944 -369130 -1319737 -526189
42488e26189J490237L96335p34935o30895l35170r90263j611151p27758R25294
$$ -526189 964048 1360383 625448 -5447 -340617 -1330880 -2942031 -3669789 -2744495
42479b744495J267651P192q82365o9890J210552R76109o31718j481471m01046
$$ -2744495 -1476844 -1469652 -2352017 -2421907 -1211355 -235246 -866964 -2348435 -2749481
42470b749481J187902J331108L91433L81780J634209K057448M65100j281384j057766
$$ -2749481 -1561579 -230471 160962 542742 2176951 4234399 4699499 3418115 2360349
42461B360349K11003K97001m62783L2803J464509J094349j524124l184012j795402
$$ 2360349 2571352 2868353 2405570 2438373 3902882 4997231 3473107 289095 -1506307
42452a506307M61842P96770J4024M05923J475164R53209j038175k066664j254645
$$ -1506307 -1044465 -247695 -233671 172252 1647416 2600625 1562450 -504214 -1758859
42443a758859r9322N76374J551825K564271J637490j601172m246819l600729q19608
$$ -1758859 -1858181 -1281807 270018 2834289 4471779 2870607 -1376212 -4976941 -5796549
42434e796549P62667k7473j390458j562801p57079P2545Q10569J735633K425183
$$ -5796549 -5033882 -5061355 -6451813 -8014614 -8771693 -8699148 -7888579 -6152946 -3727763
42425c727763K109752R01984j09522j46111L83535N50265N0883o93331j235187
$$ -3727763 -1618011 -716027 -825549 -971660 -588125 -37860 13023 -680308 -1915495
42416a915495j316301o17365Q88582K281196K273475P94289p57828j243818r90128
$$ -1915495 -3231796 -3849161 -2960579 -679383 1594092 2388381 1630553 386735 -603393
42407f03393p63723m51938L50108J151805J105468L82639p9458m9787j65992o18608
$$ -603393 -1367116 -1819054 -1468946 -317141 788327 1170966 1091508 1041721 875729 257121
42397B57121p19777p6451O31915N06065m13092j197993j008810J41231J399282
$$ 257121 -462656 -539107 92808 598873 185781 -1012212 -2021022 -1879791 -480509
42388d80509J798430J109521m9695r30035j182246p08921L66605J338252J275684
$$ -480509 1317921 2427442 2377747 1447712 265466 -443455 -76850 1261402 2537086
42379B537086K51181m90084j89494L43489P2361o37594p55419k65183Q9694J94294
$$ 2537086 2788267 2298183 2108689 2452178 2524539 1886945 1131526 866343 956037 1150331
42369A150331L73014K55779o68094j590342j086401O57672J866960J658600R88654
$$ 1150331 1523345 1779124 1111030 -479312 -1565713 -908041 958919 2617519 3606173
42360C606173P38172M00835o00034j610835j715920j110448o77419q17858j246900
$$ 3606173 4344345 4745180 4145146 2534311 818391 -292057 -969476 -1787334 -3034234
42351c034234j368786n95499R43086J908652J065707p30534j206053K61571J727947
$$ -3034234 -4403020 -4998519 -4055433 -2146781 -1081074 -1811608 -3017661 -2756090 -1028143
42342a028143J496866K87792l75133l92612m08738k81291K24706L54932l98979
$$ -1028143 468723 756515 381382 -11230 -419968 -701259 -476553 -121621 -520600
42333e20600r88380m17506L45243j6225o15676K26354J722714J537894j87927
$$ -520600 -1508980 -1926486 -1581243 -1597468 -2213144 -1986790 -264076 1273818 1085891
42324A085891p40050P36795J760000O98340m69185L96052J839499J218416q38851
$$ 1085891 345841 1082636 2842636 3540976 3071791 3467843 5307342 6525758 5686907
42315E686907j466396k12127N08249m22010j231871n73636K45770k94535j351528
$$ 5686907 4220511 4008384 4516633 4094623 2862752 2289116 2534886 2240351 888823
42306H88823j281346k64925M33872P50353J465895K229452J855031M15381o98223
$$ 888823 -392523 -657448 -223576 526777 1992672 4222124 6077155 6492536 5794313
42297E794313q95792r91325j442014j523341p76048R5061M45785O10077Q60985
$$ 5794313 4898521 3907196 2465182 941841 165793 260854 706639 1316716 2177701
42288B177701O44939k28992p51905k00562M98214J73497o54666p39525l44084
$$ 2177701 2822640 2593648 1841743 1641181 2139395 2312892 1658226 918701 574617
42279E74617p27268j662634j426778M16110J984897J587749j02333j233653j050416
$$ 574617 -152651 -1815285 -3242063 -2825953 -841056 746693 644360 -589293 -1639709
42270a639709j04457Q80236J399074J117218L45849M8609N87840J008634L81197
$$ -1639709 -1744166 -863930 535144 1652362 1998211 2046820 2634660 3643294 4024491
42261D024491p14253j019463m69425j02613k95443k93219L24277Q01422L56431
$$ 4024491 3310238 2290775 1821350 1718737 1423294 1130075 1454352 2255774 2612205
42252B612205n79551r38456m36031K31811N03389O42700J051767J289143M03973
$$ 2612205 2032654 1094198 658167 889978 1393367 2036067 3087834 4376977 4780950
42243D780950j588481l143908k753326q65314N60648N23064J09508O86158J782855
$$ 4780950 3192469 48561 -2704765 -3570079 -3009431 -2486367 -2376859 -1690701 92154
42234I2154J713190m1168k020636k440440j002809J073875K334828K224471J294742
$$ 92154 1805344 1764176 -256460 -2696900 -3699709 -2625834 -291006 1933465 3228207
42225C228207M72647N0380m50952j250997j576327n95744J080930J692572M09862
$$ 3228207 3700854 3751234 3300282 2049285 472958 -122786 958144 2650716 3060578
42216C060578j510194k150584j120917K50921P08287L60807M5577L4047m3339
$$ 3060578 1550384 -600200 -1721117 -1470196 -761909 -401102 -355525 -321478 -364817
42207c64817k37443j4072P90450J332310O72857q87085j988907j761176o91501
$$ -364817 -602260 -616332 174118 1506428 2179285 1292200 -696707 -2457883 -3149384
42198c149384J59244L80446M31271R07508J776936K266266J616613J54490p11096
$$ -3149384 -2990140 -2609694 -2178423 -1270915 506021 2772287 4388900 4543390 3832294
42189C832294r7627J027925R82347k61621r37682j5233J292385J283583P6376
$$ 3832294 3734667 4762592 5744939 5483318 4545636 4530403 5822788 7106371 7182747
42180G182747q70875q98872o20064n46395m60337k53614l45044q59354j122791
$$ 7182747 6311872 5413000 4792936 4246541 3786204 3532590 3187546 2328192 1205401
42171A205401n13009N59873R99833K78389r43764j526744j076944k70441J31712
$$ 1205401 692392 1252265 2252098 2530487 1586723 59979 -1016965 -1287406 -1155694
42162a155694K55326O44582J093189Q01702k16513q96013p25477n64587j067257
$$ -1155694 -900368 -255786 837403 1639105 1422592 526579 -198898 -763485 -1830742
42153a830742j265023L5003K051099K707419J404944k73956q34873n70979m94323
$$ -1830742 -3095765 -3060762 -1009663 1697756 3102700 2828744 1993871 1422892 928569
42144I28569o61585m12113L24475Q04422M28820n65996j369384j350277o25518
$$ 928569 266984 -145129 179346 983768 1412588 846592 -522792 -1873069 -2498587
42135b498587O7479J98412P9656M11854J272070J937763J751208Q09987k69514
$$ -2498587 -2431108 -2232696 -2153040 -1741186 -469116 1468647 3219855 4029842 3760328
42126C760328r68501j155506r91501o49967j10480O18637J052365M77369r94078
$$ 3760328 2791827 1636321 644820 -5147 -115627 503010 1555375 2032744 1038666
42117A038666k070675j599636j6022J115773Q62033l28061j441648j813972j304890
$$ 1038666 -1032009 -2631645 -2647667 -1531894 -669861 -997922 -2439570 -4253542 -5558432
42108e558432k66046N64810O77987M10261N38671J246270J901051J848813J053237
$$ -5558432 -5824478 -5259668 -4581681 -4171420 -3632749 -2386479 -485428 1363385 2416622
42099B416622J4289o10493m51927J67689M93021K69247l825o8369m46453j348601
$$ 2416622 2430911 1820418 1368491 1536180 2029201 2298448 2294623 2226254 1779801 431200
42089D31200j830313j021991M23694J216019J177043Q81373K03198j149880k094988
$$ 431200 -1399113 -2421104 -1997410 -781391 395652 1277025 1480223 330343 -1764645
42080a764645j144823J036350K025974R88858k49344q5879P55020R03404L97750
$$ -1764645 -2909468 -1873118 152856 1141714 892370 806491 1561511 2464915 2862665
42071B862665j21763p81185j681943j952311r91389K74672O74099M86998O30215
$$ 2862665 2740902 1959717 277774 -1674537 -2665926 -2391254 -1717155 -1230157 -599942
42062e99942R80931Q20856K38200k14985o20670j162622j158036m7838J181920
$$ -599942 380989 1201845 1440045 1225060 604390 -558232 -1716268 -1764106 -582186
42053e82186J102876M4406l37277M68205J304117J315705R26381N76010r7944
$$ -582186 520690 565096 227819 696024 2000141 3315846 4242227 4818237 4720293
42044D720293j237782k023102j689298o48806j9357l83105j300237j762353j045625
$$ 4720293 3482511 1459409 -229889 -878695 -898052 -1281157 -2581394 -4343747 -5389372
42035e389372N74719J982059K343881J849040J049326K6729j154179j761196j186355
$$ -5389372 -4814653 -2832594 -488713 1360327 2409653 2436382 1282203 -478993 -1665348
42026a665348j38781L5054q12513j455982j013194Q9542J001188J418225J429571
$$ -1665348 -1804129 -1769075 -2581588 -4037570 -5050764 -4961222 -3960034 -2541809 -1112238
42017a112238J124081O39273R1654o37294j537099j946290j076395Q57893K613207
$$ -1112238 11843 651116 742770 105476 -1431623 -3377913 -4454308 -3596415 -983208
42008i83208L104273K211168O04476o64329p04177K82330Q24399j70721j777657
$$ -983208 2121065 4332233 4936709 4272380 3568203 3850533 4674932 4504211 2726554
41999B726554k069071o79359P83556R74728K75176k81723m00707k96069m246M16120
$$ 2726554 657483 -21876 761680 1736408 2011584 1729861 1329154 1033085 1028839 1444959
41989A444959O19319M32291J19154j10214l49821n72989n43553l03418j48603
$$ 1444959 2064278 2496569 2615723 2505509 2155688 1582699 1039146 735728 587125
41980E87125o9947Q9455r033p37970j418878r01104N69011J363645P81031j4757
$$ 587125 517178 606633 597600 -140370 -1559248 -2460352 -1891341 -527696 253335 238578
41970B38578J8736L05981P6493j24684L40902O87288L4539o72851K2328J408240
$$ 238578 257314 563295 639788 515104 856006 1543294 1577833 904982 927310 2335550
41960B335550J367946j81832q46998N59122J951424J044743j024272j206731R25377
$$ 2335550 3703496 3521664 2674666 3233788 5185212 6229955 5205683 3998952 4924329
41951D924329K413196J127387j219774j651645k37977J87777j629506l447449
$$ 4924329 7337525 8464912 7245138 5593493 5355516 5543293 3913787 466338
41943D66338k767394l12410J245780J028489N67042R42249J186376Q7658j761496
$$ 466338 -2301056 -2613466 -1367686 -339197 227845 1170094 2356470 2444128 682632
41934F82632k618383j644424L33484J754308J690368O06485j46786R5882N03459
$$ 682632 -1935751 -3580175 -3246691 -1492383 197985 804470 657684 753566 1257025
41925A257025P8456p02173o76894o2373j63202r71674q48778Q00931K226020J724981
$$ 1257025 1335481 633308 -43586 -105959 -269161 -1240835 -2089613 -1288682 937338 2662319
41915B662319j6250j131160r68624r6534J019499J984471J956066N59234j224534
$$ 2662319 2646069 1514909 546285 449751 1469250 3453721 5409787 5969021 4744487
41906D744487k224106k484582k414239j463907P88562K938704K969528R45124
$$ 4744487 2520381 35799 -2378440 -3842347 -3053785 -115081 2854447 3799571
41898C799571j137010k033199k145016j804959n83359J228124K156991J468973
$$ 3799571 2662561 629362 -1515654 -3320613 -3903972 -2675848 -518857 950116
41890I50116L33495J62302P00872P07561r0134o85031k84684N77956O54153m58462
$$ 950116 1283611 1445913 2146785 2854346 2764212 2079181 1794497 2372453 3026606 2568144
41880B568144j635316j477858j94836N34517r9639q42034l38046P21887P56297
$$ 2568144 932828 -545030 -739866 -205349 -304988 -1147022 -1485068 -763181 -6884
41871f884j76013o68876l61586j80773k90383K05224J211256J314811K42946k38349
$$ -6884 -182897 -851773 -1213359 -1394132 -1684515 -1479291 -268035 1046776 1289722 1051373
41861A051373R65788K259062J520619q26553k474133k299642j324096q79433j071540
$$ 1051373 2017161 4276223 5796842 4970289 2496156 196514 -1127582 -2007015 -3078555
41852c078555j151503o10795K70268O78725J85036n50213m75949L67670Q32513
$$ -3078555 -4230058 -4840853 -4570585 -3891860 -3706824 -4257037 -4732986 -4365316 -3532803
41843c532803L54409k63837k01684J90449J71904k67671p32085j073824j100467
$$ -3532803 -3178394 -3442231 -3643915 -3453466 -3281562 -3549233 -4281318 -5355142 -6455609
41834f455609m70803M80798P61619K58950J83576J144226K015302J834984J507156
$$ -6455609 -6926412 -6445614 -5683995 -5425045 -5241469 -4097243 -2081941 -246957 1260199
41825A260199K087264K598375J529543l56484r51596j23943J73789r01427k000651
$$ 1260199 3347463 5945838 7475381 7118897 6167301 6043358 6217147 5315720 3315069
41816C315069j991045j359488p20645P7851P29908L60285n26102l4664K021549
$$ 3315069 1324024 -35464 -756109 -678258 51650 411935 -114167 -148831 1872718
41807A872718L048669J292684j306409j893686p98615m23066j081641p75003J091046
$$ 1872718 4921387 6214071 4907662 3013976 2215361 1792295 710654 -64349 1026697
41798A026697K510692J976965N21398k71026m48456p56573r87240n70441J84612
$$ 1026697 3537389 5514354 6035752 5764726 5316270 4559697 3572457 3002016 3186628
41789C186628O35691Q46214J055653Q70049N8463n67510l04514J6218q14947k164205
$$ 3186628 3822319 4668533 5724186 6594235 6652698 6085188 5780674 5796892 4981945 2817740
41779B817740k095712j83339J774240K207325J484642N87219m49582j735898k393915
$$ 2817740 722028 538689 2312929 4520254 6004896 6592115 6142533 4406635 2012720
41770B012720j638942k85341K22030j59154l80830l19349q65856j926752k021080
$$ 2012720 373778 88437 310467 151313 -229517 -548866 -1414722 -3341474 -5362554
41761e362554n06541J194628J527798Q65140N32294O45429K70386o98324j230996
$$ -5362554 -5869095 -4674467 -3146669 -2281529 -1749235 -1103806 -833420 -1531744 -2762740
41752b762740p88766p1745J93611K88983Q09374J559328J737365R66923k67095
$$ -2762740 -3551506 -3623251 -3429640 -3140657 -2331283 -771955 965410 1932333 1665238
41743A665238j110995j059390k88155N74171J031435J064961Q60336M31216j82207
$$ 1665238 554243 -505147 -793302 -219131 812304 1877265 2737601 3168817 2986610
41734B986610n49095k27283M47211N08317m06955j376494j189759J24581J216795
$$ 2986610 2437515 2210232 2657443 3165760 2758805 1382311 192552 317133 1533928
41725A533928R73013j57217p07459j1493R46164P95225m17492j290361q94406
$$ 1533928 2506941 2349724 1642265 1630772 2576936 3372161 2954669 1664308 769902
41716G69902J92390R13416R95655O24845l61436j968427l170470k709987p62369
$$ 769902 962292 1875708 2871363 3496208 3134772 1166345 -2004125 -4714112 -5476481
41707e476481J171064K063453K063890J379731j99406k118339k670805r12893
$$ -5476481 -4305417 -2241964 -178074 1201657 1002251 -1116088 -3786893 -4699786
41699d699786J709475K754851J564941k01296o77472K85666J288311R53898o76614
$$ -4699786 -2990311 -235460 1329481 1128185 450713 736379 2024690 2978588 2301974
41690B301974k073485j751129l0891J234085R54875L6865k49656j63280o65136
$$ 2301974 228489 -1522640 -1553531 -319446 635429 672294 422638 259358 -405778
41681d05778j473514j454878o24681j24803j64288L38065J628163K259653J204701
$$ -405778 -1879292 -3334170 -3958851 -4083654 -4247942 -3909877 -2281714 -22061 1182640
41672A182640n21930j374161j285380j044911o94205Q7366P69413O60867L40379
$$ 1182640 660710 -713451 -1998831 -3043742 -3737947 -3650581 -2881168 -2220301 -1879922
41663a879922Q58571J788408J703968N82320q755N29700Q20645j41176j202029
$$ -1879922 -1021351 767057 2471025 3053345 3044590 3574290 4394935 4253759 3051730
41654C051730q38634M54835J053000P02328N18729Q13122O05312m45270j087937
$$ 3051730 2213096 2667931 3720931 4423259 4941988 5755110 6360422 5915152 4827215
41645D827215k06528J426393J979319P18699j335294k689438k762042k042726
$$ 4827215 4620687 6047080 8026399 8745098 7409804 4720366 1958324 -84402
41637h4402j309422q48158l46469N20269J508481J980652J639922Q83040L71080
$$ -84402 -1393824 -2241982 -2588451 -2068182 -559701 1420951 3060873 3943913 4314993
41628D314993L85980O00797L60407o80939j963863k257963r43990R96628J812068
$$ 4314993 4700973 5301770 5662177 4981238 3017375 759412 -184578 812050 2624118
41619B624118R02913n84574j234161q75054l45598k98758p02597j120830r85821
$$ 2624118 3527031 2942457 1708296 833242 487644 188886 -513711 -1634541 -2620362
41610b620362R6210J773316K874199K423360O69809j217169k266996k196753j198636
$$ -2620362 -2524152 -750836 2123363 4546723 5216532 3999363 1732367 -464386 -1663022
41601a663022J24098Q63832N96748R167Q1758P38933J058731P59258N19203O45998
$$ -1663022 -1538924 -675092 -78344 -69177 12581 751514 1810245 2569503 3088706 3734704
41591C734704M62966m59313j341059j196732j93168P11745R94077P25223K273
$$ 3734704 4197670 3738357 2397298 1200566 1007398 1719143 2713220 3438443 3440716
41582C440716r20095j243073l15263J307564K260415J885994P48725l35984j112395
$$ 3440716 2520621 1277548 962285 2269849 4530264 6416258 7164983 6828999 5716604
41573E716604j658504j987200k055606j755705r05151K90335R28875K91368r90540
$$ 5716604 4058100 2070900 15294 -1740411 -2645562 -2355227 -1426352 -1134984 -2125524
41564b125524j467636p26725J11391K3632o25311q94982o15544k62646k7740K55081
$$ -2125524 -3593160 -4319885 -4208494 -4184862 -4810173 -5705155 -6320699 -6583345 -6611085 -6356004
41554f356004N33438N48634L79948N25706J325945K390024K651392J310746r47986
$$ -6356004 -5822566 -5273932 -4893984 -4368278 -3042333 -652309 1999083 3309829 2361843
41545B361843k167940j339599K8036j98026j596820j716418M1782J344456P44538
$$ 2361843 193903 -1145696 -1117660 -1315686 -2912506 -4628924 -4587142 -3242686 -2498148
41536b498148J65778J548978L089265J822604j216919j976131N21263K599616
$$ -2498148 -2332370 -783392 2305873 4128477 2911558 935427 1456690 4056306
41528D056306J462842q61075j009465P29292J442365J66271j211029j197414n69012
$$ 4056306 5519148 4658073 3648608 4377900 5820265 5986536 4775507 3578093 3009081
41519C009081o61347j356419j449946k98413J375856K152383J348730k31068j283687
$$ 3009081 2347734 991315 -458631 -757044 618812 2771195 4119925 3888857 2605170
41510B605170j558626j664797j505078k81981J600093K240432P90594j088224
$$ 2605170 1046544 -618253 -2123331 -2405312 -805219 1435213 2225807 1137583
41502A137583j512140q59870n60825o05335p7376O85276N09075l99502o02898
$$ 1137583 -374557 -1234427 -1795252 -2400587 -2477963 -1792687 -1283612 -1683114 -2286012
41493b286012K42124R46036P50861J36774m26423r45126r75637R7048J498799
$$ -2286012 -2043888 -1097852 -346991 -210217 -636640 -1581766 -2557403 -2460355 -961556
41484i61556J432227l71829j904239j430381M02770J763079J901215J439763J171420
$$ -961556 470671 98842 -1805397 -3235778 -2833008 -1069929 831286 2271049 3442469
41475C442469J258137J201546M13130p21120p23028R71984K372445J052909k137693
$$ 3442469 4700606 5902152 6315282 5594162 4871134 5843118 8215563 9268472 7130779
41466G130779l596370j690717J170973K118344J346393O34503K54308o66215j952168
$$ 7130779 3534409 1843692 3014665 5133009 6479402 7113905 7368213 6701998 4749830
41457D749830k555013k200483j268992J97336J823433K131670K99741j913882
$$ 4749830 2194817 -5666 -1274658 -1077322 746111 2877781 3177522 1263640
41449A263640j935124K14094K069444K098614J076815J01863p97538j612029j648688
$$ 1263640 -671484 -457390 1612054 3710668 4787483 4889346 4091808 2479779 831091
41440H31091o98212L34775P31750R02778J342901J546308P92256n38047j221676
$$ 831091 132879 467654 1199404 2102182 3445083 4991391 5783647 5245600 4023924
41431D023924o54371L67050M01879j019805k514590k086593L36544K292285J612377
$$ 4023924 3369553 3736603 4138482 3118677 604087 -1482506 -1145962 1146323 2758700
41422B758700o74971j550071R2718K219878K579566J382299L43798K43219N17991
$$ 2758700 2083729 533658 626376 2846254 5425820 6808119 7151917 7395136 7913127
41413G913127N86110L95368j37222j186432k323542k539105j436198L5325O26359
$$ 7913127 8499237 8894605 8757383 7570951 5247409 2708304 1272106 1307431 1933790
41404A933790L80952M26842J054393R89995o66615k628569k852054j355558n9407
$$ 1933790 2314742 2741584 3795977 4785972 4119357 1490788 -1361266 -2716824 -2776231
41395b776231P7836l4728K05286J07768l60313J61434J856674K536463R19710
$$ -2776231 -2698395 -2733123 -2527837 -2420069 -2780382 -2618948 -762274 1774189 2693899
41386B693899p96209p7004J801687J669307n12232j793164j046689k78560p78988
$$ 2693899 1897690 1820686 3622373 5291680 4779448 2986284 1939595 1661035 882047
41377H82047j171633l25732N34378O8211r53889j110947l76483N16402J284695
$$ 882047 -289586 -615318 -80940 -12729 -966618 -2077565 -2454048 -1937646 -652951
41368f52951J600411P87696r50202k202919k040171q79804O90621K377269L134627
$$ -652951 947460 1735156 784954 -1417965 -3458136 -4337940 -3647319 -1270050 1864577
41359A864577J731871r03143k063156r69513J07486m21669j089915l77482M14711
$$ 1864577 3596448 2693305 630149 -339364 -231878 -653547 -1743462 -2120944 -1706233
41350a706233l81293j563450j002315O98278J295342O28557N01808J465690K257862
$$ -1706233 -2087526 -3650976 -4653291 -3955013 -2659671 -2031114 -1529306 -63616 2194246
41341B194246K114598J419408L78143r02873j428718m58606P58852M17559j095434
$$ 2194246 4308844 5728252 6106395 5203522 3774804 3316198 4075050 4492609 3397175
41332C397175j904661j578448j152216p51277K97600J264590O17688j100085j616520
$$ 3397175 1492514 -85934 -1238150 -1989427 -1691827 -427237 190451 -909634 -2526154
41323b526154m00689Q02359J191625J811908K607160J655227j299463l353103
$$ -2526154 -2926843 -2124484 -932859 879049 3486209 5141436 3841973 488870
41315D88870k377347j70827M32056k65411R2794J921155L211625K547128O06503
$$ 488870 -1888477 -2059304 -1627248 -1892659 -1799865 121290 3332915 5880043 6486546
41306F486546j224947k230455k306851j648377o59715L19469J079895J194329
$$ 6486546 5261599 3031144 724293 -924084 -1583799 -1264330 -184435 1009894
41298A009894K63354j201806j969999j562701p13289r2535L57560N48084Q7737
$$ 1009894 1273248 71442 -1898557 -3461258 -4174547 -4267082 -3909522 -3361438 -3273701
41289c273701n08194l0513J245966J313757n30206k156184j632950j28160J65551
$$ -3273701 -3781895 -3812408 -2566442 -1252685 -1782891 -3939075 -5572025 -5700185 -5534634
41280e534634m44510j25401R39993P59065q89252j733513l90720J702278K538213
$$ -5534634 -5979144 -6104545 -5164552 -4405487 -5294739 -7028252 -7418972 -5716694 -3178481
41271c178481J962940R63247O1503m93906j31573J199749K282994J853249K58547
$$ -3178481 -1215541 -252294 -190791 -684697 -816270 383479 2666473 4519722 4778269
41262D778269r42089q67899j17957K76526J16683J9522L86904P51360L84060n88640
$$ 4778269 3836180 2968281 2850324 3126850 3243533 3263055 3649959 4401319 4785379 4196739
41252D196739j190753q97228l42796k84993m60423k27415J34990j70166r00941
$$ 4196739 3005986 2108758 1765962 1480969 1020546 793131 928121 757955 -142986
41243a42986p88901N96931J958640J802007K56811j178493j348438m69452K99455
$$ -142986 -931887 -334956 1623684 3425691 3682502 2504009 1155571 686119 985574
41234I85574j7033j328694k477790k251249n48777J534359K745802K599738J431941
$$ 985574 968541 -360153 -2837943 -5089192 -5637969 -4103610 -1357808 1241930 2673871
41225B673871L4292o97446k90006P91787J438111J003529l5178p18271o84413
$$ 2673871 2708163 2010717 1720711 2512498 3950609 4954138 4918960 4200689 3516276
41216C516276l48042j45214L6984N64743J369347J770294J101414m83505j925783
$$ 3516276 3168234 3023020 3060004 3624747 4994094 6764388 7865802 7382297 5456514
41207E456514k103408q41034Q58996J595429P47252r10233j815625j110401M34970
$$ 5456514 3353106 2512072 3371068 4966497 5713749 4803516 2987891 1877490 2312460
41198B312460J210190M93482r23731j870827k040108j778841j149353Q9354J643237
$$ 2312460 3522650 4016132 3092401 1221574 -818534 -2597375 -3746728 -3657374 -2014137
41189b014137K555207K249105J276952N96851L58200m5595p72394j122386p19203
$$ -2014137 541070 2790175 4067127 4663978 5022178 4976583 4204189 3081803 2362600
41180B362600m03682j078270k053605j775665k50704O93173J37159m43266M02003
$$ 2362600 1958918 880648 -1172957 -2948622 -3199326 -2506153 -2368994 -2812260 -2410257
41171b410257J574188J138040m13659r26026k23108l11075j574909j587119R49118
$$ -2410257 -836069 301971 -111688 -1037714 -1260822 -1571897 -3146806 -4733925 -3784807
41162c784807L515983L141887P06031n73541J12398N97319l76795j349224p95453
$$ -3784807 -268824 2873063 3579094 3005553 3117951 3715270 3338475 1989251 1193798
41153A193798N12992R00071J52731o73649r81580j048476j066998p01908K71853
$$ 1193798 1706790 2606861 2759592 2085943 1104363 55887 -1011111 -1713019 -1441166
41144a441166J355050J633478P46948n39838j004306l24300N41387N38246k87727
$$ -1441166 -86116 1547362 2294310 1754472 750166 425866 967253 1505499 1217772
41135A217772j069925j174770n80500L58484J014810P40105m02835j422783j424911
$$ 1217772 147847 -1026923 -1607423 -1248939 -234129 505976 103141 -1319642 -2744553
41126b744553o14681J16173K48075j23228o45486q46305l85812L69961N72151
$$ -2744553 -3359234 -3243061 -2994986 -3118214 -3763700 -4610005 -4995817 -4625856 -4053705
41117d053705J13218r3914M31597R18585O83865K72733L20863L51590r4126k26932
$$ -4053705 -3940487 -4034401 -3602804 -2684219 -2000354 -1727621 -1406758 -1055168 -1149294 -1376226
41107a376226N67784J097837M6361j482299j272400N31453J537470O81789n54685
$$ -1376226 -808442 289395 335756 -1146543 -2418943 -1887490 -350020 331769 -222916
41098b22916p95439m64037k63661K3315M39584L34320k59790l62711J27062O2423
$$ -222916 -1018355 -1482392 -1746053 -1722738 -1283154 -948834 -1208624 -1571335 -1444273 -1381850
41088a381850p10367o04907J097839K651708K243848N27002o67181q48426o54420
$$ -1381850 -2092217 -2697124 -1599285 1052423 3296271 3823273 3156092 2307666 1653246
41079A653246k97006K45969M20794q1875m81504j11019M14025L94852L49962P95875
$$ 1653246 1356240 1602209 2023003 1941128 1459624 1348605 1762630 2157482 2507444 3303319
41069C303319Q84021j51516j243078r89268k0359P4219n33116l45839P63515J448912
$$ 3303319 4187340 4035824 2792746 1803478 1783119 1857338 1324222 978383 1741898 3190810
41059C190810J269125J017143O80067o90310k693040l311864j727376L60068J092554
$$ 3190810 4459935 5477078 6157145 5466835 2773795 -538069 -2265445 -1905377 -812823
41050h12823O32084R1467k82124p27941q62260j85112Q54207J232689N39420o69923
$$ -812823 -180739 -89272 -371396 -1099337 -1961597 -2146709 -1292502 -59813 479607 -190316
41040a90316j369609p83878P92385J839727J091475p53715j747634j210651l60694
$$ -190316 -1559925 -2343803 -1551418 288309 1379784 626069 -1121565 -2332216 -2692910
41031b692910j92895j36268N42819J324865J374518Q57733L42246k35123j012877
$$ -2692910 -2885805 -3022073 -2479254 -1154389 220129 1077862 1420108 1184985 172108
41022A72108j410430r19404k9612N89535J125159J817896J904501O82813r17479
$$ 172108 -1238322 -2157726 -2187338 -1597803 -472644 1345252 3249753 3932566 3015087
41013C015087j288270m18946J99598j17940m62861l5760O96253R80418Q26804
$$ 3015087 1726817 1307871 1507469 1389529 926668 890908 1587161 2567579 3394383
41004C394383N83050L54862K77905N15449O04482k43159j689752k161481r69705
$$ 3394383 3977433 4332295 4610200 5125649 5730131 5486972 3797220 1635739 666034
40995F66034M11023K69598q32560q05043R52293K574491K022119n60617l102688
$$ 666034 1077057 1346655 514095 -290948 661345 3235836 5257955 4697338 1594650
40986A594650l611118j742021J018382K511413J740880k55115j704004k100630
$$ 1594650 -2016468 -3758489 -2740107 -228694 1512186 1257071 -446933 -2547563
40978b547563k193156k131488r12137J771840M248658M517947K644891N17785
$$ -2547563 -4740719 -6872207 -7784344 -6012504 -1763846 2754101 5398992 5916777
40970E916777m54067m56677l06744l80729n77811n60081N7299J097970J473287
$$ 5916777 5462710 5006033 4699289 4318560 3740749 3180668 3237967 4335937 5809224
40961E809224K70928j771394k806347k097360p85645j34846r017L17174P54143
$$ 5809224 6080152 4308758 1502411 -594949 -1380594 -1515440 -1524457 -1207283 -453140
40952d53140P07586K36784j7330J72805M16011L50940k7322m80755n24126L21008
$$ -453140 254446 491230 473900 646705 1062716 1413656 1386334 905579 381453 702461
40942G02461J685217K171120Q40653j304588k216716j225221K50045O09291r2763
$$ 702461 2387678 4558798 5399451 4094863 1878147 652926 902971 1512262 1419499
40933A419499o76246n85945l87934o67218j086675q29489K75243J400264J541064
$$ 1419499 743253 157308 -230626 -897844 -1984519 -2814008 -2538765 -1138501 402563
40924D02563N19274r05204j758623j582485o56034K93682P66933J013169J529061
$$ 402563 921837 16633 -1741990 -3324475 -3980509 -3686827 -2919894 -1906725 -377664
40915c77664J878295Q09772j720709l498805k446896L33782J687473O31403n42076
$$ -377664 1500631 2310403 589694 -2909111 -5356007 -5022225 -3334752 -2703349 -3245425
40906c245425K7369J135225R23388n5711k11411J22593m41270j372123q04515
$$ -3245425 -3218056 -2082831 -1159443 -1215154 -1426565 -1303972 -1745242 -3117365 -3921880
40897c921880J078953J874985N73255j049325j421312j311036j717894j614738
$$ -3921880 -2842927 -967942 -394687 -1444012 -2865324 -4176360 -5894254 -7508992
40889g508992L31562K964153L564400J335511j490942k197811m26137J682480
$$ -7508992 -7177430 -4213277 -648877 686634 -804308 -3002119 -3428256 -1745776
40881a745776J852789J45120j105289j95830J619173J870706N49640M7711J101086
$$ -1745776 107013 252133 -853156 -1048986 570187 2440893 2990533 3038244 4139330
40872D139330J284335r61335l089546j829064J620151K937308Q67923j204087
$$ 4139330 5423665 4462330 1372784 -456280 1163871 4101179 4969102 3765015
40864C765015n39368J143111Q36651j093361j847944n64334P84255O24737k79414
$$ 3765015 3225647 4368758 5205409 4112048 2264104 1699770 2484025 3108762 2829348
40855B829348n89784m11109o43929j323453j575018q65769L15761R20879L03428
$$ 2829348 2239564 1828455 1184526 -138927 -1713945 -2579714 -2263953 -1343074 -1039646
40846a039646j003342j469171r3386K125413K981564J679950j21376m97334K88041
$$ -1039646 -2042988 -3512159 -3605545 -1480132 1501432 3181382 3060006 2562672 2850713
40837B850713M86309n06427j490793j382577n70802j4643P0447J24122M80621
$$ 2850713 3337022 2830595 1339802 -42775 -613577 -628220 -557773 -433651 46970
40828D6970J108347J617630J317904j18575j834751k331890j143255O65939J848951
$$ 46970 1155317 2772947 4090851 3972276 2137525 -194365 -1337620 -671681 1177270
40819A177270K027456J256553k85619j672925j524681K17250J822200J957616
$$ 1177270 3204726 4461279 4175660 2502735 978054 1195304 3017504 4975120
40811D975120J277877Q45099K38601j255753k628280k245044m58573P58234O13463
$$ 4975120 6252997 7098096 7336697 6080944 3452664 1207620 749047 1507281 2120744
40802B120744K00895M26153Q79836R40744N68180j41531r11224q85285L16222
$$ 2120744 2321639 2747792 3627628 4568372 5136552 4995021 4083797 3198512 3514734
40793C514734J354560O62617r70163j247383J70744J225462P72730k4160k65799
$$ 3514734 4869294 5531911 4561748 3314365 3485109 4710571 5483301 5459141 5193342
40784E193342p84358j875411j965711k38735J428779J102914k67457n58399K72630
$$ 5193342 4408984 2533573 567862 329127 1757906 2860820 2593363 2034964 2307594
40775B307594P52181N70720M72828K89763o60661j672135j313916J42519Q97203
$$ 2307594 3059775 3630495 4103323 4393086 3732425 2060290 746374 888893 1786096
40766A786096K53445o35388p45997l52577m4765M4597j55997o43399q50589k67693
$$ 1786096 2039541 1404153 658156 305579 260814 305411 149414 -493985 -1344574 -1612267
40756a612267M95208M07468l05191m02609M64470J311207J351049Q25304K20511
$$ -1612267 -1117059 -709591 -1014782 -1417391 -952921 358286 1709335 2534639 2755150
40747B755150k42484k57302L50523R50187O73493k48508o94720k66965K63003
$$ 2755150 2512666 2255364 2605887 3556074 4229567 3981059 3286339 3019374 3282377
40738C282377J78670m09903j030009j248639p39557K12061N93315L0491k30919
$$ 3282377 3461047 3051144 2021135 772496 32939 245000 838315 868806 637887
40729F37887R74768K537834K279096J86224j413553j118625q6096P4049o37292
$$ 637887 1612655 4150489 6429585 6615809 5202256 4083631 3997535 4071584 3434292
40720C434292j343461j656055j542234r95125m49356m47449m91313N23850K327182
$$ 3434292 2090831 434776 -1107458 -2102583 -2551939 -2999388 -3490701 -2966851 -639669
40711f39669L142499K106578L99633o69165j207911j602844j413215m84218K32533
$$ -639669 2502830 4609408 5009041 4339876 3131965 1529121 115906 -368312 -135779
40702a35779J59497J45091Q37212J269190M63627o87083p17772J13815M42331
$$ -135779 23718 168809 1006021 2275211 2738838 2051755 1333983 1447798 1890129
40693A890129M9899j02535L14438O54422N33254J28058n29118j381274j751273
$$ 1890129 1940028 1837493 2151931 2806353 3339607 3467665 2938547 1557273 -194000
40684a94000j093446q4082J85519j63879j43630M09220P29982N30225K45458R556
$$ -194000 -1287446 -1371528 -1186009 -1349888 -1493518 -1084298 -354316 175909 421367 430923
40674D30923l48310m01406L93776J335859J125605O0650o4762J218965K000182
$$ 430923 82613 -318793 74983 1410842 2536447 2597097 2532335 3751300 5751482
40665E751482P43488j332900k045777j391495j178634j933367k023114k75908
$$ 5751482 6494970 5162070 3116293 1724798 546164 -1387203 -3410317 -3686225
40657c686225K013821K708090J623737M95818L89766M43610l82788j413856j209152
$$ -3686225 -1672404 1035686 2659423 3155241 3545007 3988617 3605829 2191973 982821
40648I82821Q1282O55964m42673j932404k016310o53146P05067J048292N71671
$$ 982821 1064103 1720067 1277394 -655010 -2671320 -3324466 -2619399 -1571107 -999436
40639i99436j26321o19584n04567L86708J421475J551222N91025m35910o15227
$$ -999436 -1125757 -1745341 -2249908 -1863200 -441725 1109497 1700522 1264612 649385
40630F49385l67697q15485k068112k758671j627132P48380K399764K247739J301323
$$ 649385 281688 -533797 -2601909 -5360580 -6987712 -6239332 -3839568 -1591829 -290506
40621b90506J121994J687876J680975N96912n90692r87329q49315o92153m09416
$$ -290506 831488 2519364 4200339 4797251 4206559 3219230 2369915 1677762 1268346
40612A268346O8108J86263l27753p36780l56266K85896K70360k53404l65141K56592
$$ 1268346 1336454 1522717 1194964 458184 101918 387814 658174 404770 39629 296221
40602B96221J124610J749788J875687J324278L93967p1800J74425J89162o77117
$$ 296221 1420831 3170619 5046306 6370584 6764551 6692751 6867176 7056338 6379221
40593F379221j481859j160222n12181r76543j920358j301172Q97143K159395J088259
$$ 6379221 4897362 3737140 3224959 2248416 328058 -973114 -75971 2083424 3171683
40584C171683m99542l66676R18797J168406j12414j326743j220802k13808O14510
$$ 3171683 2672141 2305465 3224262 4392668 4280254 2953511 1732709 1518901 2133411
40575B133411P29336L00942l3957L70608J297812J478607K8129k105667k931044
$$ 2133411 2862747 3163689 3129732 3500340 4798152 6276759 6304888 4199221 1268177
40566A268177j620511P20795K370575K383795Q83551j094416k031859j208873
$$ 1268177 -352334 368461 2739036 5122831 6006382 4911966 2880107 1671234
40558A671234K05571L09378r38573j383411L43014K565597K531788K1308k441862
$$ 1671234 1876805 2186183 1247610 -135801 207213 2772810 5304598 5325906 2884044
40549B884044k820625j566405k17207N34015P43756M68832P7235L75468J417434
$$ 2884044 63419 -1502986 -1720193 -1186178 -442422 26410 103645 479113 1896547
40540A896547J970260J206179J23461L3249M04342j93082j548336k097690j542944
$$ 1896547 3866807 5072986 5196447 5229696 5634038 5440956 3892620 1794930 251986
40531B51986j131379j171218m66060J160099J979408J096796M2543J84572M12095
$$ 251986 -879393 -2050611 -2516671 -1356572 622836 1719632 1762175 1946747 2358842
40522B358842p75905k469300k791115j923816j348878r58824M80351K392968K644167
$$ 2358842 1582937 -886363 -3677478 -5601294 -6950172 -7908996 -7428645 -5035677 -2391510
40513b391510R55908m41244k24194K65217k61734o61794O27651K602726K700472
$$ -2391510 -1435602 -1876846 -2101040 -1835823 -2097557 -2759351 -2131700 471026 3171498
40504C171498L68495k025028k107424k52302J198383R63696J87312M73176J398388
$$ 3171498 3539993 1514965 -592459 -844761 353622 1317318 1504630 1977806 3376194
40495C376194J204826k52355j013086r6932P60627j60696j742714j902334r51270
$$ 3376194 4581020 4328665 3315579 3218647 3979274 3818578 2075864 173530 -777740
40486g77740o43825q18870J38296J856617K083970N02307n47559J32456R39790
$$ -777740 -1421565 -2240435 -2102139 -245522 1838448 2340755 1793196 1925652 2865442
40477B865442O61812M74337J202296J226691p82228l119291l283099j437274M16409
$$ 2865442 3527254 4001591 5203887 6430578 5648350 2529059 -754040 -2191314 -1774905
40468a774905J365708J681991J236553o4658j169429j108555n40837m36827k87653
$$ -1774905 -409197 1272794 2509347 2444689 1275260 166705 -374132 -810959 -1098612
40459a098612N84281J130477J55806j219923j076956P7304J51820r08464j047659
$$ -1098612 -514331 616146 771952 -447971 -1524927 -1447623 -1295803 -2204267 -3251926
40450c251926L58397J530386J293567O60246O79789Q12704L74123j60398k68898
$$ -3251926 -2893529 -1363143 -69576 590670 1270459 2083163 2457286 2296888 2027990
40441B027990l66650p86639j006834o78343l31638l94009n20879m33258l75170
$$ 2027990 1661340 874701 -132133 -810476 -1142114 -1536123 -2057002 -2490260 -2865430
40432b865430k85337L48845J323474J598272R20145L62996N61117O14808l39675
$$ -2865430 -3150767 -2801922 -1478448 119824 1039969 1402965 1964082 2578890 2239215
40423B239215j538894j687477r24433n70852j235780k050803j725645R6134K417238
$$ 2239215 700321 -987156 -1911589 -2482441 -3718221 -5769024 -7494669 -7398535 -4981297
40414d981297L652164L110965J767941J135212J462890J686671J048497o4587
$$ -4981297 -1329133 1781832 3549773 4684985 6147875 7834546 8883043 8818456
40406H818456q85708j000692l42625N94779O23607q98459k710589k870539j438163
$$ 8818456 7932748 6932056 6589431 7184210 7807817 6909358 4198769 1328230 -109933
40397a09933m38993q92426j570246j276705n99679m57558n22011k44552j7342
$$ -109933 -548926 -1441352 -3011598 -4288303 -4887982 -5345540 -5867551 -6112103 -6129445
40388f129445p4384L99395J716397K562062J910618Q11244O35256Q03431J80757
$$ -6129445 -6203829 -5804434 -4088037 -1525975 384643 1195887 1831143 2634574 2815331
40379B815331m55373K78164J399986O16495j830740l090090j860724q8743L07684
$$ 2815331 2359958 2638122 4038108 4654603 2823863 -266227 -2126951 -2215694 -1908010
40370a908010M7520N32464J290329J093441K45193o6054J25280k04706j135082
$$ -1908010 -1860490 -1328026 -37697 1055744 1300937 1234883 1360163 1155457 20375
40361B0375j603823j073479j75022M00418O63310P93225O68350K64200k8640J35066
$$ 20375 -1583448 -2656927 -2831949 -2431531 -1768221 -974996 -306646 -42446 -71086 63980
40351F3980N38325O35381K47184j41676J02066R21756J455725J020286K4625n48671
$$ 63980 602305 1237686 1484870 1343194 1445260 2367016 3822741 4843027 4867652 4318981
40341D318981m72304m46260q70127j201249q94880l12121j43731m15449o28952
$$ 4318981 3846677 3400417 2530290 1329041 434161 122040 -21691 -437140 -1066092
40332a066092n15597j42230L38807N48805J4166r00646p99932R79214K842092
$$ -1066092 -1581689 -1723919 -1385112 -836307 -822141 -1722787 -2522719 -1543505 1298587
40323A298587K538010K81648j209392k92922J382241J254815o25518j906978j314696
$$ 1298587 3836597 4118245 2908853 2615931 3998172 5252987 4627469 2720491 1405795
40314A405795j44046r9775r11897r50004L70578J725884J527373j22958j567765
$$ 1405795 1261749 1161974 250077 -699927 -329349 1396535 2923908 2800950 1233185
40305A233185j606945q13618l92178k03190R63394L020159L908616K303588j09307
$$ 1233185 -373760 -1187378 -1579556 -1782746 -819352 2200807 6109423 8413011 8303704
40296H303704o46920O61589J270278k0282j489617j446102p55536j066805k039896
$$ 8303704 7656784 8318373 9588651 9568369 8078752 6632650 5877114 4810309 2770413
40287B770413k107029j061392o7481L89758P77743R81315L23080p57907q08567
$$ 2770413 663384 -398008 -465489 -75731 702012 1683327 2006407 1248500 439933
40278D39933L76726J177624N73979k59461J65873J291454J373241J20511q96579
$$ 439933 816659 1994283 2568262 2308801 2474674 3766128 5139369 5259880 4363301
40269D363301m79862O33570Q69087j06420j027380p80249J6640j65717j422218
$$ 4363301 3883439 4517009 5386096 5279676 4252296 3472047 3488687 3322970 1900752
40260A900752j915128l68969J915869K788441K241035J902599J894843N55996
$$ 1900752 -14376 -383345 1532524 4320965 6562000 8464599 10359442 10915438
40252A0915438k154625l441731j467692J491499J857374l72770j905894r04053
$$ 10915438 8760813 5319082 3851390 5342889 7200263 6827493 4921599 4017546
40244D017546R04132J191212N2669q90904r71668q11891q98657r58444o32708
$$ 4017546 4921678 6112890 6165559 5274655 4302987 3491096 2592439 1633995 1001287
40235A001287l5703N12966R67476J518820K053366J896718N64146j185043j736584
$$ 1001287 965584 1478550 2446026 3964846 6018212 7914930 8479076 7294033 5557449
40226E557449n35117R91488J128721K0163p66369m88640L3709n5385m43905l51948
$$ 5557449 5022332 6013820 7142541 7162704 6396335 5907695 5941404 5886019 5442114 5090166
40216E090166K99090Q90217Q90962L27253l27376o17549n85118o31147p40601
$$ 5090166 5389256 6279473 7170435 7497688 7170312 6552763 5967645 5336498 4595897
40207D595897l17335P32926J324116M69665j110819j718636r07160R4109K50371
$$ 4595897 4278562 5011488 6335604 6805269 5694450 3975814 3068654 3162763 3413134
40198C413134r9919k09701J6190M14119J060480J726099J614548M38315p46688
$$ 3413134 3313215 3103514 3119704 3533823 4594303 6320402 7934950 8373265 7626577
40189G626577n95151P94388J801048J004978j256878l115280k993786j269761
$$ 7626577 7031426 7825814 9626862 10631840 9374962 6259682 3265896 1996135
40181A996135J63900K11228j18742O57751K197397K802609J852361L67066p99723
$$ 1996135 2160035 2371263 2252521 2910272 5107669 7910278 9762639 10129705 9329982
40172I329982j760705k304966j501137O22335K430885K707483K148555J889130
$$ 9329982 7569277 5264311 3763174 4385509 6816394 9523877 11672432 13561562
40164A3561562J757526J147785M73916L79453M53957J94955M04842K016759M159739
$$ 13561562 15319088 16466873 16940789 17320242 17774199 17969154 18373996 20390755 24550494
40155B4550494N079412M598082M049045M092982M274828M549982N501710P021728
$$ 24550494 29629906 34227988 38277033 42370015 46644843 51194825 56696535 63718263
40147F3718263Q442941J0078850J2985317J7075763K1192522K5179809K9875514
$$ 63718263 72161204 82240054 95225371 112301134 133493656 158673465 188548979
40140A88548979L4554321L6421252L3491932K6172431J5309494J064223j4810027
$$ 188548979 223103300 259524552 293016484 319188915 334498409 335562632 320752605
40133C20752605k7898007l4739966l6227519l5328122l2818563k7815343k1424544
$$ 320752605 292854598 258114632 221887113 186558991 153740428 125925085 104500541
40126A04500541j6560061j3999491j1559918p985457n099860m779269n869120
$$ 104500541 87940480 73940989 62381071 54395614 49295754 44516485 38647365
40119C8647365n883293m395442k875136j954223q07424P92213J506646K35091
$$ 38647365 32764072 28368630 25493494 23539271 22731847 23524060 25030706 25265797
40111B5265797k048076l180712k344438r53051p39677j545854j778709q39550
$$ 25265797 23217721 20037009 17692571 16739520 15999843 14453989 12675280 11835730
40103A1835730Q1378J5276k71201J90227O37907j95650j615329j721637n08932
$$ 11835730 11917108 11932384 11661183 11851410 12489317 12293667 10678338 8956701 8447769
40094H447769o0277j219053k199206j503264k75170k30385q21759m13299P33006
$$ 8447769 8387492 7168439 4969233 3465969 3190799 2960414 2138655 1725356 2458362
40085B458362Q11692m82658j296532l37503J330463J883110J042012q446l84511
$$ 2458362 3270054 2787396 1490864 1153361 2483824 4366934 5408946 5400500 5015989
40076E015989l48756m61231n31404N7243J020878R63995p49066k455819j877863
$$ 5015989 4667233 4206002 3674598 3731841 4752719 5716714 4967648 2511829 633966
40067F33966O71689K344781J509701j90145m68509N02678J034672O30776K2261
$$ 633966 1305655 3650436 5160137 4969992 4501483 5004161 6038833 6669609 6691870
40058F691870n44185j240505j535130q70900N9361L13667L14216P68032Q45157
$$ 6691870 6147685 4907180 3372050 2501150 2560511 2874178 3188394 3956426 4801583
40049D801583m25928j695159q09786J544100K470303J142637l64657p63995j032343
$$ 4801583 4375655 2680496 1870710 3414810 5885113 7027750 6663093 5899098 4866755
40040D866755j560682j029913O19240J148370l42984j545885o95146M58689k13013
$$ 4866755 3306073 2276160 2895400 4043770 3700786 2154901 1459755 1918444 1705431
40031A705431j520706j146115M32600J105586O81169M03125K38481m52638o87379
$$ 1705431 184725 -961390 -528790 576796 1257965 1661090 1899571 1446933 759554
40022G59554O86882K220145J603905n12916j531227j103581j047495j501490p87113
$$ 759554 1446436 3666581 5270486 4757570 3226343 2122762 1075267 -426223 -1213336
40013a213336Q41022J046890l87540q48230O13058J593483N70517n77631j45254
$$ -1213336 -372314 674576 287036 -561194 51864 1645347 2215864 1638233 1492979
40004A492979M81677k19581q88187P2428J242879O33301n14417L04584K313134
$$ 1492979 1974656 1755075 866888 939316 2182195 2815496 2301079 2605663 4918797
39995D918797K326326k14738k274009j619628M34697J417224P91343k68723p73847
$$ 4918797 7245123 7030385 4756376 3136748 3571445 4988669 5780012 5511289 4737442
39986D737442o52971l63724l79950p08923q22543l97831J33948K28922Q906j09728
$$ 4737442 4084471 3720747 3340797 2631874 1809331 1411500 1545448 1774370 1783276 1673548
39976A673548l0692K85089R34836J319826L21447j829420l011409j887747n8158
$$ 1673548 1642856 1927945 2862781 4182607 4504054 2674634 -336775 -2224522 -2282680
39967b282680J66230p65697n33553J176046K146505J244406J79457O64067J689853
$$ -2282680 -2116450 -2882147 -3415700 -2239654 -93149 1151257 1330714 1994781 3684634
39958C684634J112736j118347k776053k073195L85540K322448K016954p4437j782732
$$ 3684634 4797370 3679023 902970 -1170225 -784685 1537763 3554717 3480280 1697548
39949A697548j509915Q2687J107946Q71094L68329M47066O39061K67413k76942
$$ 1697548 187633 270320 1378266 2249360 2617689 3064755 3703816 3971229 3694287
39940C694287j53953N85701J050581O80435k02047r11527j025852n05641M20142
$$ 3694287 3540334 4126035 5176616 5857051 5655004 4743477 3717625 3211984 3632126
39931C632126J293585J523590P69457n90466j580477j577119j042666q59200j037005
$$ 3632126 4925711 6449301 7218758 6628292 5047815 3470696 2428030 1568830 531825
39922E31825q01900j1621M98087L68931M57690J350497K101748J539643J04155
$$ 531825 -270075 -281696 216391 585322 1043012 2393509 4495257 6034900 6139055
39913F139055q57582j104846j432845j870821j465331l3826J181656J087669N3168
$$ 6139055 5281473 4176627 2743782 872961 -592370 -626196 555460 1643129 1696297
39904A696297p76172p82531j53786N70633R10697P44700L43848l1930l41650l85071
$$ 1696297 920125 137594 -16192 554441 1465138 2209838 2553686 2521756 2180106 1795035
39894A795035J72793R31170P16773p38520j873574j189956O02815J630822J406650
$$ 1795035 1967828 2898998 3615771 2877251 1003677 -186279 416536 2047358 3454008
39885C454008Q18301J64118r13721j818662j409152j22639L49692k15993l04550
$$ 3454008 4272309 4436427 3522706 1704044 294892 172253 521945 305952 1402
39876A402M23971L06243j259247k250089j074269Q16563J280193P74542J022743
$$ 1402 425373 731616 -527631 -2777720 -3851989 -3035426 -1755233 -980691 42052
39867D2052J630078P22331j437594k167718k59724J976578J731314n68489j930088
$$ 42052 1672130 2394461 956867 -1210851 -1470575 506003 2237317 1668828 -261260
39858b61260p08817J443648J850715J84691j334037r92237L01491O57758R179
$$ -261260 -970077 473571 2324286 2508977 1174940 182703 484194 1141952 1151131
39849A151131j01360Q72204J701337J341116J79902r71001j686639j388163L61762
$$ 1151131 1049771 1921975 3623312 4964428 5144330 4173329 2486690 1098527 1460289
39840A460289K432662K724603J054117l02694j9853K34595j260024l105330k754009
$$ 1460289 3892951 6617554 7671671 7368977 7349124 7583719 6323695 3218365 464356
39831D64356m44360J181424P67823n67599j358350j172937j62910R79043R04517
$$ 464356 19996 1201420 1969243 1401644 43294 -1129643 -1292553 -313510 591007
39822E91007p79109k124961r77235J779539L157136K146653O52314J85558O058
$$ 591007 -188102 -2313063 -3290298 -1510759 1646377 3793030 4445344 4630902 4636960
39813D636960p60961j395055j144767p40548r80959j133431j38371J460496K031516
$$ 4636960 3875999 2480944 1336177 595629 -385330 -1518761 -1657132 -196636 1834880
39804A834880Q63388j127067k333518j736392K07910J748360J578324L96417j61961
$$ 1834880 2698268 1571201 -762317 -2498709 -2290799 -542439 1035885 1432302 1270341
39795A270341N8911j81612j027867j010903L88742J545303J125540Q7936o2651
$$ 1270341 1329252 1147640 119773 -891130 -502388 1042915 2168455 2256391 2193740
39786B193740M24458N16942M39073R59529J481735P24200j036474k049605j343690
$$ 2193740 2618198 3135140 3574213 4533742 6015477 6739677 5703203 3653598 2309908
39777B309908L95022K025590K779249K085488j8373k201220k812004j807872p26755
$$ 2309908 2704930 4730520 7509769 9595257 9576884 7375664 4563660 2755788 2029033
39768B029033n85452q35030o46628j65834L7897m8870q5286l5103n5632n6130
$$ 2029033 1443581 608551 -38077 -203911 -166014 -214884 -300170 -335273 -390905 -447035
39758d47035J36113L30694J18030n13267r78888p08271J08049O47575M79454J25832
$$ -447035 -310922 19772 137802 -375465 -1354353 -2062624 -1954575 -1307000 -827546 -701714
39748g01714K04342L93923K7387n54931m16823J57514k58320j773439k368205
$$ -701714 -497372 -103449 -76062 -630993 -1047816 -890302 -1148622 -2922061 -5290266
39739e290266o92014J687143K389146J496487Q60952R48136O04303l38109o36711
$$ -5290266 -5982280 -4295137 -1905991 -409504 451448 1399584 2003887 1665778 1029067
39730A029067j06057j94294j352922j969491j030673J05064M4465k75258O10196
$$ 1029067 923010 728716 -624206 -2593697 -3624370 -3519306 -3474841 -3750099 -3139903
39721c139903J915020J802219N07196k6380O83434J095834M17214j82289K33206
$$ -3139903 -1224883 577336 1084532 1058152 1741586 2837420 3254634 3072345 3305551
39712C305551P49176J93386r64891j386692o43933O68521J821960K149057J168187
$$ 3305551 4054727 4248113 3283222 1896530 1252597 1921118 3743078 5892135 7060322
39703G060322n49340j355140m27068Q63639O22888r56570j925435j318941j81725
$$ 7060322 6510982 5155842 4728774 5592413 6215301 5258731 3333296 2014355 1832630
39694A832630L07102L67089O93909J122924J105249P96274O77714M45842p06391
$$ 1832630 2139732 2506821 3200730 4323654 5428903 6225177 6902891 7348733 6642342
39685F642342k596024l657465k578393n7952J639105J116108n09433r52327L04939
$$ 6642342 4046318 388853 -2189540 -2247492 -608387 507721 -1712 -954039 -649100
39676f49100J324248M83333j038957q63482R77756J845179K70884j843714j937287
$$ -649100 675148 1158481 119524 -743958 233798 2078977 2349861 506147 -1431140
39667a431140l47272M70277m17794j364764p81809P12526J405683P98305R87J43032
$$ -1431140 -1778412 -1308135 -1725929 -3090693 -3872502 -3159976 -1754293 -955988 -955001 -811969
39657h11969R73201J210029J87302j170787j460029o97309k25164n80303o78990
$$ -811969 161232 1371261 1558563 387776 -1072253 -1769562 -1994726 -2575029 -3254019
39648c254019K34719J172283J124374R43473J759379K492977J240738j236221
$$ -3254019 -3019300 -1847017 -722643 220830 1980209 4473186 5713924 4477703
39640D477703j955366j3154J937143J411655p32699k033095j615021l29185Q70464
$$ 4477703 2522337 2509183 4446326 5857981 5125282 3092187 1477166 1147981 2018445
39631B018445J299946M75084r98210j474933l85119P81567P08816J21209O6621
$$ 2018445 3318391 3793475 2795265 1320332 935213 1716780 2425596 2546805 2613426
39622B613426j20856j251639k074169j041358O78841O50009q51185j152745M59829
$$ 2613426 2492570 1240931 -833238 -1874596 -1195755 -545746 -1396931 -2549676 -2089847
39613b089847J630162Q71708j22334N49241J967935K073096P50711n25810j012532
$$ -2089847 -459685 412023 289689 838930 2806865 4879961 5630672 5104862 4092330
39604D092330r74650m46688O58235J582531J261005k19626j625297j966031j260745
$$ 4092330 3117680 2670992 3329227 4911758 6172763 5953137 4327840 2361809 1101064
39595A101064j61987O09522P05040M42307L57277K98047l68872j418869j616067
$$ 1101064 939077 1548599 2253639 2695946 3053223 3351270 2982398 1563529 -52538
39586e2538m63204Q54816J023299K05239o88428j339649j631227r52101P38469
$$ -52538 -515742 339074 1362373 1567612 879184 -460465 -2091692 -3043793 -2305324
39577b305324J969262J455504J80152R2659J091077J206446j52882j125897j93388
$$ -2305324 -336062 1119442 1299594 1392253 2483330 3689776 3536894 2410997 2217609
39568B217609J620709K301380J353659k46328j623027k433452k415187j608693
$$ 2217609 3838318 6139698 7493357 7247029 5624002 3190550 775363 -833330
39560h33330p21301m14359m21859l2147P83112J355846J277952P92522L00030
$$ -833330 -1554631 -1968990 -2390849 -2422996 -1639884 -284038 993914 1786436 2086466
39551B086466n8810l51055p01477j124384j311628q22797K58447J142774J133572
$$ 2086466 2027656 1676601 975124 -149260 -1460888 -2283685 -2025238 -882464 251108
39542B51108L57202n75758j259244j458481q64682M33106J497730J360186K86352
$$ 251108 608310 32552 -1226692 -2685173 -3549855 -3116749 -1619019 -258833 27519
39533B7519m66902k40335L67156N89942M97580M94078M83489K11430K6806M77951
$$ 27519 -439383 -679718 -312562 277380 774960 1269038 1752527 1963957 1990763 2468714
39523B468714J213873J089646l43294k009966k422562j346163M6111N35576J731
$$ 2468714 3682587 4772233 4428939 2418973 -3589 -1349752 -1303641 -768065 -766334
39514g66334p31322q13120o8844R26047J369574J017374M53654L64909O37277
$$ -766334 -1497656 -2310776 -2379620 -1453573 -83999 933375 1387029 1751938 2389215
39505B389215N83196J6871n20489p48285j066701j530335j247237L01161J972033
$$ 2389215 2972411 2989282 2468793 1720508 653807 -876528 -2123765 -1822604 149429
39496A49429K185043J107618K92492K63393N1261o18726n17541P95888J581101
$$ 149429 2334472 3442090 3734582 3997975 4049236 3430510 2912969 3708857 5289958
39487E289958L50940j568049j792011l92400M18780k46457r92489p60478k20198
$$ 5289958 5640898 4072849 2280838 1888438 2307218 2060761 1068272 307794 87596
39478H7596L4618N89447J488247J315921n38505k236857j835204j42309N85373
$$ 87596 122214 711661 2199908 3515829 2977324 740467 -1094737 -1237046 -651673
39469f51673l0283m22374J40115P41659P69915P54803Q80204L19363j249913k666688
$$ -651673 -681956 -1104330 -964215 -222556 547359 1302162 2182366 2501729 1251816 -1414872
39459a414872k527156o87678J732900L144492K424289J53584j269159j81249J789099
$$ -1414872 -3942028 -4629706 -2896806 247686 2671975 2825559 1556400 1375151 3164250
39450C164250J532649j060327k700790j490180L81441K52189r86261p80327Q41298
$$ 3164250 4696899 3636572 935782 -554398 -172957 79232 -907029 -1687356 -846058
39441h46058J654488R90859L63210N81278P35540K22334l72242o93552j005134
$$ -846058 808430 1799289 2162499 2743777 3479317 3701651 3329409 2635857 1630723
39432A630723r49934J21378J374699J179718o1011j23134J329179J835744J75601
$$ 1630723 680789 802167 2176866 3356584 3295573 3172439 4501618 6337362 6512963
39423F512963j330995n16877R89755M53381j414062j699516q2633R15281K52047
$$ 6512963 5181968 4665091 5654846 6108227 4694165 2994649 2912016 3827297 4079344
39414D079344l18033K48627N10033n15785j249497j92591J300106R92037p75827
$$ 4079344 3761311 4009938 4519971 4004186 2754689 2562098 3862204 4854241 4078414
39405D078414j731824j047671j408M44087P21273J118920R90637J91803j37997
$$ 4078414 2346590 1298919 1297511 1741598 2462871 3581791 4572428 4764231 4626234
39396D626234P65145J840774J539452k733j276068j546751j424061j243539l06588
$$ 4626234 5391379 7232153 8771605 8768872 7492804 5946053 4521992 3278453 2971865
39387B971865J526635K625216J337719j456029l008101k090126l56294K48123
$$ 2971865 4498500 7123716 8461435 7005406 3997305 1907179 1550885 1799008
39379A799008Q2923O35068J783315K000812R73416J26645J94145M8156j131975
$$ 1799008 1881931 2516999 4300314 6301126 7274542 7401187 7595332 7643488 6511513
39370F511513k095851j407046P358N4628j266569j818742o64863N45698L20085
$$ 6511513 4415662 3008616 3015974 3070602 1804033 -14709 -679572 -133874 186211
39361A86211l10841M05345J981466K345248R78139m17553n36750j52634n53038
$$ 186211 -124630 280715 2262181 4607429 5585568 5168015 4631265 4478631 3925593
39352C925593j552838k035727j705949j239393j001431n67750M14039J549670
$$ 3925593 2372755 337028 -1368921 -2608314 -3609745 -4177495 -3763456 -2213786
39344b213786K126764J907930J308701Q51336N05264k74286j627744k627057k140721
$$ -2213786 -87022 1820908 3129609 3980945 4486209 4211923 2584179 -42878 -2183599
39335b183599m09757R88995J058300M97236M20060P75195Q23808M97140K71551
$$ -2183599 -2593356 -1604361 -546061 -48825 371235 1146430 1970238 2467378 2738929
39326B738929J78366N473R8895Q00427J389544R01767j59848m00709J62549M1715
$$ 2738929 2917295 2922768 3021663 3822090 5211634 6113401 5953553 5552844 5715393 5757108
39316E757108j143391j821578j006573N0980Q428k65936P72461K537306K954941
$$ 5757108 4613717 2792139 1785566 1836546 1844974 1579038 2351499 4888805 7843746
39307G843746J464834m13578j406119j711442j746787j258533k55277L99509R1226
$$ 7843746 9308580 8895002 7488883 5777441 4030654 2772121 2516844 2916353 3007579
39298C007579o25570q53752n33948k40804k26257k15759R689K22168j412o96250
$$ 3007579 2382009 1528257 994309 753505 527248 311489 321178 543346 541934 -154316
39288a54316j261734j064733l51197m7853l67248k98651Q60217K141106K101146
$$ -154316 -1416050 -2480783 -2831980 -2879833 -3247081 -3545732 -2685515 -544409 1556737
39279A556737R41958K00287M76521Q00585M15214j28391j24916J80740K92938
$$ 1556737 2498695 2698982 3175503 3976088 4391302 4262911 4137995 4318735 4611673
39270D611673L23857M31358K15255n00416r36858l43675O85817Q13964k57855
$$ 4611673 4935530 5366888 5582143 5081727 4144869 3801194 4487011 5300975 5043120
39261E043120j427441j681437j238257q94745p29539n3572J327690K367558J859290
$$ 5043120 3615679 1934242 695985 -198760 -928299 -981871 345819 2713377 4572667
39252D572667J07846j262072j395522j219591j753823k337982j680639j4877J252034
$$ 4572667 4680513 3418441 2022919 803328 -950495 -3288477 -4969116 -4983993 -3731959
39243c731959J707025K099018K381989J488364m49925j519584o71839O18051O02335
$$ -3731959 -2024934 74084 2456073 3944437 3494512 1974928 1303089 1921140 2523475
39234B523475j63161k0689J023602J463443O95547l74951r53481j158520j192932
$$ 2523475 2360314 2339625 3363227 4826670 5522217 5147266 4193785 3035265 1842333
39225A842333r16179l72744J53582O05264R06770N38433o68697j616954j049979
$$ 1842333 926154 553410 706992 1312256 2219026 2757459 2088762 471808 -578171
39216e78171N21966J323843Q44242M47769J029150J462966L45530j684321k562248
$$ -578171 -56205 1267638 2111880 2559649 3588799 5051765 5397295 3712974 1150726
39207A150726j396692N47278J509007J158636N36528M32067L95080l57886j441514
$$ 1150726 -245966 301312 1810319 2968955 3505483 3937550 4332630 3974744 2533230
39198B533230j544878l65260O80035M36672j56920M87673J854553J767728k07924
$$ 2533230 988352 623092 1303127 1739799 1582879 2070552 3925105 5692833 5484909
39189E484909j607525l15004K333204L146325J158552j389032k100745j091393
$$ 5484909 3877384 3562380 5895584 9041909 10200461 8811429 6710684 5619291
39181E619291j23904j51886o56276r14940q27634m19909M42778J334480J141416
$$ 5619291 5495387 5343501 4687225 3772285 2944651 2524742 2967520 4302000 5443416
39172E443416m08441j686076r11467J249035K323546J443355M29714Q06140J516504
$$ 5443416 5034975 3348899 2437432 3686467 6010013 7453368 7883082 8689222 10205726
39163A0205726R88771q7793n0807O87581K65313j265048j636265J55427K193719
$$ 10205726 11194497 11106704 11055897 11743478 12008791 10743743 9107478 9262905 11456624
39154A1456624K346987J008617J31143P28642K262944L576469L692194K534453
$$ 11456624 13803611 14812228 14943371 15672013 17934957 21511426 25203620 27738073
39146B7738073J417691J911354L773607N110117N057838M927413N844740O661105
$$ 27738073 29155764 31067118 34840725 39950842 45008680 49936093 55780833 62441938
39138F2441938N510531K458481p63168l011647m490964n727580o868587p666364
$$ 62441938 67952469 70410950 69647782 66636135 62145171 56417591 49549004 41882640
39130D1882640p407649n437256k490659o70001j097005k403102k678539k039467
$$ 41882640 34474991 29037735 26547076 25877075 24780070 22376968 19698429 17658962
39122A7658962j818263j995791j343105J02011O47466n58557k175675k497065
$$ 17658962 15840699 13844908 12501803 12603814 13251280 12692723 10517048 8019983
39114H019983j563053p21177p23628r50524l99727Q75301J578490P88096m59005
$$ 8019983 6456930 5735753 5012125 4061601 3661874 4537175 6115665 6903761 6444756
39105F444756k62472J227499J514178o66305l054139k862333p96094J77730o73394
$$ 6444756 6182284 7409783 8923961 8257656 5203517 2341184 1545090 1722820 1049426
39096A049426j172580J3959J507014J647526O43179m70710j195583j188707k29559
$$ 1049426 -123154 -109195 1397819 3045345 3688524 3217814 2022231 833524 603965
39087F03965P76283M74875o61286o35744Q42326J658224Q18958J93943J119879
$$ 603965 1380248 1855123 1193837 558093 1400419 3058643 3877601 4071544 5191423
39078E191423J762597K43280j715503j292007P03375R80209r32750j980868m64417
$$ 5191423 6954020 7197300 5481797 4189790 4893165 5873374 4940624 2959756 2495339
39069B495339J515592J496591k8701j130472j300515j210473j004134m22223J83843
$$ 2495339 4010931 5507522 5478821 4348349 3047834 1837361 833227 411004 594847
39060E94847K87662J34903K30265L02191k91172j371467j952690j415343j64899
$$ 594847 882509 1017412 1247677 1549868 1258696 -112771 -2065461 -3480804 -3645703
39051c645703R02968J332221J448475J737314J900180J019948r18440k327195
$$ -3645703 -2742735 -1410514 37961 1775275 3675455 4695403 3776963 1449768
39043A449768j805527j98670M28833k83797o64337J68334Q95852K43151r25959
$$ 1449768 -355759 -554429 -125596 -409393 -1073730 -905396 -9544 233607 -692352
39034f92352j045116k21120L26139M11243Q29811J515439J404413K84789o03895
$$ -692352 -1737468 -1958588 -1632449 -1221206 -391395 1124044 2528457 2813246 2209351
39025B209351k63706P84439J417824J331675R90999O85629J94722p68910k050903
$$ 2209351 1945645 2730084 4147908 5479583 6470582 7156211 7350933 6582023 4531120
39016D531120k929891k581839r82837P46640J370467R09934M79254P18708J041806
$$ 4531120 1601229 -980610 -1963447 -1216807 153660 1063594 1542848 2261556 3303362
39007C303362O94257q1430m61576k06795K03501M27365O40016R97446J228749
$$ 3303362 3997619 3916189 3454613 3247818 3451319 3878684 4518700 5516146 6744895
38998F744895J020941N20324J50683L3757j59734p58763j631496k214597j960951
$$ 6744895 7765836 8286160 8436843 8470600 8310866 7552103 5920607 3706010 1745059
38989A745059q29721N57079J348391J275528R60681J092533J341419O61212j093723
$$ 1745059 915338 1472417 2820808 4096336 5057017 6149550 7490969 8152181 7058458
38980G058458k492832k092207k69852J247304J430732O68753l77262j482739k229262
$$ 7058458 4565626 2473419 2203567 3450871 4881603 5550356 5173094 3690355 1461093
38971A461093j900193o82813K1376n98504j405766q14292R07714K008553J638934
$$ 1461093 -439100 -1121913 -1100537 -1699041 -3104807 -3919099 -3011385 -1002832 636102
38962F36102O58207J01393L2183J15237K21285Q4423o31481j400657r32164J012898
$$ 636102 1294309 1395702 1427885 1543122 1764407 1848830 1217349 -183308 -1115472 -102574
38952a02574K646664K016793m74701k366518j937857P0568J676474J879172J222208
$$ -102574 2544090 4560883 4086182 1719664 -218193 -147625 1528849 3408021 4630229
38943D630229N88487J50972l34198p15071m97629L23695J040028J070753O00032
$$ 4630229 5218716 5369688 5035490 4320419 3822790 4146485 5186513 6257266 6857298
38934F857298R4345k86633l63524K97790J486002J850756N37397j094629r76489
$$ 6857298 6951643 6665010 6301486 6599276 8085278 9936034 10473431 9378802 8402313
38925H402313N04324P76511r50006k114463n83082J842524J852779n38883k103693
$$ 8402313 8906637 9683148 8733142 6618679 6035597 7878121 9730900 9192017 7088324
38916G088324j072072P61548J077167M3239p09438n22900J15292P56208J118360
$$ 7088324 6016252 6777800 7854967 7898206 7188768 6665868 6781160 7537368 8655728
38907H655728O92760o90167k215371k764062k010841m53517J131355J860768J124734
$$ 8655728 9348488 8658321 6442950 3678888 1668047 1214530 2345885 4206653 5331387
38898E331387n24704j504127r85161J049K5513p66423j128000o86027k42455k20665
$$ 5331387 4806683 3302556 2317395 2318444 2343957 1577534 449534 -236493 -478948 -699613
38888f99613L888R62952K171282K719357K236268J031803k58430j024485j099318
$$ -699613 -695725 267227 2438509 5157866 7394134 8425937 8167507 7143022 6043704
38879F043704r25034r68304j034048n89586L31497J080796J215548Q57037K76972
$$ 6043704 5118670 4150366 3116318 2526732 2858229 3939025 5154573 6011610 6288582
38870F288582l42449p81371r61053j194312j701171j992945j412867k11530O63544
$$ 6288582 5946133 5164762 4203709 3009397 1308226 -684719 -2097586 -2309116 -1645572
38861a645572Q10660O00140K21788m59186r64197l17586J376963K523149J955179
$$ -1645572 -834912 -234772 -12984 -472170 -1436367 -1753953 -376990 2146159 4101338
38852D101338M77427l27523j74410m6610n13621j031856q81726j28760M63783
$$ 4101338 4578765 4251242 4076832 4030222 3516601 2484745 1603019 1474259 1938042
38843A938042K05065p77271j471079r78695L02642R68431K74946r85738j497451
$$ 1938042 2143107 1365836 -105243 -1083938 -781296 187135 462081 -523657 -2021108
38834b021108p72559O71602J823242J702316K29508j170211q27819R36696J993977
$$ -2021108 -2793667 -2122065 -298823 1403493 1633001 462790 -365029 571667 2565644
38825B565644J311025K52125J38344J55026q24775j808197j156093M41483P67732
$$ 2565644 3876669 4128794 4267138 4422164 3597389 1789192 633099 1074582 1842314
38816A842314n18456j530033j187819m35014j28314J78597O99404N61003n69286
$$ 1842314 1323858 -206175 -1393994 -1829008 -1957322 -1778725 -1079321 -518318 -1087604
38807a087604j516928j255195l31709K38746M39297P68181J213133J486454J551805
$$ -1087604 -2604532 -3859727 -4191436 -3952690 -3513393 -2745212 -1532079 -45625 1506180
38798A506180J365315P94342J11643k18710l57739p43645j048340p64404n65796
$$ 1506180 2871495 3665837 3777480 3558770 3201031 2457386 1409046 644642 78846
38789G8846j290026j794992k82246K099928K049639o14790j912769K24763K319900
$$ 78846 -1211180 -3006172 -3288418 -1188490 861149 246359 -1666410 -1441647 878253
38780H78253P49341k256231k019230J227641K939114J321036p52820r70233m66358
$$ 878253 1627594 -628637 -2647867 -1420226 1518888 2839924 2087104 1116871 650513
38771F50513o28031p71105l43704k66147o17283J59578K196608L029009J225154
$$ 650513 22482 -748623 -1092327 -1358474 -1975757 -1816179 380429 3409438 4634592
38762D634592j222585j960980j469364j241385r67705J69536J247110J136914
$$ 4634592 3412007 1451027 -18337 -1259722 -2227427 -2057891 -810781 326133
38754C26133Q19876J646557K515792J447518r03692k048865j531354j282753k106067
$$ 326133 1146009 2792566 5308358 6755876 5852184 3803319 2271965 989212 -1116855
38745a116855k391145r22936J108079J777321P51541o77206r42764N55028K619663
$$ -1116855 -3508000 -4430936 -3322857 -1545536 -793995 -1471201 -2413965 -1858937 760726
38736G60726K893159N26731k153502k206362L176J351424L81783j040462r85150
$$ 760726 3653885 4180616 2027114 -179248 -176072 1175352 1557135 516673 -468477
38727d68477r7581J32171k02149k44051j50711l85252l19151P27392J791444J395036
$$ -468477 -566058 -433887 -636036 -880087 -1030798 -1416050 -1735201 -1007809 783635 2178671
38717B178671o836m82803M52497J099692K55113q89575n55064R19686J528790
$$ 2178671 2171835 1689032 2141529 3241221 3496334 2606759 2051695 2971381 4500171
38708D500171M64213p91725o11246N48236R31972J7666q66705n82424K16900J82854
$$ 4500171 4964384 4172659 3561413 4109649 5041621 5059287 4192582 3610158 3827058 4009912
38698D009912p35128j326859q67328J08758Q10770J135342J304702J168735L59398
$$ 4009912 3274784 1947925 1080597 1189355 2000125 3135467 4440169 5608904 5968302
38689E968302j020465k165277k152070q87493N61785R56523L14446j78657R3018
$$ 5968302 4947837 2782560 630490 -257003 304782 1261305 1575751 1397094 1490112
38680A490112L45776r8071m18145M22757J656571J500889j81507j551871j329754
$$ 1490112 1835888 1737817 1319672 1742429 3399000 4899889 4718382 3166511 1836757
38671A836757k35079N17080P96466R45222P70938P9763n85086n98949j16586L23565
$$ 1836757 1601678 2118758 2915224 3860446 4631384 4711147 4126061 3527112 3410526 3734091
38661C734091M81455K13417o91862j870348k265239j348811P2766Q61194Q08150
$$ 3734091 4215546 4428963 3737101 1866753 -398486 -1747297 -1674531 -813337 -5187
38652e187L95164l5116k77075j06186K43995J11817m86845n60754L69945J369443
$$ -5187 389977 354861 77786 -28400 215595 327412 -159433 -720187 -350242 1019201
38642A019201J491197J117039Q54173J59891j452380k699251j900381K89702J427748
$$ 1019201 2510398 3627437 4481610 4641501 3189121 489870 -1410511 -1120809 306939
38633C06939N93319o46030q37584m03666j97121q584M61127M96459n06466j707924
$$ 306939 900258 254228 -583356 -987022 -1184143 -1192727 -731600 -235141 -741607 -2449531
38623b449531j833669r26658j7725M63462Q56272J175793R94926L94278K9019
$$ -2449531 -4283200 -5209858 -5227583 -4764121 -3907849 -2732056 -1737130 -1342852 -1313833
38614a313833R9510J15733q1550P9152Q13059J248265N67462n48814n82353P30967
$$ -1313833 -1214323 -1098590 -1180140 -1100988 -287929 960336 1527798 978984 396631 1127598
38604A127598J918977J735129P43548K47449L36510P9913o66694r41447l08291
$$ 1127598 3046575 4781704 5525252 5772701 6109211 6189124 5522430 4580983 4272692
38595D272692M05353M36161M8314l93766j150655k055279j905908j90314J494938
$$ 4272692 4678045 5114206 5162520 4768754 3618099 1562820 -343088 -533402 961536
38586I61536J306743j40069o23838M13822J287642Q67114P2316l2210M9984n14179
$$ 961536 2268279 2128210 1504372 1918194 3205836 4072950 4145266 4113056 4163040 3648861
38576C648861j169768p15016Q98834K440233K636015J027632j687106l616903
$$ 3648861 2479093 1764077 2662911 5103144 7739159 8766791 7079685 3462782
38568C462782k927684l1579K254847J789662k72054j084628J45537J424230R34243
$$ 3462782 535098 503519 2758366 4548028 4275974 3191346 3336883 4761113 5695356
38559E695356o71427j478449q50031N8801p964q55071j111690J06781J975068
$$ 5695356 5023929 3545480 2695449 2754250 2746286 1891215 779525 886306 2861374
38550B861374K620620J134560j312446k631105j932982k10621R27594P85111j53414
$$ 2861374 5481994 6616554 5304108 2673003 740021 529400 1456994 2242105 2088691
38541B088691j011164j237184o98876M49687J658885K004772R69755o59487j363571
$$ 2088691 1077527 -159657 -858533 -408846 1250039 3254811 4224566 3565079 2201508
38532B201508p59466j50656n38598r75337j39017J166940R28988q10948j718511
$$ 2201508 1442042 1291386 752788 -222549 -361566 805374 1734362 923414 -795097
38523g95097o99249M65340J49128m38897N67476K310044K302470K25288j649943
$$ -795097 -1494346 -1029006 -879878 -1318775 -751299 1558745 3861215 4086503 2436560
38514B436560j756368r03364l28327P7420P97800J298220O59507r96778k444691
$$ 2436560 680192 -223172 -551499 -474079 323721 1621941 2281448 1284670 -1160021
38505a160021k510209j095553O77743J424635R63103N33544J064361J798151J533648
$$ -1160021 -3670230 -4765783 -4088040 -2663405 -1700302 -1166758 -102397 1695754 3229402
38496C229402O12515L01277N38298j8505j564158k465834j588253J35454J197989
$$ 3229402 3841917 4143194 4681492 4662987 3098829 632995 -955258 -819804 378185
38487C78185J334500J038083M58518j87536j05596R68808J810447J057476q15150
$$ 378185 1712685 2750768 3209286 3021750 2916154 3884962 5695409 6752885 5937735
38478E937735j938959j359879m0249M98902q1426p36640l56182Q03779J203020
$$ 5937735 3998776 2638897 2598648 3097550 3016124 2279484 1923302 2727081 3930101
38469C930101j17623k041373k541001j222812L63172J034319J252608J643345
$$ 3930101 3812478 1771105 -769896 -1992708 -1629536 -595217 657391 2300736
38461B300736J700274R17995n869k81814l75599j009422j657311j377229m85112
$$ 2300736 4001010 4919005 4913136 4631322 4255723 3246301 1588990 211761 -273351
38452b73351l8466j62432j96128j6838R0531L52850Q92136P83911o09881j896678
$$ -273351 -311817 -474249 -670377 -687215 -596684 -243834 648302 1432213 822332 -1074346
38442a074346j224705O79397J283192J33547m80660O70373J811135J226430k3290
$$ -1074346 -2299051 -1619654 -336462 -202915 -683575 -13202 1797933 3024363 3001073
38433C001073k05606J58046l66644j227939p67847O95254J091732j52056j254900
$$ 3001073 2795467 2953513 2586869 1358930 591083 1286337 2378069 2226013 971113
38424I71113q53977J78950L87151k12956n87236k68988K98368M58696j14152j129144
$$ 971113 117136 296086 683237 470281 -116955 -385943 -87575 371121 256969 -872175
38414h72175j690407j141876o8453K16731n87696j283714p81153N33369J525455
$$ -872175 -2562582 -3704458 -3772911 -3556180 -4143876 -5427590 -6208743 -5675374 -4149919
38405d149919J762074J616736J427360J229993J030096P31238K1524j097143j863766
$$ -4149919 -2387845 -771109 656251 1886244 2916340 3647578 3669102 2571959 708193
38396G08193j468310j65672Q75787Q89295K25668k68325j11348O58235J673887
$$ 708193 -760117 -925789 -50002 839293 1064961 796636 685288 1343523 3017410
38387C017410K309950J939387N19967j186807k230927k266149j645238r12913
$$ 3017410 5327360 7266747 7786714 6599907 4368980 2102831 457593 -455320
38379d55320l89792j10627P8178L58364P49942J101148J297999J337798J139200
$$ -455320 -845112 -955739 -877561 -519197 230745 1331893 2629892 3967690 5106890
38370E106890N47893k84170q32569q39187p17287q51195p98344O8945J251291
$$ 5106890 5654783 5370613 4538044 3698857 2981570 2130375 1332031 1400976 2652267
38361B652267J431202L48325o08694k61567P68489J139710O99932K47440m2304
$$ 2652267 4083469 4431794 3823100 3561533 4330022 5469732 6169664 6417104 6374800
38352F374800o23591j286018j323582j036829j485477k345792j712709R69456
$$ 6374800 5751209 4465191 3141609 2104780 619303 -1726489 -3439198 -2469742
38344b469742L261176K544578m32440k498263k067719n05845M11202O06343P71184
$$ -2469742 791434 3336012 2903572 405309 -1662410 -2168255 -1757053 -1150710 -379526
38335c79526Q35107L63052l85093p74610p60773p90243r89679j044350p43662
$$ -379526 455581 818633 433540 -341070 -1101843 -1892086 -2881765 -3926115 -4669777
38326d669777j96700M05880R09349J144763J015513O12844J45016j68653j32713
$$ -4669777 -4866477 -4460597 -3551248 -2406485 -1390972 -778128 -633112 -801765 -934478
38317i34478K94218Q58900J173628J016695L66831o32273j465652j376761k87038
$$ -934478 -640260 218640 1392268 2408963 2775794 2143521 677869 -698892 -985930
38308i85930P15227O13497n787K89055J482545J888215O51652q58349j045979
$$ -985930 -270703 342794 337007 626062 2108607 3996822 4648474 3790125 2744146
38299B744146l21787r3977l79665K2775J295289K070779J321884l98041j879826
$$ 2744146 2422359 2328382 1948717 1971492 3266781 5337560 6659444 6261403 4381577
38290D381577k446985j936673m63625J275076K157299J674230M61277m98363q08312
$$ 4381577 1934592 -2081 -465706 809370 2966669 4640899 5102176 4603813 3795501
38281C795501o00549n5109O40705J140934J071580K84215r47696j815771j396711
$$ 3795501 3194952 3139843 3780548 4921482 5993062 6277277 5329581 3513810 2117099
38272B117099K74415J805191J855855Q05059J44903K93885J45093r51256j967617
$$ 2117099 2391514 4196705 6052560 6857619 7002522 7296407 7441500 6490244 4522627
38263D522627j679333m58096L20170J25214l08953j47177O01204J176796Q13968
$$ 4522627 2843294 2385198 2705368 2830582 2521629 2374452 2975656 4152452 4966420
38254D966420l45320j032064j85547J387676J674447J55386j323874j118666L185
$$ 4966420 4621100 3589036 3403489 4791165 6465612 6620998 5297124 4178458 4181643
38245D181643L80670R0523M44575J526817K019144J312792J80986o81905j320178
$$ 4181643 4562313 4652836 5097411 6624228 8643372 9956164 10137150 9455245 8135067
38236H135067j639918j338728q72613j024486j324596n38967R30468J042838o78580
$$ 8135067 6495149 5156421 4283808 3259322 1934726 1395759 2326227 3369065 2690485
38227B690485j892537p97671R46126O24638j324507j841662L05871K834614L171939
$$ 2690485 797948 277 946403 1571041 246534 -1595128 -1289257 1545357 4717296
38218D717296J589677J44594l14452p61874j951060k958198k328095k24310J423439
$$ 4717296 6306973 6451567 6137115 5375241 3424181 465983 -1862112 -2086422 -662983
38209f62983J253746K23891J18695Q14981N59555r37725j593931j07780J702188
$$ -662983 590763 814654 933349 1748330 2307885 1370160 -223771 -331551 1370637
38200A370637J392175n09818j458281p09706J03583L5486N7862P47727R62210
$$ 1370637 2762812 2252994 794713 85007 188590 224076 281938 1029665 1991875
38191A991875r1165j183119q25099M70889J024780K91171q33378j401845j090756
$$ 1991875 1900710 717591 -107508 363381 1388161 1679332 845954 -555891 -1646647
38182a646647n702J216597J525152N58381o90830j031961m91877J08098M38429
$$ -1646647 -1652349 -435752 1089400 1647781 956951 -75010 -566887 -458789 -20360
38173b0360O54934N90268j2277o93623o88331p1826L21740P1414m60529q20617
$$ -20360 634574 1224842 1212565 518942 -169389 -241215 80525 151939 -308590 -1129207
38163a129207q17900l24334N37834J110305Q13065m6360p00974r06396p81731
$$ -1129207 -1947107 -2271441 -1733607 -623302 189763 143403 -557571 -1463967 -2245698
38154b245698r0201J270312K331811J875084K00696j115474j290804q89594k71084
$$ -2245698 -2335899 -1065587 1266224 3141308 3342004 2226530 935726 46132 -224952
38145b24952Q67066J948220J349146j124743l114879k520655l06208J053614R52238
$$ -224952 642114 2590334 3939480 2814737 -300142 -2820797 -3127005 -2073391 -1121153
38136a121153O48589O09048Q4915p22493l74647J265988K194471J111419m64734
$$ -1121153 -472564 136484 221399 -501094 -875741 390247 2584718 3696137 3231403
38127C231403m30645O95101O09468j226933k753251k244338n22421M91616L51639
$$ 3231403 2800758 3495859 4105327 2878394 125143 -2119195 -2641616 -2150000 -1798361
38118a798361K06014Q63733J759935J900390J153371K87856J0614K71644N25738
$$ -1798361 -1592347 -728614 1031321 2931711 4085082 4372938 4383552 4655196 5180934
38109E180934M71806K78508M9109n13982j452608j857137p02930J440850K494393
$$ 5180934 5652740 5931248 5980357 5466375 4013767 2156630 1453700 2894550 5388943
38100E388943J310903p51904j648294j342644j319604j810117j399836K64409
$$ 5388943 6699846 5947942 4299648 2957004 1637400 -172717 -1572553 -1308144
38092a308144J371396O75455l59767J53650J375410J058042o56590j273286J02431
$$ -1308144 63252 738707 378940 532590 1908000 2966042 2309452 1036166 1138597
38083A138597J310293N01489j138269j406051k35865P76833R10210P11371N25640
$$ 1138597 2448890 2950379 1812110 406059 170194 947027 1857237 2568608 3094248
38074C094248K09683j4659K26069N84176M62685Q0306m8098l07141j332832k449594
$$ 3094248 3303931 3289272 3515341 4099517 4562202 4642508 4594410 4287269 2954437 504843
38064E04843k277552r05854P9593k8789j98837L48457Q16442L65890l02668k4844
$$ 504843 -1772709 -2678563 -2598970 -2627759 -2826596 -2478139 -1661697 -1295807 -1598475 -1623319
38054a623319J023272J699802J511880Q58534O2876q81272j767728k174140j993815
$$ -1623319 -600047 1099755 2611635 3470169 3533045 2651773 884045 -1290095 -3283910
38045c283910j469454p77122L5113Q12044J297764J277789O45159l65525j019726
$$ -3283910 -4753364 -5530486 -5495373 -4683329 -3385565 -2107776 -1462617 -1828142 -2847868
38036b847868p37902q395Q6412n25035o58209L23866J390822J243732N8651r58443
$$ -2847868 -3585770 -3594165 -3507753 -4032788 -4690997 -4367131 -2976309 -1732577 -1673926 -2632369
38026b632369j068441k46565J313249K942899L415202K254209O08237l09167r86487
$$ -2632369 -3700810 -3947375 -2634126 308773 3723975 5978184 6586421 6277254 5290767
38017E290767k345193l311041j788053J749405L837470K284159p84210j663255
$$ 5290767 2945574 -365467 -2153520 -404115 3433355 5717514 4933304 3270049
38009C270049J57958J741939R51579q55474j103479K46582O95808j094660l099875
$$ 3270049 3428007 5169946 6121525 5266051 4162572 4409154 5104962 4010302 910427
38000I10427k530899J75311J740521N27071j337923j334199j84302j87007j229574
$$ 910427 -1620472 -1445161 295360 822431 -515492 -1849691 -2033993 -2221000 -3450574
37991c450574j089931O57458J801496J052706m1222J94635J020630Q74773j25750
$$ -3450574 -4540505 -3883047 -2081551 -1028845 -1070067 -875432 145198 1019971 894221
37982H94221q29596r50274p98598j53784J068939J865869J365848L16903p1029
$$ 894221 64625 -885649 -1684247 -1838031 -769092 1096777 2462625 2779528 2708499
37973B708499o8250o71563j521661j309537k97R87599P87058j36117j108481j776943
$$ 2708499 2640249 1968686 447025 -862512 -862809 124790 911848 775731 -332750 -2109693
37963b109693j643582n30041N62468N44265J04397Q26362K437969K887837J525753
$$ -2109693 -3753275 -4283316 -3720848 -3176583 -3072186 -2245824 192145 3079982 4605735
37954D605735J63086J71157M96278k06522j190658r65687K46423J083055J176049
$$ 4605735 4768821 4939978 5436256 5229734 4039076 3073389 3319812 4402867 5578916
37945E578916J111368R58228M43875O8147L98825N93983o37789k644065l181823
$$ 5578916 6690284 7648512 8092387 8160534 8559359 9153342 8515553 5871488 2689665
37936B689665j569936J25153j24125j586508j938869l87007J569976K254516J616536
$$ 2689665 1119729 1244882 1120757 -465751 -2404620 -2791627 -1221651 1032865 2649401
37927B649401O86014R721o77329j414382j465107l31072J111825J372792L16616
$$ 2649401 3335415 3345136 2667807 1253425 -211682 -542754 569071 1941863 2258479
37918B258479n19601J0057J128787J372750O20172j00135l25022n12951q69255
$$ 2258479 1738878 1748935 2877722 4250472 4870644 4770509 4445487 3932536 3063281
37909C063281r99068q35260q55668j129841j088978n49978r0032n4556n3457J60627
$$ 3063281 2064213 1228953 373285 -756556 -1845534 -2395512 -2485544 -2540100 -2593557 -2432930
37899b432930K17488N1077L49449J324881J901036J148990j05556l02266N82912
$$ -2432930 -2215442 -2164365 -1814916 -490035 1411001 2559991 2454435 2152169 2735081
37890B735081J075127M85005j64348Q6059N63285K6553j337953j961816q63113
$$ 2735081 3810208 4295213 4130865 4216924 4780209 4806762 3468809 1506993 643880
37881F43880J116534K205971J469459m31745j940418j909688m64813J140584J566645
$$ 643880 1760414 3966385 5435844 5004099 3063681 1153993 689180 1829764 3396409
37872C396409N45022q90245j426216p53149K98016Q21534O56604N7886q42364
$$ 3396409 3941431 3051186 1624970 871821 1169837 1991371 2647975 2705861 1863497
37863A863497j732504j812095o78534O96473R25571J70367m9693O88423Q78303
$$ 1863497 130993 -1681102 -2359636 -1663163 -737592 -567225 -616918 71505 949808
37854I49808m30697j703466r98439R56095J665673M79792p30427o47798j89058
$$ 949808 519111 -1184355 -2182794 -1226699 438974 918766 188339 -459459 -648517
37845f48517l85018n00877M19748J594994J679444R14633M83319M20540j16873
$$ -648517 -1033535 -1534412 -1114664 480330 2159774 3074407 3557726 3978266 3861393
37836C861393r10963q26247J40633P04821M16742K09380L38272l77827k199308
$$ 3861393 2950430 2124183 2264816 2969637 3386379 3595759 3934031 3556204 1356896
37827A356896l015061r76372K380386L574099J528075j227371j922581o27641
$$ 1356896 -1658165 -2634537 -254151 3319948 4848023 3620652 1698071 1070430
37819A070430O42816O92150n134n72514p48694o45079k74823L35741Q81112R46781
$$ 1070430 1713246 2405396 2400262 1827748 1079054 433975 159152 494893 1376005 2322786
37809B322786M71657o5409n3010N43883R49578L18949j150338k087986j289619
$$ 2322786 2794443 2729034 2676024 3219907 4169485 4488434 3338096 1250110 -39509
37800c9509Q06921K338590J934228J81807j142429j129404m92980k54276l99284
$$ -39509 767412 3106002 5040230 5222037 4079608 2950204 2457224 2202948 1803664
37791A803664l22046j8119k33k38444j02933N09073Q11907K42070p21301j257870
$$ 1803664 1481618 1463499 1463266 1224822 1121889 1630962 2442869 2684939 1963638 705768
37781G05768j182275p84208k00359N32908J176305J519675J599800J322919L63966
$$ 705768 -476507 -1260715 -1461074 -928166 248139 1767814 3367614 4690533 5054499
37772E054499j043418j763822r82431N62958J373202J006622L21240N8726O5221
$$ 5054499 4011081 2247259 1264828 1827786 3200988 4207610 4528850 4587576 4652797
37763D652797l7801k40047m24282o25433p75499o72818l61618j39166j25959j88070
$$ 4652797 4614996 4374949 3950667 3325234 2549735 1876917 1515299 1376133 1250174 1062104
37753A062104k14071j05750K54280N68092J30057r89876j363588O831J776019
$$ 1062104 848033 742283 996563 1564655 1694712 704836 -658752 -651921 1124098
37744A124098J736960Q7274p24650K16039Q26095n52895k302715j977629j51224
$$ 1124098 2861058 2948332 2223682 2439721 3265816 2712921 410206 -1567423 -1718647
37735a718647N26921n54049j238752j27982J345388J171832m48176j633930j254951
$$ -1718647 -1191726 -1745775 -2984527 -3112509 -1767121 -595289 -1043465 -2677395 -3932346
37726c932346R2167J067301Q82337j26052q21368l63602Q57779J644772J346632
$$ -3932346 -3840179 -2772878 -1890541 -2016593 -2837961 -3201563 -2343784 -699012 647620
37717F47620L98241m44638q28114o92333r7629N67289P22498K73284k14695k67006
$$ 647620 1045861 601223 -226891 -919224 -1016853 -449564 272934 546218 331523 64517
37707F4517p5679p2467k60427k99061q2584O1814k21081p97164j020656m07603
$$ 64517 -11162 -83629 -344056 -643117 -725701 -663887 -884968 -1682132 -2702788 -3110391
37697c110391O42939J131377O35834j86195n42851m40135k17891K43346J094579
$$ -3110391 -2467452 -1336075 -700241 -886436 -1429287 -1869422 -2087313 -1843967 -749388
37688g49388J780779J674499J117457Q02552M05381q98329k623462l155073k059447
$$ -749388 1031391 2705890 3823347 4625899 5031280 4132951 1509489 -1645584 -3705031
37679c705031p97084n17498m83948L84602J565690J757898R02976J39431J60424
$$ -3705031 -4502115 -5019613 -5503561 -5118959 -3553269 -1795371 -892395 -752964 -592540
37670e92540P20714J457344K088750J952138M92334j603885k687220j950870l91033
$$ -592540 128174 1585518 3674268 5626406 6118740 4514855 1827635 -123235 -514268
37661e14268L59886k21722j222818j428217n21480P56832J445532J208555L53458
$$ -514268 -154382 -376104 -1598922 -3027139 -3548619 -2791787 -1346255 -137700 215758
37652B15758o48232j297924j048987J32512J257363J200486K08591l54699P6622
$$ 215758 -432474 -1730398 -2779385 -2646873 -1389510 -189024 19567 -335132 -258510
37643b58510O76584Q33737J016554J385982J011884l91702j312344n64670N61514
$$ -258510 418074 1251811 2268365 3654347 4666231 4274529 2962185 2397515 2959029
37634B959029J24486j379519j867695j015280l48817k07007P10147K345001K546991
$$ 2959029 3083515 1703996 -163699 -1178979 -1527796 -1734803 -1024656 1320345 3867336
37625C867336M33578j874688k328386j660674j313909o62382J389407L522097
$$ 3867336 4300914 2426226 97840 -1562834 -2876743 -3539125 -2149718 1372379
37617A372379L420614J384537q7083j36836m58766k032258l276726k435978j40057
$$ 1372379 4792993 6177530 6090447 5953611 5494845 3462587 185861 -2250117 -2390174
37608b390174J509699J375297J1810j195284j066162M01796J718504J390928q7965
$$ -2390174 -880475 494822 506632 -688652 -1754814 -1353018 365486 1756414 1668449
37599A668449q26521k63480J91929k65253m15937O85242J661155Q39276q33588
$$ 1668449 841928 578448 770377 505124 89187 774429 2435584 3274860 2441272
37590B441272j011632M80974J484278Q79199j0009R4325M77561K2090p81899q09147
$$ 2441272 1429640 1910614 3394892 4274091 4264082 4358407 4835968 4858058 4076159 3267012
37580C267012k92789l25699q51270o73712M84985J285387O36165p17095j262485
$$ 3267012 2974223 2648524 1797254 1123542 1608527 2893914 3530079 2812984 1550499
37571A550499q22785o14420j252213j672704o34282J264491J995449O03702j483849
$$ 1550499 727714 113294 -1138919 -2811623 -3445905 -2181414 -185965 417737 -1066112
37562a066112k091233p25934J164751K021467J592309O27728j62115n95367q02710
$$ -1066112 -3157345 -3883279 -2718528 -697061 895248 1522976 1360861 765494 -37216
37553c7216q18323m78296J76875N59972J16628o91160p47661K5360K83489p10884
$$ -37216 -855539 -1333835 -1156960 -596988 -480360 -1171520 -1919181 -1893821 -1610332 -2321216
37543b321216j681149j137171L02614R68402Q29338J138286J752230J210442l09904
$$ -2321216 -4002365 -5139536 -4836922 -3868520 -3039182 -1900896 -148666 1061776 751872
37534G51872p20499M68385R82633m27905j569655l25332J588366J191244r49494
$$ 751872 31373 499758 1482391 1054486 -515169 -840501 747865 1939109 989615
37525I89615j644405o5871J385082J098404J12298m48615r84607j644671j419380
$$ 989615 -654790 -720661 664421 1762825 1875123 1426508 441901 -1202770 -2622150
37516b622150j39115O60708L5078r13519q77093k5160J013440K108178K675259
$$ -2622150 -2761265 -2100557 -2065479 -2978998 -3856091 -3881251 -2867811 -759633 1915626
37507A915626J701256j47404m40912J541185L205724K249230j5368j014653q51632
$$ 1915626 3616882 3469478 3028566 4569751 7775475 10024705 10009337 8994684 8143052
37498H143052j332376k362739k210940p82988J25047k16873o57700m15125j3890
$$ 8143052 6810676 4447937 2236997 1454009 1579056 1362183 704483 289358 275468
37489B75468J67429L10435J7741j236826k377924j572863Q23581K287795J695122
$$ 275468 442897 753332 771073 -465753 -2843677 -4416540 -3592959 -1305164 389958
37480C89958P97659J254319K134854J652762j06200j545351j693025r29111k66522
$$ 389958 1187617 2441936 4576790 6229552 6123352 4578001 2884976 1955865 1689343
37471A689343n34220j579620k061315r95554N39388O79140k94067k65378J192108
$$ 1689343 1155123 -424497 -2485812 -3481366 -2941978 -2262838 -2556905 -2822283 -1630175
37462a630175J993385J087523L11574J189988K208420J345093n65147j315757
$$ -1630175 363210 1450733 1762307 2952295 5160715 6505808 5940661 4624904
37454D624904p17801j63865l1022J00259k56002j426515j767939K79465K986206
$$ 4624904 3907103 3743238 3712216 3812475 3556473 2129958 362019 641484 3627690
37445C627690L172784R39923n83679k51953k41958j705653k568041j233341N25574
$$ 3627690 6800474 7740397 7156718 6904765 6662807 4957154 2389113 1155772 1681346
37436A681346N04846m93424m98560K53211K73597k59539r6158N10555L29493l07839
$$ 1681346 2186192 1692768 1194208 1447419 1721016 1461477 1365319 1875874 2205367 1897528
37426A897528L7255J089747R26178q20322k034584j203908L46482M36017r32390
$$ 1897528 1934783 3024530 3950708 3130386 1095802 -108106 238376 674393 -257997
$$ [...]
##END NTUPLES=NMR SPECTRUM
##END=
