##TITLE=31Pdec_DE-45rm
 
 24 sc
 5.4.2024
##JCAMPDX= 6.0         $$ Bruker NMR JCAMP-DX V2.0
##DATA TYPE= NMR SPECTRUM
##DATA CLASS= NTUPLES
##ORIGIN= UXNMR, Bruker Analytische Messtechnik GmbH
##OWNER= root
$$ XWIN-NMR		Version 3.5
$$ Fri Apr  5 14:26:24 2024 Russian Standard Time (UT+4h)  she@DPX200
##.OBSERVE FREQUENCY= 81.013821
##.OBSERVE NUCLEUS= ^31P
##.ACQUISITION MODE= SIMULTANEOUS
##.ACQUISITION SCHEME= undefined
##.AVERAGES= 24
##.DIGITISER RES= 16
##SPECTROMETER/DATA SYSTEM= spect
##.PULSE SEQUENCE= zgpg30
##.SOLVENT NAME= CDCl3
##.SHIFT REFERENCE= (INTERNAL, CDCl3, 0, 248.564)
##AUDIT TRAIL= $$ (NUMBER, WHEN, WHO, WHERE, WHAT)
$$ ##TITLE= Audit trail, XWIN-NMR		Version 3.5
$$ ##JCAMPDX= 5.01
$$ ##ORIGIN= Bruker BioSpin GmbH
$$ ##OWNER= she
$$ F:/spectra/data/she/nmr/P31/1/pdata/1/auditp.txt
$$ ##AUDIT TRAIL=  $$ (NUMBER, WHEN, WHO, WHERE, WHAT)
(   1,<2024-04-05 14:25:37.17 +0400>,<she>,<DPX200>,
      <created by zg, POWCHK disabled, PULCHK disabled
       configuration hash MD5:
       00 E9 B6 7A A2 85 ED C7 34 08 36 98 17 FE 4E 26
       data hash MD5: 32K
       BA 8C 81 9F DC 41 A7 CB 51 FE 6D F6 74 F4 77 14>)
(   2,<2024-04-05 14:25:40.23 +0400>,<she>,<DPX200>,
      <Start of raw data processing
       efp BC_mod = 2 LB = 10 FT_mod = 6 PKNL = 1 PHC0 = -13232.09 PHC1 = 65.08333 SI = 64K 
       data hash MD5: 64K
       28 A2 D4 66 30 7B 54 4B 5A 4C F0 B0 27 62 0B 7D>)
(   3,<2024-04-05 14:25:50.92 +0400>,<she>,<DPX200>,
      <pk PHC0 = 31.21251 PHC1 = 0 
       data hash MD5: 64K
       33 03 32 E4 12 9A B7 59 D1 31 35 C1 BD 59 0D 44>)
$$ ##END=
$$ 
$$ hash MD5
$$ A3 AF E9 42 64 55 55 FA 9D 31 B7 9E 1C C1 14 DB
##$RELAX= 
##$RELAX= 
##$RELAX= 
##$RELAX= 
##$RELAX= 
##$RELAX= 
##$RELAX= 
##$RELAX= 
##$RELAX= 
$$ Bruker specific parameters
$$ --------------------------
##$DU= <F:/spectra>
##$EXPNO= 1
##$NAME= <P31>
##$PROCNO= 1
##$TYPE= <nmr>
##$USER= <she>
##$AMP= (0..31)
100 100 100 100 100 100 100 100 100 100 100 100 100 100 100 100 100 100 
100 100 100 100 100 100 100 100 100 100 100 100 100 100 
##$AQSEQ= 0
##$AQ_mod= 1
##$AUNM= <au_zg>
##$AUTOPOS= <>
##$BF1= 81.014009
##$BF2= 200.13
##$BF3= 200.13
##$BF4= 200.13
##$BF5= 200.13
##$BF6= 200.13
##$BF7= 200.13
##$BF8= 200.13
##$BYTORDA= 1
##$CFDGTYP= 0
##$CFRGTYP= 5
##$CHEMSTR= <none>
##$CNST= (0..31)
1 1 145 1 1 1 1 1 1 1 1 1 1 1 1 1 1 1 1 1 1 1 1 1 1 1 1 1 1 1 1 1 
##$CPDPRG= <waltz16>
##$CPDPRG1= <>
##$CPDPRG2= <waltz16>
##$CPDPRG3= <>
##$CPDPRG4= <mlev>
##$CPDPRG5= <mlev>
##$CPDPRG6= <mlev>
##$CPDPRG7= <mlev>
##$CPDPRG8= <mlev>
##$CPDPRGB= <>
##$CPDPRGT= <>
##$D= (0..31)
0 1 0 0 0 0 0 0 0 0 0 0.03 2e-05 3e-06 0 0 0 0 0 0 0 0 0 0 0 0 0 0 0 0 
0 0 
##$DATE= 1712312736
##$DBL= (0..7)
120 120 120 11 120 120 24 19 
##$DBP= (0..7)
150 150 150 150 150 150 150 150 
##$DBP07= 0
##$DBPNAM0= <>
##$DBPNAM1= <>
##$DBPNAM2= <>
##$DBPNAM3= <>
##$DBPNAM4= <>
##$DBPNAM5= <>
##$DBPNAM6= <>
##$DBPNAM7= <>
##$DBPOAL= (0..7)
0.5 0.5 0.5 0.5 0.5 0.5 0.5 0.5 
##$DBPOFFS= (0..7)
$$ [...]
##$SUBNAM2= <"">
##$SUBNAM3= <"">
##$SUBNAM4= <"">
##$SUBNAM5= <"">
##$SUBNAM6= <"">
##$SUBNAM7= <"">
##$SUBNAM8= <"">
##$SUBNAM9= <"">
##$SW= 501.771253377433
##$SWIBOX= (0..15)
0 1 3 0 0 0 0 0 0 0 0 0 0 0 0 0 
##$SW_h= 40650.406504065
##$TD= 32768
##$TD0= 1
##$TE= 0
##$TE2= 300
##$TE3= 300
##$TEG= 300
##$TL= (0..7)
0 120 53 12 22 120 120 120 
##$TP= (0..7)
150 150 150 150 150 150 150 150 
##$TP07= 0
##$TPNAME0= <>
##$TPNAME1= <>
##$TPNAME2= <>
##$TPNAME3= <>
##$TPNAME4= <>
##$TPNAME5= <>
##$TPNAME6= <>
##$TPNAME7= <>
##$TPOAL= (0..7)
0.5 0.5 0.5 0.5 0.5 0.5 0.5 0.5 
##$TPOFFS= (0..7)
0 0 0 0 0 0 0 0 
##$TUNHIN= 0
##$TUNHOUT= 0
##$TUNXOUT= 0
##$USERA1= <user>
##$USERA2= <user>
##$USERA3= <user>
##$USERA4= <user>
##$USERA5= <user>
##$V9= 5
##$VALIST= <valist>
##$VCLIST= <CCCCCCCCCCCCCCC>
##$VD= 0
##$VDLIST= <DDDDDDDDDDDDDDD>
##$VPLIST= <PPPPPPPPPPPPPPP>
##$VTLIST= <TTTTTTTTTTTTTTT>
##$WBST= 1024
##$WBSW= 4
##$XGAIN= (0..3)
0 0 0 0 
##$XL= 0
##$YL= 0
##$YMAX_a= 4318
##$YMIN_a= -2345
##$ZGOPTNS= <>
##$ZL1= 120
##$ZL2= 120
##$ZL3= 120
##$ZL4= 120
##$ABSF1= 0
##$ABSF2= 0
##$ABSG= 0
##$ABSL= 0
##$ALPHA= 0
##$AQORDER= 0
##$ASSFAC= 0
##$ASSFACI= 0
##$ASSFACX= 0
##$ASSWID= 0
##$AUNMP= <proc_1d>
##$AZFE= 0.1
##$AZFW= 0.5
##$BCFW= 0
##$BC_mod= 2
##$BYTORDP= 0
##$COROFFS= 0
##$CY= -3
##$DATMOD= 1
##$DC= 0
##$DFILT= <>
##$DTYPP= 0
##$F1P= 0
##$F2P= 0
##$FCOR= 1
##$FTSIZE= 65536
##$FT_mod= 6
##$GAMMA= 0
##$GB= 0
##$INTBC= 1
##$INTSCL= 6.047779e-11
##$ISEN= 30
##$LB= 10
##$LEV0= 0
##$LPBIN= 0
##$MAXI= 10000
##$MC2= 0
##$MEAN= 0
##$ME_mod= 0
##$MI= 50
##$NCOEF= 0
##$NC_proc= -9
##$NLEV= 6
##$NOISF1= 182.463
##$NOISF2= 159.3651
##$NSP= 0
##$NTH_PI= 0
##$NZP= 0
##$OFFSET= 248.5645
##$PC= 4
##$PHC0= -13200.88
##$PHC1= 65.08333
##$PH_mod= 1
##$PKNL= yes
##$PPARMOD= 0
##$PSCAL= 0
##$PSIGN= 0
##$REVERSE= no
##$SF= 81.0140089999694
##$SI= 65536
##$SIGF1= 159.3651
##$SIGF2= -187.1042
##$SINO= 113.3802
##$SIOLD= 16384
##$SREGLST= <1H.CDCl3>
##$SSB= 0
##$STSI= 65536
##$STSR= 0
##$SW_p= 40650.406504065
##$SYMM= 0
##$S_DEV= 0
##$TDeff= 32768
##$TDoff= 0
##$TI= <>
##$TILT= no
##$TM1= 0
##$TM2= 0
##$TOPLEV= 0
##$USERP1= <user>
##$USERP2= <user>
##$USERP3= <user>
##$USERP4= <user>
##$USERP5= <user>
##$WDW= 1
##$XDIM= 65536
##$YMAX_p= 507179293
##$YMIN_p= -13268911
$$ End of Bruker specific parameters
$$ ---------------------------------
##NTUPLES= NMR SPECTRUM
##VAR_NAME=  FREQUENCY,     SPECTRUM/REAL,   SPECTRUM/IMAG
##SYMBOL=    X,             R,               I
##VAR_TYPE=  INDEPENDENT,   DEPENDENT,       DEPENDENT
##VAR_FORM=  AFFN,          ASDF,            ASDF
##VAR_DIM=   65536,         65536,           65536
##UNITS=     HZ,            ARBITRARY UNITS, ARBITRARY UNITS
##FACTOR=    0.620285442955139, 1,           1
##FIRST=     20137.2065510682, 0,            0
##LAST=      -20513.1999529968, 0,           0
##MIN=       -20513.1999529968, -13268911,   0
##MAX=       20137.2065510682, 507179293,    0
$$ Real data points
##PAGE= N=1
##DATA TABLE= (X++(R..R)), XYDATA
$$ [...]
36934A702644l52761l32804k89074k21708j35539m0196N1020J23322J63687J64216
$$ 1702644 1349883 1017079 728005 506297 370758 330562 381582 504904 668591 832807
36924H32807J24079M8971n1465j66641k86747m02367n02684n74484o04106n82212
$$ 832807 956886 1005857 954392 787751 501004 98637 -404047 -978531 -1582637 -2164849
36914b164849n08437l92508k50631r9297M9965J92170L26443M51606N62694O50367
$$ -2164849 -2673286 -3065794 -3316425 -3415722 -3365757 -3173587 -2847144 -2395538 -1832844 -1182477
36904a182477P03364P12754O76143N99902M97957L87279K82392J91963J18722
$$ -1182477 -479113 233641 909784 1509686 2007643 2394922 2677314 2869277 2987999
36895B987999O1560J7787j5136l8201n0371n0216l9362k4653j6073k1319m1714
$$ 2987999 3049559 3067346 3052210 3014009 2963638 2913422 2874060 2849407 2833334 2812015 2770301
36884B770301p2779j07968j41533j68985j87008j94173j91065j78297j53759j12313
$$ 2770301 2697522 2589554 2448021 2279036 2092028 1897855 1706790 1528493 1374734 1262421
36874A262421m9056L6161J36240K38004L26490L90378M26079M38640M39230M40210
$$ 1262421 1213365 1249526 1385766 1623770 1950260 2340638 2766717 3205357 3644587 4084797
36864D084797M49254M64321M72347M53950L92992K85501J42282j5869j66312k90890
$$ 4084797 4534051 4998372 5470719 5924669 6317661 6603162 6745444 6729575 6563263 6272373
36854F272373l77918m20853m16773l67365k82275j81110q9725l0950j5678m0987
$$ 6272373 5894455 5473602 5056829 4689464 4407189 4226079 4136354 4105404 4089726 4048739
36844D048739r6132j70648k58005l53323m48861n31952n87059o00650n66668m90680
$$ 4048739 3952607 3781959 3523954 3170631 2721770 2189818 1602759 1002109 435441 -55239
36834e5239l90660k92274k19025j82123j77039j89329k04639k14939k17685k11423
$$ -55239 -445899 -738173 -957198 -1139321 -1316360 -1505689 -1710328 -1925267 -2142952 -2354375
36824b354375j92996j58327j05478l7645L6209J04347J57530J92378K10269K13925
$$ -2354375 -2547371 -2705698 -2811176 -2848821 -2812612 -2708265 -2550735 -2358357 -2148088 -1934163
36814a934163K06268J92633J82841J89499K22882K86034L73258M72559N70142
$$ -1934163 -1727895 -1535262 -1352421 -1162922 -940040 -654006 -280748 191811 761953
36805G61953O54032P15209P46921P44208P04399O27805N18006L81990K30004P4258
$$ 761953 1415985 2131194 2878115 3622323 4326722 4954527 5472533 5854523 6084527 6158785
36795F158785p3298k02484l05057l75311m12652m24124m23262m24697m38079m65105
$$ 6158785 6085487 5883003 5577946 5202635 4789983 4365859 3942597 3517900 3079821 2614716
36785B614716n00167n32902n51280n44802n07330m38886l45931k40070j34967
$$ 2614716 2114549 1581647 1030367 485565 -21765 -460651 -806582 -1046652 -1181619
36776a181619m2054L3084R1454J38036J77814K13014K42579K63174K70856K63145
$$ -1181619 -1223673 -1190589 -1099135 -961099 -783285 -570271 -327692 -64518 206338 469483
36766D69483K40988K09481J76086J46970J23684J02516P6988M2070k480n1566
$$ 469483 710471 919952 1096038 1243008 1366692 1469208 1546196 1588266 1585786 1534220
36756A534220r7259j32614j54247j62423j59563j48978j34581j20584j09944j01898
$$ 1534220 1436961 1304347 1150100 987677 828114 679136 544555 423971 314027 212129
36746B12129r0659o7312k4604L8236J13596J87531K44289K71265K62671K20826
$$ 212129 121470 54158 29554 67790 181386 368917 613206 884471 1147142 1367968
36736A367968J54820P7485K080o0512j03783j25898j27556j08846o8538p174O9156
$$ 1367968 1522788 1600273 1602353 1541841 1438058 1312160 1184604 1075758 1007220 1000046 1069202
36725A069202J49214K21914K82144L32071L77267M21444M63871N00327N25193
$$ 1069202 1218416 1440330 1722474 2054545 2431812 2853256 3317127 3817454 4342647
36716D342647N32412N16006M72538M05590L28197K58863K11836J87864J72193
$$ 4342647 4875059 5391065 5863603 6269193 6597390 6856253 7068089 7255953 7428146
36707G428146J41686P6840k8582j65728l16502m61871n86982o81991p41476p64690
$$ 7428146 7569832 7646672 7618090 7452362 7135860 6673989 6087007 5405016 4663540 3898850
36697C898850p55949p23610o78001o29529n86744n53564n26689m95922m48420
$$ 3898850 3142901 2419291 1741290 1111761 525017 -28547 -555236 -1051158 -1499578
36688a499578l74406k70653j40643O789J58532K98625M11633M87250N22798N21492
$$ -1499578 -1873984 -2144637 -2285280 -2278491 -2119959 -1821334 -1409701 -922451 -399653 121839
36678A21839M88571M29446L51059K63454J78618J07099N5061K3201P368P34k523
$$ 121839 610410 1039856 1390915 1654369 1832987 1940086 1995147 2018348 2025716 2026450 2023927
36667B023927l701J188J8600N3219J05184J69773K39024L04449L60034M04024
$$ 2023927 2020226 2021414 2040014 2093233 2198417 2368190 2607214 2911663 3271697 3675721
36657C675721M38232M65366M86355M99199M99166M79756M34220L57334K46541
$$ 3675721 4113953 4579319 5065674 5564873 6064039 6543795 6978015 7335349 7581890
36648G581890J02176p1830k65463m60154o30333p50391q03133p84237p01276n70355
$$ 7581890 7684066 7612236 7346773 6886619 6256286 5505895 4702762 3918525 3217249 2646894
36638B646894m12825k51836j07991M209P7171J08988J02668O6216J1510m9208
$$ 2646894 2234069 1982233 1874242 1878451 1955622 2064610 2167278 2233494 2245004 2195796
36628B195796j07207j58354k00770k31591k46064k39860k12432j68441j16163
$$ 2195796 2088589 1930235 1729465 1497874 1251810 1011950 799518 631077 514914
36619E14914o4978k4321l945j2897n5554j27133k13222k95376l59498m00877m22627
$$ 514914 449936 425615 421670 408773 353219 226086 12864 -282512 -642010 -1042887 -1465514
36608a465514m29907m25572m10112l83844l47631l01218k41806j65291o9823M0824
$$ -1465514 -1895421 -2320993 -2731105 -3114949 -3462580 -3763798 -4005604 -4170895 -4240718 -4199894
36598d199894J56160K60499L36033L66437L40824K58177J30789j6435j52735k51920
$$ -4199894 -4043734 -3783235 -3447202 -3080765 -2739941 -2481764 -2350975 -2367410 -2520145 -2772065
36588b772065l00883l02055k69879k24002j81857j52864j36346j23958j05010
$$ -2772065 -3072948 -3375003 -3644882 -3868884 -4050741 -4203605 -4339951 -4463909 -4568919
36579d568919p1969k4176L1211Q1827J15992J29211J27157J23083J31261J60268
$$ -4568919 -4640888 -4665064 -4633853 -4552026 -4436034 -4306823 -4179666 -4056583 -3925322 -3765054
36569c765054K09678K71701L36312L95935M46189M83330N02456M99394M74643
$$ -3765054 -3555376 -3283675 -2947363 -2551428 -2105239 -1621909 -1119453 -620059 -145416
36560a45416M35356L93354L60898L47105L56535L89385M41577N03760N60457N92089
$$ -145416 289940 683294 1044192 1391297 1747832 2137217 2578794 3082554 3643011 4235100
36550D235100N80752N16961M03385K54284R2132n7413j72072k39441k59570k41625
$$ 4235100 4815852 5332813 5736198 5990482 6082614 6025201 5853129 5613688 5354118 5112493
36540E112493j97578j38262p3730j5298K4168L2554K184o6864j65371k76991l83486
$$ 5112493 4914915 4776653 4702923 4687625 4711793 4744347 4746531 4679667 4514296 4237305 3853819
36529C853819m70705n32069n67879n81387n74389n45348m91523m13735l19948
$$ 3853819 3383114 2851045 2283166 1701779 1127390 582042 90519 -323216 -643164
36520f43164k24566j43422q7317n7559m5775l8452k4196L08K9264N1932N8671
$$ -643164 -867730 -1011152 -1098469 -1156028 -1201803 -1240255 -1264451 -1264143 -1234879 -1182947 -1124276
36509a124276M5252J3941k7970p0893j05720j25836j28354j14888r1318o5003
$$ -1124276 -1079024 -1065083 -1093053 -1163946 -1269666 -1395502 -1523856 -1638744 -1730062 -1795065
36499a795065l9724j1713K9271R3853J86429L02729M32299N63213O85739P93239
$$ -1795065 -1834789 -1846502 -1817231 -1723378 -1536949 -1234220 -801921 -238708 447031 1240270
36489A240270Q80329R40068R62770R38064Q59381P28015N54643L57862J60719
$$ 1240270 2120599 3060667 4023437 4961501 5820882 6548897 7103540 7461402 7622121
36480G622121j3738j47017k28888k59300k47866k10884j66630j30219j09813j05646
$$ 7622121 7608383 7461366 7232478 6973178 6725312 6514428 6347798 6217579 6107766 6002120
36470F002120j12556j24971j41441j65672k03401k57990l28299m09532m94530
$$ 6002120 5889564 5764593 5623152 5457480 5254079 4996089 4667790 4258258 3763728
36461C763728n73341o32274o55636o31275n57063m43998l13723j91703r9186m6951
$$ 3763728 3190387 2558113 1902477 1271202 714139 270141 -43582 -235285 -334471 -381422
36451c81422l3069m5685o9741r3912j13611j28947j40674j48170j50759j50270
$$ -381422 -414491 -460176 -529917 -623829 -737440 -866387 -1007061 -1155231 -1305990 -1456260
36441a456260j51893j62068j84229k14824k42555k52295k32195j80135j05977
$$ -1456260 -1608153 -1770221 -1954450 -2169274 -2411829 -2664124 -2896319 -3076454 -3182431
36432c182431k8413L2467O3808O5561M9585L2853K9493M6437Q3691J36754J98794
$$ -3182431 -3210844 -3178377 -3114569 -3049008 -2999423 -2966570 -2937077 -2890640 -2806949 -2670195 -2471401
36421b471401K62181L19734L65766L96757M11809M12838M04025L90151L74365
$$ -2471401 -2209220 -1889486 -1523720 -1126963 -715154 -302316 101709 491860 866225
36412H66225L56712L34663L05407K68126K24195J75297J21657O2363k524o9954
$$ 866225 1222937 1557600 1863007 2131133 2355328 2530625 2652282 2714645 2712121 2642167
36402B642167j33357j83809k12567k13792j85617j28792m5088O1769J82937L02836
$$ 2642167 2508810 2325001 2112434 1898642 1713025 1584233 1539145 1600914 1783851 2086687
36392B086687M01765M61465M70312M26064L36008K14709P9924n1795j67993k61265
$$ 2086687 2488452 2949917 3420229 3846293 4182301 4397010 4476934 4425139 4257146 3995881
36382C995881l29111l73512m00200m16999m31090m46042m60403m69040m66058
$$ 3995881 3666770 3293258 2893058 2476059 2044969 1598927 1138524 669484 203426
36373B03426m46628m06921l44108k58358j55508m7386N0986J25362J65552J67982
$$ 203426 -243202 -650123 -994231 -1252589 -1408097 -1455483 -1404497 -1279135 -1113583 -945601
36363i45601J37578Q7594L5997q24j4126n495J5030L3993L9355K2695k1097r4268
$$ -945601 -808023 -720429 -684432 -685256 -699382 -704877 -689847 -655854 -616499 -593804 -614901 -709169
36351g09169j95105l15690m40493n47702o14454o24831n76840m83501l66984k49823
$$ -709169 -904274 -1219964 -1660457 -2208159 -2822613 -3447444 -4024284 -4507785 -4874769 -5124592
36341e124592j49111p5753l6481l5427p4185j50697k57361l79211m94332n78306
$$ -5124592 -5273703 -5349456 -5385937 -5421364 -5495549 -5646246 -5903607 -6282818 -6777150 -7355456
36331g355456o11210n82844m93146l49295j63222M9234K69577M79613O64216Q11560
$$ -7355456 -7966666 -8549510 -9042656 -9391951 -9555173 -9505939 -9236362 -8756749 -8092533 -7280973
36321g280973R12271R60857R59617R20651Q62259Q01378P47369P01081O58852
$$ -7280973 -6368702 -5407845 -4448228 -3527577 -2665318 -1863940 -1116571 -415490 243362
36312B43362O18173N81128N53080N37151N28638N14245M77517M07134L02941J76800
$$ 243362 861535 1442663 1995743 2532894 3061532 3575777 4053294 4460428 4763369 4940169
36302D940169M8655o0157j34007j68267j70740j58154j48728j54240j75921k06292
$$ 4940169 4988824 4928667 4794660 4626393 4455653 4297499 4148771 3994531 3818610 3612318
36292C612318k35019k54311k60944k55771k43021k29764k23924k30852k51323
$$ 3612318 3377299 3122988 2862044 2606273 2363252 2133488 1909564 1678712 1427389
36283A427389k83007l23431l70481m19871m63129m89225m88428m55097l88489
$$ 1427389 1144382 820951 450470 30599 -432530 -921755 -1410183 -1865280 -2253769
36274b253769k93062j78567n8321N5069J53906K36265L03003L53878L86132L96584
$$ -2253769 -2546831 -2725398 -2783719 -2728650 -2574744 -2338479 -2035476 -1681598 -1295466 -898882
36264h98882L85435L58489L25568K95817K73159K54984K34289K03232J55915R0050
$$ -898882 -513447 -154958 170610 466427 739586 994570 1228859 1432091 1588006 1678056
36254A678056Q224q1069j63596k22085k41279k13450j41848m0689O8467J62982
$$ 1678056 1686280 1605211 1441615 1219530 978251 764801 622953 582264 650731 813713
36244H13713K26085K51300K41895K05934J50713Q0387k325r2668j81972k59555
$$ 813713 1039798 1291098 1532993 1738927 1889640 1970027 1967702 1875034 1693062 1433507
36234A433507l17297l52971l68699l65688l40522k87045k01949q8994M0764J71303
$$ 1433507 1116210 763239 394540 28852 -311670 -598715 -800664 -889658 -848894 -677591
36224f77591K84528L63553L96513L79717L18906K28619J29887M5535o845k1383
$$ -677591 -393063 -29510 367003 746720 1065626 1294245 1424132 1469667 1462822 1441439
36214A441439n411K5641N6857Q0482R7213J12302J29583J47157J57449J51546
$$ 1441439 1436028 1461669 1518526 1599008 1696221 1808523 1938106 2085263 2242712 2394258
36204B394258J24929Q0824K9146j7854n0804o6742o9272o4834n7055m3304j6605
$$ 2394258 2519187 2600011 2629157 2611303 2560499 2493757 2424485 2359651 2302596 2259292 2242687
36193B242687K8589R1691J65683K40074L04089L48801L68833L63418L35965K92391
$$ 2242687 2271276 2362967 2528650 2768724 3072813 3421614 3790447 4153865 4489830 4782221
36183D782221K39493J83594J28615P4077J5304n3221j33857k24385l19344m11830
$$ 4782221 5021714 5205308 5333923 5408000 5423304 5370083 5236226 5011841 4692497 4280667
36173D280667m94156n58239n96716o04474n79662n24109m43772l49068k53890
$$ 4280667 3786511 3228272 2631556 2027082 1447420 923311 479539 130471 -123419
36164a23419j72544j15534q6852q4446j02815j34826j71519k01991k16240k10283
$$ -123419 -295963 -411497 -498349 -582795 -685610 -820436 -991955 -1193946 -1410186 -1620469
36154a620469j89087j63630j43601j31368j21748j06836q1383m5108k029M0982
$$ -1620469 -1809556 -1973186 -2116787 -2248155 -2369903 -2476739 -2558122 -2603230 -2605259 -2564277
36144b564277P5521R3886R2346P3376M4506J4416j0763k8673l9870m6240m9138
$$ -2564277 -2488756 -2394870 -2302524 -2229148 -2184642 -2170226 -2180989 -2209662 -2249532 -2295772 -2344910
36133b344910m7664l8169j6241J9829O6762J17110J62250J95367K12629K12258
$$ -2344910 -2392574 -2430743 -2446984 -2427155 -2360393 -2243283 -2081033 -1885666 -1673037 -1460779
36123a460779J92401J49757Q1202j1587j18053k19618k96407l35824l37533l12497
$$ -1460779 -1268378 -1118621 -1037419 -1049006 -1167059 -1386677 -1683084 -2018908 -2356441 -2668938
36113b668938k77206k46007k24725k08479j85036j41886p3026J7879J18691K13113
$$ -2668938 -2946144 -3192151 -3416876 -3625355 -3810391 -3952277 -4025303 -4007424 -3888733 -3675620
36103c675620K86201L28957L40281L26082K96619K63077K33627K10071J87570
$$ -3675620 -3389419 -3060462 -2720181 -2394099 -2097480 -1834403 -1600776 -1390705 -1203135
36094a203135J58901J20766P7352L8751J6111J6959M2401Q6519J38431J86977
$$ -1203135 -1044234 -923468 -846116 -807365 -791254 -774295 -731894 -645375 -506944 -319967
36084c19967K25644K54022K74749K89147K95988K94068K85421K75464K69798K70362
$$ -319967 -94323 159699 434448 723595 1019583 1313651 1599072 1874536 2144334 2414696
36074B414696K73883K73702K63810K42688K14392J85935J62696J45160J29078
$$ 2414696 2688579 2962281 3226091 3468779 3683171 3869106 4031802 4176962 4306040
36065D306040J08184P7113L3205k2433q4487j44733j95931k36410k71574l10209
$$ 4306040 4414224 4491337 4524542 4502109 4417622 4272889 4076958 3840548 3568974 3258765
36055C258765l57750m11491m61433m96151n09510n03473m84998m59508m26205
$$ 3258765 2901015 2489524 2028091 1531940 1022430 518957 33959 -425549 -851754
36046h51754l79230l13667k31154j40582n3897J9284P5227J16995J53051J93734
$$ -851754 -1230984 -1544651 -1775805 -1916387 -1970284 -1951000 -1875773 -1758778 -1605727 -1411993
36036a411993K46512L12290L84892M53746N08015N40481N49797N40156N18009
$$ -1411993 -1165481 -853191 -468299 -14553 493462 1033943 1583740 2123896 2641905
36027B641905M87669M48671L96504L25747K33567J22476K097j10772j94687k28662
$$ 2641905 3129574 3578245 3974749 4300496 4534063 4656539 4658636 4547864 4353177 4124515
36017D124515j98291j00842N2419K37647M23560N78841O79346P13298O83586O06613
$$ 4124515 3926224 3825382 3877801 4115448 4539008 5117849 5797195 6510493 7194079 7800692
36007G800692N07087M09700L31334K77815K45988K28115K15442K00589J79865
$$ 7800692 8307779 8717479 9048813 9326628 9572616 9800731 10016173 10216762 10396627
35998A0396627J55034J32641J20483J23577J42428J74329K16345K67752L30268
$$ 10396627 10551661 10684302 10804785 10928362 11070790 11245119 11461464 11729216 12059484
35989A2059484M05751M92924N85686O74447P49478Q04114Q36334Q48409Q45260
$$ 12059484 12465235 12958159 13543845 14218292 14967770 15771884 16608218 17456627 18301887
35980A8301887Q32611Q16111Q01456P94217P98518Q15711Q44749Q84123R33422
$$ 18301887 19134498 19950609 20752065 21546282 22344800 23160511 24005260 24889383 25822805
35971B5822805R93192J063747J144244J232491J325512J421055J520066J628862
$$ 25822805 26815997 27879744 29023988 30256479 31581991 33003046 34523112 36151974
35963C6151974J759131J924977K138269K405052K725120L094545L508770L963726
$$ 36151974 37911105 39836082 41974351 44379403 47104523 50199068 53707838 57671564
35955E7671564M454604M974234N513005O060465O606894P143203P658530Q136263
$$ 57671564 62126168 67100402 72613407 78673872 85280766 92423969 100082499 108218762
35947A08218762Q549829Q859571R011789Q940845Q575386P849390O717720N174126
$$ 108218762 116768591 125628162 134639951 143580796 152156182 160005572 166723292 171897418
35939A71897418L267295J107951j140269l288267n159975o627481p629883q171793
$$ 171897418 175164713 176272664 175132395 171844128 166684153 160056672 152426789 144254996
35931A44254996q306503q112736p673436p062180o338842n551978m743182l950006
$$ 144254996 135948493 127835757 120162321 113100141 106761299 101209321 96466139 92516133
35923I2516133l207005k546204j997705j589366j343230j267370j345760j533009
$$ 92516133 89309128 86762924 84765219 83175853 81832623 80565253 79219493 77686484
35915G7686484j760587j954418k055689k034534j891762j651307j349666j027126
$$ 77686484 75925897 73971479 71915790 69881256 67989494 66338187 64988521 63961395
35907F3961395p22167m67649k87219j91945j79147k34779l38128m65857n94044
$$ 63961395 63239228 62771579 62484360 62292415 62113268 61878489 61540361 61074504 60480460
35898F0480460o99452p61761p66567p07759n88729m22626k30951l8926J32307
$$ 60480460 59781008 59019247 58252680 57544921 56956192 56533566 56302615 56263689 56395996
35889E6395996K73857L93571N14332O66339Q75971J155960J501839J896604K320217
$$ 56395996 56669853 57063424 57577756 58244095 59120066 60276026 61777865 63674469 65994686
35880F5994686K757715L202115L653061M114255M591222N089049N609994O151744
$$ 65994686 68752401 71954516 75607577 79721832 84313054 89402103 95012097 101163841
35872A01163841O706454P259261P785269Q245963Q587681Q744384Q644893Q223105
$$ 101163841 107870295 115129556 122914825 131160788 139748469 148492853 157137746 165360851
35864A65360851P429244O240585M670508K774310O49854j569154l728412n675600
$$ 165360851 172790095 179030680 183701188 186475498 187125352 185556198 181827786 176152186
35856A76152186p285268q478576r231663r571517r563076r292381q849018q310639
$$ 176152186 168866918 160388342 151156679 141585162 132022086 122729705 113880687 105570048
35848A05570048p733430p151607o584129o042466n534094n061871m623698m215450
$$ 105570048 97836618 90685011 84100882 78058416 72524322 67462451 62838753 58623303
35840E8623303l835795l488718l181117k916768k691114k491009k300118k106710
$$ 58623303 54787508 51298790 48117673 45200905 42509791 40018782 37718664 35611954
35832C5611954j908977j714946j537318j386484j265519j169638j089802j017880
$$ 35611954 33702977 31988031 30450713 29064229 27798710 26629072 25539270 24521390
35824B4521390r50026q86676q30027p81440p40746p07253o80604o60201o44137
$$ 24521390 23571364 22684688 21854661 21073221 20332475 19625222 18944618 18284417 17640280
35815A7640280o29510o14168n97734n80441n61038n36079n01018m51872l86714
$$ 17640280 17010770 16396602 15798868 15218427 14657389 14121310 13620292 13168420 12781706
35806A2781706l07419k21052j38934p2532k8471n992J735L802P383J5129K5422
$$ 12781706 12474287 12253235 12114301 12041769 12013298 12007306 12009041 12012843 12020226 12035355 12060777
35795A2060777L5497M5014N6694P2906R0747R9948Q5795L5703n4302j76871l15869
$$ 12060777 12096274 12141288 12197982 12270888 12361635 12461583 12547378 12583081 12528779 12351908 12036039
35784A2036039m52448n71111o62647p23619p54044p55231p28321o73714n91669
$$ 12036039 11583591 11012480 10349833 9626214 8872170 8116939 7388618 6714904 6123235
35775F123235m84305l57879k23252r3208K2277J19989K04313K84545L70256M66997
$$ 6123235 5638930 5281051 5057799 4964591 4986868 5106857 5311170 5595715 5965971 6432968
35765F432968N74216O86037P93639Q87239R56882R93246R89986R46813Q70525
$$ 6432968 7007184 7693221 8486860 9374099 10330981 11324227 12314213 13261026 14131551
35756A4131551P72202O62042N45455M22692K91471J50281L36j54413l08524m56442
$$ 14131551 14903753 15565795 16111250 16533942 16825413 16975694 16976030 16821617 16513093 16056651
35746A6056651n92989p12813q09519q75746r05059q94724q47273p69089o67066
$$ 16056651 15463662 14750849 13941330 13065584 12160525 11265801 10418528 9649439 8982373
35737H982373n46675m13663k77544j52499n3398J0207L7074L2363L898l9410q6606
$$ 8982373 8435698 8022035 7744491 7591992 7538594 7548801 7585875 7618238 7622136 7582726 7496120
35726G496120j24785j42802j36904j13554q6375o8841o7839q2311j07097j37777
$$ 7496120 7371335 7228533 7091629 6978075 6891700 6822859 6755020 6672709 6565612 6427835
35716F427835j72017k06724k34685k44779k26122j73006q7392K1938J42550K62432
$$ 6427835 6255818 6049094 5814409 5569630 5343508 5170502 5083110 5105048 5247598 5510030
35706E510030L73222M70987N54522O23131O76038P13238P36102P46631P46171
$$ 5510030 5883252 6354239 6908761 7531892 8207930 8921168 9657270 10403901 11150072
35697A1150072P34603P10369O71318O16211N46166M64773L76633K85773J95359
$$ 11150072 11884675 12595044 13266362 13882573 14428739 14893512 15270145 15555918 15751277
35688A5751277J08136K5999n1144j24941j95580k58416l04178l23636l13644k79878
$$ 15751277 15859413 15885412 15834268 15709327 15513747 15255331 14951153 14627517 14313873 14033995
35678A4033995k34345j89531j52901j25067j02392q1927o4933n6460o2086q5294
$$ 14033995 13799650 13610119 13457218 13332151 13229759 13147832 13082899 13026439 12964353 12879059
35668A2879059j27593j89780k71202l66579m63585n44741n93632o01404n69194
$$ 12879059 12751466 12561686 12290484 11923905 11460320 10915579 10321947 9720543 9151349
35659I151349n05565m21906l29336k37918j56212q9844m0161m894J9534L6310
$$ 9151349 8645784 8223878 7894542 7656624 7500412 7410568 7370407 7365513 7385047 7421357
35649G421357M8201N7727O5803O9844O4031M2921O410l7296p2630q1257m8600
$$ 7421357 7469558 7527285 7593088 7662932 7726963 7769884 7776294 7738998 7666368 7585111 7536511
35638G536511K9788J44362K72411L84537M54757M69418M30110L49480K43770J27249
$$ 7536511 7566299 7710661 7983072 8367609 8822366 9291784 9721894 10071374 10315144 10442393
35628A0442393J0873r6622j88483k61740l19449l70610m26326m93357n68583o38056
$$ 10442393 10453266 10356644 10168161 9906421 9586972 9216362 8790036 8296679 7728096 7090040
35618G090040o82051o83818o37476n50892m42447l33736k42118j76294j35842
$$ 7090040 6407989 5724171 5086695 4535803 4093356 3759620 3517502 3341208 3205366
35609C205366j13420r7802p6907m0890J4791Q7713J69834K51699L26723L92151
$$ 3205366 3091946 2994144 2917237 2876347 2891138 2978851 3148685 3400384 3727107 4119258
35599D119258M46056M83698M97463M81260M35861L70682L00646K40240J97958
$$ 4119258 4565314 5049012 5546475 6027735 6463596 6834278 7134924 7375164 7573122
35590G573122J73461J58782J43329J20076Q8780N4286K2106m634k5442m1668n6302
$$ 7573122 7746583 7905365 8048694 8168770 8257550 8311836 8333942 8329308 8303866 8262198 8205896
35579H205896p3718r8002j30156j65922j95320k04213j78000j07221O708J48952
$$ 8205896 8132178 8034176 7904020 7738098 7542778 7338565 7160565 7053344 7060052 7209004
35569G209004K94280M15172M91529N17388N01447M61463M16044L78100L52204
$$ 7209004 7503284 7918456 8409985 8927373 9428820 9890283 10306327 10684427 11036631
35560A1036631L35219L18478K90488K40209J60892N3851o9534j89541k84094l36685
$$ 11036631 11371850 11690328 11980816 12221025 12381917 12435768 12366234 12176693 11892599 11555914
35550A1555914l42154l07263k46411j75272j05766m4267P056M7675P6763R2596
$$ 11555914 11213760 10906497 10660086 10484814 10379048 10334781 10341837 10389512 10466275 10558871
35540A0558871R2603P3963L5093k2272r1955j64162k27456k70509k83855k62633
$$ 10558871 10651474 10725437 10760530 10738258 10646303 10482141 10254685 9984176 9700321 9437688
35530I437688k09833j37508o3851o753K3004K5500J0648o904j4483o961J0769
$$ 9437688 9227855 9090347 9026496 9019743 9042747 9068247 9078895 9071991 9057508 9050547 9061316
35519I061316K5251J9622j9417r6028k03890l29239m55791n68445o54385p02415
$$ 9061316 9086567 9106189 9086772 8990744 8786854 8457615 8001824 7433379 6778994 6076579
35509F076579p02697o48526n39662l84925k01955j4128J54253K83540L64147L99322
$$ 6076579 5373882 4725356 4185694 3800769 3598814 3584686 3738939 4022479 4386626 4785948
35499D785948M02656L90596L74225L55205L27721K84539K23380J49973P5969J3373
$$ 4785948 5188604 5579200 5953425 6308630 6636351 6920890 7144270 7294243 7370212 7383585
35489G383585l0269n2718n4836l8642p222L4753Q1401J26701J65074J91276K00089
$$ 7383585 7353316 7300598 7245762 7207120 7199898 7234651 7316052 7442753 7607827 7799103 7999192
35478G999192J86215J44863P3443k6057j45762k73049l93667m95104n69119o13280
$$ 7999192 8185407 8330270 8403713 8377656 8231894 7958845 7565178 7070074 6500955 5887675
35468E887675o30923o28964o14365n91762n63729n32473n00613m70578m44085
$$ 5887675 5256752 4627788 4013423 3421661 2857932 2325459 1824846 1354268 910183
35459I10183m22536m07329l98694l93501l84095l60183l13811k45053j64556r0189
$$ 910183 487647 80318 -318376 -711877 -1095972 -1456155 -1769966 -2015019 -2179575 -2269764
35449b269764l8966j9249k8199n5389q9019j20320j44193j57070j54423j30080
$$ -2269764 -2308730 -2327979 -2356178 -2411567 -2500586 -2620906 -2765099 -2922169 -3076592 -3206672
35439c206672p8212K994J08344K25470L37969M30435M93366N25985N35542N32626
$$ -3206672 -3284884 -3281890 -3173546 -2948076 -2610107 -2179672 -1686306 -1160321 -624779 -92153
35429i2153N24315N09113M77721M20086L34291K31006J30164N2039Q079l672L234
$$ -92153 432162 941275 1418996 1839082 2173373 2404379 2534543 2586582 2594661 2590989 2594223
35418B594223J0632M393j9928n7520r9943j41291j80303k17818k52992k81966
$$ 2594223 2604855 2609248 2589320 2531800 2431857 2290566 2110263 1892445 1639453 1357487
35408A357487k99697l02775k90986k67343k37630k09726j91845j89353k01832
$$ 1357487 1057790 755015 464029 196686 -40944 -250670 -442515 -631868 -833700
35399h33700k22970k44151k59473k68748k76456k87809l05114l27019l50685l74281
$$ -833700 -1056670 -1300821 -1560294 -1829042 -2105498 -2393307 -2698421 -3025440 -3376125 -3750406
35389c750406l97239m18123m32525m33333m13611l69870l03413k19038j22709
$$ -3750406 -4147645 -4565768 -4998293 -5431626 -5845237 -6215107 -6518520 -6737558 -6860267
35380f860267k0257Q2441J79427K65999L40079M01304M48082M76217M81723M65765
$$ -6860267 -6880524 -6798083 -6618656 -6352657 -6012578 -5611274 -5163192 -4686975 -4205252 -3739487
35370c739487M36701M06202L81908L62026L36043K91295K21112J29467K9706o0807
$$ -3739487 -3302786 -2896584 -2514676 -2152650 -1816607 -1525312 -1304200 -1174733 -1145027 -1205834
35360a205834j26483j57516j51672j13976n4203J6860R0197J59029K17913K62407
$$ -1205834 -1332317 -1489833 -1641505 -1755481 -1809684 -1792824 -1702627 -1543598 -1325685 -1063278
35350a063278K89837L00049K95213K78883K55105K27705J99322J70080J36811
$$ -1063278 -773441 -473392 -178179 100704 355809 583514 782836 952916 1089727
35341A089727R4280L8786k8014r8271j61500k10178k43467k67095k90260l21540
$$ 1089727 1184007 1222793 1194779 1096508 935008 724830 481363 214268 -75992 -397532
35331c97532l65335m20090m78797n30761n62919n60772n11188m08017k57403p8122
$$ -397532 -762867 -1182957 -1661754 -2192515 -2755434 -3316206 -3827394 -4235411 -4492814 -4570936
35321d570936J04261K65692L89865M70268N08791N12500M90650M53357M11420
$$ -4570936 -4466675 -4200983 -3811118 -3340850 -2832059 -2319559 -1828909 -1375552 -964132
35312i64132L75151L51264L40126L36192L31333L18008K90509K45571J83986J12077
$$ -964132 -588981 -237717 102409 438601 769934 1087942 1378451 1624022 1808008 1920085
35302A920085M0476k0371o5063r5081j16780j37605j62928j94170k27839k56057
$$ 1920085 1960561 1940190 1875127 1780046 1663266 1525661 1362733 1168563 940724 684667
35292F84667k69503k61682k31167j79925j10337k5306O8311J57589K26578K62930
$$ 684667 415164 153482 -77685 -257610 -367947 -393253 -324942 -167353 59225 322155
35282C22155K62989K32323J82581J27141P7186L9012J3308l434j6176k8640m1833
$$ 322155 585144 817467 1000048 1127189 1204375 1243387 1256695 1253261 1237085 1208445 1166612
35271A166612n3991o1294n8789m2069j0421K9811O5118Q0161O5854K4347l2602
$$ 1166612 1112621 1051327 992538 950469 940048 969859 1034977 1115138 1180992 1205339 1172737
35260A172737q9635j33236j53905j46373j10267n1692J6638P9032J23510J47183
$$ 1172737 1083102 949866 795961 649588 539321 487629 504267 583299 706809 853992
35250H53992J56052J59437J63895J71189J80224J89349J96636J99041J92386J72749
$$ 853992 1010044 1169481 1333376 1504565 1684789 1874138 2070774 2269815 2462201 2634950
35240B634950J38706R3991M9455K1788K7053P1341J45070K26312K91751L28018
$$ 2634950 2773656 2867647 2917102 2938890 2965943 3037284 3182354 3408666 3700417 4028435
35230D028435L36011L26606L11963K98589K85863K69443K46003K15815J81996
$$ 4028435 4364446 4691052 5003015 5301604 5587467 5856910 6102913 6318728 6500724
35221F500724J47564J12332P1704J8848n0210j32041k15959k89383l43921l77332
$$ 6500724 6648288 6760620 6832324 6851172 6800962 6668921 6452962 6163579 5819658 5442326
35211E442326l91047l87176l67968l37010k99786k62653k31226k09170j97382
$$ 5442326 5051279 4664103 4296135 3959125 3659339 3396686 3165460 2956290 2758908
35202B758908j92992j88414j72068j32367o3970K8056J30196K27662L10772L75536
$$ 2758908 2565916 2377502 2205434 2073067 2009097 2037153 2167349 2395011 2705783 3081319
35192C081319M19346M37202M22280L69695K79533J56999J0897j47097l02169m37580
$$ 3081319 3500665 3937867 4360147 4729842 5009375 5166374 5177271 5030174 4728005 4290425
35182D290425n39082o00202o23589o16602n85032n30441m52133l50290k27091
$$ 4290425 3751343 3151141 2527552 1910950 1325918 795477 343344 -6946 -234037
35173b34037q6686O3972K13873L48712M54571N22088N48093N34078M83608M01100
$$ -234037 -320723 -256751 -42878 305834 760405 1282493 1830586 2364664 2848272 3249372
35163C249372K92487J66337L4105r0572j92925k58776k78021k49428j83750j01782
$$ 3249372 3541859 3708196 3742301 3651729 3458804 3200028 2922007 2672579 2488829 2387047
35153B387047k7253K1678L7618K3824j0149n3988j00384j45454j86513k19937
$$ 2387047 2359794 2381472 2419090 2442914 2432765 2378777 2278393 2132939 1946426 1726489
35143A726489k41284k47658k40161k24289k07575j95693j89462j85064j77240
$$ 1726489 1485205 1237547 997386 773097 565522 369829 180367 -4697 -181937
35134a81937j62422j38834j04242n4820J3060J00070K02675L13193M19747N06799
$$ -181937 -344359 -483193 -587435 -642255 -629195 -529125 -326450 -13257 406490 913289
35124I13289N58241N62646N17224M27656L04743J60670O567j48764k99145m40019
$$ 913289 1471530 2034176 2551400 2979056 3283799 3444469 3451036 3302272 3003127 2563108
35114B563108n66301o70576p43541p77423p70444p28783o64011n87812n08482
$$ 2563108 1996807 1326231 582690 -194733 -965177 -1693960 -2357971 -2945783 -3454265
35105c454265m31351l61054l02253k58214k29373k13481k06658k04379k02520
$$ -3454265 -3885616 -4246670 -4548923 -4807137 -5036510 -5249991 -5456649 -5661028 -5863548
35096e863548j98819j93966j91038j93240k01414k12665k20532k16618j93501
$$ -5863548 -6062367 -6256333 -6447371 -6640611 -6842025 -7054690 -7275222 -7491840 -7685341
35087g685341j48275q4814j2873N5919J12612J53233J78406J91748J98314K03116
$$ -7685341 -7833616 -7918430 -7931303 -7875384 -7762772 -7609539 -7431133 -7239385 -7041071 -6837955
35077f837955K09648K19282K31945K47267K65272K87042L15941L58029M19326
$$ -6837955 -6628307 -6409025 -6177080 -5929813 -5664541 -5377499 -5061558 -4703529 -4284203
35068d284203N00235N91354O75296P34259P58148P47543P10311O55540N89554
$$ -4284203 -3783968 -3192614 -2517318 -1783059 -1024911 -277368 432943 1088483 1678037
35059A678037N15826M36940L55595K73703J91125J06336J9444o4745j36988j88548
$$ 1678037 2193863 2630803 2986398 3260101 3451226 3557562 3577006 3512261 3375273 3186725
35049C186725k17968k34037k51305k80544l21235l61939l88104l91220l73045
$$ 3186725 2968757 2734720 2483415 2202871 1881636 1519697 1131593 740373 367328
35040C67328l43015l11572k83891k57248k23107j72699j03161k0754O0894J26735
$$ 367328 24313 -287259 -571150 -828398 -1051505 -1224204 -1327365 -1348119 -1287225 -1160490
35030a160490J67244J82790J83348J83936J98142K32991K87137L52143M15337
$$ -1160490 -993246 -810456 -627108 -443172 -245030 -12039 275098 627241 1042578
35021A042578M63454M86951M83654M59172M23004L82851L41191K95729K42457
$$ 1042578 1506032 1992983 2476637 2935809 3358813 3741664 4082855 4378584 4621041
35012D621041J79360J09583M2668p949l0915k3023Q734N0296Q6518J06592J06483
$$ 4621041 4800401 4909984 4952652 4944703 4913788 4890765 4899499 4949795 5036313 5142905 5249388
35001E249388Q7949N5721J5604k5132n6799o8716n3192q888N9452J44144K37489
$$ 5249388 5337337 5393058 5408662 5383530 5326731 5258015 5204823 5195935 5255387 5399531 5637020
34990E637020L32721M23768N04831N69803O11695O23210N98978N37891M43393
$$ 5637020 5969741 6393509 6898340 7468143 8079838 8703048 9302026 9839917 10283310
34981A0283310L22039J82642L6990r9878k12593k91182l36191l59448l79203m11628
$$ 10283310 10605349 10787991 10824981 10725103 10512510 10221328 9885137 9525689 9146486 8734858
34971H734858m62883n26361n86796o28375o41465o24622n82734n23948m56770
$$ 8734858 8271975 7745614 7158818 6530443 5888978 5264356 4681622 4157674 3700904
34962C700904l87332l17262k43515j60768o5416M0699J48489K42852L07138L29398
$$ 3700904 3313572 2996310 2752795 2592027 2526611 2567310 2715799 2958651 3265789 3595187
34952C595187L07374K49565J71935R2317K5022k3108n4821q2085j21854j88063
$$ 3595187 3902561 4152126 4324061 4416378 4441400 4418292 4363471 4281386 4159532 3971469
34942C971469k83280l95446n02681n83504o25980o30808o08266n72295n35069
$$ 3971469 3688189 3292743 2790062 2206558 1580578 949770 341504 -230791 -765860
34933g65860n03685m79191m57705m32755l97727l47644k80419j98137j08387k4594
$$ -765860 -1269545 -1748736 -2206441 -2639196 -3036923 -3384567 -3664986 -3863123 -3971510 -3996104
34923c996104L6373N9795L9709j7674r6577j78693k49823l02286l33435l43263
$$ -3996104 -3959731 -3899936 -3860227 -3877901 -3974478 -4153171 -4402994 -4705280 -5038715 -5381978
34913e381978l33303l06528k66911k18049j61951r9748l4630K5446O9064Q7448
$$ -5381978 -5715281 -6021809 -6288720 -6506769 -6668720 -6768468 -6803098 -6777652 -6708588 -6621140
34903f621140Q0966O0034L9345L0748M0604P1629J24405J95510K74618L45090
$$ -6621140 -6540174 -6480140 -6440795 -6410047 -6369443 -6297814 -6173409 -5977899 -5703281 -5358191
34893e358191L89272L95038L59394K87704J90687Q1679k5070j16193j81763k17510
$$ -5358191 -4968919 -4573881 -4214487 -3926783 -3736096 -3654417 -3679487 -3795680 -3977443 -4194953
34883d194953k24826k08019j70801j14605l9798N1488J53135K54973L44918M12357
$$ -4194953 -4419779 -4627798 -4798599 -4913204 -4953002 -4901514 -4748379 -4493406 -4148488 -3736131
34873c736131M51385M62378M50804M23670L86128L41109K92569K49066K23377
$$ -3736131 -3284746 -2822368 -2371564 -1947894 -1561766 -1220657 -928088 -679022 -455645
34864d55645K27063K63568L25319L97147M63639N15409N50666N71974N81038N75282
$$ -455645 -228582 34986 360305 757452 1221091 1736500 2287166 2859140 3440178 4015460
34854D015460N48589M95782M17495L21543K19647J22482L6959l3453q7678j27119
$$ 4015460 4564049 5059831 5477326 5798869 6018516 6140998 6177957 6144504 6056826 5929707
34844E929707j55968j80410k07048k41481k86136l36868l80874m00273l81128
$$ 5929707 5773739 5593329 5386281 5144800 4858664 4521796 4140922 3740649 3359521
34835C359521l21821k34386j38442n2870R886M5463N6412M9815L4670J9380R195
$$ 3359521 3037700 2803314 2664872 2612002 2621888 2667351 2723763 2773578 2808248 2827628 2836823
34824B836823M187q23j3314l8275p4277j12515j39441j42306j15532o4557m603
$$ 2836823 2841010 2840187 2826873 2788598 2714321 2601806 2462365 2320059 2204527 2139970 2135367
34813B135367M4966O7393N3805O277o2210j32650j89028k26263k51103k75503
$$ 2135367 2180333 2247726 2301531 2307808 2245598 2112948 1923920 1697657 1446554 1171051
34803A171051l08372l51992m03865m59844n14577n59688n83474n74664n28344
$$ 1171051 862679 510687 106822 -353022 -867599 -1427287 -2010761 -2585425 -3113769
34794c113769m49080l48270k37787j24908j1941J00254K08058L03435L76107M18297
$$ -3113769 -3562849 -3911119 -4148906 -4273814 -4285755 -4185501 -3977443 -3674008 -3297901 -2879604
34784b879604M28470M10889L71197L12129K33258J35036K3824q5598j71632k11095
$$ -2879604 -2451134 -2040245 -1669048 -1356919 -1123661 -988625 -964801 -1050399 -1222031 -1433126
34774a433126j86396r1983O2383K52863M46742O10214P16401P50835P12219O09117
$$ -1433126 -1619522 -1711505 -1649122 -1396259 -949517 -339303 377098 1127933 1840152 2449269
34764B449269M55507K68055O5508j31483l01504m24998m88103m86904m30168l38319
$$ 2449269 2904776 3172831 3238339 3106856 2805352 2380354 1892251 1405347 975179 636860
34754F36860k38028j54482j04803r4780j19077j64181k13452k53133k76815k85754
$$ 636860 398832 244350 139547 44767 -74310 -238491 -451943 -705076 -981891 -1267645
34744a267645k85061k78914k68174k50816k23223j81235j21557m3748M8698J49217
$$ -1267645 -1552706 -1831620 -2099794 -2350610 -2573833 -2755068 -2876625 -2920373 -2871675 -2722458
34734b722458K49786L41575M15234M62696M80097M69052M35068L85370L28778
$$ -2722458 -2472672 -2131097 -1715863 -1253167 -773070 -304018 131050 516420 845198
34725H45198K76656K41460K31747K46589K73931K94884K92019K56972J92973J11156
$$ 845198 1121854 1363314 1595061 1841650 2115581 2410465 2702484 2959456 3152429 3263585
34715C263585K3993n9172j32156j89464k24898k32692k10086j59345q8042p026
$$ 3263585 3287578 3228406 3096250 2906786 2681888 2449196 2239110 2079765 1991723 1984697
34705A984697P3485J47841K16167K81590L45431M03906M48429M68685M56518M09414
$$ 1984697 2058182 2206023 2422190 2703780 3049211 3453117 3901546 4370231 4826749 5236163
34695E236163L32873K40189J48380P1572J5724k1922m9128p3952j01888j35217
$$ 5236163 5569036 5809225 5957605 6029177 6044901 6022979 5973851 5899899 5798011 5662794
34685E662794j73672k15374k57328k95110l22281l31162l15905k76402k20122
$$ 5662794 5489122 5273748 5016420 4721310 4399029 4067867 3751962 3475560 3255438
34676C255438j59930j08736p3915n4682m3975l3954k1676j0916q839k0428m5364
$$ 3255438 3095508 2986772 2912857 2858175 2814200 2780246 2758570 2747654 2738815 2718387 2673023
34665B673023p9348j17411j55384j88839k12028k19182k07360j78354j38243r5321
$$ 2673023 2593675 2476264 2320880 2132041 1920013 1700831 1493471 1315117 1176874 1081553
34655A081553n7662l1001j7513j6193k4480l9333n6282o7630o3072l4241J9671
$$ 1081553 1023891 992890 975377 959184 934704 895371 839089 771459 708387 674146 693817
34644F93817R0248J64274K30930K86352L32863L74467M12063M40871M51441M34368
$$ 693817 784065 948339 1179269 1465621 1798484 2172951 2585014 3025885 3477326 3911694
34634C911694L86427L13635K28178J41571O0278j2646p3082j14596j32334j27948
$$ 3911694 4298121 4611756 4839934 4981505 5041783 5029137 4956055 4841459 4709125 4581177
34624D581177j10377r1747q1933q5294j00378j21539j41679j55840j64302j73115
$$ 4581177 4470800 4379053 4297120 4211826 4111448 3989909 3848230 3692390 3528088 3354973
34614C354973j91087k24988k76237l41215m14298m90673n66369o35714o89210
$$ 3354973 3163886 2938898 2662661 2321446 1907148 1416475 850106 214392 -474818
34605d74818p15038p04201o55576n76726m80047l77696k78569j87452j04758k6486
$$ -474818 -1189856 -1894057 -2549633 -3126359 -3606406 -3984102 -4262671 -4450123 -4554881 -4581367
34595d581367N4292J43677K42300L42335M28167M81421M88978M50261L78950K97051
$$ -4581367 -4527075 -4383398 -4141098 -3798763 -3370596 -2889175 -2400197 -1949936 -1570986 -1273935
34585a273935K24358J69875J30208R4935N4816P862l9458p5875r1420q2311n1890
$$ -1273935 -1049577 -879702 -749494 -654559 -599743 -591881 -631339 -707214 -798634 -880945 -932835
34574i32835p735M2206R1572J35303J68741J87415J87407J65931J22541O0911
$$ -932835 -940570 -898364 -806792 -671489 -502748 -315333 -127926 38005 160546 221457
34564B21457j0250p8835j33092j64982j70970j50506j04339l4552N3633J50051
$$ 221457 211207 132372 -720 -165702 -336672 -487178 -591517 -626069 -572436 -422385
34554d22385K39953L07326L39740L32137K87810K16696J32218M7796k6308q5170
$$ -422385 -182432 124894 464634 796771 1084581 1301277 1433495 1481291 1454983 1369813
34544A369813j29474j63128j88759k03610j99191j65908r9981p665R6264J94403
$$ 1369813 1240339 1077211 888452 684842 485651 319743 219762 212097 308361 502764
34534E02764K73000L25418L52219L59121L54323L45933L39598L36633L33440L22772
$$ 502764 775764 1101182 1453401 1812522 2166845 2512778 2852376 3189009 3522449 3845221
34524C845221K96051K45456J65536N5365p8806k22531l55931m59295n18316n26429
$$ 3845221 4141272 4386728 4552264 4607629 4528823 4306292 3950361 3491066 2972750 2446321
34514B446321m84260l97466k74194j23318M5663K21528L91192N42119O66164P61529
$$ 2446321 1962061 1564595 1290401 1167083 1212746 1434274 1825466 2367585 3033749 3795278
34504C795278Q30761Q76365Q98039Q94232Q66202Q19860P62616O97832O22264
$$ 3795278 4626039 5502404 6400443 7294675 8160877 8980737 9743353 10441185 11063449
34495A1063449N29049M13493K77123J28210k0013j51791k51617l07550l14589
$$ 11063449 11592498 12005991 12283114 12411324 12391311 12239520 11987903 11680353 11365764
34486A1365764k76896k07663j25953n1358J262K4701J9259r710n5399j13043j81233
$$ 11365764 11088868 10881205 10755252 10703894 10705156 10729857 10749116 10739406 10684007 10570964 10389731
34475A0389731k59303l41953m15978m63654m71884m40331l81681l13640k48912
$$ 10389731 10130428 9788475 9372497 8908843 8436959 7996628 7614947 7301307 7052395
34466G052395j90255j32524o8128Q485R8647J98199K96304L75891M17848M08471
$$ 7052395 6862140 6729616 6661488 6669973 6768620 6966819 7263123 7639014 8056862 8465333
34456H465333L45950K41064J11097k8554j69142l07368m41095n66178o76145p63670
$$ 8465333 8811283 9052347 9163444 9134890 8965748 8658380 8217285 7651107 6974962 6211292
34446F211292q22523q49543q45960q16856p67998p01768o15453n03924l64948
$$ 6211292 5388769 4539226 3693266 2876410 2108412 1406644 791191 287267 -77681
34437g7681k02924k8176J46661L09630M50241N59572O31280O62887O56149O16590
$$ -77681 -280605 -308781 -162120 147510 597751 1157323 1788603 2451490 3107639 3724229
34427C724229N52835M75150L92751L11646K35178J66517J09814O8710M4518L6237
$$ 3724229 4277064 4752214 5144965 5456611 5691789 5858306 5968120 6036830 6081348 6117585
34417F117585M1435N6216P5003R2167J04992J14916J25649J40155J59210J81725
$$ 6117585 6159020 6215236 6290239 6382406 6487398 6602314 6727963 6868118 7027328 7209053
34407G209053K05402K27067K43393K52001K51688K40918K15851J70320R8736M42
$$ 7209053 7414455 7641522 7884915 8136916 8388604 8629522 8845373 9015693 9114429 9114871
34397I114871j17102k38064l41306m06264m20167l83543l10796k24608j46402
$$ 9114871 8997769 8759705 8418399 8012135 7591968 7208425 6897629 6673021 6526619
34388F526619q7475m5476q659L4124Q4172J31535J62856J71975J64520J53670
$$ 6526619 6439144 6393668 6385009 6419133 6503305 6634840 6797696 6969671 7134191 7287861
34378G287861J51873J65365J93725K31965K72225L04998L21334L16272K91737
$$ 7287861 7439734 7605099 7798824 8030789 8303014 8608012 8929346 9245618 9537355
34369I537355K56854K25401K11557K25386K69364L37444M17583M96634N64616
$$ 9537355 9794209 10019610 10231167 10456553 10725917 11063361 11480944 11977578 12542194
34360A2542194O16114O49477O65989O69751O67173O65274O69756O84000P08790
$$ 12542194 13158308 13807785 14473774 15143525 15810698 16475972 17145728 17829728 18538518
34351A8538518P41828P77125Q05385Q15893P99111P48834O63332N45174L99607
$$ 18538518 19280346 20057471 20862856 21678749 22477860 23226694 23890026 24435200 24834807
34342B4834807K32474M9793j39971l23503m84557o10982p01450p65316q15232
$$ 24834807 25067281 25117074 24977103 24653600 24169043 23558061 22856611 22091295 21276063
34333B1276063q58980q96818r24324r36477r29922r03642q59080p99666p29759
$$ 21276063 20417083 19520265 18595941 17659464 16729542 15825900 14966820 14167154 13437395
34324A3437395o53626n75257m98821m29425l73527l37986l26880l37510l59041
$$ 13437395 12783769 12208512 11709691 11280266 10906739 10568753 10241873 9904363 9545322
34315I545322l76045l75072l49679l01176k36096j63076r0572k5137K9947P5131
$$ 9545322 9169277 8794205 8444526 8143350 7907254 7744178 7653606 7628469 7658416 7733547
34305G733547J13475J48293J80804K08996K28241K33540K22514J97499J65111
$$ 7733547 7847022 7995315 8176119 8385115 8613356 8846896 9069410 9266909 9432020
34296I432020J33162J06763Q6209O7927M7668K4181J455j1804n938K3915P3255
$$ 9432020 9565182 9671945 9758154 9826081 9873749 9897930 9899385 9887581 9881643 9905558 9978813
34285I978813J27909J68555J77356J43328O5031m8612j79120l01980l93255m36433
$$ 9978813 10106722 10275277 10452633 10595961 10660992 10612380 10433260 10131280 9738025 9301592
34275I301592m25460l62832k55757j13760N1771K27747M00353N56821O87834P90152
$$ 9301592 8876132 8513300 8257543 8143783 8195554 8423301 8823654 9380475 10068309 10858461
34265A0858461Q67774R29752R85131J038045J086142J122905J141863J140182
$$ 10858461 11726235 12655987 13641118 14679163 15765305 16888210 18030073 19170255
34257A9170255J120003J087444J050587J017938R98019R99165J028129J086961
$$ 19170255 20290258 21377702 22428289 23446227 24444246 25443411 26471540 27558501
34249B7558501J169784J262405J346619J407638J440492J451855J456765J472048
$$ 27558501 28728285 29990690 31337309 32744947 34185439 35637294 37094059 38566107
34241C8566107J509052J568942J643490J721589J797173J872836J957179K059219
$$ 38566107 40075159 41644101 43287591 45009180 46806353 48679189 50636368 52695587
34233E2695587K184791K337174K520212K740083L002981L309396L649032M000020
$$ 52695587 54880378 57217552 59737764 62477847 65480828 68790224 72439256 76439276
34225G6439276M332485M613453M810132M890507M822465M575695M131789L502662
$$ 76439276 80771761 85385214 90195346 95085853 99908318 104484013 108615802 112118464
34217A12118464K746886J968470J292328Q27807O40457P44830J116293J710433
$$ 112118464 114865350 116833820 118126148 118953955 119594412 120339242 121455535 123165968
34209A23165968K479547L382174M387060N473911O631873P856580R148184J0512389
$$ 123165968 125645515 129027689 133414749 138888660 145520533 153377113 162525297 173037686
34201A73037686J1962577J3518303J5197917J7007900J8933127K0930303K2924705
$$ 173037686 185000263 198518566 213716483 230724383 249657510 270587813 293512518
34194B93512518K4808928K6440594K7636006K8160685K7723917K5991523K2638590
$$ 293512518 318321446 344762040 372398046 400558731 428282648 454274171 476912761
34187D76912761J7460180J0523155K283197o435796j4641338k1469158k6417538
$$ 476912761 494372941 504896096 507179293 500743497 486102159 464633001 438215463
34180D38215463k9405307l0665721l0579073k9539807k7889270k5896145k3758504
$$ 438215463 408810156 378144435 347565362 318025555 290136285 264240140 240481636
34173B40481636k1613052j9546525j7607841j5820542j4193256j2725137j1406681
$$ 240481636 218868584 199322059 181714218 165893676 151700420 138975283 127568602
34166A27568602j0220677r146655q167124p271904o459554n736692n114643m602536
$$ 127568602 117347925 108201270 100034146 92762242 86302688 80565996 75451353 70848817
34158G0848817m199355l889983l648059l443348l248736l043807k815613k558974
$$ 70848817 66649462 62759479 59111420 55668072 52419336 49375529 46559916 44000942
34150D4000942k277432j983625j697062j438889j225646j064914r54722q86379
$$ 44000942 41723510 39739885 38042823 36603934 35378288 34313374 33358652 32472273
34142C2472273q48317q28224q12965p89023p46223o83610o12406n52028n20632
$$ 32472273 31623956 30795732 29982767 29193744 28447521 27763911 27151505 26599477 26078845
34133B6078845n25930n61490o09852o50205o66949o55837o25407n92896n75898
$$ 26078845 25552915 24991425 24381573 23731368 23064419 22408582 21783175 21190279 20614381
34124B0614381n83436o11086o42967o59311o45009n94820n13746m14029l11379
$$ 20614381 20030945 19419859 18776892 18117581 17472572 16877752 16364006 15949977 15638598
34115A5638598k22059j60738j37846j56315k09699k84202l64241m37766m97692
$$ 15638598 15416539 15255801 15117955 14961640 14751941 14467739 14103498 13665732 13168040
34106A3168040n39382n57229n43558m90874l96239k65114j11690M5460J90007
$$ 13168040 12628658 12071429 11527871 11036997 10640758 10375644 10263954 10309414 10499421
34097A0499421L12294M08596M76814N12956N11348M67932L83927K68171J37788
$$ 10499421 10811715 11220311 11697125 12210081 12721429 13189361 13573288 13841459 13979247
34088A3979247J6380p1535j08915r2964l5440M3748J25080J95401K49747K89641
$$ 13979247 13995627 13924092 13815177 13722213 13686773 13730521 13855601 14051002 14300749 14590390
34078A4590390L18428L35512L33498L01686K34104J35707K1823q8157j78195k40327
$$ 14590390 14908818 15244330 15577828 15879514 16113618 16249325 16271148 16182991 16004796 15764469
34068A5764469k75687k92310l01009l11318l29274l57147l94105m37048m81554
$$ 15764469 15488782 15196472 14895463 14584145 14254871 13897724 13503619 13066571 12585017
34059A2585017n22540n53843n67247n52894n02409m13352k92275j54581k1290
$$ 12585017 12062477 11508634 10941387 10388493 9886084 9472732 9180457 9025876 9004586
34050I004586Q6161J51481J67348J35834O5890k9729j36123k36718l14246l53422
$$ 9004586 9090747 9242228 9409576 9545410 9611300 9581571 9445448 9208730 8894484 8541062
34040H541062l45100k90499k03535j09090l6311q723l5433j07943k04452k99294
$$ 8541062 8195962 7905463 7701928 7592838 7556527 7547804 7512371 7404428 7199976 6900682
34030F900682l72207m12772m19386l96283l52140k99961k55006k29353k25998
$$ 6900682 6528475 6115703 5696317 5300034 4947894 4647933 4392927 4163574 3937576
34021C937576k37128k48061k44138k16184j61957q3974J3889J28205K55113L88094
$$ 3937576 3700448 3452387 3208249 2992065 2830108 2746134 2760023 2888228 3143341 3531435
34011C531435N17114O30287P16913P69841P86358P68083P20118O49520N63485
$$ 3531435 4048549 4678836 5395749 6165590 6951948 7720031 8440149 9089669 9653154
34002I653154M68449L70441K75540J89045J13547M7729j2610p1515j29468j81765
$$ 9653154 10121603 10492044 10767584 10956629 11070176 11117905 11105295 11033780 10904312 10722547
33992A0722547k20255k38358k36639k24524k15688k19292k32908k42049k26790
$$ 10722547 10502292 10263934 10027295 9802771 9587083 9367791 9134883 8892834 8666044
33983H666044j71821p4664N1951J84573K97866L73090M02546L89412L44725K83410
$$ 8666044 8494223 8419559 8471510 8656083 8953949 9327039 9729585 10118997 10463722 10747132
33973A0747132K20199J66089J26375J00643Q4179O9668M9007J5677l2360r0728
$$ 10747132 10967331 11133420 11259795 11360438 11444617 11514285 11563292 11578969 11546609 11455881
33963A1455881j49726j98871k32499k52428k65642k78912k94720l11240l25448
$$ 11455881 11306155 11107284 10874785 10622357 10356715 10077803 9783083 9471843 9146395
33954I146395l35961l43235l47747l48609l44550l36439l28469l26183l32632
$$ 9146395 8810434 8467199 8119452 7770843 7426293 7089854 6761385 6435202 6102570
33945F102570l45909l59948l67374l61958l39509k97776k36446j57471o5144L4747
$$ 6102570 5756661 5396713 5029339 4667381 4327872 4030096 3793650 3636179 3571035 3605782
33935C605782J36244K33558L19711L85311M20326M18990L83999L26307K60819
$$ 3605782 3742026 3975584 4295295 4680606 5100932 5519922 5903921 6230228 6491047
33926F491047K01350J57304J32135J23313J23966J25562J20011J00625O3065P012
$$ 6491047 6692397 6849701 6981836 7105149 7229115 7354677 7474688 7575313 7638378 7645390
33916G645390o2590j36306k02890k52607k79951k84795k71003k42624k00140j39812
$$ 7645390 7582800 7446494 7243604 6990997 6711046 6426251 6155248 5912624 5712484 5572672
33906E572672n6921M9467J73505L03181M24064N24121N97408O45430O75915O99183
$$ 5572672 5515751 5565218 5738723 6041904 6465968 6990089 7587497 8232927 8908842 9608025
33896I608025P22704P46136P60120P50446P05307O21302N05308L72100K39171
$$ 9608025 10330729 11076865 11836985 12587431 13292738 13914040 14419348 14791448 15030619
33887A5030619J20675K2784n7339j28390j99216k73598l48246m14816m64124m89642
$$ 15030619 15151294 15174078 15116739 14988349 14789133 14515535 14167289 13752473 13288349 12798707
33877A2798707m89255m66379m30785l96731l76892l75320l85209l93179l86021
$$ 12798707 12309452 11843073 11412288 11015557 10638665 10263345 9878136 9484957 9098936
33868I098936l55714l02229k35116j72322j34187j34484j73920k40301l14659
$$ 9098936 8743222 8440993 8205877 8033555 7899368 7764884 7590964 7350663 7036004
33859G036004l79200m22778m42380m41866m30308m20281m24459m50243m95772
$$ 7036004 6656804 6234026 5791646 5349780 4919472 4499191 4074732 3624489 3128717
33850C128717n51104o03902o44704o68101o70550o47788n93877n02696l72223
$$ 3128717 2577613 1973711 1329007 660906 -9644 -657432 -1251309 -1754005 -2126228
33841b126228k10149l6373J21502K38423L01313L11855K82575K30679J73288J24615
$$ -2126228 -2336377 -2372750 -2251248 -2012825 -1711512 -1399657 -1117082 -886403 -713115 -588500
33831e88500R4325Q7300J04990J46842K09623K84987L58451M12597M33539M16724
$$ -588500 -494175 -406875 -301885 -155043 54580 339567 698018 1110615 1544154 1960878
33821A960878L68659L03988K39882J90171J60901J48161J38976J15938O4838j8398
$$ 1960878 2329537 2633525 2873407 3063578 3224479 3372640 3511616 3627554 3692392 3673994
33811C673994j25936k42650l53101m45490n11368n44558n42759n10897m61996
$$ 3673994 3548058 3305408 2952307 2506817 1995449 1450891 908132 397235 -64761
33802f4761m12651l74914l50016l28835k98898k52684j90979j19753m4467L3060
$$ -64761 -477412 -852326 -1202342 -1531177 -1830075 -2082759 -2273738 -2393491 -2437958 -2404898
33792b404898J13593J97649K83771L68615M47445N14287N62525N86900N85753
$$ -2404898 -2291305 -2093656 -1809885 -1441270 -993825 -479538 82987 669887 1255640
33783A255640N61061N15653M50387L64556K59493J41876K3706q0698j58368k00219
$$ 1255640 1816701 2332354 2782741 3147297 3406790 3548666 3572372 3491674 3333306 3133087
33773C133087k02080j64800r3961R4J02242J93779K56057K75669K48563J80818
$$ 3133087 2931007 2766207 2672246 2672340 2774582 2968361 3224418 3500087 3748650 3929468
33763C929468Q6425j5718j04521j60418j71573j40638q6728l8922k3815n4367
$$ 3929468 4015893 4000175 3895654 3735236 3563663 3423025 3336297 3297375 3273560 3219193
33753C219193j26391k23349l25620m19077m99149n69040o33611o92944p39694
$$ 3219193 3092802 2869453 2543833 2124756 1625607 1056567 422956 -269988 -1009682
33744a009682p61626p47377o91590n96657m71296l28244j82850n1911M8899J08913
$$ -1009682 -1771308 -2518685 -3210275 -3806932 -4278228 -4606472 -4789322 -4841233 -4792334 -4683421
33734d683421J25551J04959O0232P931l6850o5602p8776q3275q6537r1342r4585
$$ -4683421 -4557870 -4452911 -4392679 -4384748 -4421598 -4487200 -4565976 -4649251 -4735788 -4827130 -4921715
33723d921715r0116p3489m5709j3506J4154L0948L6024L3723L1653L8709O2856
$$ -4921715 -5011831 -5085320 -5131029 -5144535 -5130381 -5099433 -5063409 -5029686 -4998033 -4959324 -4896468
33712d896468J08326J73267K49489L24791L86945M27931M46688M48750M42621
$$ -4896468 -4788142 -4614875 -4365386 -4040595 -3653650 -3225719 -2779031 -2330281 -1887660
33703a887660M35171M28949M22316M10980L89401L52145K95699K20433J31524
$$ -1887660 -1452489 -1023540 -601224 -190244 199157 551302 847001 1067434 1198958
33694A198958L8159m8670j18877j65712j87419j87592j73750j54087j33813j13546
$$ 1198958 1237117 1188447 1069570 903858 716439 528847 355097 201010 67197 -46349
33684d6349r1126o5401l8611j5210J844J4234K8461N2803R3046J49689K18364
$$ -46349 -137475 -202876 -241487 -256697 -254853 -240619 -212158 -159355 -66309 83380 301744
33673C01744K92743L67515M39422N06352N65745O13506O44196O52731O36854N98201
$$ 301744 594487 962002 1401424 1907776 2473521 3087027 3731223 4383954 5020808 5619009
33663E619009N40888M69003L85708K94593K01138J12517L6377k0006n0270n0386
$$ 5619009 6159897 6628900 7014608 7309201 7510339 7622856 7659233 7639227 7588957 7538571
33653G538571k1067L0350R0240J41795J69769J64671J24488N4167l5441j29068
$$ 7538571 7517504 7547854 7638094 7779889 7949658 8114329 8238817 8292984 8257543 8128475
33643H128475k11046k72254l15185l50900l88316m24218m42776m25029l61053
$$ 8128475 7917429 7645175 7329990 6979090 6590774 6166556 5723780 5298751 4937698
33634D937698k56597j30818p263R6289J73314K26845K63432K88191L04246L15124
$$ 4937698 4681101 4550283 4543020 4639309 4812623 5039468 5302900 5591091 5895337 6210461
33624F210461L26300L43600L69588M00898M28411M39719M22189L66335K70191
$$ 6210461 6536761 6880361 7249949 7650847 8079258 8518977 8941166 9307501 9577692
33615I577692J43235N477j20938k23304l03997l75076m46377n17048n76589o12917
$$ 9577692 9720927 9726404 9605466 9382162 9078165 8703089 8256712 7739664 7163075 6550158
33605F550158o20019n99529n56403m93319m08639k99424j66889k0491J22034K39063
$$ 6550158 5930139 5330610 4774207 4280888 3872249 3572825 3405936 3385445 3507479 3746542
33595C746542L12266L33523L07958K51399J83773J22204P6829M9796L6264K6626
$$ 3746542 4058808 4392331 4700289 4951688 5135461 5257665 5334494 5384290 5420554 5447180
33585E447180J0078k0529o4445j12242j50150j67443j61947j40012j11727q5694
$$ 5447180 5457258 5436729 5372284 5260042 5109892 4942449 4780502 4640490 4528763 4443069
33575D443069o6755n6169n1733m7125l2685J09N1800J10459J53919J58775J11387
$$ 4443069 4376314 4320145 4268412 4221287 4188602 4188711 4240511 4350970 4504889 4663664 4775051
33564D775051J4771j12077k41474l47178m13224m38410m34689m19827m07644m01321
$$ 4775051 4789822 4677745 4436271 4089093 3675869 3237459 2802770 2382943 1975299 1573978
33554A573978l93590l72899l30650k65109j81234q8556R95P4998J22515J36366
$$ 1573978 1180388 807489 476839 211730 30496 -58060 -57065 17933 140448 276814
33544B76814J15396O6098K550n6019q9794q3789l2467N8260J73153K93644M04491
$$ 276814 392210 458308 460858 404839 315045 231256 198789 257049 430202 723846 1128337
33533A128337M96807N66209O09203O21841O01423N48873M69488L71994K66905
$$ 1128337 1625144 2191353 2800556 3422397 4023820 4572693 5042181 5414175 5681080
33524E681080J64564P2874m865p1021j32451j96675k66796l38523m02082m47954
$$ 5681080 5845644 5918518 5913653 5842632 5710181 5513506 5246710 4908187 4506105 4058151
33514D058151m71765m74633m59988m30807l89468l38803k82016k21162j55824
$$ 4058151 3586386 3111753 2651765 2220958 1831490 1492687 1210671 989509 833685
33505H33685q3713l556Q1227J60828K21544K51428K45186K04916J37215M9981
$$ 833685 749972 746416 827643 988471 1210015 1461443 1706629 1911545 2048760 2098741
33495B098741m8504j48576k38351l04613l35725l25498k76265j99411j12707l5487
$$ 2098741 2050237 1901661 1663310 1358697 1022972 697474 421209 221798 109091 73604
33485G3604J6490L4445J7151l0923j02078j86849k74619l54530m17036m55179
$$ 73604 90094 124539 141690 110767 8689 -178160 -452779 -807309 -1224345 -1679524
33475a679524m65232m47360m06268l50440k89395k30799j79567j38283j06598
$$ -1679524 -2144756 -2592116 -2998384 -3348824 -3638219 -3869018 -4048585 -4186868 -4293466
33466d293466p9478m7113J792P5191J74556K94318M22578N42167O33000O76631
$$ -4293466 -4372944 -4420057 -4418265 -4343074 -4168518 -3874200 -3451622 -2909455 -2276455 -1599824
33456a599824O62273N91733M80114L50739K26039J19284L1977m2148j09856j72623
$$ -1599824 -937551 -345818 134296 485035 711074 830358 862335 820187 710331 537708
33446E37708k25138k58018k62708k35969j81878j10650l4990L4094Q9872J29659
$$ 537708 312570 54552 -208156 -444125 -626003 -736653 -771643 -737549 -647677 -518018
33436e18018J52919J60336J55133J44508J37924J42116J56682J74073J83884J78286
$$ -518018 -365099 -204763 -49630 94878 232802 374918 531600 705673 889557 1067843
33426A067843J55722J21847Q7433O3737N7490O8659R2222J21783J51822J77765
$$ 1067843 1223565 1345412 1432845 1496582 1554072 1622731 1714953 1836736 1988558 2166323
33416B166323J95551K02394J98329J87162J75804J72099J81662K04752K34869
$$ 2166323 2361874 2564268 2762597 2949759 3125563 3297662 3479324 3684076 3918945
33407C918945K60548K69946K55441K15238J51437O7061l5107j51641k77655m07830
$$ 3918945 4179493 4449439 4704880 4920118 5071555 5138616 5103509 4951868 4674213 4266383
33397D266383n38182o66118p88073q97133r83811j040282j064887j063004j043281
$$ 4266383 3728201 3062083 2274010 1376877 393066 -647216 -1712103 -2775107 -3818388
33388c818388j011892r69046r10377q32193p36538o31850n28523m33075l45836
$$ -3818388 -4830280 -5799326 -6709703 -7541896 -8278434 -8910284 -9438807 -9871882 -10217718
33379a0217718k63447j82933j03362k4589N4322J34885K17565L00031L75862M34205
$$ -10217718 -10481165 -10664098 -10767460 -10792049 -10737727 -10602842 -10385277 -10085246 -9709384 -9275179
33369i275179M61826M48500L93307L07145K08896J17997M9154J1793J1572M9920
$$ -9275179 -8813353 -8364853 -7971546 -7664401 -7455505 -7337508 -7288354 -7276561 -7264989 -7215069
33359g215069J21345K12346L04655L80887M28382M39792M13217L54301K78607
$$ -7215069 -7093724 -6881378 -6576723 -6195836 -5767454 -5327662 -4914445 -4560144 -4281537
33350d281537K09651J70841J75153K19079K84682L48042L88979L97128L72645
$$ -4281537 -4071886 -3901045 -3725892 -3506813 -3222131 -2874089 -2485110 -2087982 -1715337
33341a715337L22834K57774J87477J21137O6886L0065J0159j005j6884m9777j04094
$$ -1715337 -1392503 -1134729 -947252 -826115 -759229 -729164 -719005 -720010 -736894 -786671 -890765
33330h90765j73879k46424l09448l57203l91876m20200m48264m77759n04973n21703
$$ -890765 -1064644 -1311068 -1620516 -1977719 -2369595 -2789795 -3238059 -3715818 -4220791 -4742494
33320d742494n17386m82534m13188l14450k00798r2385q624L8701N0304L9778
$$ -4742494 -5259880 -5742414 -6155602 -6470052 -6670850 -6763235 -6771859 -6733158 -6682854 -6643076
33310f643076K8317L5874P3482J40736K28591L24493M16666M96108N56375N91962
$$ -6643076 -6614759 -6578885 -6505403 -6364667 -6136076 -5811583 -5394917 -4898809 -4342434 -3750472
33300c750472N96623N63216M85903L63683K02962J7386j74840l54394n03674o09210
$$ -3750472 -3153849 -2590633 -2104730 -1741047 -1538085 -1520699 -1695539 -2049933 -2553607 -3162817
33290c162817o64187o70218o36528n76026n00250m16056l25495k28336j25557
$$ -3162817 -3827004 -4497222 -5133750 -5709776 -6210026 -6626082 -6951577 -7179913 -7305470
33281g305470k1869P4659J56276K20309K71130L17184L64945M14292M58667M89700
$$ -7305470 -7327339 -7252680 -7096404 -6876095 -6604965 -6287781 -5922836 -5508544 -5049877 -4560177
33271d560177N02901N00677M91038M83093M82106M86739M89651M80817M51581
$$ -4560177 -4057276 -3556599 -3065561 -2582468 -2100362 -1613623 -1123972 -643155 -191574
33262a91574L97499L19362K23023J18544J8230o6768j29955j70794j92785j99978
$$ -191574 205925 525287 748310 866854 885084 818316 688361 517567 324782 124804
33252A24804j94694j77762j50286j15015p6211l8212l940K5434M9264O5553O9895
$$ 124804 -69890 -247652 -397938 -512953 -589164 -627376 -631316 -605882 -556618 -491065 -421170
33241d21170N6147J8697m4606j29757k25289l13550l75055l94661l66556k95565
$$ -421170 -365023 -346326 -390932 -520689 -745978 -1059528 -1434583 -1829244 -2195800 -2491365
33231b491365j94808q1736K5452J10807J63409J79474J62808J23454P5353L3387
$$ -2491365 -2686173 -2767909 -2742457 -2631650 -2468241 -2288767 -2125959 -2002505 -1927152 -1893765
33221a893765R658R755L1387O7129J09641J54946K00987K43364K72975K78152
$$ -1893765 -1884107 -1874352 -1842965 -1775836 -1666195 -1511249 -1310262 -1066898 -793923 -515771
33211e15771K49587J84324Q7193k9359j46471k42336k98844l08827k79245k28007
$$ -515771 -266184 -81860 5333 -24026 -170497 -412833 -711677 -1020504 -1299749 -1527756
33201a527756j77021j45763j47240j85180k51798l27962l88324m10602l84150
$$ -1527756 -1704777 -1850540 -1997780 -2182960 -2434758 -2762720 -3151044 -3561646 -3945796
33192c945796l12315k07350q2651N1283J85262L08367M08674M77659N13387N18891
$$ -3945796 -4258111 -4465461 -4548112 -4496829 -4311567 -4003200 -3594526 -3116867 -2603480 -2084589
33182b084589M97828M52320L84739L00640K09386J22081M9047j596k4627j8736
$$ -2084589 -1586761 -1134441 -749702 -449062 -239676 -117595 -68548 -70144 -94771 -113507
33172a13507J2312N9661J11340J55505J83221J89908J75632J44688J04398O2972
$$ -113507 -101195 -41534 69806 225311 408532 598440 774072 918760 1023158 1086130
33162A086130K7162R02j4605k0065j7450r982k399p83j1252l7722q0110j34367
$$ 1086130 1113292 1114194 1099589 1079524 1062074 1052092 1049693 1048910 1037658 999936 919826 785459
33150G85459j94017k51726k99904l30899l37483l13457k54163j57317k4496J37536
$$ 785459 591442 339716 39812 -291087 -628570 -942027 -1196190 -1353507 -1378003 -1240467
33140a240467L16763M97000O59539P85617Q60251Q76289Q35913P48295O25212
$$ -1240467 -923704 -426704 232835 1018452 1878703 2754992 3590905 4339200 4964412
33131D964412M77509L13634J39824l8599k15128l80406n22844o32121p03619p40609
$$ 4964412 5441921 5755555 5895379 5856780 5641652 5261246 4738402 4106281 3402662 2662053
33121B662053p52423p49655p39522p23976p01073o68032o24086n71947n17547
$$ 2662053 1909630 1159975 420453 -303523 -1004596 -1672628 -2296714 -2868661 -3386208
33112c386208m68272m30396m06713l94856l86727l69777l30871k61643j62349
$$ -3386208 -3854480 -4284876 -4691589 -5086445 -5473172 -5842949 -6173820 -6435463 -6597812
33103f597812m2018Q4411J99828K88582L40186L52411L31923K91912K48278K16250
$$ -6597812 -6639830 -6555419 -6355591 -6067009 -5726823 -5374412 -5042489 -4750577 -4502299 -4286049
33093d286049K07880K30352K85507L70251M76479N89908O90095P54597P66907
$$ -4286049 -4078169 -3847817 -3562310 -3192059 -2715580 -2125672 -1435577 -680980 85927
33084H5927P23597O36095N26298M18716L32724K77641K52174K48058K55529K67409
$$ 85927 809524 1445619 1971917 2390633 2723357 3000998 3253172 3501230 3756759 4024168
33074D024168K80019K91684L00657L03819K96726K75171K38005J89844J41682
$$ 4024168 4304187 4595871 4896528 5200347 5497073 5772244 6010249 6200093 6341775
33065F341775J08172J02364J30399J88716K65044L42281M03219M34273M27712
$$ 6341775 6449947 6552311 6682710 6871426 7136470 7478751 7881970 8316243 8743955
33056H743955L82609L04339K02125Q5083m0998j73860l11806m49754n77155o79268
$$ 8743955 9126564 9430903 9633028 9718111 9677113 9503253 9191447 8741693 8164538 7485270
33046G485270p41529p55114p20825o48937n55129m55257l61973k84223k28542
$$ 7485270 6743741 5988627 5267802 4618865 4063736 3608479 3246506 2962283 2733741
33037B733741k00356k03998k40850l06559l89791m74536n45066n90235o04775
$$ 2733741 2533385 2329387 2088537 1781978 1392187 917651 372585 -217650 -822425
33028h22425n88213n43459m75831l92080k99228k03676j10658k3909N4010J20183
$$ -822425 -1410638 -1954097 -2429928 -2822008 -3121236 -3324912 -3435570 -3459479 -3405469 -3285286
33018c285286J69813J96996J98089J74725J33465Q2639K9706j8935n6886p7621
$$ -3285286 -3115473 -2918477 -2720388 -2545663 -2412198 -2329559 -2299853 -2318788 -2375674 -2453295
33008b453295p5960n0281m219N3436J11530J61157J99099K27552K50601K70789
$$ -2453295 -2529255 -2579536 -2583755 -2530319 -2418789 -2257632 -2058533 -1830981 -1580380 -1309591
32998a309591K88473L03634L17559L32458L49396L66530L79407L83510L77462
$$ -1309591 -1021118 -717484 -399925 -67467 281929 648459 1027866 1411376 1788838
32989A788838L64997L54489L56058L77061M17591M68475N13935N38609N35183
$$ 1788838 2153835 2508324 2864382 3241443 3659034 4127509 4641444 5180053 5715236
32980E715236N07916M69882M36252M17511M15522M23236M28001M17347L84099
$$ 5715236 6223152 6693034 7129286 7546797 7962319 8385555 8813556 9230903 9615002
32971I615002L27287K48971J51232L7130q5989k05586l07392l80352m19782m28681
$$ 9615002 9942289 10191260 10342492 10379622 10293633 10088047 9780655 9400303 8980521 8551840
32961H551840m18442m07891m18340m64966n48863o54858p57193q30402q59654
$$ 8551840 8133398 7725507 7307167 6842201 6293338 5638480 4881287 4050885 3191231
32952C191231q45085p98491p35245o66526n95438n18068m28221l22972k05685
$$ 3191231 2346146 1547655 812410 145884 -449554 -967622 -1395843 -1718815 -1924500
32943a924500q4960K8969J27644K06156K63563L02107L25147L34294L27035K96202
$$ -1924500 -2009460 -1980491 -1852847 -1646691 -1383128 -1081021 -755874 -421580 -94545 201657
32933B01657K32302J29069r872j67845l18979m37258n04868n15746m74591l93332
$$ 201657 433959 563028 553156 385311 66332 -370926 -875794 -1391540 -1866131 -2259463
32923b259463k86203j64942l6717R4094K22636L42104M44478N21429N64453N65392
$$ -2259463 -2545666 -2710608 -2747325 -2653231 -2430595 -2088491 -1644013 -1122584 -558131 7261
32913G261N18590M24321K91837J39651q423j30797k15335k62490k83230k93533
$$ 7261 525851 950172 1242009 1381660 1373237 1242440 1027105 764615 481385 187852
32903A87852l07668l32397l64694l94863m13512m17408m10151l97694l82856l63206
$$ 187852 -119816 -452213 -816907 -1211770 -1625282 -2042690 -2452841 -2850535 -3233391 -3596597
32893c596597l33846k92609k43262j94220j54184j28216j16002j12019j07326
$$ -3596597 -3930443 -4223052 -4466314 -4660534 -4814718 -4942934 -5058936 -5170955 -5278281
32884e278281r3365o6594l0749N676L5262N6657P5528J01411J42804K03369K80855
$$ -5278281 -5371646 -5438240 -5468989 -5463313 -5428051 -5371394 -5295866 -5194455 -5051651 -4848282 -4567427
32873d567427L68265M55838N32945N90037O20436O21088N92200N36929M61822
$$ -4567427 -4199162 -3743324 -3210379 -2620342 -1999906 -1378818 -786618 -249689 212133
32864B12133L76924K93930K22819J68886J31737J06503Q6842O8804N3513M6653
$$ 212133 589057 882987 1105806 1274692 1406429 1512932 1599774 1668578 1722091 1768744
32854A768744N4973Q2392J28162J87261K51670L11401L55238L71754L51249K88739
$$ 1768744 1823717 1906109 2034271 2221532 2473202 2784603 3139841 3511595 3862844 4151583
32844D151583J87044N8068p8932k01623k89772l30033l19308k65470j84358r3894
$$ 4151583 4338627 4396695 4317763 4116140 3826368 3496335 3177027 2911557 2727199 2633305
32834B633305q273O4618J21789J61590J80908J75005J39997P6183j0061j07483
$$ 2633305 2625032 2689650 2811439 2973029 3153937 3328942 3468939 3545122 3535061 3427578
32824C427578k03664k89210l60234m18577m70547n25087n91511o76274p79169
$$ 3427578 3223914 2934704 2574470 2155893 1685346 1160259 568748 -107526 -886695
32815h86695q90587r92083j060784j075854j024318r04439p26331n09892k80143
$$ -886695 -1777282 -2769365 -3830149 -4906003 -5930321 -6834760 -7561091 -8070983 -8351126
32806h351126o1084J29629K82905L97163M75793N25148N53729N71692N89428O14693
$$ -8351126 -8412210 -8282581 -7999676 -7602513 -7126720 -6601572 -6047843 -5476151 -4886723 -4272030
32796d272030O49396O88207P20722P36487P29826P01381O55834N98120N31203
$$ -4272030 -3622634 -2934427 -2213705 -1477218 -747392 -46011 609823 1207943 1739146
32787A739146M56473L75451K90712K05146J20445L6321m8643j35014k20849l01724
$$ 1739146 2195619 2571070 2861782 3066928 3187373 3223694 3175051 3040037 2819188 2517464
32777B517464l72593m30063m73586n04944n26430n38258n35997n09748m47145
$$ 2517464 2144871 1714808 1241222 736278 209848 -328410 -864407 -1374155 -1821300
32768a821300l39870j90221j3166J68035L30310M58364N47158N98529O15313N97657
$$ -1821300 -2161170 -2351391 -2364557 -2196522 -1866212 -1407848 -860690 -262161 353152 950809
32758I50809N43760M53464L31606J89376M3050r0412k00146k86616l60451m34029
$$ 950809 1494569 1948033 2279639 2469015 2512065 2421653 2221507 1934891 1574440 1140411
32748A140411n11380n83866o34594o48055o18345n51378m60663l59962k57242
$$ 1140411 629031 45165 -589429 -1237484 -1855829 -2407207 -2867870 -3227832 -3485074
32739c485074j53040m3608P3335J93823L06897L98486M57525M80397M71225M38344
$$ -3485074 -3638114 -3681722 -3608387 -3414564 -3107667 -2709181 -2251656 -1771259 -1300034 -861690
32729h61690L89427L28054K53501J63709N9542n2247j59299k47477l06744l35998
$$ -861690 -472263 -144209 109292 273001 332543 280296 120997 -126480 -433224 -769222
32719g69222l43447l41630l40454l43435l49079l54521l57267l54006l38824l03468
$$ -769222 -1112669 -1454299 -1794753 -2138188 -2487267 -2841788 -3199055 -3553061 -3891885 -4195353
32709d195353k40329j46705k7768J03783K31379L39272M16083M56818M63742M45409
$$ -4195353 -4435682 -4582387 -4610155 -4506372 -4274993 -3935721 -3519638 -3062820 -2599078 -2153669
32699b153669M13049L75457L35690K91677K39973J79823J15276N4542P377j7989
$$ -2153669 -1740620 -1365163 -1029473 -737796 -497823 -318000 -202724 -148182 -140805 -158794
32689a58794j7106R212N3802J03255J40726J51198J26333O6039k3211j30967k44733
$$ -158794 -175900 -166688 -112886 -9631 131095 282293 408626 474665 451454 320487 75754
32678G5754l51587m40348n03886n40589n54042n50985n38261n20261m98336m72085
$$ 75754 -275833 -716181 -1220067 -1760656 -2314698 -2865683 -3403944 -3924205 -4422541 -4894626
32668d894626m40679m02551l54213k90914k10272j16339j9921O5972J31769J73417
$$ -4894626 -5335305 -5737856 -6092069 -6382983 -6593255 -6709594 -6729515 -6663543 -6531774 -6358357
32658f358357J90293J82745J52586J05402N1105J526l2549m2317k0512L7998J33752
$$ -6358357 -6168064 -5985319 -5832733 -5727331 -5676226 -5674700 -5707249 -5749566 -5770078 -5732080 -5598328
32647e598328K59844M00629N32947O30224O69247O37613N38303L88861K15889
$$ -5598328 -5338484 -4937855 -4404908 -3774684 -3105437 -2467824 -1929521 -1540660 -1324771
32638a324771M7881r1256j87226k38300k54641k53003k48534k48028k48642k42363
$$ -1324771 -1276890 -1368146 -1555372 -1793672 -2048313 -2301316 -2549850 -2797878 -3046520 -3288883
32628c288883k22343j86364j36306p6301j2139M8788R9493J37225J65824J93960
$$ -3288883 -3511226 -3697590 -3833896 -3910197 -3922336 -3873548 -3774055 -3636830 -3471006 -3277046
32618c277046K30228K78493L36012L94837M45433M80618M97648M97573M82998
$$ -3277046 -3046818 -2768325 -2432313 -2037476 -1592043 -1111425 -613777 -116204 366794
32609C66794M56220M18443L69941L10957K43485J72987J08399O0054L7004M5417
$$ 366794 823014 1241457 1611398 1922355 2165840 2338827 2447226 2507280 2544284 2589701
32599B589701Q7849J62273K60820L69608M70983N47507N85776N78610N25431M31560
$$ 2589701 2677550 2839823 3100643 3470251 3941234 4488741 5074517 5653127 6178558 6610118
32589F610118L07069J65457K2135j07771k12786k89045l42135l84138m26637m74277
$$ 6610118 6917187 7082644 7104779 6997008 6784222 6495177 6153042 5768904 5342267 4867990
32579D867990n23202n64014n85618n77743n33381m52652l46156k33883j38148
$$ 4867990 4344788 3780774 3195156 2617413 2084032 1631380 1285224 1051341 913193
32570I13193p3947m2719l3547l0865k3487r182P353K0230K6759K7505K3325J3051
$$ 913193 839246 796527 762980 732115 708628 699446 706799 727029 753788 781293 804618 817669
32558H17669n781l4143o9568j06938j41245j69822j92217k07944k14030k04593
$$ 817669 811888 777745 708177 601239 459994 290172 97955 -109989 -324019 -528612
32548e28612j73493j18936m7047K8321Q9865J22719J18855P8701J0376p2902j56863
$$ -528612 -702105 -821041 -868088 -839767 -749902 -627183 -508328 -429627 -419251 -492153 -649016
32537f49016k30631k89396l33871l67473l94004m17247m41360m69888n03224n36525
$$ -649016 -879647 -1169043 -1502914 -1870387 -2264391 -2681638 -3122998 -3592886 -4096110 -4632635
32527d632635n59936n60897n27402m51916l36011j93775n0109O7700J41258J67935
$$ -4632635 -5192571 -5753468 -6280870 -6732786 -7068797 -7262572 -7312681 -7244981 -7103723 -6935788
32517f935788J58959J31297R9707P3678N8706N8323P4238J05467J49072K03354
$$ -6935788 -6776829 -6645532 -6545825 -6472147 -6413441 -6355118 -6280880 -6175413 -6026341 -5822987
32507e822987K70530L55052M57845N71667O82675P77173Q47399Q91783R11203
$$ -5822987 -5552457 -5197405 -4739560 -4167893 -3485218 -2708045 -1860646 -968863 -57660
32498e7660R06116Q77153Q27497P63880O94741O26888N63247N03567M47397L96510
$$ -57660 848456 1725609 2553106 3316986 4011727 4638615 5201862 5705429 6152826 6549336
32488F549336L54506L23977L03737K88127K68822K38224J92639J33130O3355j3639
$$ 6549336 6903842 7227819 7531556 7819683 8088505 8326729 8519368 8652498 8715853 8702214
32478H702214r6565j84010k71596l50965m11362m42875m39582m01253l33283k45950
$$ 8702214 8605649 8421639 8150043 7799078 7387716 6944841 6505259 6104006 5770723 5524773
32468E524773j53912p4892k5472j4596l9273q6690j41903j95626k46862k99223
$$ 5524773 5370861 5295969 5270497 5255901 5216628 5129938 4988035 4792409 4545547 4246324
32458D246324l54224m06780m46542m64077m56931m30997l97098l66038l45061
$$ 4246324 3892100 3485320 3038778 2574701 2117770 1686773 1289675 923637 578576
32449E78576l36502l38360l46368l56470l66336l75393l83776l90606l91988l80399
$$ 578576 242074 -96286 -442654 -799124 -1165460 -1540853 -1924629 -2315235 -2707223 -3087622
32439c087622l47305k88557k08900j21821m4140J1675M3029N7178O5741P7677
$$ -3087622 -3434927 -3723484 -3932384 -4054205 -4098345 -4086670 -4043641 -3986463 -3920722 -3843045
32429c843045R5940J19610J48477J85402K34676K98021L71179M43406N00749N31839
$$ -3843045 -3747105 -3627495 -3479018 -3293616 -3058940 -2760919 -2389740 -1946334 -1445585 -913746
32419i13746N33067N10036M74588M39199M11416L90678L69054L35904K83910K12862
$$ -913746 -380679 129357 603945 1043144 1454560 1845238 2214292 2550196 2834106 3046968
32409C046968J29061M1323m3540j22781j96169k61938l13530l40330l32417k85925
$$ 3046968 3176029 3217352 3173812 3051031 2854862 2592924 2279394 1939064 1606647 1320722
32399A320722k05302j01984Q300J07860J79531K09968J92792J29746K9718r2970
$$ 1320722 1115420 1013436 1021736 1129596 1309127 1519095 1711887 1841633 1871351 1778381
32389A778381k20305l32895m13351m49776m38306l84232l01205k07421j19259
$$ 1778381 1558076 1225181 811830 362054 -76252 -460484 -761689 -969110 -1088369
32380a088369m5765J1981N6622Q9795J11044J20510J22044J23457J33079J54856
$$ -1088369 -1134134 -1122153 -1065531 -975736 -864692 -744182 -622138 -498681 -365602 -210746
32370b10746J85742K17807K43177K56984K56105K36676J95180J33034N9370j2404
$$ -210746 -25004 192803 435980 692964 949069 1185745 1380925 1513959 1573329 1560925
32360A560925p2511j20547j64111k11387k63667l13459l48972l60992l47484l14201
$$ 1560925 1488414 1367867 1203756 992369 728702 415243 66271 -294721 -642205 -956406
32350i56406k72417k35459k14938k17478k42944k84791l32408l74959m05595m23883
$$ -956406 -1228823 -1464282 -1679220 -1896698 -2139642 -2424433 -2756841 -3131800 -3537395 -3961278
32340c961278m34273m40923m42410m30327l92953l21873k18265r5749K2455J12107
$$ -3961278 -4395551 -4836474 -5278884 -5709211 -6102164 -6424037 -6642302 -6738051 -6715596 -6603489
32330f603489J58611J63668J43891J22731J20717J48513K04525K76891L48962
$$ -6603489 -6444878 -6281210 -6137319 -6014588 -5893871 -5745358 -5540833 -5263942 -4914980
32321d914980M06438M42996M61259M68306M68498M58610M29066L70745K82413
$$ -4914980 -4508542 -4065546 -3604287 -3135981 -2667483 -2208873 -1779807 -1409062 -1126649
32312a126649J73437O0310m0222j17463j69853k03787k28601k50314k68006k74831
$$ -1126649 -953212 -892902 -933124 -1050587 -1220440 -1424227 -1652828 -1903142 -2171148 -2445979
32302b445979k62115k23701j59239p6307R568P8273J11491R9650M6415l1693j11528
$$ -2445979 -2708094 -2931795 -3091034 -3167341 -3157773 -3079500 -2968009 -2868359 -2821944 -2853637 -2965165
32291b965165j73090k06979k14460k01080j70128j20989n2017L5510J35075K35572
$$ -2965165 -3138255 -3345234 -3559694 -3760774 -3930902 -4051891 -4103908 -4068398 -3933323 -3697751
32281c697751L25188L96475M48539M84105N04153N05148M80897M26642L42295
$$ -3697751 -3372563 -2976088 -2527549 -2043444 -1539291 -1034143 -553246 -126604 215691
32272B15691K33634J12034o720j04712j65760j80417j49886q5737m758P7625J51015
$$ 215691 449325 561359 554639 449927 284167 103750 -46136 -131873 -136631 -59006 92009
32261I2009K09695K50861K74187K82666K82659K81435K82794K83909K76771K54288
$$ 92009 301704 552565 826752 1109418 1392077 1673512 1956306 2240215 2516986 2771274
32251B771274K16395J70932J28364R4730O8064M0483M399m1316q9450j28247j47868
$$ 2771274 2987669 3158601 3286965 3381695 3449759 3490242 3494641 3453325 3363875 3235628 3087760
32240C087760j44778j22084q7393n0345k0242l941m798k3140n7318j04388j60548
$$ 3087760 2942982 2820898 2733505 2683160 2662918 2658977 2654179 2631039 2573721 2469333 2308785
32229B308785k21533k82447l37212l79231m04027m11815m07164l95683l80574
$$ 2308785 2087252 1804805 1467593 1088362 684335 272520 -134644 -530327 -910901
32220i10901l61242l33805k92499k31945j50166n0948N6380J59972K49246L17231
$$ -910901 -1272143 -1605948 -1898447 -2130392 -2280558 -2331506 -2275126 -2115154 -1865908 -1548677
32210a548677L60993L81220L81629L67784L44842L15394K79101K34614J82105
$$ -1548677 -1187684 -806464 -424835 -57051 287791 603185 882286 1116900 1299005
32201A299005J24450O6571J3919k8591n6776o7065n7034k6739K0284P7473J36790
$$ 1299005 1423455 1490026 1503945 1475354 1418578 1351513 1294479 1267740 1288024 1365497 1502287
32190A502287J90164K30410K52476K55060K41161K16493J86444J53382J15462
$$ 1502287 1692451 1922861 2175337 2430397 2671558 2888051 3074495 3227877 3343339
32181C343339O7637N425o9801j47706k11795k47031k46715k13753j56989q7287
$$ 3343339 3410976 3416401 3346600 3198894 2987099 2740068 2493353 2279600 2122611 2035324
32171B035324j6548M1660P3175O7224K1028n8230j55331k51393l28231l71280
$$ 2035324 2018776 2060436 2133611 2200835 2221863 2163633 2008302 1756909 1428678 1057398
32161A057398l71227l25281k38246j22462M532J24347K22165K89199L22515L23082
$$ 1057398 686171 360890 122644 182 4714 129061 351226 640425 962940 1286022
32151A286022K93491K36776J57284O2904l3862j18158j77703k07086k08745j90455
$$ 1286022 1579513 1816289 1973573 2036477 2002615 1884457 1706754 1499668 1290923 1100468
32141A100468j61112j27107r1009n2972j2995K8388P1505J18772J74046K40612
$$ 1100468 939356 812249 721240 668268 655273 683661 755166 873938 1047984 1288596
32131A288596L19462M08164N00073N84396O48106O79237O69977O18648N30707
$$ 1288596 1608058 2016222 2516295 3100691 3748797 4428034 5098011 5716659 6247366
32122F247366M18835L01246J97434J22141Q0188O5365O4749O5632O0276M6089
$$ 6247366 6666201 6967447 7164881 7287022 7367210 7432575 7497324 7562956 7623232 7669321
32112G669321K3496m851l3040n1449m8747j5883M9462J39816K38275L23291L76337
$$ 7669321 7692817 7687966 7654926 7603477 7554730 7538847 7588309 7728125 7966400 8289691 8666028
32101H666028L88879L65759L23666K84420K64736K67538K80767K84901K63693
$$ 8666028 9054907 9420666 9744332 10028752 10293488 10561026 10841793 11126694 11390387
32092A1390387K10943J30519L1996p4353j80869k83346l79802m68598n47281o12673
$$ 11390387 11601330 11731849 11763845 11689492 11508623 11225277 10845475 10376877 9829596 9216923
32082I216923o61918o93656p08226p06366o87369o48993n89949n13087m26603
$$ 9216923 8555005 7861349 7153123 6446757 5759388 5110395 4520446 4007359 3580756
32073C580756l42391k72815k27603k11774k24747k60158l06075l46447l65428
$$ 3580756 3238365 2965550 2737947 2526173 2301426 2041268 1735193 1388746 1023318
32064A023318l53943l14565k60430k08343j71014j53396j54486j71923k05627
$$ 1023318 669375 354810 94380 -113963 -284977 -438373 -592859 -764782 -970409
32055i70409k57866l29832m17327n09052n89005o41698o57327o34453n79385n03071
$$ -970409 -1228275 -1558107 -1975434 -2484486 -3073491 -3715189 -4372516 -5006969 -5586354 -6089425
32045f089425m17448l33103k58725k01433j66611j56594j68847j95344k24806
$$ -6089425 -6506873 -6839976 -7098701 -7300134 -7466745 -7623339 -7792186 -7987530 -8212336
32036h212336k47073k56401k50969k29565j89185j26079l9205O6631J79856K84007
$$ -8212336 -8459409 -8715810 -8966779 -9196344 -9385529 -9511608 -9550813 -9484182 -9304326 -9020319
32026i020319L61999M01172L96354L49268K65488J52199J8920j19858k43574l29151
$$ -9020319 -8658320 -8257148 -7860794 -7511526 -7246038 -7093839 -7074919 -7194777 -7438351 -7767502
32016g767502l59204l30628k57795j67285q7023l5960j9212k9497n2829p5700
$$ -7767502 -8126706 -8457334 -8715129 -8882414 -8969437 -9005397 -9024609 -9054106 -9106935 -9182635
32006i182635r0897r9301j06345j15356j22674j18585r3729m6236J5446P5761
$$ -9182635 -9273532 -9372833 -9479178 -9594534 -9717208 -9835793 -9929522 -9975758 -9960312 -9884551
31996i884551J19337J38501J37434J30792J37173J70473K33342L15415L96683
$$ -9884551 -9765214 -9626713 -9489279 -9358487 -9221314 -9050841 -8817499 -8502084 -8105401
31987h105401M54471M71374M40650L66405K59232J31371n040j36761k48689l26074
$$ -8105401 -7650930 -7179556 -6738906 -6372501 -6113269 -5981898 -5986938 -6123699 -6372388 -6698462
31977f698462l59210l47561l00243k31833j55778p9842o571O2551J23750J71748
$$ -6698462 -7057672 -7405233 -7705476 -7937309 -8093087 -8172929 -8179500 -8116949 -7993199 -7821451
31967g821451K04071K25264K47326K84914L47331M31896N23238N99249O40081
$$ -7821451 -7617380 -7392116 -7144790 -6859876 -6512545 -6080649 -5557411 -4958162 -4318081
31958d318081O35171N85579N02045M00750K98354K07416J33167P2727J7530m1725
$$ -4318081 -3682910 -3097331 -2595286 -2194536 -1896182 -1688766 -1555599 -1482872 -1465342 -1507067
31948a507067j10161j86560k64811l37082l96612m39285m64562m75839m79745
$$ -1507067 -1617228 -1803788 -2068599 -2405681 -2802293 -3241578 -3706140 -4181979 -4661724
31939d661724m84096m94986n13800n35057n46320n31060m73927l66286k09536
$$ -4661724 -5145820 -5640806 -6154606 -6689663 -7235983 -7767043 -8240970 -8607256 -8816792
31930h816792j4961J99450M13530O08719P69796Q84900R45314R46318Q89015P81814
$$ -8816792 -8831753 -8632303 -8218773 -7610054 -6840258 -5955358 -5010044 -4063726 -3174711 -2392897
31920b392897O39834M81243L21496J68690K3645j14891k43742l52935m29505m64681
$$ -2392897 -1753063 -1271820 -950324 -781634 -757989 -872880 -1116622 -1469557 -1899062 -2363743
31910b363743m59225m23541l72878l20801k74631k34733j97077j56772j10798
$$ -2363743 -2822968 -3246509 -3619387 -3940188 -4214819 -4449552 -4646629 -4803401 -4914199
31901d914199n9509p109L9125P1543Q5995Q4618P5029O5791O1040N8183N0357
$$ -4914199 -4973708 -4980817 -4941692 -4870149 -4784154 -4699536 -4624507 -4558716 -4497676 -4439493 -4389136
31890d389136L1527L24l9762q2933j24111j60765j93346k24616k58514k99182
$$ -4389136 -4357609 -4357285 -4397047 -4479980 -4604091 -4764856 -4958202 -5182818 -5441332 -5740514
31880e740514l50183m13033m84746n56204o13525o41990o29605n68719m57335
$$ -5740514 -6090697 -6503730 -6988476 -7544680 -8158205 -8800195 -9429800 -9998519 -10455854
31871a0455854l01658j17852P0530K39773L73737M67502N25610N56940N69594
$$ -10455854 -10757512 -10875364 -10804834 -10565061 -10191324 -9723822 -9198212 -8641272 -8071678
31862h071678N68448N55827N33155N01260M59751M07812L46882K82244K20923
$$ -8071678 -7503230 -6947403 -6414248 -5912988 -5453237 -5045425 -4698543 -4416299 -4195376
31853d195376J67204J19542P1227J4086n6908j40528k29681l15154l89486m47309
$$ -4195376 -4028172 -3908630 -3837403 -3823317 -3880225 -4020753 -4250434 -4565588 -4955074 -5402383
31843e402383m82513m86879m53653l83828k89196j88810j01273l8093j312J5171
$$ -5402383 -5884896 -6371775 -6825428 -7209256 -7498452 -7687262 -7788535 -7826628 -7827940 -7812769
31833g812769K2460L2395N2537Q2408J14142J37855J47532J42433J23606R0042
$$ -7812769 -7790309 -7757914 -7705377 -7622969 -7508827 -7370972 -7223440 -7081007 -6957401 -6867359
31823f867359L8709l1605j16055k02466k74250l16668l23381k99320k57816k14021
$$ -6867359 -6828650 -6860255 -6976310 -7178776 -7453026 -7769694 -8093075 -8392395 -8650211 -8864232
31813h864232j79208j58641j52161j55388j61318j63443j59922j55883j61017
$$ -8864232 -9043440 -9202081 -9354242 -9509630 -9670948 -9834391 -9994313 -10150196 -10311213
31804a0311213j83020k20950k62785k88651k78252k19345j13884K1220J59675
$$ -10311213 -10494233 -10715183 -10977968 -11266619 -11544871 -11764216 -11878100 -11856880 -11697205
31795a1697205K75378L51007L81737L73749L40330K98018K63305K49253K62035
$$ -11697205 -11421827 -11070820 -10689083 -10315334 -9975004 -9676986 -9413681 -9164428 -8902393
31786h902393K98727L47741L92251M15558M06327L61611K86843J93998R9965K5421
$$ -8902393 -8603666 -8255925 -7863674 -7448116 -7041789 -6680178 -6393335 -6199337 -6099372 -6073951
31776f073951q270J3745R1188K05780L28796M35119N13395N65493N98017O14646
$$ -6073951 -6082221 -6068476 -5977288 -5771508 -5442712 -5007593 -4494198 -3928705 -3330688 -2716042
31766b716042O14444N94299N51058M82274L87457K70553J41351J3589r9339j88036
$$ -2716042 -2101598 -1507299 -956241 -473967 -86510 184043 325394 338983 239644 51608
31756E1608k48108k78919k81536k57459k09361j43976p4570j9047P227n87l4414
$$ 51608 -196500 -475419 -756955 -1014414 -1223775 -1367751 -1442321 -1461368 -1454141 -1454728 -1489142
31745a489142p8514j18092j45103j58567j61299j56411j45737j29977j09514q5144
$$ -1489142 -1567656 -1685748 -1830851 -1989418 -2150717 -2307128 -2452865 -2582842 -2692356 -2777500
31735b777500n8844l4599j8454j6758l3039o5640j07818j50031j82323j95518
$$ -2777500 -2836344 -2870943 -2889397 -2906155 -2939194 -3004834 -3112652 -3262683 -3445006 -3640524
31725c640524j81757j35866n7943M4479J56805K60976L40638L85410L92455L65444
$$ -3640524 -3822281 -3958147 -4016090 -3971611 -3814806 -3553830 -3213192 -2827782 -2435327 -2069883
31715b069883L12293K43397J70667J06068N8720L2234K5354L6177O5713J16746
$$ -2069883 -1757590 -1514193 -1343526 -1237458 -1178738 -1146504 -1121150 -1084973 -1019260 -902514
31705i02514J88805K74130L58019M22964M53964M42806L89795L02361J92148P3196
$$ -902514 -713709 -439579 -81560 341404 795368 1238174 1627969 1930330 2122478 2195674
31695B195674l8524j26630j78614j90729j69971j31528r2954o7474n9540o5316
$$ 2195674 2157150 2030520 1851906 1661177 1491206 1359678 1266724 1199250 1139710 1074394
31685A074394p7874r3011j11059j34221j62627j92392k16820k30058k31166k25106
$$ 1074394 996520 903509 792450 658229 495602 303210 86390 -143668 -374834 -599940
31675e99940k19040k16846k17461k18538k20874k28230k42884k61887k77598k81326
$$ -599940 -818980 -1035826 -1253287 -1471825 -1692699 -1920929 -2163813 -2425700 -2703298 -2984624
31665b984624k66656k30796j74944j04707k9833L8554R3032J34132J70280K13156
$$ -2984624 -3251280 -3482076 -3657020 -3761727 -3791560 -3753006 -3659974 -3525842 -3355562 -3142406
31655c142406K71724L48378M38012N29302O07864O61324O84635O82111O63653
$$ -3142406 -2870682 -2522304 -2084292 -1554990 -947126 -285802 398833 1080944 1744597
31646A744597O36780N99956N42493M51458L20834J56547k5496k06108l69157n03678
$$ 1744597 2381377 2981333 3523826 3975284 4296118 4452665 4427169 4221061 3851904 3348226
31636C348226o01922o57068o64221o24350n47005m48206l44523k47810j63745
$$ 3348226 2746304 2089236 1425015 800665 253660 -194546 -539069 -786879 -950624
31627i50624r3920l9128j937J2634j209m6709j21541k16821l18215m08351m69923
$$ -950624 -1044544 -1083672 -1085609 -1072975 -1074184 -1120893 -1242434 -1459255 -1777470 -2185821 -2655744
31616b655744m89290m59757l83592k72383j45853k8978N3248Q2925N5543j8219
$$ -2655744 -3145034 -3604791 -3988383 -4260766 -4406619 -4435597 -4382349 -4299424 -4243881 -4262100
31606d262100j16905k16541k97989l50233l70069l60457l28652k83544k32302
$$ -4262100 -4379005 -4595546 -4893535 -5243768 -5613837 -5974294 -6302946 -6586490 -6818792
31597f818792j77906j19245n3962J7680R0174J53347J96173K11645J99425J65032
$$ -6818792 -6996698 -7115943 -7169905 -7152225 -7062051 -6908704 -6712531 -6500886 -6301461 -6136429
31587f136429J17049O4923J8303j3255k1499j812M4383J08409J75406K28309K54206
$$ -6136429 -6019380 -5954457 -5936154 -5949409 -5970908 -5972720 -5928337 -5819928 -5644522 -5416213 -5162007
31576e162007K50228K24624J91026J59510J31353J00870O0947O814o3023j46227
$$ -5162007 -4911779 -4687155 -4496129 -4336619 -4205266 -4104396 -4043449 -4036635 -4099658 -4245885
31566d245885k35809l21407l93257m45398m75168m80608m59601m11604l39554
$$ -4245885 -4481694 -4803101 -5196358 -5641756 -6116924 -6597532 -7057133 -7468737 -7808291
31557g808291k49898j51044n1374M2486J26867K01261K67532L28423L85764M39132
$$ -7808291 -8058189 -8209233 -8260607 -8218121 -8091254 -7889993 -7622461 -7294038 -6908274 -6469142
31547f469142M85706N21103N39999N36179N03522M39092L46831K38780J32261
$$ -6469142 -5983436 -5462333 -4922334 -4386155 -3882633 -3443541 -3096710 -2857930 -2725669
31538b725669M4131j5327m5733n4719n1569m1540k6167q878O79j0915n3121j24910
$$ -2725669 -2681538 -2696865 -2742598 -2797317 -2848886 -2890426 -2916593 -2925471 -2924792 -2935707 -2988828 -3113738
31526c113738k14396l04373l79286m29011m48143m33672l84829l05535k06124
$$ -3113738 -3328134 -3632507 -4011793 -4440804 -4888947 -5322619 -5707448 -6012983 -6219107
31517f219107j01399n887P0716J25748J62852J88568K07774K21254K27622K27739
$$ -6219107 -6320506 -6326393 -6255677 -6129929 -5967077 -5778509 -5570735 -5349481 -5121859 -4894120
31507d894120K26744K31226K44179K62738K81026K95763L09731L29859L61228
$$ -4894120 -4667376 -4436150 -4191971 -3929233 -3648207 -3352444 -3042713 -2712854 -2351626
31498b351626M02024M43658M75397M89049M80304M47639L91699L16233K28915
$$ -2351626 -1949602 -1505944 -1030547 -541498 -61194 386445 778144 1094377 1323292
31489A323292J39890N8084j2503p3661j29769j82656k28582k60004k70636k59780
$$ 1323292 1463182 1521266 1508763 1435102 1305333 1122677 894095 634091 363455 103675
31479A03675k33056j99592j67804j42013j21586j02908q2437n8335k9888L294
$$ 103675 -129381 -328973 -496777 -638790 -760376 -863284 -945721 -1004056 -1033944 -1030650
31469a030650M0584P8933J13230J39040J55462J65316J72311J77572J78532J70953
$$ -1030650 -990066 -911133 -797903 -658863 -503401 -338085 -165774 11798 190330 361283
31459C61283J51944J20991P8466K3970m3249j21988k06815k87180l48743l77682
$$ 361283 513227 634218 712684 736654 693405 571417 364602 77422 -271321 -649003
31449f49003l67286l23042k61654k03731j64886j50437j55428j68643j78303j76563
$$ -649003 -1016289 -1339331 -1600985 -1804716 -1969602 -2120039 -2275467 -2444110 -2622413 -2798976
31439b798976j60213j28024p8585j1568O9777J59148K50791L41683M29458N09053
$$ -2798976 -2959189 -3087213 -3165798 -3177366 -3107589 -2948441 -2697650 -2355967 -1926509 -1417456
31429a417456N73009O15845O37832O43827O37766O17509N74055M95739L74752
$$ -1417456 -844447 -228602 409230 1053057 1690823 2308332 2882387 3378126 3752878
31420C752878K12678K2369j75142l57737n09534o24062p02247p48111p65640p57523
$$ 3752878 3965556 3987925 3812783 3455046 2945512 2321450 1619203 871092 105452 -652071
31410f52071p24961o68363n89049m90470l77502k55133j29368r929Q9381J55274
$$ -652071 -1377032 -2045395 -2634444 -3124914 -3502416 -3757549 -3886917 -3896846 -3807465 -3652191
$$ [...]
##END NTUPLES=NMR SPECTRUM
##END=
