##TITLE=31Pdec_DE-44_EA3c_w
 D2O
 24 sc
 10.4.2024
##JCAMPDX= 6.0         $$ Bruker NMR JCAMP-DX V2.0
##DATA TYPE= NMR SPECTRUM
##DATA CLASS= NTUPLES
##ORIGIN= UXNMR, Bruker Analytische Messtechnik GmbH
##OWNER= root
$$ XWIN-NMR		Version 3.5
$$ Wed Apr 10 16:37:55 2024 Russian Standard Time (UT+4h)  she@DPX200
##.OBSERVE FREQUENCY= 81.013821
##.OBSERVE NUCLEUS= ^31P
##.ACQUISITION MODE= SIMULTANEOUS
##.ACQUISITION SCHEME= undefined
##.AVERAGES= 24
##.DIGITISER RES= 16
##SPECTROMETER/DATA SYSTEM= spect
##.PULSE SEQUENCE= zgpg30
##.SOLVENT NAME= CDCl3
##.SHIFT REFERENCE= (INTERNAL, CDCl3, 0, 248.564)
##AUDIT TRAIL= $$ (NUMBER, WHEN, WHO, WHERE, WHAT)
$$ ##TITLE= Audit trail, XWIN-NMR		Version 3.5
$$ ##JCAMPDX= 5.01
$$ ##ORIGIN= Bruker BioSpin GmbH
$$ ##OWNER= she
$$ F:/spectra/data/she/nmr/P31/1/pdata/1/auditp.txt
$$ ##AUDIT TRAIL=  $$ (NUMBER, WHEN, WHO, WHERE, WHAT)
(   1,<2024-04-10 16:36:45.39 +0400>,<she>,<DPX200>,
      <created by zg, POWCHK disabled, PULCHK disabled
       configuration hash MD5:
       00 E9 B6 7A A2 85 ED C7 34 08 36 98 17 FE 4E 26
       data hash MD5: 32K
       CC C2 64 34 91 BD A6 63 26 EA 99 E2 B5 FF 4E D1>)
(   2,<2024-04-10 16:36:48.75 +0400>,<she>,<DPX200>,
      <Start of raw data processing
       efp BC_mod = 2 LB = 10 FT_mod = 6 PKNL = 1 PHC0 = -13429.41 PHC1 = 536.0829 SI = 64K 
       data hash MD5: 64K
       18 81 FC 67 AB 31 54 B5 DC 50 21 65 A3 5A 77 C0>)
(   3,<2024-04-10 16:37:19.35 +0400>,<she>,<DPX200>,
      <pk PHC0 = -26.85312 PHC1 = 91.59998 
       data hash MD5: 64K
       F4 2C 2E A3 18 7E 6E 72 55 8A BE CB A0 8F D4 8B>)
(   4,<2024-04-10 16:37:22.21 +0400>,<she>,<DPX200>,
      <abs ABSG = 5 
       data hash MD5: 64K
       09 CF 8D 97 3B CF DF E6 3F 18 30 9D AA 35 C6 48>)
$$ ##END=
$$ 
$$ hash MD5
$$ 11 31 01 97 C9 13 30 3D 4C D5 12 CC 6C 89 91 D6
##$RELAX= 
##$RELAX= 
##$RELAX= 
##$RELAX= 
##$RELAX= 
##$RELAX= 
##$RELAX= 
##$RELAX= 
##$RELAX= 
$$ Bruker specific parameters
$$ --------------------------
##$DU= <F:/spectra>
##$EXPNO= 1
##$NAME= <P31>
##$PROCNO= 1
##$TYPE= <nmr>
##$USER= <she>
##$AMP= (0..31)
100 100 100 100 100 100 100 100 100 100 100 100 100 100 100 100 100 100 
100 100 100 100 100 100 100 100 100 100 100 100 100 100 
##$AQSEQ= 0
##$AQ_mod= 1
##$AUNM= <au_zg>
##$AUTOPOS= <>
##$BF1= 81.014009
##$BF2= 200.13
##$BF3= 200.13
##$BF4= 200.13
##$BF5= 200.13
##$BF6= 200.13
##$BF7= 200.13
##$BF8= 200.13
##$BYTORDA= 1
##$CFDGTYP= 0
##$CFRGTYP= 5
##$CHEMSTR= <none>
##$CNST= (0..31)
1 1 145 1 1 1 1 1 1 1 1 1 1 1 1 1 1 1 1 1 1 1 1 1 1 1 1 1 1 1 1 1 
##$CPDPRG= <waltz16>
##$CPDPRG1= <>
##$CPDPRG2= <waltz16>
##$CPDPRG3= <>
##$CPDPRG4= <mlev>
##$CPDPRG5= <mlev>
##$CPDPRG6= <mlev>
##$CPDPRG7= <mlev>
##$CPDPRG8= <mlev>
##$CPDPRGB= <>
##$CPDPRGT= <>
##$D= (0..31)
0 1 0 0 0 0 0 0 0 0 0 0.03 2e-05 3e-06 0 0 0 0 0 0 0 0 0 0 0 0 0 0 0 0 
0 0 
##$DATE= 1712752604
##$DBL= (0..7)
120 120 120 11 120 120 24 19 
##$DBP= (0..7)
150 150 150 150 150 150 150 150 
##$DBP07= 0
##$DBPNAM0= <>
##$DBPNAM1= <>
$$ [...]
##$SUBNAM3= <"">
##$SUBNAM4= <"">
##$SUBNAM5= <"">
##$SUBNAM6= <"">
##$SUBNAM7= <"">
##$SUBNAM8= <"">
##$SUBNAM9= <"">
##$SW= 501.771253377433
##$SWIBOX= (0..15)
0 1 3 0 0 0 0 0 0 0 0 0 0 0 0 0 
##$SW_h= 40650.406504065
##$TD= 32768
##$TD0= 1
##$TE= 0
##$TE2= 300
##$TE3= 300
##$TEG= 300
##$TL= (0..7)
0 120 53 12 22 120 120 120 
##$TP= (0..7)
150 150 150 150 150 150 150 150 
##$TP07= 0
##$TPNAME0= <>
##$TPNAME1= <>
##$TPNAME2= <>
##$TPNAME3= <>
##$TPNAME4= <>
##$TPNAME5= <>
##$TPNAME6= <>
##$TPNAME7= <>
##$TPOAL= (0..7)
0.5 0.5 0.5 0.5 0.5 0.5 0.5 0.5 
##$TPOFFS= (0..7)
0 0 0 0 0 0 0 0 
##$TUNHIN= 0
##$TUNHOUT= 0
##$TUNXOUT= 0
##$USERA1= <user>
##$USERA2= <user>
##$USERA3= <user>
##$USERA4= <user>
##$USERA5= <user>
##$V9= 5
##$VALIST= <valist>
##$VCLIST= <CCCCCCCCCCCCCCC>
##$VD= 0
##$VDLIST= <DDDDDDDDDDDDDDD>
##$VPLIST= <PPPPPPPPPPPPPPP>
##$VTLIST= <TTTTTTTTTTTTTTT>
##$WBST= 1024
##$WBSW= 4
##$XGAIN= (0..3)
0 0 0 0 
##$XL= 0
##$YL= 0
##$YMAX_a= 1365
##$YMIN_a= -2046
##$ZGOPTNS= <>
##$ZL1= 120
##$ZL2= 120
##$ZL3= 120
##$ZL4= 120
##$ABSF1= 248.5645
##$ABSF2= -253.2056
##$ABSG= 5
##$ABSL= 3
##$ALPHA= 0
##$AQORDER= 0
##$ASSFAC= 0
##$ASSFACI= 0
##$ASSFACX= 0
##$ASSWID= 0
##$AUNMP= <proc_1d>
##$AZFE= 0.1
##$AZFW= 0.5
##$BCFW= 0
##$BC_mod= 2
##$BYTORDP= 0
##$COROFFS= 0
##$CY= -3
##$DATMOD= 1
##$DC= 0
##$DFILT= <>
##$DTYPP= 0
##$F1P= 0
##$F2P= 0
##$FCOR= 1
##$FTSIZE= 65536
##$FT_mod= 6
##$GAMMA= 0
##$GB= 0
##$INTBC= 1
##$INTSCL= 6.047779e-11
##$ISEN= 30
##$LB= 10
##$LEV0= 0
##$LPBIN= 0
##$MAXI= 10000
##$MC2= 0
##$MEAN= 0
##$ME_mod= 0
##$MI= 50
##$NCOEF= 0
##$NC_proc= -10
##$NLEV= 6
##$NOISF1= 182.463
##$NOISF2= 159.3651
##$NSP= 0
##$NTH_PI= 0
##$NZP= 0
##$OFFSET= 248.5645
##$PC= 4
##$PHC0= -13456.26
##$PHC1= 627.6829
##$PH_mod= 1
##$PKNL= yes
##$PPARMOD= 0
##$PSCAL= 0
##$PSIGN= 0
##$REVERSE= no
##$SF= 81.0140089999694
##$SI= 65536
##$SIGF1= 159.3651
##$SIGF2= -187.1042
##$SINO= 113.3802
##$SIOLD= 16384
##$SREGLST= <1H.CDCl3>
##$SSB= 0
##$STSI= 65536
##$STSR= 0
##$SW_p= 40650.406504065
##$SYMM= 0
##$S_DEV= 0
##$TDeff= 32768
##$TDoff= 0
##$TI= <>
##$TILT= no
##$TM1= 0
##$TM2= 0
##$TOPLEV= 0
##$USERP1= <user>
##$USERP2= <user>
##$USERP3= <user>
##$USERP4= <user>
##$USERP5= <user>
##$WDW= 1
##$XDIM= 65536
##$YMAX_p= 334625644
##$YMIN_p= -55546232
$$ End of Bruker specific parameters
$$ ---------------------------------
##NTUPLES= NMR SPECTRUM
##VAR_NAME=  FREQUENCY,     SPECTRUM/REAL,   SPECTRUM/IMAG
##SYMBOL=    X,             R,               I
##VAR_TYPE=  INDEPENDENT,   DEPENDENT,       DEPENDENT
##VAR_FORM=  AFFN,          ASDF,            ASDF
##VAR_DIM=   65536,         65536,           65536
##UNITS=     HZ,            ARBITRARY UNITS, ARBITRARY UNITS
##FACTOR=    0.620285442955139, 1,           1
##FIRST=     20137.2065510682, 0,            0
##LAST=      -20513.1999529968, 0,           0
##MIN=       -20513.1999529968, -55546232,   0
##MAX=       20137.2065510682, 334625644,    0
$$ Real data points
##PAGE= N=1
##DATA TABLE= (X++(R..R)), XYDATA
$$ [...]
41628C624453N2798j55701l55293n24653o35244o60574n88216m24526j90081Q7111
$$ 3624453 3677251 3521550 3166257 2641604 2006360 1345786 757570 333044 142963 230074
41618B30074L75100O40262Q52485R92141J054205J047218R88579Q98208P92340
$$ 230074 605174 1245436 2097921 3090062 4144267 5191485 6180064 7078272 7870612
41609G870612O80329N66719M56576L57709K75859K06801J34259L7912r3453k53329
$$ 7870612 8550941 9117660 9574236 9931945 10207804 10414605 10548864 10586776 10493323 10239994
41599A0239994m18617n58496o45347o63165o11214n02665l59570k06688o5578
$$ 10239994 9821377 9262881 8617534 7954369 7343155 6840490 6480920 6274232 6208654
41590F208654N0429J38874K05630K57269K93424L05743K84526K27676J45613N9149
$$ 6208654 6259083 6397957 6603587 6860856 7154280 7460023 7744549 7972225 8117838 8176987
41580H176987q448m1368l7956j0044K4376N0160O0289N5652M0824J8534j4389
$$ 8176987 8168539 8127171 8089215 8079171 8103547 8153707 8213996 8269648 8310472 8329006 8314617
41569H314617o7609j54459k87563m73767p08107r68664j217526j411922j522006
$$ 8314617 8247008 8092549 7804986 7331219 6623112 5654448 4436922 3025000 1502994
41560A502994j544583j503240j434269j366934j309774j250298j167233j047427
$$ 1502994 -41589 -1544829 -2979098 -4346032 -5655806 -6906104 -8073337 -9120764
41552i120764q97335p42402o14629n35873n07500n12500n26327n26667m96429
$$ -9120764 -10018099 -10760501 -11375130 -11911003 -12418503 -12931003 -13457330 -13983997 -14480426
41543a4480426m23497l03156j42243M1824K29453M07847N72093P18117Q35504
$$ -14480426 -14903923 -15207079 -15349322 -15307498 -15078045 -14670198 -14098105 -13379988 -12544484
41534a2544484R07280R16631Q55532P30577N63855L88642K41391J53177J43906
$$ -12544484 -11637204 -10720573 -9865041 -9134464 -8570609 -8181967 -7940576 -7787399 -7643493
41525g643493K19717L71578N74661P91638R82485J117042J182265J180314J121724
$$ -7643493 -7423776 -7052198 -6477537 -5685899 -4703414 -3586372 -2404107 -1223793 -102069
41516a02069J020136Q89835P43068N86695M21485K46509O6004j06543k50657l47442
$$ -102069 918067 1807902 2550970 3137665 3559150 3805659 3871663 3765120 3514463 3167021
41506C167021l90131l89552l69202l52482l51584l65693l86960m06593m16309
$$ 3167021 2776890 2387338 2018136 1665654 1314070 948377 561417 154824 -261485
41497b61485m07005l69002k95322j86046n0570R4079K28693L38544M18014M71102
$$ -261485 -668490 -1037492 -1332814 -1518860 -1569430 -1475351 -1246658 -908114 -490100 -18998
41487a8998N07690N37024N61130N71963N54509M94370L85350K33474N6420j21352
$$ -18998 488692 1025716 1586846 2158809 2713318 3207688 3593038 3826512 3882932 3761580
41477C761580k77426m01428n00110n92622o98075q23626r59719j082605j160766
$$ 3761580 3484154 3082726 2582616 1989994 1291919 468293 -491426 -1574031 -2734797
41468b734797j164112j075993r04274o83788m65992l00569k18939k26211l01740
$$ -2734797 -3898909 -4974902 -5879176 -6562964 -7028956 -7329525 -7548464 -7774675 -8076415
41459h076415m05670m90021n12729m50793l07272j08781J05747L00041M52097
$$ -8076415 -8482085 -8972106 -9484835 -9935628 -10242900 -10351681 -10245934 -9945893 -9493796
41450i493796N56868O19930O47810O41546N96458N06743L71964K01998J6796j60504
$$ -9493796 -8936928 -8316998 -7669188 -7027642 -6431184 -5924441 -5552477 -5350479 -5333683 -5494187
41440e494187l13304m37034n36608o19437o90608p52877q08508q59486r05602
$$ -5494187 -5807491 -6244525 -6781133 -7400570 -8091178 -8844055 -9652563 -10512049 -11417651
41431a1417651r42463r61384r51826r05508q19233o93564n28347l20923p1714
$$ -11417651 -12360114 -13321498 -14273324 -15178832 -15998065 -16691629 -17219976 -17540899 -17612613
41422a7612613K05884M80661P10430Q57422R02319Q48753P17800N38480L40608
$$ -17612613 -17406729 -16926068 -16215638 -15358216 -14455897 -13607144 -12889344 -12350864 -12010256
41413a2010256J52075k592j05543j49882j40755r1503j8024O4658J43296K07010
$$ -12010256 -11858181 -11860773 -11966316 -12116198 -12256953 -12348456 -12366480 -12301822 -12158526 -11951516
41403a1951516K48399K64425K56779K32284K02376J80034J74883J90073K23326
$$ -11951516 -11703117 -11438692 -11181913 -10949629 -10747253 -10567219 -10392336 -10202263 -9978937
41394i978937K70779L30001L99677M75991N49078O04554O31941O34204O29019
$$ -9978937 -9708158 -9378157 -8978480 -8502489 -7953411 -7348857 -6716916 -6082712 -5453693
41385e453693O39079O78961P48004Q31149R03897R39060R15304Q25248O78339
$$ -5453693 -4814614 -4135653 -3387649 -2556500 -1652603 -713543 201761 1027009 1705348
41376A705348M96884L08881J41539J6242n5291p2583m5134J0151P1970J19690
$$ 1705348 2202232 2511113 2652652 2668894 2613603 2541020 2495886 2506037 2578007 2697697
41366B697697J40981J37738J24545J19601J34792J71922K26010K90476L58583
$$ 2697697 2838678 2976416 3100961 3220562 3355354 3527276 3753286 4043762 4402345
41357D402345M20243M58970M54794L93740K77484J25449l2994j71446k77274l55193
$$ 4402345 4822588 5281558 5736352 6130092 6407576 6533025 6500031 6328585 6051311 5696118
41347E696118m22481m98300n92569p00499q05741q89583r39333r49902r18189
$$ 5696118 5273637 4775337 4182768 3482269 2676528 1786945 847612 -102290 -1020479
41338a020479q36494o93224m82953k18695O4509L19489N04839O00335O12507N69337
$$ -1020479 -1856973 -2550197 -3033150 -3251845 -3187336 -2867847 -2363008 -1762673 -1150166 -580829
41328e80829N07554M58295M37584M45988M75692N17666N62356N95252N95392N42801
$$ -580829 -73275 385020 822604 1268592 1744284 2261950 2824306 3419558 4014950 4557751
41318D557751M31183K75058J03799n4232j86094k97373m02910n12659o22286p13498
$$ 4557751 4988934 5263992 5367791 5313559 5127465 4830092 4427182 3914523 3292237 2578739
41308B578739p62056p47602o60929n08030l11269j06211O7725J80233K19443J91813
$$ 2578739 1816683 1069081 408152 -99878 -411147 -517358 -449633 -269400 -49957 141856
41298A41856J14125M960j18748k41030l46577m23078m64618m73723m61208m43963
$$ 141856 255981 260941 142193 -98837 -445414 -868492 -1333110 -1806833 -2268041 -2712004
41288b712004m40469m64501n19130n94057o68091p16425p20358o74997n90027
$$ -2712004 -3152473 -3616974 -4136104 -4730161 -5398252 -6114677 -6835035 -7510032 -8100059
41279h100059m82322l65740k46365j25932q026R9929J89371K53303K86636K87234
$$ -8100059 -8582381 -8948121 -9194486 -9320418 -9328444 -9228515 -9039144 -8785841 -8499205 -8211971
41269h211971K59811K19122J86357J78731J99682K37290K71236K82303K58646
$$ -8211971 -7952160 -7733038 -7546681 -7367950 -7168268 -6930978 -6659742 -6377439 -6118793
41260f118793J97710J05613m634j15890k10676k75591l05600l06329k91801k77002
$$ -6118793 -5921083 -5815470 -5820104 -5935994 -6146670 -6422261 -6727861 -7034190 -7325991 -7602993
41250g602993k69234k64567k52005k21948j73093j14547o3077l6541m5413q6463
$$ -7602993 -7872227 -8136794 -8388799 -8610747 -8783840 -8898387 -8961464 -8998005 -9043418 -9129881
41240i129881j42771j91183k13541k05862j80191j57185j52610j65612j76339
$$ -9129881 -9272652 -9463835 -9677376 -9883238 -10063429 -10220614 -10373224 -10538836 -10715175
41231a0715175j54324p2491Q0289K93165N36150P70644R61669J084506J124163
$$ -10715175 -10869499 -10941990 -10861701 -10568536 -10032386 -9261742 -8300073 -7215567 -6091404
41222f091404J073389R34715P24334M71107K08552l5060k42004m03687n15114
$$ -6091404 -5018015 -4083300 -3358966 -2887859 -2679307 -2714367 -2956371 -3360058 -3875172
41213c875172n70238n62628m91926l70344k21196o7878P8335K21102L69888N26551
$$ -3875172 -4445410 -5008038 -5499964 -5870308 -6091504 -6159382 -6081047 -5859945 -5490057 -4963506
41203d963506O77901P98489Q60426Q44092P45522N79097L74878J70048l557j29655
$$ -4963506 -4285605 -3487116 -2626690 -1782598 -1037076 -457979 -83101 86947 83390 -46265
41193d6265k09037k52155k69377k65624k40381j89933j09702L250J48040L19689
$$ -46265 -255302 -507457 -776834 -1042458 -1282839 -1472772 -1582474 -1579224 -1431184 -1111495
41183a111495N10590P10756R05256J071733J182862J214697J155970J012510Q05180
$$ -1111495 -600905 109851 1015107 2086840 3269702 4484399 5640369 6652879 7458059
41174G458059N64228L22963J11513m9148j50797j97062j98799j69208j20745o3279
$$ 7458059 8022287 8345250 8456763 8407615 8256818 8059756 7860957 7691749 7571004 7507725
41164G507725k412O0922J28057J97800K61950L04186L04159K46033J26998m0182
$$ 7507725 7505313 7566235 7694292 7892092 8154042 8458228 8762387 9008420 9135418 9095236
41154I095236k32576m25946o00531p41864q39550q86467q78473q14436o97703
$$ 9095236 8862660 8436714 7836183 7094319 6254769 5368302 4489829 3675393 2977690
41145B977690n38334l52868j59386K9669K11777L92860N80600P75604R64700J121077
$$ 2977690 2439356 2086488 1927102 1956771 2168548 2561408 3142008 3917612 4882312 6003389
41135F003389J213088J217902J132233R73909P73112N57775L40999J18437j22024
$$ 6003389 7216477 8434379 9566612 10540521 11313633 11871408 12212407 12330844 12208820
41126A2208820l85035o58121r13812j119976j250211j289754j237971j109302
$$ 12208820 11823785 11165664 10251852 9131876 7881665 6591911 5353940 4244638
41118D244638r31983p43012n80239m75001m47860n06711o45123q40719j056490
$$ 4244638 3312655 2569643 1989404 1514403 1066543 559832 -85291 -926010 -1982500
41109a982500j247779j373637j407296j340811j183016r53806o78247l82331r0570
$$ -1982500 -3230279 -4603916 -6011212 -7352023 -8535039 -9488845 -10167092 -10549423 -10639993
41100a0639993J74660L92226N41019O00574N55119L99890J46209j78126n34128
$$ -10639993 -10465333 -10073107 -9532088 -8931514 -8376395 -7976505 -7830296 -8008422 -8542550
41091h542550q80959j185669j428646j601133j696365j702259j603907j395548
$$ -8542550 -9423509 -10609178 -12037824 -13638957 -15335322 -17037581 -18641488 -20037036
41083b0037036j091383p24569l34246M8808M07728P35340J027285J279072J487431
$$ -20037036 -21128419 -21852988 -22187234 -22138426 -21730698 -20995358 -19968073 -18689001 -17201570
41074a7201570J651590J771186J842499J857675J809088J695241J522626J302150
$$ -17201570 -15549980 -13778794 -11936295 -10078620 -8269532 -6574291 -5051665 -3749515
41066c749515J044760P61285M66083J79743p2453k65142l78113m01550l40997
$$ -3749515 -2704755 -1943470 -1477387 -1297644 -1370097 -1635239 -2013352 -2414902 -2755899
41057b755899k19221p1073O8031J73352K34769K52729K31948J78248R8971M067
$$ -2755899 -2975120 -3046193 -2978162 -2804810 -2570041 -2317312 -2085364 -1907116 -1808145 -1804078
41047a804078r3871j79942k37414k49934k06717j08656K9018J80319L16538M13878
$$ -1804078 -1897949 -2077891 -2315305 -2565239 -2771956 -2880612 -2851594 -2671275 -2354737 -1940859
41037a940859M57087M39569L62912K37606Q3634p1527j98316k72639k83027k34763
$$ -1940859 -1483772 -1044203 -681291 -443685 -360051 -431578 -629894 -902533 -1185560 -1420323
41027a420323j48532n3235K3558O2246N2802n804j04485k22044l26874l84956
$$ -1420323 -1568855 -1622090 -1598532 -1536286 -1483484 -1489288 -1593773 -1815817 -2142691 -2527647
41017b527647l71001k76805j12940R6077L20473N33900P18266Q62999R60959J005504
$$ -2527647 -2898648 -3175453 -3288393 -3192316 -2871843 -2337943 -1619677 -756678 204281 1209785
41007A209785R91444R18097P90577O17791M09480J75979o8753l04196n04551o45142
$$ 1209785 2201229 3119326 3909903 4527694 4937174 5113153 5044400 4740204 4235653 3590511
40997C590511p10834p01960o34920n37042m37431l57145l02883k67057k34170
$$ 3590511 2879677 2177717 1542797 1005755 568324 211179 -91704 -358761 -592931
40988e92931j89900j28318n4007K0962Q2781J21115J32298J20269R4943O7494
$$ -592931 -782831 -911149 -965156 -944194 -861413 -740298 -608000 -487731 -392788 -325294
40978c25294M4182K3144k626l8283q1948j24742j54389j59184j31334o9955J7558
$$ -325294 -281112 -257968 -260594 -298877 -380825 -505567 -659956 -819140 -950474 -1020429 -1002871
40967a002871J17702K16102L02282L70364M15504M29200L97728L06236J46730
$$ -1002871 -885169 -669067 -366785 3579 419083 848283 1246011 1552247 1698977
40958A698977p5178l39913o20750q92760j137276j339129j480855j541286j501784
$$ 1698977 1623799 1283886 663136 -229624 -1366900 -2706029 -4186884 -5728170 -7229954
40949g229954j355719j113506q00444m50829j02284K10044M60553O38551P47176
$$ -7229954 -8585673 -9699179 -10499623 -10950452 -11052736 -10842692 -10382139 -9743588 -8996412
40940h996412P96056P93921P46537O59064N38080L90852K23905M4126j37040l00118
$$ -8996412 -8200356 -7406435 -6659898 -6000834 -5462754 -5071902 -4847997 -4803871 -4940911 -5241029
40930e241029m19735m73550m52458l64487k29793p1806Q9098K37646L63995M64144
$$ -5241029 -5660764 -6134314 -6586772 -6951259 -7181052 -7252858 -7163760 -6926114 -6562119 -6097975
40920f097975N39738N96157O39718O75299P04862P26210P32296P12806O59386
$$ -6097975 -5558237 -4962080 -4322362 -3647063 -2942201 -2215991 -1483695 -770889 -111503
40911a11503N72403M63803L52036K52600J72797J15638Q8149J04776J81544L24924
$$ -111503 460900 924703 1276739 1529339 1702136 1817774 1905923 2010699 2192243 2517167
40901B517167N22615P41638R35588J059023J082742J002366Q36349O15941L72678
$$ 2517167 3039782 3781420 4717008 5776031 6858773 7861139 8697488 9313429 9686107
40892I686107J28089j11433l52823o07871q82030j166776j439757j672439j840073
$$ 9686107 9814196 9702763 9349940 8742069 7860039 6693263 5253506 3581067 1740994
40883A740994j927573j928549j840632j663634j403112j075527p08756l36038
$$ 1740994 -186579 -2115128 -3955760 -5619394 -7022506 -8098033 -8806789 -9142827
40875i142827J2495L15208N59000P36471Q44612Q87098Q77734Q40082Q01131P82183
$$ -9142827 -9130332 -8815124 -8256124 -7519653 -6675041 -5787943 -4910209 -4070127 -3268996 -2486813
40865b486813P92062Q24922Q61822Q75454Q38601P34738N65945L52786J25413
$$ -2486813 -1694751 -869829 -8007 867447 1706048 2440786 3006731 3359517 3484930
40856C484930q9457k78616m43965n95460p40705q78611j000746j097745j165167
$$ 3484930 3395473 3116857 2672892 2077432 1336727 458116 -542630 -1640375 -2805542
40847b805542j205566j226924j238808j247142j249202j232325j178898j075752
$$ -2805542 -4011108 -5238032 -6476840 -7723982 -8973184 -10205509 -11384407 -12460159
40839a2460159r21438p26123n05217k73579m5228J63778L35703M56944N24700
$$ -12460159 -13381597 -14107720 -14612937 -14886516 -14931744 -14767966 -14432263 -13975319 -13450619
40830a3450619N48744N47874N44562N59824O07710O90008P94342Q97547R71948
$$ -13450619 -12901875 -12354001 -11809439 -11249615 -10641905 -9951897 -9157555 -8260008 -7288060
40821g288060R91146R35173P96840N87311L35547P8727j51361l37483m77246n76832
$$ -7288060 -6296914 -5361741 -4564901 -3977590 -3642043 -3563316 -3714677 -4052160 -4529406 -5106238
40811e106238o43154o77776o74385o21246n08214l34767j13815J31072L72413
$$ -5106238 -5749392 -6427168 -7101553 -7722799 -8231013 -8565780 -8679595 -8548523 -8176110
40802h176110N84758P47166Q43738Q65535Q14604P06760N68657M28660L06578
$$ -8176110 -7591352 -6844186 -6000448 -5134913 -4320309 -3613549 -3044892 -2616232 -2309654
40793b309654K08645J30062O2281Qn5650r8827j23358j26187j06993o5321M67
$$ -2309654 -2101009 -1970947 -1908666 -1908658 -1964308 -2063135 -2186493 -2312680 -2419673 -2484994 -2484527
40782b484527Q9889J95092K98479L76071M05351L74212K86965J64374L7091o4546
$$ -2484527 -2394638 -2199546 -1901067 -1524996 -1119645 -745433 -458468 -294094 -257003 -321549
40772c21549j19462j19997p0880J4738J19276K22838L04254L44047L31232K71068
$$ -321549 -441011 -561008 -631888 -617150 -497874 -275036 29218 373265 704497 975565
40762I75565J87660J17225R4549J39551K50308M04937N70546P15027Q16501Q66661
$$ 975565 1163225 1280450 1374999 1514550 1764858 2169795 2740341 3455368 4271869 5138530
40752E138530Q67642Q25793P47089O36257M97860L36271J54404m6252k62972m89051
$$ 5138530 6006172 6831965 7579054 8215311 8713171 9049442 9203846 9157594 8894622 8405571
40742H405571p14077r26444j114797j267585j373320j423211j414254j350473
$$ 8405571 7691494 6765050 5650253 4382668 3009348 1586137 171883 -1178590
40734a178590j242522j106644r61869q24502p02136n91145m78811l48247j84690
$$ -1178590 -2421112 -3527756 -4489625 -5314127 -6016263 -6607408 -7086219 -7434466 -7619156
40725g619156J7564K50653M95723P32611R49388J143734J316131J462634J574147
$$ -7619156 -7601592 -7350939 -6855216 -6122605 -5173217 -4029483 -2713352 -1250718 323429
40716C23429J641747J662158J638894J578929J487844J365755J205384R93582
$$ 323429 1965176 3627334 5266228 6845157 8333001 9698756 10904140 11897722
40708A1897722P17389L73543k2870m35681q13433j102763j265629j293740j212004
$$ 11897722 12615111 12988654 12965784 12530103 11716670 10613907 9348278 8054538 6842534
40699F842534j066884r05824p61408o49367n76365n45875n56204n95520o42061
$$ 6842534 5775650 4869826 4108418 3459051 2882686 2336811 1780607 1185087 543026
40690E43026o71551o66782o23228n48332m55930l59834k69954j91599j25592o7484
$$ 543026 -128525 -795307 -1418535 -1966867 -2422797 -2782631 -3052585 -3244184 -3369776 -3437260
40680c437260p523O5718J58609K67462L79353M78148N51577N95592O14221O14978
$$ -3437260 -3444783 -3379065 -3220456 -2952994 -2573641 -2095493 -1543916 -948324 -334103 280875
40670B80875O02246N73747N23793M51102L63923K77949K09949J73343J77720K28937
$$ 280875 883121 1456868 1980661 2431763 2795686 3073635 3283584 3456927 3634647 3863584
40660C863584L26923M62912O19714P75611R09098J001611J038087J007054R01799
$$ 3863584 4190507 4653419 5273133 6048744 6957842 7959453 8997540 10004594 10906393
40651A0906393P22643M79067J90236j16938m11936o65991q57322r74928j019786
$$ 10906393 11629036 12108103 12298339 12181401 11769465 11103474 10246152 9271224 8251438
40642H251438j002708r39098q42855p23469n88861m51542l31581k52003k29115
$$ 8251438 7248730 6309632 5466777 4743308 4154447 3702905 3371324 3119321 2890206
40633B890206k64276l41537m31573n00904n24413m95763m28677l47266k72393
$$ 2890206 2625930 2284393 1852820 1351916 827503 331740 -96937 -444203 -716596
40624g16596k13839j71299j39944j14954r3466p5188o2575o0084p1708r7403j31138
$$ -716596 -930435 -1101734 -1241678 -1356632 -1450098 -1525286 -1587861 -1647945 -1719653 -1817056 -1948194
40613a948194j63205j86087j99304k08764k20820k35157k41164k20729j57860
$$ -1948194 -2111399 -2297486 -2496790 -2705554 -2926374 -3161531 -3402695 -3623424 -3781284
40604c781284n0929Q1042K04376K85938L06790K66643J80476P2987k7128r4763
$$ -3781284 -3832213 -3751171 -3546795 -3260857 -2954067 -2687424 -2506948 -2433961 -2461089 -2555852
40594b555852j17647j02805p5102o6543j00459j78390k76906l56638l78798l20938
$$ -2555852 -2673499 -2776304 -2851406 -2917949 -3018408 -3196798 -3473704 -3830342 -4209140 -4530078
40584d530078j84687P197K21803M27937O01922P26070P85683P71067O84991N49379
$$ -4530078 -4714765 -4707568 -4485765 -4057828 -3455906 -2729836 -1944153 -1173086 -488095 61284
40574F1284M04259K96449K61724L09693M21278N61274O96501Q05570Q75510Q94250
$$ 61284 465543 761992 1023716 1333409 1754687 2315961 3012462 3818032 4693542 5587792
40564E587792Q50892P44553N91086M17968K49478R4174n5631k13612l88045n77341
$$ 5587792 6438684 7183237 7774323 8192291 8441769 8535943 8480312 8266700 7878655 7301314
40554G301314p72284r59893j125861j256768j342764j378730j362182j290199
$$ 7301314 6529030 5569137 4443276 3186508 1843744 465014 -897168 -2187367
40546b187367j159070r67449p20150m30216j19487J81847M37712O12173O78727
$$ -2187367 -3346437 -4313886 -5034036 -5464252 -5583739 -5401892 -4964180 -4352007 -3673280
40537c673280O30100M84401K83399Q1318p2357j48112j42472p4046K5829J22859
$$ -3673280 -3043180 -2558779 -2275380 -2194062 -2266419 -2414531 -2557003 -2631049 -2605220 -2482361
40527b482361J88601K08338J85792J40914R9801Q1434Q8725J09046J23550J19253
$$ -2482361 -2293760 -2085422 -1899630 -1758716 -1658915 -1577481 -1488756 -1379710 -1256160 -1136907
40517a136907R6129O4782L6901J5794o915m7683j24130k48047m19925o26720q44986
$$ -1136907 -1040778 -975996 -939095 -923301 -930216 -977899 -1102029 -1350076 -1770001 -2396721 -3241707
40506c241707j049046j219867j349461j439238j494621j519129j510236j458460
$$ -3241707 -4290753 -5510620 -6860081 -8299319 -9793940 -11313069 -12823305 -14281765
40498a4281765j350156j172917r21194o00649k30618J56357N19496Q18773J024112
$$ -14281765 -15631921 -16804838 -17726032 -18326681 -18557299 -18400942 -17881446 -17062673 -16038561
40489a6038561J120545J108636J002423Q26746O13434L95531K00894M7535n7820
$$ -16038561 -14918016 -13809380 -12806957 -11980211 -11366777 -10971246 -10770352 -10722817 -10780637
40480a0780637j17995j40823j32912r5005k3081Q3904K15417L48387M56867N25433
$$ -10780637 -10898632 -11039455 -11172367 -11267372 -11290453 -11206549 -10991132 -10642745 -10185878 -9660445
40470i660445N55380N59443N50890N35822N11523M68310L93456K78571J28512
$$ -9660445 -9105065 -8545622 -7994732 -7458910 -6947387 -6479077 -6085621 -5807050 -5678538
40461e678538l5754j85953l01564l79034m29120m68047n10940n68975o46088p34158
$$ -5678538 -5714292 -5900245 -6201809 -6580843 -7009963 -7478010 -7988950 -8557925 -9204013 -9938171
40451i938171q11082q45948q10175o89026m87405k26675O5791L67296O63173R41322
$$ -9938171 -10749253 -11595201 -12405376 -13094402 -13581807 -13808482 -13742691 -13375395 -12712222 -11770900
40441a1770900J184307J367109J463307J455986J346996J159174R29333O94568
$$ -11770900 -10586593 -9219484 -7756177 -6300191 -4953195 -3794021 -2864688 -2170120
40433b170120M78794K86708J07906p1990k59467m46734o14127p39750q09957q23765
$$ -2170120 -1691326 -1404618 -1296712 -1368702 -1628169 -2074903 -2689030 -3428780 -4238737 -5062502
40423e062502p89293p16765o14396m89866l54503k24628j16337l5943K6241R1546
$$ -5062502 -5851795 -6568560 -7182956 -7672822 -8027325 -8251953 -8368290 -8404233 -8377992 -8286446
40413h286446J78689K89027M02129M85168N10141M68416L74583K58409J51045
$$ -8286446 -8107757 -7818730 -7416601 -6931433 -6421292 -5952876 -5578293 -5319884 -5168839
40404e168839P4449L9016M7008R5564J76613K76459L78291M66438N28569N54881
$$ -5168839 -5094390 -5055374 -5008366 -4912802 -4736189 -4459730 -4081439 -3615001 -3086432 -2531551
40394b531551N37598M73777L69668K41668J11050m971r9825j77249k44349l02989
$$ -2531551 -1993953 -1520176 -1150508 -908840 -797790 -802761 -902586 -1079835 -1324184 -1627173
40384a627173l45770l59306l32027k61136j55628l5289P3901J48256J76364J64026
$$ -1627173 -1972943 -2332249 -2664276 -2925412 -3081040 -3116329 -3042428 -2894172 -2717808 -2553782
40374b553782J29217R0246N6557K7893n80l2706o7487r7010j07818q7327l1718
$$ -2553782 -2424565 -2334319 -2277762 -2249869 -2250449 -2283155 -2350642 -2447652 -2555470 -2642797 -2674515
40363b674515N1483J48607K47683L42018M27718M98820N44998N54081N17766M36215
$$ -2674515 -2623032 -2474425 -2226742 -1884724 -1457006 -958186 -413188 140893 658659 1094874
40353A094874L18166J77685L1170j04226k12895k84077l12705k96633k35785j37840
$$ 1094874 1413040 1590725 1621895 1517669 1304774 1020697 707992 411359 175574 37734
40343C7734k4649P2092J27555J39036J25046J09079J02730J00319Q5102M0053
$$ 37734 13085 85177 212732 351768 476814 585893 688623 788942 874044 914097
40333I14097m2486j55194k77190l83709m59485n06501n40230n77785o27711o88034
$$ 914097 871611 716417 439227 55518 -403967 -910468 -1450698 -2028483 -2656194 -3344228
40323c344228p50844q07325q50017q73845q78082q67902q52271q37633q20864
$$ -3344228 -4095072 -4902397 -5752414 -6626259 -7504341 -8372243 -9224514 -10062147 -10883011
40314a0883011p86416p10280n69760l54790p5098K40839N54448Q28316J034210
$$ -10883011 -11669427 -12379707 -12949467 -13304257 -13379355 -13138516 -12584068 -11755752 -10721542
40305a0721542J155927J188902J139253J022756Q62723O86537N21670L91266L08983
$$ -10721542 -9565615 -8376713 -7237460 -6214704 -5351981 -4665444 -4143774 -3752508 -3443525
40296c443525K74417K72672K80215K73834K36954J60926M3788j10343k91543m85600
$$ -3443525 -3169108 -2896436 -2616221 -2342387 -2105433 -1944507 -1900719 -2011062 -2302605 -2788205
40286b788205o76274q46948r82468j072566j115148j115032j077525j002444q84601
$$ -2788205 -3464479 -4311427 -5293895 -6366461 -7481609 -8596641 -9674166 -10676610 -11561211
40277a1561211p20339n14110k80622m3282J68785L25568M04371L99118L23809
$$ -11561211 -12281550 -12795660 -13076282 -13119564 -12950779 -12625211 -12220840 -11821722 -11497913
40268a1497913K05138O8208p3261k13984l45116m45794m87287m46936l20848j27161
$$ -11497913 -11292775 -11224567 -11297828 -11511812 -11856928 -12302722 -12790009 -13236945 -13557793 -13684954
40258a3684954J00387L23445N09722O40418P12478P35272P24046O94606O62188
$$ -13684954 -13584567 -13261122 -12751400 -12110982 -11398504 -10663232 -9939186 -9244580 -8582392
40249h582392O42760O52021O99404P80146Q72241R42363R58663R03641P80939
$$ -8582392 -7939632 -7287611 -6588207 -5808061 -4935820 -3993457 -3034794 -2131153 -1350214
40240a350214O13773M36495K83088J77199J27575J29984J72844K41586L18504
$$ -1350214 -736441 -299946 -16858 160341 287916 417900 590744 832330 1150834
40231A150834L79914L96642L42391K07207O684k20715m26655n67653o14861n59376
$$ 1150834 1530748 1927390 2269781 2476988 2483672 2262957 1836302 1268649 653788 94412
40221I4412m15550k20044k1401J38865K42385K94655L09379K89876K23372R1833
$$ 94412 -321138 -541182 -562583 -423718 -181333 113322 422701 712577 935949 1027782
40211A027782j10977l69717o49666r06456j097221j190943j177432j071879r10708
$$ 1027782 916805 547088 -102578 -1009034 -2106255 -3297198 -4474630 -5546509 -6457217
40202f457217p38246n90324m83474m14349l67139l22416k62475j73114m4686J25800
$$ -6457217 -7195463 -7785787 -8269261 -8683610 -9050749 -9373165 -9635640 -9808754 -9853440 -9727640
40192i727640L32996N64055Q01680J027126J221661J367756J451683J467205J417724
$$ -9727640 -9394644 -8830589 -8028909 -7001783 -5780122 -4412366 -2960683 -1493478 -75754
40183g5754J314500J171466R99745Q05357N90828L59194J18268j16454l22160
$$ -75754 1238746 2410212 3409957 4215314 4806142 5165336 5283604 5167150 4844990
40174D844990m74418n56956n69359n26082m47386l50425k47613j50746p3243k6492
$$ 4844990 4370572 3813616 3244257 2718175 2270789 1920364 1672751 1522005 1448762 1422270
40164A422270j3762k7875n4768q0142r5276r9382r8113r9183j07275j20457j29519
$$ 1422270 1408508 1380633 1325865 1245723 1150447 1051065 952952 853769 746494 626037 496518
40153D96518j20882q2437j0040Q9039J98104K97373L71078M11797M20694M03908
$$ 496518 375636 293199 283159 372198 570302 867675 1238753 1650550 2071244 2475152
40143B475152L67126L11863K36439J40854L0795q3212j90481k84266l62858m28851
$$ 2475152 2842278 3154141 3390580 3531434 3562229 3479017 3288536 3004270 2641412 2212561
40133B212561m87789n45273o02008o50065o74452o59579n95888m82888l29480
$$ 2212561 1724772 1179499 577491 -72574 -747026 -1406605 -2002493 -2485381 -2814861
40124b814861j53462K0364J65042K58299K88340K57237J82100R3257K7490J6940
$$ -2814861 -2968323 -2947959 -2782917 -2524618 -2236278 -1979041 -1796941 -1703684 -1676194 -1659254
40114a659254P8252K06867L78052N53244O89664P51018P16358N84844L75436J21515
$$ -1659254 -1581002 -1374135 -996083 -442839 246825 997843 1714201 2299045 2674481 2795996
40104B795996j39176l76536n76622p41836q83257j010259j122728j208314j245136
$$ 2795996 2656820 2280284 1703662 961826 78569 -931690 -2054418 -3262732 -4507868
40095d507868j208774j081090q57265n48995j83701J99810N59154Q58182J074927
$$ -4507868 -5716642 -6797732 -7654997 -8203992 -8387693 -8187883 -7628729 -6770547 -5695620
40086e695620J203924J252360J233205J159492J042305Q92280P22005N46650L81650
$$ -5695620 -4491696 -3239336 -2006131 -846639 195666 1087946 1809951 2356601 2738251
40077B738251K38782J22605K8968n3160j36392k28286l27286m23715n04951n61934
$$ 2738251 2977033 3099638 3128606 3075446 2939054 2710768 2383482 1959767 1454816 892882
40067H92882n94192o10498o22787o35183o36463o04560n22122l91086k33964q1223
$$ 892882 298690 -311808 -934595 -1569778 -2206241 -2810801 -3332923 -3724009 -3957973 -4039196
40057d039196M4811J38247K06727K61712L09301L47539L71481L81137L84457L91771
$$ -4039196 -3994385 -3856138 -3649411 -3387699 -3078398 -2730859 -2359378 -1978241 -1593784 -1202013
40047a202013M06325M19065M11504L63943K64846J18609n1191k07069l11684l42970
$$ -1202013 -795688 -376623 34881 398824 663670 782279 731088 524019 212335 -130635
40037a30635l00368j99299o0657R6574K57856M13812N60524O98045Q26290R40591
$$ -130635 -431003 -630302 -690959 -594385 -336529 77283 637807 1335852 2162142 3102733
40027C102733J029777J077803J068356R90746Q44637O40710L96754J31986j36335
$$ 3102733 4132510 5210313 6278669 7269415 8114052 8754762 9151516 9283502 9147167
40018I147167l92950o23767q16612r62960j058088j098656j080250r98061q51259
$$ 9147167 8754217 8130450 7313838 6350878 5292790 4194134 3113884 2115823 1264564
40009A264564o48425m10078j65639N4936K31038L56677M38053M86785N15723N39663
$$ 1264564 616139 206061 40422 95358 326396 683073 1121126 1607911 2123634 2663297
39999B663297N75269O34245P12520P85844Q18822P82835O70899N00216L02172
$$ 2663297 3238566 3872811 4585331 5371175 6189997 6972832 7643731 8143947 8446119
39990H446119J07086o6910k14875l37191m30834m88116n03888m83509m42875l99842
$$ 8446119 8553205 8486295 8271420 7934229 7503395 7015279 6511391 6027882 5585007 5185165
39980E185165l64603l36464l07111k65081j98295r6629M3276K13271L94043N61409
$$ 5185165 4820562 4484098 4176987 3911906 3713611 3616982 3660258 3873529 4267572 4828981
39970D828981O93831P75864P97153P50531O32037M42673J90490j07965m27902
$$ 4828981 5522812 6298676 7095829 7846360 8478397 8921070 9111560 9003595 8575693
39961H575693p39366j012550j222289j349361j380501j311240j151751r29613
$$ 8575693 7836327 6823777 5601488 4252127 2871626 1560386 408635 -520978
39953e20978o83472m49316k48712q6476M3039J48235K36164L10892L71122M07464
$$ -520978 -1204450 -1653766 -1902478 -1988954 -1945915 -1797680 -1561516 -1250624 -879502 -472038
39943d72038M03865L45496K28762O5490j21552l06941m68009n85983o46362o40704
$$ -472038 -68173 277323 506085 571575 450023 143082 -324927 -910910 -1557272 -2197976
39933b197976n68522m38357k68675q7879O9308J69853J90567J22250k9263k42145
$$ -2197976 -2766498 -3204855 -3473530 -3561409 -3492101 -3322248 -3131681 -3009431 -3038694 -3280839
39923c280839m78935o93127q43062r06617q87742q10813p06148n94859m81075
$$ -3280839 -3759774 -4452901 -5295963 -6202580 -7090322 -7901135 -8607283 -9202142 -9683217
39914i683217l54482j99403m330K31121M92125P49317R67224J118685J196469
$$ -9683217 -10037699 -10237102 -10241432 -10010311 -9518186 -8768869 -7801645 -6682960 -5486491
39905e486491J213497J191404J145568J076270R71200Q17442O14666L79989J40806
$$ -5486491 -4272994 -3081590 -1936022 -859752 111448 928890 1543556 1923545 2064351
39896B064351p8328k65008m19463n48480o57751p46568q06758q26040p93796p05896
$$ 2064351 1986023 1721015 1301552 753072 95321 -651247 -1458005 -2284045 -3077841 -3783737
39886c783737n66182l84418j72905N4805K81236M80825O20920O71541O18890M72213
$$ -3783737 -4349919 -4734337 -4907242 -4852437 -4571201 -4090376 -3469456 -2797915 -2179025 -1706812
39876a706812K58254P977k54290n12502p52640r55743j097536j156243j123283
$$ -1706812 -1448558 -1440581 -1694871 -2207373 -2960013 -3915756 -5013292 -6169535 -7292818
39867g292818j009160q41455o57707m97598l95927l75677m41455n75608p39983
$$ -7292818 -8301978 -9143433 -9801140 -10298738 -10694665 -11070342 -11511797 -12087405 -12827388
39858a2827388q84814r63275r46525q32455o44295m20627k02136k0217J09627
$$ -12827388 -13712202 -14675477 -15622002 -16454457 -17098752 -17519379 -17721515 -17741732 -17632105
39849a7632105J88358K28540K46570K55878K63831K72635K81984K91002K98308
$$ -17632105 -17443747 -17215207 -16968637 -16712759 -16448928 -16176293 -15894309 -15603307 -15304999
39840a5304999L01181K95547K77552K45382J99433J40560O8867j3969r9265j67769
$$ -15304999 -15003818 -14708271 -14430719 -14185337 -13985904 -13845344 -13776477 -13790446 -13889711 -14057480
39830a4057480j93645j55860m9684J10326K97811M86879O61304Q16367R53737
$$ -14057480 -14251125 -14406985 -14456669 -14346343 -14048532 -13561653 -12900349 -12083982 -11130245
39821a1130245J072804J163330J204335J171298J048969Q42571N79931L01550
$$ -11130245 -10057441 -8894111 -7689776 -6518478 -5469509 -4626938 -4047007 -3745457
39813c745457M3609j75568l56572n07452o29049p07975p21668o51139m93054k64846
$$ -3745457 -3701848 -3877416 -4233988 -4741440 -5370489 -6078464 -6800132 -7451271 -7944325 -8209171
39803h209171j885K50733M48944N61083N76779N08888L86162K40402R5548l6630
$$ -8209171 -8211056 -7960323 -7511379 -6950296 -6373517 -5864629 -5478467 -5238065 -5142517 -5179147
39793e179147j54807k62932l64046m56050n32675n88774o24250o42333o45210
$$ -5179147 -5333954 -5596886 -5960932 -6416982 -6949657 -7538431 -8162681 -8805014 -9450224
39784i450224o33203o08496n77622n47737n18849m78922m06804k81969r5545J43282
$$ -9450224 -10083427 -10691923 -11269545 -11817282 -12336131 -12815053 -13221857 -13503826 -13599371 -13456089
39774a3456089M07932O60539Q60356R72463R75866Q69573O75048M34200K02220
$$ -13456089 -13048157 -12387618 -11527262 -10554799 -9578933 -8709360 -8034312 -7600112 -7397892
39765g397892L4642k9438J9162J57585L41599N21550O54838P11918O78508N56289
$$ -7397892 -7363250 -7392688 -7373526 -7215941 -6874342 -6352792 -5697954 -4986036 -4307528 -3751239
39755c751239L61861J23201j25625l50293n22058o23405o52398o23756n64654
$$ -3751239 -3389378 -3266177 -3391802 -3742095 -4264153 -4887558 -5539956 -6163712 -6728366
39746f728366n05130m66726m55650m65080m84528n08111n34421n58644n65411
$$ -6728366 -7233496 -7700222 -8155872 -8620952 -9105480 -9613591 -10148012 -10706656 -11272067
39737a1272067n30675m32790k64453l6622K27037M98901P52615R64127J113543
$$ -11272067 -11802742 -12235532 -12499985 -12536607 -12309570 -11810669 -11058054 -10093927 -8980384
39728h980384J191394J206179J185202J163842J167737J199123J236642J248699
$$ -8980384 -7788990 -6582811 -5397609 -4233767 -3066030 -1866907 -630265 618434
39720F18434J211803J123305J002178Q78203P76241P04279O51040N92764N04610
$$ 618434 1830237 2953542 3955720 4833923 5610164 6314443 6965483 7558247 8062857
39711H062857L71881J97362J369j86860l42694m56330n33596n88631o35318o82788
$$ 8062857 8434738 8632100 8633469 8446609 8103915 7647585 7113989 6525358 5890040 5207252
39701E207252p35098p91974q48719q96631r25954r30737r11606q72721q14591
$$ 5207252 4472154 3680180 2831461 1934830 1008876 78139 -833467 -1706188 -2520779
39692b520779p29613o06022m38417k36330k3109J74865L40664M71846N75193O56509
$$ -2520779 -3250392 -3856414 -4294831 -4531161 -4554270 -4379405 -4038741 -3566895 -2991702 -2335193
39682b335193P13743P37673P18296O52339N47892M23394L00169J91807R8047R196
$$ -2335193 -1621450 -883777 -165481 486858 1034750 1458144 1758313 1950120 2048167 2057363
39672B057363q1241j65878k24190k35255j93392j14947l0505L2694O5954Q1541
$$ 2057363 1976122 1810244 1586054 1350799 1157407 1042460 1011955 1044649 1110603 1192144
39662A192144J01816J44147K11682K93327L69039M15621M11810L43880K11162
$$ 1192144 1293960 1438107 1649789 1943116 2312155 2727776 3139586 3483466 3694628
39653C694628K8165j79091l80794n50694o70396p31082p33945o89404o14778n31269
$$ 3694628 3722793 3543702 3162908 2612214 1941818 1210736 476791 -212613 -827391 -1358660
39643a358660m60843m22186m25170m66254n28614n88183o22319o16811n69403
$$ -1358660 -1819503 -2241689 -2666859 -3133113 -3661727 -4249910 -4872229 -5489040 -6058443
39634f058443m90402m00948l28590k99903l31378m21381n47122o69656p46860
$$ -6058443 -6548845 -6949793 -7278383 -7578286 -7909664 -8331045 -8878167 -9547823 -10294683
39625a0294683p49860o75348n46993m04239k83835k03998j59585j29546r0281
$$ -10294683 -11044543 -11719891 -12266884 -12671123 -12954958 -13158956 -13318541 -13448087 -13538368
39616a3538368k5957O9219J94697L46901N18113O93713Q54268R84478J082212
$$ -13538368 -13564325 -13495106 -13300409 -12953508 -12435395 -11741682 -10887414 -9902936 -8820724
39607h820724J158366J225982J287263J328764J327836J265452J138283R64360
$$ -8820724 -7662358 -6436376 -5149113 -3820349 -2492513 -1227061 -88778 875582
39599H75582P79101O22036N20295M78016M77555M90485M90913M64327M09441L34235
$$ 875582 1654683 2276719 2797014 3275030 3752585 4243070 4733983 5198310 5607751 5941986
39589E941986K49685J65407Q9386K9783n218j0465J3670O2037J26472J94879K49082
$$ 5941986 6191671 6357078 6446464 6476247 6471029 6460564 6474234 6536271 6662743 6857622 7106704
39578G106704K67010K30912J36144o298j74206l41440m84559n87472o43134o51743
$$ 7106704 7373714 7604626 7740770 7734472 7560266 7218826 6734267 6146795 5503661 4851918
39568D851918o17341n45700m43485l16641j68215J049J88056L82288N64897P12799
$$ 4851918 4234577 3688877 3245392 2928751 2760536 2761585 2949641 3331929 3896826 4609625
39558D609625Q05670Q33630Q03000P35816O60253N95633N41573M78861L81032
$$ 4609625 5415295 6248925 7051925 7787741 8447994 9043627 9585200 10064061 10445093
39549A0445093K28159J4423k52164n52977q60261j138366j349939j467489j482731
$$ 10445093 10673252 10687675 10435511 9882534 9022273 7883907 6533968 5066479 3583748
39540C583748j405948j256570j053821q13865n52147k86571l9423J62018K88243
$$ 3583748 2177800 921230 -132591 -946456 -1498603 -1785174 -1824597 -1662579 -1374336
39531a374336L15866K39309P8359j25347l23146m78427n80199o44163p00730p76120
$$ -1374336 -1058470 -819161 -740802 -866149 -1189295 -1667722 -2247921 -2892084 -3592814 -4368934
39521d368934q76927r86646j075483j115894j093677j009647q75019p06231n21288
$$ -4368934 -5245861 -6232507 -7307990 -8423884 -9517561 -10527208 -11402227 -12108458 -12629746
39512a2629746l35929j59270P799J68589L22667M60201N63748O17314O16569N72537
$$ -12629746 -12965675 -13124945 -13117146 -12948557 -12625890 -12165689 -11601941 -10984627 -10368058 -9795521
39502i795521N06233M38882L85051L51234L36379L31150L18010K76407J92656
$$ -9795521 -9289288 -8850406 -8465355 -8114121 -7777742 -7446592 -7128582 -6852175 -6659519
39493f659519O8516p7204k14744l14121l56677l43354k95381k45063k19980k28853
$$ -6659519 -6591003 -6668207 -6882951 -7197072 -7553749 -7897103 -8192484 -8437547 -8657527 -8886380
39483h886380k56897k73161k45966j58976k0383J39369K80886L73897M10745M08005
$$ -8886380 -9143277 -9416438 -9662404 -9821380 -9841763 -9702394 -9421508 -9047611 -8636866 -8228861
39473h228861L96037M03306M44524N17424O06419O88462P38080P32162O55599
$$ -8228861 -7832824 -7429518 -6984994 -6467570 -5861151 -5172689 -4434609 -3702447 -3046848
39464c046848N06451K97563N2956j99308m34134o33339p85322q81636r13396q71234
$$ -3046848 -2540397 -2242834 -2189878 -2389186 -2823320 -3456659 -4241981 -5123617 -6037013 -6908247
39454f908247p50521n58983l20716p2066J49730L19002M28211M85274N04621M98489
$$ -6908247 -7658768 -8217751 -8538467 -8610533 -8460803 -8141801 -7713590 -7228316 -6723695 -6225206
39444f225206M73685M33600L81252L19892K51473J75327Q8130j5113j38957k83630
$$ -6225206 -5751521 -5317921 -4936669 -4616777 -4365304 -4189977 -4101847 -4116960 -4255917 -4539547
39434d539547m40257n88714p01206p51255p23966o22827m69908k99208j45547
$$ -4539547 -4979804 -5568518 -6269724 -7020979 -7744945 -8367772 -8837680 -9136888 -9282435
39425i282435l3618K8233M7207L9612K2099M309j4329m2298q9376j59056k43801
$$ -9282435 -9316053 -9287820 -9240613 -9201001 -9178902 -9174593 -9188922 -9231220 -9320596 -9479652 -9723453
39414i723453l25056l78261l81614l25609k18299q2293N5414J74207K64866L27654
$$ -9723453 -10048509 -10426770 -10808384 -11133993 -11352292 -11434585 -11379171 -11204964 -10940098 -10612444
39404a0612444L67355L89423L99120M02519M06897M17992M34352M42958M20932
$$ -10612444 -10245089 -9855666 -9456546 -9054027 -8647130 -8229138 -7794786 -7351828 -6930896
39395f930896L44382J99993o593k49295m87198o74981p74475p63505o40095m22002
$$ -6930896 -6586514 -6386521 -6393114 -6642409 -7129607 -7804588 -8579063 -9342568 -9982663 -10404665
39385a0404665j42602J56112M31949O49771P85799Q29127P81467O55090M68581
$$ -10404665 -10547267 -10391155 -9959206 -9309435 -8523636 -7694509 -6913042 -6257952 -5789371
39376e789371K41783p495k63365n09094p24047q82865r59099r33249q01829n82152
$$ -5789371 -5547588 -5555083 -5818448 -6327542 -7051589 -7934454 -8893553 -9826802 -10628631 -11210783
39366a1210783l09157k5171K33076M45027O10504P45830Q73410J009349J154945
$$ -11210783 -11519940 -11545111 -11312035 -10867008 -10256504 -9510674 -8637264 -7627915 -6472970
39357f472970J296060J410240J477204J486862J440913J348803J221887J069500
$$ -6472970 -5176910 -3766670 -2289466 -802604 638309 1987112 3208999 4278499
39349D278499Q98103P12915N20414L29551J49938j2418j58428k94977m29492n63500
$$ 4278499 5176602 5889517 6409931 6739482 6889420 6877002 6718574 6423597 5994105 5430605
39339E430605o89208p91387q53602q65317q25712p42565o28185m95593l56201
$$ 5430605 4741397 3950010 3096408 2231091 1405379 662814 34629 -460964 -817165
39330h17165k17969q4088M6410J74844K97489M02099M69470M80938M28888L23813
$$ -817165 -1035134 -1119222 -1072812 -897968 -600479 -198380 271090 752028 1180916 1504729
39320A504729J91630O1283m9045j37141k11109k79898l48544m19674m95702n76842
$$ 1504729 1696359 1757642 1708597 1571456 1360347 1080449 731905 312231 -183471 -760313
39310g60313o56408p19631p49591p36619o83409o01682n03987l98398k89925j85489
$$ -760313 -1416721 -2136352 -2885943 -3622562 -4305971 -4907653 -5411640 -5810038 -6099963 -6285452
39300f285452r6271l4548p649j3961m3964q5025j26105j59284j78315j77151j50731
$$ -6285452 -6381723 -6416271 -6423920 -6437881 -6481845 -6566870 -6692975 -6852259 -7030574 -7207725 -7358456
39289g358456r7103j7966Q3801K07392L54226N23548P06963Q87248J043428J158290
$$ -7358456 -7455559 -7473525 -7389724 -7182332 -6828106 -6304558 -5597595 -4710347 -3666919 -2508629
39279b508629J222658J234700J197357J117224J004967Q75285P45528O33277N52980
$$ -2508629 -1285971 -51271 1146086 2263310 3268277 4143562 4889090 5522367 6075347
39270F075347N11506N04308N15391N23161N10332M72439M18922L65014L19326
$$ 6075347 6586853 7091161 7606552 8129713 8640045 9112484 9531406 9896420 10215746
39261A0215746K76311K19725J35099K3012r4861j80352j92644j05397Q1491L42037
$$ 10215746 10492057 10711782 10846881 10869893 10775032 10594680 10402036 10296639 10378130 10720167
39251A0720167O35174R18623J158172J331042J426001J442116J386280J270350
$$ 10720167 11355341 12273964 13432136 14763178 16189179 17631295 19017575 20287925
39243B0287925J108721R15571P00657M65780K06552p9387l83265o83228r51764
$$ 20287925 21396646 22312217 23012874 23478654 23685206 23605819 23222554 22539326 21587562
39234B1587562j166876j318789j408737j443237j429807j376900j295651j199481
$$ 21587562 20420686 19101897 17693160 16249923 14820116 13443216 12147565 10948084
39226A0948084j100316j003836r07182q00550o71888n12756l22849j10998J08364
$$ 10948084 9847768 8843932 7936750 7136200 6464312 5951556 5628707 5517709 5626073
39217E626073L21087N17459O91943Q40146R57016J037647J077978J073153J016089
$$ 5626073 5947160 6464619 7156562 7996708 8953724 9991371 11069349 12142502 13158591
39208A3158591R00633P28858N16149K89013P6918r6839k21681l02106l54013l95072
$$ 13158591 14059224 14788082 15304231 15593244 15670162 15573323 15351642 15049536 14695523 14300451
39198A4300451m34109m66805m80067m60417m00650l02817j78432m6072P3443J62380
$$ 14300451 13866342 13399537 12919470 12459053 12058403 11755586 11577154 11531082 11604525 11766905
39188A1766905K09225K09116J62680P4090n1544k10312l99189o12894q40079j061591
$$ 11766905 11976130 12185246 12347926 12422016 12370472 12160160 11760971 11148077 10307998 9246407
39178I246407j251901j383005j430027j378256j230448j010994p62316n32443
$$ 9246407 7994506 6611501 5181474 3803218 2572770 1561776 799460 267017
39170B67017l59166k59451k28537k45943k83024l09888l02288k47883j49170k1583
$$ 267017 -92149 -351600 -580137 -826080 -1109104 -1418992 -1721280 -1969163 -2118333 -2139916
39160b139916J11846K26958L04273L32676L09724K39562J31487P25j31135k40135
$$ -2139916 -2028070 -1801112 -1496839 -1164163 -854439 -614877 -483390 -482665 -613800 -853935
39150h53935l08041l29102l10252k65474k09801j56464j15035q6961o0704j4059
$$ -853935 -1161976 -1491078 -1801330 -2066804 -2276605 -2433069 -2548104 -2635065 -2695769 -2709828
39140b709828P3112K03489L56989N00024O01230O42811O24224N61508M83902M25737
$$ -2709828 -2636716 -2433227 -2076238 -1576214 -974984 -332173 292051 853559 1337461 1763198
39130A763198M13860M57039N44160O51324P51289Q19288Q34642P81455O51212
$$ 1763198 2177058 2634097 3178257 3829581 4580870 5400158 6234800 7016255 7667467
39121G667467M47574J90787q2442l26836n02804n90336n94629n40526m59933l79757
$$ 7667467 8115041 8305828 8223386 7896550 7393746 6803410 6208781 5668255 5208322 4828565
39111D828565l16192k76246k63003k79066l24903l93771m68697n25708n42168
$$ 4828565 4512373 4236127 3973124 3694058 3369155 2975384 2506687 1980979 1438811
39102A438811n05342m16797k91783j54874l3616M8541P8813N9858J0829l7297
$$ 1438811 933469 516672 224889 70015 36399 84940 163753 223611 234440 197143
39092A97143n2651j6117O9115J78303K76556L34718L40667L00317K29642J44589
$$ 197143 144492 128375 197490 375793 652349 987067 1327734 1628051 1857693 2002282
39082B002282N5759l0646j09252j73847k18601k40055k37590k11982j63686r2650
$$ 2002282 2058041 2027395 1918143 1744296 1525695 1285640 1048050 836068 672382 579732
39072E79732p78J04008K04963K78344L01282K63070J73896O4868k2786n4769j8128
$$ 579732 578954 682962 887925 1166269 1467551 1730621 1904517 1969385 1946599 1891830 1873702
39061A873702P4509J92258K99633L68956L86581L52963K79748J86487R6593L1120
$$ 1873702 1948211 2140469 2440102 2809058 3195639 3548602 3828350 4014837 4111430 4142550
39051D142550J668O687L4568P1693J09521J45860J80820K11687K30639K26185
$$ 4142550 4144218 4150905 4185473 4257166 4366687 4512547 4693367 4905054 5135693 5361878
39041E361878J86983J07127p826j36611k44650k95959k70071j73496l7619R5406
$$ 5361878 5548861 5655988 5648162 5511551 5266901 4970942 4700871 4527375 4489756 4585162
39031D585162J89468K25636K05522J49021Q8496N9972R2466J98205L67563N71993
$$ 4585162 4774630 5000266 5205788 5354809 5443305 5503277 5595743 5793948 6161511 6733504
39021F733504P75204R48054J079088J174885J251706J325988J410064J512611
$$ 6733504 7508708 8456762 9535850 10710735 11962441 13288429 14698493 16211104
39013A6211104J638652J786569J945478K098040K228388K328794K399044K439692
$$ 16211104 17849756 19636325 21581803 23679843 25908231 28237025 30636069 33075761
39005C3075761K446432K412063K335368K229994K125649K058881K057777K129188
$$ 33075761 35522193 37934256 40269624 42499618 44625267 46684148 48741925 50871113
38997E0871113K256005K405427K543130K646672K714231K766683K840918K974118
$$ 50871113 53127118 55532545 58075675 60722347 63436578 66203261 69044179 72018297
38989G2018297L185218L464613L779175M088009M356572M561068M685996M722962
$$ 72018297 75203515 78668128 82447303 86535312 90891884 95452952 100138948 104861910
38981A04861910M674276M557303M404210M256244M155861M140131M236594M461379
$$ 104861910 109536186 114093489 118497699 122753943 126909804 131049935 135286529 139747908
38973A39747908M819073N303666N899674O583118P322977Q084352Q833616R543953
$$ 139747908 144566981 149870647 155770321 162353439 169676416 177760768 186594384 196138337
38965A96138337J0198010J0785350J1295532J1710536J1999855J2119636J2016214
$$ 196138337 206336347 217121697 228417229 240127765 252127620 264247256 276263470
38958B76263470J1634766J0932360R891918Q532647O915134N141096L346053J681489
$$ 276263470 287898236 298830596 308722514 317255161 324170295 329311391 332657444 334338933
38950C34338933K86711p41889j372333j640695j635793j471696j260033j093737
$$ 334338933 334625644 333883755 332511422 330870727 329234934 327763238 326503205 325409468
38942C25409468j045805j175440j529256k132466k976827m016829n178956o378696
$$ 325409468 324363663 323188223 321658967 319526501 316549674 312532845 307353889 300975193
38934C00975193p535895q583321r469729j0160639j0637489j0894367j0934339
$$ 300975193 293439298 284855977 275386248 265225609 254588120 243693753 232759414
38927B32759414j0769580j0425939r945833r382658q787733q198008p631276p089047
$$ 232759414 221989834 211563895 201618062 192235404 183447671 175249663 167618387 160529340
38919A60529340o563961o049935n552588n093846m704947m409903m210381m082931
$$ 160529340 153965379 147915444 142362856 137269010 132564063 128154160 123943779 119860848
38911A19860848l990422l899849l796044l685093l587572l526265l514558l550220
$$ 119860848 115870426 111970577 108174533 104489440 100901868 97375603 93861045 90310825
38903I0310825l615808l683069l718179l687719l567720l354943l073178k766258
$$ 90310825 86695017 83011948 79293769 75606050 72038330 68683387 65610209 62843951
38895F2843951k478677k235989k038333j869237j710419j551917j394313j245911
$$ 62843951 60365274 58129285 56090952 54221715 52511296 50959379 49565066 48319155
38887D8319155j118039j019541r51801r07520q75324q47561q25044q14537q21615
$$ 48319155 47201116 46181575 45229774 44322254 43446930 42599369 41774325 40959788 40138173
38878D0138173q45729q81580r24495r74035j032536j099916j168841j223906j245707
$$ 40138173 39292444 38410864 37486369 36512334 35479798 34379882 33211041 31987135 30741428
38869C0741428j217458j129970r82794p82772n42594k80347j8895K15823L97775
$$ 30741428 29523970 28394000 27411206 26628434 26085840 25805493 25786598 26002421 26400196
38860B6400196N04642N22167M47999K93867Q4937j44201l57131n24708o31986
$$ 26400196 26904838 27427005 27875004 28168871 28253808 28109607 27752476 27227768 26595782
38851B6595782o80386o86276o77680o88197p46807q67480j045658j263611j498145
$$ 26595782 25915396 25229120 24551440 23863243 23116436 22248956 21203298 19939687 18441542
38842A8441542j723820j912490k035114k067774j997826j826006j564962j237073
$$ 18441542 16717722 14805232 12770118 10702344 8704518 6878512 5313550 4076477
38834D076477q72616n06943j75228R4805K89120M08888M66211M77487M59059M26012
$$ 4076477 3203861 2696918 2521690 2616495 2905615 3314503 3780714 4258201 4717260 5143272
38824E143272L91168L62236L39219L15587K83985K43399K03428J81966J96177
$$ 5143272 5534440 5896676 6235895 6551482 6835467 7078866 7282294 7464260 7660437
38815G660437K51572L36712M27481M97198N24788M97427M10675K70253R4434q8027
$$ 7660437 7912009 8248721 8676202 9173400 9698188 10195615 10606290 10876543 10970977 10882950
38805A0882950k46829l62022m31638m70836n03915n53590o31837p35111q45839
$$ 10882950 10636121 10274099 9842461 9371625 8867710 8314120 7682283 6947172 6101333
38796F101333r39786r95707j001910r56489q62259p20927n31042k91284o696L07311
$$ 6101333 5161547 4165840 3163930 2207441 1345182 624255 93213 -198071 -204767 102544
38786A02544O26738R25188J179424J370831J484858J512663J455528J327892J155234
$$ 102544 729282 1654470 2833894 4204725 5689583 7202246 8657774 9985666 11140900
38777A1140900R67869P94769O59587N77534N51782N71183O12572O48033O53408
$$ 11140900 12108769 12903538 13563125 14140659 14692441 15263624 15876196 16524229 17177637
38768A7177637O13606N23532L86929K15269K6447j58617l21557m51906n48980
$$ 17177637 17791243 18314775 18701704 18916973 18943420 18784803 18463246 18011340 17462360
38759A7462360o19568o73374p18815p60105p95361q16471q12249p75016p07349
$$ 17462360 16842792 16169418 15450603 14690498 13895137 13078666 12266417 11491401 10784052
38750A0784052o24476n50429n10068n21086n89260p07876q60205j022633j166804
$$ 10784052 10159576 9609147 9099079 8577993 7988733 7280857 6420652 5398019 4231215
38741D231215j261566j277275j193667j008892p44951m45256j63541N2305J74182
$$ 4231215 2969649 1692374 498707 -510185 -1255136 -1700392 -1863933 -1811628 -1637446
38732a637446J98916J43805L8221q2872j83260k31413k08646j14905L2180K03763
$$ -1637446 -1438530 -1294725 -1256504 -1339376 -1522636 -1754049 -1962695 -2077600 -2045420 -1841657
38722a841657L66995M90352N48437N27727M31575K80741J07477n4832j81001k57264
$$ -1841657 -1474662 -984310 -435873 91854 523429 804170 911647 856815 675814 418550
38712D18550k77951k40331j43077J0693K09126M29982O43122Q16878R27082R65283
$$ 418550 140599 -99732 -242809 -232116 -22990 406992 1050114 1866992 2794074 3759357
38702C759357R41189Q76504P93083P02646O04082M89219L52667J99336M5336q7470
$$ 3759357 4700546 5577050 6370133 7072779 7676861 8166080 8518747 8718083 8763419 8675949
38692H675949j79711k22172k20977j97997j83570k02410k60304l40882m14641
$$ 8675949 8496238 8274066 8053089 7855092 7671522 7469112 7208808 6867926 6453285
38683F453285m53377m41521l80907k89307j93512j18623p8536p3570r6323j40576
$$ 6453285 5999908 5558387 5177480 4888173 4694661 4576038 4497502 4423932 4327609 4187033
38673D187033k06391k98605m20518n67031p21465q58380r51416r81827r42832
$$ 4187033 3980642 3682037 3261519 2694488 1973023 1114643 163227 -818600 -1761432
38664a761432q37986o76189m67814k24444L8974L02927N45201P45175Q88502R70152
$$ -1761432 -2599418 -3275607 -3743421 -3967865 -3928891 -3625964 -3080763 -2335588 -1447086 -476934
38654d76934R94935R75558R29190Q73413Q21436P76748P30381O65298N68513M43393
$$ -476934 518001 1493559 2422749 3296162 4117598 4894346 5624727 6290025 6858538 7301931
38644G301931L11833K02803J35140J07290J01175R6826Q7374Q4362J10096J81664
$$ 7301931 7613764 7816567 7951707 8058997 8160172 8256998 8344372 8428734 8538830 8720494
38634H720494K96172M26204N29108N65807N18638L98147K36222P1795o2092j45267
$$ 8720494 9016666 9442870 9971978 10537785 11056423 11454570 11690792 11762587 11700495 11555228
38624A1555228j71500j45202p6212K3270J36645K39258L00922K97602K24881J02294
$$ 11555228 11383728 11238526 11162314 11185584 11322229 11561487 11862409 12160011 12384892 12487186
38614A2487186l5193j52650k29003k64144k77680k99361l53990m47550n62186
$$ 12487186 12451993 12299343 12070340 11806196 11528516 11229155 10875165 10427615 9865429
38605I865429o63039p12627o84693n71536l84491j50655R1581K98757M31949M69377
$$ 9865429 9202390 8489763 7805070 7233534 6849043 6698388 6789969 7088726 7520675 7990052
38595G990052M17443L13333K14577J77916K36978L89425N98450Q06307R54170
$$ 7990052 8407495 8720828 8935405 9113321 9350299 9739724 10338174 11144481 12098651
38586A2098651J002391R44679Q09462O46131N01991M01558L38208K81650J97190
$$ 12098651 13101042 14045721 14855183 15501314 16003305 16404863 16743071 17024721 17221911
38577A7221911O7174r7482k63428l95363m76617n15164n32142n44016n53318n53228
$$ 17221911 17289085 17191603 16928175 16532812 16056195 15541031 15008889 14464873 13911555 13358327
38567A3358327n38220n09419m71397m26703l75168l17628k58709k05344j63054
$$ 13358327 12820107 12310688 11839291 11412588 11037420 10719792 10461083 10255739 10092685
38558A0092685j33590j15536j06966j08136j21990j51211j93120k35863k59109
$$ 10092685 9959095 9843559 9736593 9628457 9506467 9355256 9162136 8926273 8667164
38549H667164k40042j62629k6029J52461L42037N07627O17918O49148N86805M28926
$$ 8667164 8427122 8264493 8238464 8390925 8732962 9240589 9858507 10507655 11094460 11523386
38539A1523386J90569r5038l82505o26620p95940q81485q96610q68248q24020
$$ 11523386 11713955 11618917 11236412 10609792 9813852 8932367 8035757 7167509 6343489
38530F343489p81759p46118p12395o73970o28838n82612n47205n35677n55165
$$ 6343489 5561730 4815612 4103217 3429247 2800409 2217797 1670592 1134915 579750
38521E79750o01649o60111p10052p32374p13791o48422n38214l92283k24006m6954
$$ 579750 -21899 -682010 -1392062 -2124436 -2838227 -3486649 -4024863 -4417146 -4641152 -4688106
38511d688106J27212K87902M25062N32146O11116O74306P39551Q19976R14084
$$ -4688106 -4560894 -4272992 -3847930 -3315784 -2704668 -2030362 -1290811 -470835 443249
38502D43249J002644J055860J047929R70531Q37159O76889N22890M02298L30290
$$ 443249 1445893 2501753 3549682 4520213 5357372 6034261 6557151 6959449 7289739
38493G289739L07456L19341L39253L36370K88543J93929P3215m1045j21955j60897
$$ 7289739 7597195 7916536 8255789 8592159 8880702 9074631 9147846 9106801 8984846 8823949
38483H823949j67521j59338j49814j42792j34937j22803j09412j06160j28243
$$ 8823949 8656428 8497090 8347276 8204484 8069547 7946744 7837332 7731172 7602929
38474G602929j85412k73792l75415m67551n35980n82320o20150o64049p19996
$$ 7602929 7417517 7143725 6768310 6300759 5764779 5182459 4562309 3898260 3178264
38465C178264p82058q34301q55604q26993p40518o04955m43551k84768j53489
$$ 3178264 2396206 1561905 706301 -120692 -861210 -1466165 -1909716 -2194484 -2347973
38456b347973o8495m4177q9463k01666l61580n37956p00886q33782r34223j004741
$$ -2347973 -2416468 -2460645 -2550108 -2751774 -3113354 -3651310 -4352196 -5185978 -6120201 -7124942
38446g124942j044413j050417j027416r93827r76254r93850j043356j095536j105644
$$ -7124942 -8169355 -9219772 -10247188 -11241015 -12217269 -13211119 -14254475 -15350011 -16455655
38437a6455655j032112q54187n81112k49415R0691L93702O32481Q00522R04593
$$ -16455655 -17487767 -18341954 -18923066 -19172481 -19081790 -18688088 -18055607 -17255085 -16350492
38428a6350492R56455R69755R60227R43295R27629R09268Q71933P94833O64896
$$ -16350492 -15394037 -14424282 -13464055 -12520760 -11593131 -10683863 -9811930 -9017097 -8352201
38419h352201M87810K91620J19197J2275m665O7145K02046L58469M91553N66740
$$ -8352201 -7864391 -7572771 -7453574 -7441299 -7445964 -7378819 -7176773 -6818304 -6326751 -5760011
38409e760011N69616N07318M01176K75637J49631L2940p3190j73129k73077l77484
$$ -5760011 -5190395 -4683077 -4281901 -4006264 -3856633 -3823693 -3896883 -4070012 -4343089 -4720573
38399d720573m86098n91805o80043p31140p25771o51606n08126l07904p4058J65006
$$ -4720573 -5206671 -5798476 -6478519 -7209659 -7935430 -8587036 -9095162 -9403066 -9477124 -9312118
38389i312118L81787N54551O69685P21555P10584O40470N16321L45585J40942
$$ -9312118 -8930331 -8375780 -7706095 -6984540 -6273956 -5633486 -5117165 -4771580 -4630638
38380d630638p8792k92561m83311o41192p61396q40025q72877q58862q05329p30569
$$ -4630638 -4709430 -5001991 -5485302 -6126494 -6887890 -7727915 -8600792 -9459654 -10264983 -10995552
38370a0995552o59745o14730o03167o13762o21345n99264n32691m25648k97315
$$ -10995552 -11655297 -12270027 -12873194 -13486956 -14108301 -14707565 -15240256 -15665904 -15963219
38361a5963219j69419n3709N0761J49538K43048L24872L87561M27555M43610M32475
$$ -15963219 -16132638 -16186347 -16135586 -15986048 -15743000 -15418128 -15030567 -14603012 -14159402 -13726927
38351a3726927L89415L15570K25562J46654J07642J24941J96014L03471M24402
$$ -13726927 -13337512 -13021942 -12796380 -12649726 -12542084 -12417143 -12221129 -11917658 -11493256
38342a1493256N38076O29992O94088P33127P55507P69387P78529P82612P79660
$$ -11493256 -10955180 -10325188 -9631100 -8897973 -8142466 -7373079 -6594550 -5811938 -5032278
38333e032278P66873P39835O93130O23308N31617M24386L12218K09808J35055
$$ -5032278 -4265405 -3525570 -2832440 -2209132 -1677515 -1253129 -940911 -731103 -596048
38324e96048J04002J22253J79886K56667L35173M10357M86638N66025O39945O92382
$$ -596048 -492046 -369793 -189907 66760 401933 812290 1298928 1864953 2504898 3197280
38314C197280P09756O87372O28572N40877M33711L16545J94305O2222r3684k87986
$$ 3197280 3907036 4594408 5222980 5763857 6197568 6514113 6708418 6770640 6676956 6388970
38304F388970n25005p93924j071867j329936j537532j665535j691287j605126
$$ 6388970 5863965 5070041 3998174 2668238 1130706 -534829 -2226116 -3831242
38296c831242j415275j148204q44103n48063k98232j14595N994Q4809J48418K15399
$$ -3831242 -5246517 -6394721 -7238824 -7786887 -8085119 -8199714 -8193720 -8108911 -7960493 -7745094
38286g745094K90064L65563M32134M83535N17563N32322N23260M84169M11033
$$ -7745094 -7455030 -7089467 -6657333 -6173798 -5656235 -5123913 -4600653 -4116484 -3705451
38277c705451L05208J73217K3445j37359l04717m73844o36761p82398q99750r81161
$$ -3705451 -3400243 -3227026 -3203581 -3340940 -3645657 -4119501 -4756262 -5538660 -6438410 -7419571
38267g419571j022968j023187r78210q81169p24184n04042k27327Q9161M22593
$$ -7419571 -8442539 -9465726 -10443936 -11325105 -12049289 -12553331 -12780658 -12691497 -12268904
38258a2268904P48603J043369J284820J455118J542764J541758J449816J270406
$$ -12268904 -11520301 -10476932 -9192112 -7736994 -6194230 -4652472 -3202656 -1932250
38250a932250J018613P24040M25190J58321n0947j89561k56022k60399k23583
$$ -1932250 -913637 -189597 235593 393914 342967 153406 -102616 -363015 -586598
38241e86598j71704j26644r9181q9329r1477r8528j03391j00558q9091p3758o1213
$$ -586598 -758302 -884946 -984127 -1073456 -1164933 -1263461 -1366852 -1467410 -1556501 -1630259 -1691472
38230a691472n3847m7732l6946j9261L552L1229O9657J28011K09166L01317L78454
$$ -1691472 -1745319 -1793051 -1829997 -1849258 -1845706 -1814477 -1744820 -1616809 -1407643 -1106326 -727872
38219g27872M10450L76558K74946J24815l8817j76154k56955k72775k39881j89299
$$ -727872 -317422 59136 334082 458897 420080 243926 -13029 -285804 -525685 -714984
38209g14984j48726j27653j15187r1062m1501L0674J07505J67423J99655K12638
$$ -714984 -863710 -991363 -1106550 -1197612 -1239113 -1208439 -1100934 -933511 -733856 -521218
38199e21218K30664K80253L74783N06900O51758P76315Q48205Q42335P47233N70718
$$ -521218 -290554 -10301 364482 871382 1523140 2299455 3147660 3989995 4737228 5307946
38189E307946L40367R5143j28546l08101m37695n24043n79731o17386o45503o66703
$$ 5307946 5648313 5743456 5614910 5306809 4869114 4345071 3765340 3147954 2502451 1835748
38179A835748o79287o81524o76098o72529o86687p36574q33723r72490j123750
$$ 1835748 1156461 474937 -201161 -873690 -1560377 -2296951 -3130674 -4103164 -5226914
38170e226914j239783j270714j184831r81912o92838l67156n6846J95516L61939
$$ -5226914 -6466697 -7737411 -8922242 -9904154 -10596992 -10964148 -11020994 -10825478 -10463539
38161a0463539M31213M11082L28296K22435J34204R4284J17892K05072L43785
$$ -10463539 -10032326 -9621244 -9292948 -9070513 -8936309 -8842025 -8724133 -8519061 -8175276
38152h175276N14161O93526Q61013R99930J097678J144763J134470J063486R33025
$$ -8175276 -7661115 -6967589 -6106576 -5106646 -4008968 -2864205 -1729735 -666249 266776
38143B66776P49972N27188K82576L6538j91579l87250n43221o59024p37214p78233
$$ 266776 1016748 1543936 1826512 1863050 1671471 1284221 741000 81976 -655238 -1433471
38133a433471p77484p27441o24483m76666l06552j45480k1487N1672P7275O9034
$$ -1433471 -2210955 -2938396 -3562879 -4039545 -4346097 -4491577 -4513064 -4461392 -4384117 -4315083
38123d315083M0566j623n7213j24484j92322k38963k39986j81130o7675P5261
$$ -4315083 -4274517 -4276140 -4333353 -4457837 -4650159 -4889122 -5129108 -5310238 -5377913 -5302652
38113e302652K11467L06547L38909L04347K13489Q5258n8953j97963l11710l83460
$$ -5302652 -5091185 -4784638 -4445729 -4141382 -3927893 -3842635 -3901588 -4099551 -4411261 -4794721
38103d794721m04318l77553l18351k46946j77948j12608l9576N6046J81591L31227
$$ -4794721 -5199039 -5576592 -5894943 -6141889 -6319837 -6432445 -6472021 -6415975 -6234384 -5903157
38093e903157M88844O35840P57442Q43804Q87543Q81434Q18139O91325M97763
$$ -5903157 -5414313 -4778473 -4021031 -3177227 -2289684 -1408250 -590111 101214 598977
38084E98977K40593o7301m02762p35859j035082j271566j422710j476844j437548
$$ 598977 839570 772269 369507 -366352 -1401434 -2673000 -4095710 -5572554 -7010102
38075g010102j323635j163236r85010q10890o52405n10592l79109k49598j17065
$$ -7010102 -8333737 -9496973 -10481983 -11292873 -11945278 -12455870 -12834979 -13084577 -13201642
38066a3201642J7179J45817K57991L42728L92713M07811L96913L75984L61713
$$ -13201642 -13184463 -13038646 -12780655 -12437927 -12045214 -11637403 -11240490 -10864506 -10502793
38057a0502793L63682L80358M01980M17968M23383M21110M19973M29641M52911
$$ -10502793 -10139111 -9758753 -9356773 -8938805 -8515422 -8094312 -7674339 -7244698 -6791787
38048f791787M78896M84256M46366L61736K55373J71974J54232K23228L71929
$$ -6791787 -6312891 -5828635 -5382269 -5020533 -4765160 -4593186 -4438954 -4215726 -3843797
38039c843797N70985P79015R52252J054048J064763R87897Q46875O72861M91141
$$ -3843797 -3272812 -2493797 -1541545 -487497 577266 1565163 2412038 3084899 3576040
38030C576040L14855J49022O75j13323j68144j43472l8925J19307K86133M14284
$$ 3576040 3890895 4039917 4040592 3927269 3759125 3615653 3576728 3696035 3982168 4396452
38020D396452M69610M38761L30080J70140l335j51278k42148k56419j87648m4226
$$ 4396452 4866062 5304823 5634903 5805043 5801708 5650430 5408282 5151863 4964215 4919989
38010D919989J47330L42755M90152N48344N03469L73177J96631J7620j29863k29068
$$ 4919989 5067319 5410074 5900226 6448570 6952039 7325216 7521847 7539467 7409604 7180536
38000G180536k81056k99594l02071l00166k95487k82546k56023k16578j71527
$$ 7180536 6899480 6599886 6297815 5997649 5702162 5419616 5163593 4947015 4775488
37991D775488j31052j02707q7104p7239o2618l6131J605M4706Q9272J38073J97231
$$ 4775488 4644436 4541729 4454625 4377386 4314768 4278637 4280242 4324948 4414220 4552293 4749524
37980D749524K67642L39463L95430M20598M10537L71377L12126K36388J41582
$$ 4749524 5017166 5356629 5752059 6172657 6583194 6954571 7266697 7503085 7644667
37971G644667K7036r6451k05622k74863k89788k53842j84162j01881k4710L4499
$$ 7644667 7671703 7575252 7369630 7094767 6804979 6551137 6366975 6265094 6240384 6274883
37961F274883O5705O0935J7186n9411j52767k41474l06350l36148l28739k88961
$$ 6274883 6340588 6401523 6418709 6359298 6206531 5965057 5658707 5322559 4993820 4704859
37951D704859k26173j53342q6779m3981l8246p2010j33163j97799k39193k39089
$$ 4704859 4478686 4325344 4238565 4194584 4156338 4084328 3951165 3753366 3514173 3275084
37941C275084j95533j22964m4712J7041M8257M5485J6038k3340n1421n1632k0580
$$ 3275084 3079551 2956587 2911875 2928916 2977173 3022658 3038696 3015356 2963935 2912303 2891723
37930B891723L0022P8501J00973P8395L157j15495k51261l68778m36468m36650
$$ 2891723 2921745 3000246 3101219 3179614 3182771 3067276 2816015 2447237 2010769 1574119
37920A574119l67860k40772p2478J17387L08712M82970O26191P31270P97453Q26876
$$ 1574119 1206259 965487 893009 1010396 1319108 1802078 2428269 3159539 3956992 4783868
37910D783868Q20957P79159P00425N85641M40024K74787J06589m6769j73129k70416
$$ 4783868 5604825 6383984 7084409 7670050 8110074 8384861 8491450 8444681 8271552 8001136
37900H001136l44804m04221m53443m95216n35091n83320o50075p37140q33171
$$ 8001136 7656332 7252111 6798668 6303452 5768361 5185041 4534966 3797826 2964655
37891B964655r16828r65818r65878r14767q20830o98915n66565m40621l33300
$$ 2964655 2047827 1082009 116131 -798636 -1619466 -2318381 -2884946 -3325567 -3658867
37882c658867k48165j78541j10211k7804P7855K04319L37176M56402N46701O04261
$$ -3658867 -3907032 -4085573 -4195784 -4223588 -4145733 -3941414 -3604238 -3147836 -2601135 -1996874
37872a996874O34205O41541O24849N78164M97593L85729K51694J09534k3056j26610
$$ -1996874 -1362669 -721128 -96279 481885 979478 1365207 1616901 1726435 1703379 1576769
37862A576769j83428j81819j19521n422J41351K96180M36654N49390O32018O89711
$$ 1576769 1393341 1211522 1092001 1086579 1227930 1524110 1960764 2510154 3142172 3831883
37852C831883P29614P57056P74962P84785P86656P78710P57984P24062O82505
$$ 3831883 4561497 5318553 6093515 6878300 7664956 8443666 9201650 9925712 10608217
37843A0608217O43314O14063N93409N71224N35700M82302M19051L65137L42453
$$ 10608217 11251531 11865594 12459003 13030227 13565927 14048229 14467280 14832417 15174870
37834A5174870L62858M18063M79730N10907M81244L76229J96899m5722l34941
$$ 15174870 15537728 15955791 16435521 16946428 17427672 17803901 18000800 17955078 17620137
37825A7620137o48045r52996j207633j366817j397049j290254j066815p65920
$$ 17620137 16972092 16019096 14811463 13444646 12047597 10757343 9690528 8924608
37817H924608m31203j00837J95891M39526O21077P40277P99734P98447P30657
$$ 8924608 8493405 8392568 8588459 9027985 9649062 10389339 11189073 11987520 12718177
37808A2718177N92664L93690J62997n3381k07480k69532k41893j57109o0169J3791
$$ 12718177 13310841 13704531 13867528 13814147 13606667 13337135 13095242 12938133 12877964 12891755
37798A2891755N2434O4007O5422P0150Q1323R0257P9444K9608p1379k22191m07614
$$ 12891755 12944189 13008196 13073618 13143768 13225091 13315348 13394792 13424400 13353021 13130830 12723216
37787A2723216o03050p80204r11515r74061r55195q59717p13700n58084m31448
$$ 12723216 12120166 11339962 10428447 9454386 8499191 7639474 6925774 6367690 5936242
37778E936242l52268l14694l01010k98874l08715l38406l93636m71794n60382
$$ 5936242 5583974 5269280 4968270 4669396 4360681 4022275 3628639 3156845 2596463
37769B596463o38768o83684o77685o16026n07773l71551k28941r7512J4759J09961
$$ 2596463 1957695 1274011 596326 -19700 -527473 -899024 -1127965 -1225477 -1210718 -1100757
37759a100757J93877K67259L22777L50125L43816L06799K48742J82177J19209
$$ -1100757 -906880 -639621 -316844 33281 377097 683896 932638 1114815 1234024
37750A234024O8948L5783J9177J4889J6341J5257K387l0271q5961j60238k40084
$$ 1234024 1302972 1338755 1357932 1372821 1389162 1404419 1406806 1376535 1290574 1130336 890252
37739H90252l05482l33099l02369k03410m3557J52057L47430N06483O02041O20550
$$ 890252 584770 251671 -50698 -254108 -297665 -145608 201822 708305 1310346 1930896
37729A930896N63495M46198K92767J27330l4223j86331l28206m55388n55627o13029
$$ 1930896 2494391 2940589 3233356 3360686 3326463 3140132 2811926 2356538 1800911 1187882
37719A187882o17644n73228m96904m10999l33171k70864k21107j73470j14590
$$ 1187882 570238 -2990 -499894 -910893 -1244064 -1514928 -1736035 -1909505 -2024095
37710b024095l4026P0565J91874L15192M20845M85118M83387L99472K37684K7628
$$ -2024095 -2058121 -1987556 -1795682 -1480490 -1059645 -574527 -91140 308332 546016 573644
37700E73644j84255l51770m44011m51505l84219k65779j26577L830J04470J68386
$$ 573644 389389 37619 -406392 -857897 -1242116 -1507895 -1634472 -1630642 -1526172 -1357786
37690a357786K02769K23242K45701K80534L31358L96414M69704N40875N95219
$$ -1357786 -1155017 -931775 -686074 -405540 -74182 322232 791936 1332811 1928030
37681A928030O15370N85655M98503L59833J89321J4081j40505k57411l30049l61575
$$ 1928030 2543400 3129055 3627558 3987391 4176712 4190793 4050288 3792877 3462828 3101253
37671C101253l62802l47640l25915k96951k49098j67205m4766J06397K56010L66735
$$ 3101253 2738451 2390811 2064896 1767945 1518847 1351642 1306876 1413273 1669283 2036018
37661B036018M11301L84967L06384K08253J24770Q1817R1912J53454K53065L69476
$$ 2036018 2447319 2832286 3138670 3346923 3471693 3553510 3645422 3798876 4051941 4421417
37651D421417M77512N52355N75235N39662M54186L38071K11541Q7315l0530j40997
$$ 4421417 4898929 5451284 6026519 6566181 7020367 7358438 7569979 7657294 7626764 7485767
37641G485767k40073l19574l70618l87767l70722l24084k56384j78816j03417
$$ 7485767 7245694 6926120 6555502 6167735 5797013 5472929 5216545 5037729 4934312
37632D934312m1327j622R786p868m8174r7968j42053j70426j83263j89768k02405
$$ 4934312 4892985 4891363 4901149 4893281 4845107 4747139 4605086 4434660 4251397 4061629 3859224
37621C859224k31782k85008l64599m64650n67432o46832o78483o48021n51728
$$ 3859224 3627442 3342434 2977835 2513185 1945753 1298921 620438 -27583 -579311
37612e79311l94247j90822K8380K22382L55337M13801M11663L79760L48980L37215
$$ -579311 -973558 -1164380 -1136000 -913618 -558281 -144480 267183 646943 995923 1333138
37602A333138L45107L60102L65812L52304L22140K88957K69388K73794L01883
$$ 1333138 1678245 2038347 2404159 2756463 3078603 3367560 3636948 3910742 4212625
37593D212625L45392L93750M36712M62403M55331L99537K86739J23648o7543k56873
$$ 4212625 4558017 4951767 5388479 5850882 6306213 6705750 6992489 7116137 7048594 6791721
37583F791721m18401n39434o22948o83679p41257q12837r06088j014221j115954
$$ 6791721 6373320 5833886 5210938 4527259 3786002 2973165 2067077 1052856 -63098
37574f3098j181606j182663j100810r33970o97912m22191j41336J14153L22633
$$ -63098 -1244704 -2427367 -3528177 -4462147 -5160059 -5582250 -5723586 -5609433 -5286800
37565e286800M72210N61059N97453N96090N69841N22578M49956L48096K22363
$$ -5286800 -4814590 -4253531 -3656078 -3059988 -2490147 -1967569 -1517613 -1169517 -947154
37556i47154Q8334l5448j35430k03803k31797k03759j00578Q8213L53460O65414
$$ -947154 -858820 -894268 -1029698 -1233501 -1465298 -1669057 -1769635 -1681422 -1327962 -662548
37546f62548R82405J261890J468246J577258J579146J479445J295446J048582
$$ -662548 319857 1581747 3049993 4627251 6206397 7685842 8981288 10029870
37538A0029870P57466M36983J04205k14833m85487o74097p60534p44670o43313
$$ 10029870 10787336 11224319 11328524 11113691 10628204 9954107 9193573 8448903 7805590
37529G805590m81653k85062p3901J38604L45229N40414P15155Q55147R43787R67800
$$ 7805590 7323937 7038875 6964974 7103578 7448807 7989221 8704376 9559523 10503310 11471110
37519A1471110R21581Q08456O39342M30079J98443l8440k65968m73870o58287
$$ 11471110 12392691 13201147 13840489 14270568 14469011 14430571 14164603 13690733 13032446
37510A3032446q23054r77593j130460j280883j413623j501666j517030j444480
$$ 13032446 12209392 11231799 10101339 8820456 7406833 5905167 4388137 2943657
37502B943657j289999j078381q42068o09496m00369k27735j00567k1950J5541
$$ 2943657 1653658 575277 -266791 -876287 -1276656 -1504391 -1604958 -1626908 -1611367
37493a611367L1805N4791J10384K10818L47553M93391O13504O78636O72856N94696
$$ -1611367 -1579562 -1524771 -1414387 -1203569 -856016 -362625 250879 929515 1602371 2197067
37483B197067M56586K85149J18098o770o6477o1259j1006N5586J10936J34717
$$ 2197067 2653653 2938802 3056900 3050130 2983653 2922394 2911388 2966974 3077910 3212627
37473C212627J18209O7442J973n2583p5061n5890K734R1616J98907L10679M09784
$$ 3212627 3330836 3398278 3400251 3347668 3272607 3216717 3219451 3311067 3509974 3820653 4230437
37462D230437M77664N00329M73955M04611L02459J76281L2916j19981k72629m15628
$$ 4230437 4708101 5208430 5682385 6086996 6389455 6565736 6598652 6478671 6206042 5790414
37452E790414n44065o59328p66755q70325r67770j049290j100714j109167j067776
$$ 5790414 5246349 4587021 3820266 2949941 1982171 932881 -167833 -1277000 -2344776
37443b344776r76901q41776o68879m64372k35821N085K42319M58306O36940P64769
$$ -2344776 -3321677 -4163453 -4832332 -5296704 -5532525 -5527440 -5285121 -4826815 -4189875 -3425106
37433c425106Q31945Q35304P82308O91827N89364M98343M31574L87194L51996
$$ -3425106 -2593161 -1757857 -975549 -283722 305642 803985 1235559 1622753 1974749
37424A974749L11475K60431K06369J63167J40711J38969J49938J64299J76907
$$ 1974749 2286224 2546655 2753024 2916191 3056902 3195871 3345809 3510108 3687015
37415C687015J87451J96766K02767K00031J83090J49353R8276K8965n8831j59032
$$ 3687015 3874466 4071232 4273999 4474030 4657120 4806473 4904749 4933714 4874883 4715851
37405D715851k54189l17693l24368k63291j44421N253J53187K72939L50348L83559
$$ 4715851 4461662 4143969 3819601 3556310 3411889 3417142 3570329 3843268 4193616 4577175
37395D577175L79338L47718K96667K29755J49132O1269k0750q1615j10871j06318
$$ 4577175 4956513 5304231 5600898 5830653 5979785 6041054 6020304 5938689 5827818 5721500
37385E721500p1945j4202N8858J34722J93199K08220J57602L6824j33021l10549
$$ 5721500 5649555 5635353 5694211 5828933 6022132 6230352 6387954 6424778 6291757 5981208
37375E981208m50282n20147n11913m42382l46393k64119k27292k50206l28064
$$ 5981208 5530926 5010779 4498866 4056484 3710091 3445972 3218680 2968474 2640410
37366B640410m40399n56608o43842o77014o47016n62312m43722l16697k04352
$$ 2640410 2200011 1643403 999561 322547 -324469 -886781 -1330503 -1647200 -1851552
37357a851552j21921p3209n0927m1115k9388o546K6903N8501O6928L2015n2712
$$ -1851552 -1973473 -2046682 -2097609 -2138724 -2168112 -2174658 -2147755 -2089254 -2022326 -1990311 -2043023
37346b043023j73572l01887m07752m72861m93889m75981m24247l41987k36394
$$ -2043023 -2216595 -2518482 -2926234 -3399095 -3892984 -4368965 -4793212 -5135199 -5371593
37337e371593j23603k4976M4457Q6279J19648J72611K69159M17763O05341P99682
$$ -5371593 -5495196 -5520172 -5475715 -5389436 -5269788 -5097177 -4828018 -4410255 -3804914 -3005232
37327c005232R60842J056380J071111J005643Q67463O64333M05337J06038k09313
$$ -3005232 -2044390 -988010 83101 1088744 1956207 2620540 3025877 3131915 2922602
37318B922602n10807p68025r54256j050358j049683r61909q11647o30631m47732
$$ 2922602 2411795 1643770 689514 -360844 -1410527 -2372436 -3184083 -3814714 -4262446
37309d262446k83189j49434n5087o391l787l6680q1828j08386q8160o272J33065
$$ -4262446 -4545635 -4695069 -4750156 -4756547 -4760334 -4797014 -4878842 -4987228 -5075388 -5081660 -4948595
37298d948595L08881M92851O60405P96961Q96688R57167R76035R52558Q90996
$$ -4948595 -4639714 -4146863 -3486458 -2689497 -1792809 -835642 140393 1092951 1983947
37289A983947Q00748O92131N72300M45816L18479J98572R2907K167p8232j51724
$$ 1983947 2784695 3476826 4049126 4494942 4813421 5011993 5104900 5107067 5028835 4877111
37279D877111k15035k58522k71372k47316j88484j07203k4950L3099M7095J0555
$$ 4877111 4662076 4403554 4132182 3884866 3696382 3589179 3564229 3597328 3644423 3654978
37269C654978o7589j67695k66666l42608l75954l50730k59346j08926P6768K62959
$$ 3654978 3587389 3419694 3153028 2810420 2434466 2083736 1824390 1715464 1792232 2055191
37259B055191M13865N00853N06191M24060K61067L5466k26560m97069p51767r72067
$$ 2055191 2469056 2969909 3476100 3900160 4161227 4196693 3970133 3473064 2721297 1749230
37249A749230j144447j260321j318302j327003j304407j271752j244462j224991
$$ 1749230 604783 -655538 -1973840 -3300843 -4605250 -5877002 -7121464 -8346455
37241h346455j201730j155220j069541r43068p91653o41348n15592m25956l70954
$$ -8346455 -9548185 -10703405 -11772946 -12716014 -13507667 -14149015 -14664607 -15090563 -15461517
37232a5461517l39759l15165k74992j95387n7338J46982M11714P18060J035645
$$ -15461517 -15801276 -16116441 -16391433 -16586820 -16644158 -16497176 -16085462 -15367402 -14331757
37223a4331757J325431J548112J677703J712009J669908J575120J438129J250526
$$ -14331757 -13006326 -11458214 -9780511 -8068502 -6398594 -4823474 -3385345 -2134819
37215b134819R96097O70335K94582q4644m11021o39786p53061p60971o89303n62589
$$ -2134819 -1138722 -468387 -173805 -258449 -669470 -1309256 -2062317 -2823288 -3512591 -4075180
37205d075180l93315j82722O9388L53313O43996R04812J099354J206111J228811
$$ -4075180 -4468495 -4651217 -4581829 -4228516 -3584520 -2679708 -1580354 -374243 854568
37196H54568J195651J145805J109209J091205J071393J017228R04137P30940N23047
$$ 854568 2050219 3196024 4305233 5396438 6467831 7485059 8389196 9120136 9643183
37187I643183L22510J69773Q5629O2129O7276O1018J2918q9096k42119m37035
$$ 9643183 9965693 10135466 10221095 10283224 10350500 10411518 10424436 10335340 10093221 9656186
37177I656186o62832r03928j137152j335592j478214j557340j578223j552412
$$ 9656186 8993354 8089426 6952274 5616682 4138468 2581128 1002905 -549507
37169e49507j490773j400233j284338j145539r87346q15519o38623m68452l19890
$$ -549507 -2040280 -3440513 -4724851 -5870390 -6857736 -7673255 -8311878 -8780330 -9100220
37160i100220k08942j48079j40408j76189k35380k96046l43174l70377l73069
$$ -9100220 -9309162 -9457241 -9597649 -9773838 -10009218 -10305264 -10648438 -11018815 -11391884
37151a1391884l40862k59165j20455O5493K73086M73266O46247P85829Q94617
$$ -11391884 -11732746 -11991911 -12112366 -12046873 -11773787 -11300521 -10654274 -9868445 -8973828
37142h973828R75178J022684J023815R64408Q42376O75930M98625L43202K25689
$$ -8973828 -7998650 -6975966 -5952151 -4987743 -4145367 -3469437 -2970812 -2627610 -2401921
37133b401921J40065O4659k5611j47190k99675m64069o09024p03423p29539o89904
$$ -2401921 -2261856 -2197197 -2222808 -2369998 -2669673 -3133742 -3742766 -4446189 -5175728 -5865632
37123e865632o03707m94692l78306k57471j29518L099J29046K34197L10548L59813
$$ -5865632 -6469339 -6964031 -7342337 -7599808 -7729326 -7726227 -7597181 -7362984 -7052436 -6692623
37113f692623L90785M14621M40605M72170N03922N22507N12759M66352L88020
$$ -6692623 -6301838 -5887217 -5446612 -4974442 -4470520 -3948013 -3435254 -2968902 -2580882
37104b580882K95471K12524J58736J41243J53262J79381K03671K16269K15834
$$ -2580882 -2285411 -2072887 -1914151 -1772908 -1619646 -1440265 -1236594 -1020325 -804491
37095h04491K07648J99107J95753J99825K10130K21441K24531K10128J76259J32797
$$ -804491 -596843 -397736 -201983 -2158 207972 429413 653944 864072 1040331 1173128
37085A173128R7216Q3106Q9856J01772R7715O4465M550o6137j27706j65245j72710
$$ 1173128 1270344 1353450 1443306 1545078 1642793 1707258 1711808 1645671 1517965 1352720 1180010
37074A180010j52279j11679o0882r383L3986N8883N2750N418q3110j98593l16686
$$ 1180010 1027731 916052 855170 845787 879773 938656 991406 996824 913714 715121 398435
37063C98435m12302m67276m72630m27443l38068k18064q5811M1522J53788K47987
$$ 398435 -13867 -481143 -953773 -1381216 -1719284 -1937348 -2023159 -1981637 -1827849 -1579862
37053a579862L22724L73249L92546L76785L29220K59719J82163J12112O3769M4751
$$ -1579862 -1257138 -883889 -491343 -114558 214662 474381 656544 768656 832425 877176
37043H77176N0887O6198P0619N1769J2947k8039m8158l0631K7041J11422J98983
$$ 877176 928063 994261 1064880 1116649 1129596 1101557 1053399 1022768 1049809 1161231 1360214
37032A360214K67956L09965L32541L49940L70808L94546M18618M47746M95823
$$ 1360214 1628170 1938135 2270676 2620616 2991424 3385970 3804588 4252334 4748157
37023D748157N80272P14014Q98348J117486J337011J510153J591972J555743J403745
$$ 4748157 5328429 6042443 6940791 8058277 9395288 10905441 12497413 14053156 15456901
37014A5456901J167104Q93770O28779L95967J91886l896k09162m24195o30786
$$ 15456901 16624005 17517775 18146554 18542521 18734407 18730511 18521349 18097154 17466368
37005A7466368q02640r17604r64879r47292q80715p90257p02288o34872n91894
$$ 17466368 16663728 15746124 14781245 13833953 12953238 12162981 11460693 10825821 10233927
36996A0233927n63718n32973m82796m05469l08598k14822j53553j48625k08375
$$ 10233927 9670209 9137236 8654440 8248971 7940373 7725551 7571998 7423373 7214998
36987G214998l22300m64563o02757p09225p70029p85877p63790p05935o05374
$$ 7214998 6892698 6428135 5825378 5116153 4346124 3560247 2796457 2090522 1485148
36978A485148m53241k51298j8708K13235M13743N62420O50781O77997O46741N62130
$$ 1485148 1031907 780609 761901 975136 1388879 1951299 2602080 3280077 3926818 4488948
36968D488948M33068K74154J06550m3919j51956j99878j84004j18167l2179L6675
$$ 4488948 4922016 5196170 5302720 5258801 5106845 4906967 4722963 4604796 4572617 4609292
36958D609292N7536J8191p2385j92034l16452m25216n02154n35479n21384m68486
$$ 4609292 4666828 4685019 4612634 4420600 4104148 3678932 3176778 2641299 2119915 1651429
36948A651429l96869l28926k76497k33616j81179j00726J2728J47450K81451L92195
$$ 1651429 1254560 925634 649137 415521 234342 133616 146344 293794 575245 967440
36938I67440M63207M86224M60667L92351K91882J72811M9706o3459j54681k15452
$$ 967440 1430647 1916871 2377538 2769889 3061771 3234582 3284288 3220829 3066148 2850696
36928B850696k42611k39859k17592j89946j69841j64829j76693k05003k51202
$$ 2850696 2608085 2368226 2150634 1960688 1790847 1626018 1449325 1244322 993120
36919I93120l18619m07666n10814o12918o97400p52707p73791p59183p09005o26339
$$ 993120 674501 266835 -243979 -856897 -1554297 -2307004 -3080795 -3839978 -4548983 -5175322
36909e175322n18629l94817k60149j15618L4952J76864K85487L37880L26146K62392
$$ -5175322 -5693951 -6088768 -6348917 -6464535 -6429583 -6252719 -5967232 -5629352 -5303206 -5040814
36899e040814J73515R0847L9279K8349M8476P5790Q3604N2863k4040j43890k92492
$$ -5040814 -4867299 -4776452 -4737173 -4708824 -4660348 -4584558 -4500954 -4448091 -4472131 -4616021 -4908513
36888d908513m43655n62283o13939n76354m45979k36567K7564L18520O09027Q74509
$$ -4908513 -5352168 -5914451 -6528390 -7104744 -7550723 -7787290 -7759726 -7441206 -6832179 -5957670
36878e957670J095623J261346J369419J422145J420792J364514J255128J103310
$$ -5957670 -4862047 -3600701 -2231282 -809137 611655 1976169 3231297 4334607
36870D334607R30629P65446O34211N52165N19151N24402N56760O10676O82325
$$ 4334607 5265236 6030682 6664893 7217058 7736209 8260611 8817371 9428047 10110372
36861A0110372P61383Q29050Q65622Q60500Q15687P40614O43031N22504L70748
$$ 10110372 10871755 11700805 12566427 13426927 14242614 14983228 15626259 16148763 16519511
36852A6519511J78601n4993l18179n88502q40373j052995j214811j322411j374807
$$ 16519511 16698112 16643119 16324940 15736438 14896065 13843070 12628259 11305848 9931041
36843I931041j367564j292186j141973r19729o41549l34860l2802K32486M35244
$$ 9931041 8563477 7271291 6129318 5209589 4568040 4233180 4200378 4432864 4868108
36834D868108N57910N89379N24216L67638J43932j01256l12046m42923m76293
$$ 4868108 5426018 6015397 6539613 6907251 7051183 6949927 6637881 6194958 5718665
36825E718665m26814l31575k33169j64385j40553j60424k11873k77426l38023
$$ 5718665 5291851 4960276 4727107 4562722 4422169 4261745 4049872 3772446 3434423
36816C434423l76728l82934l53836k90568j92573n7757J09351K88950M46737N45892
$$ 3434423 3057695 2674761 2320925 2030357 1837784 1780027 1889378 2178328 2625065 3170957
36806C170957N62052M91692L50987J68697k2478j93908l27766m21108m85473n41187
$$ 3170957 3733009 4224701 4575688 4744385 4721907 4527999 4200233 3779125 3293652 2752465
36796B752465o07682o93620p91533q80206r34201r35615q81769p85330o68523
$$ 2752465 2144783 1451163 659630 -220576 -1154777 -2090392 -2972161 -3757491 -4426014
36787d426014n56312m71980m34100m52184n21424o21156p20976p92485q19624
$$ -4426014 -4982326 -5454306 -5888406 -6340590 -6862014 -7483170 -8204146 -8996631 -9816255
36778i816255q01770p49502o77108n96112n12382m27834l45517k73813k24794
$$ -9816255 -10618025 -11367527 -12044635 -12640747 -13153129 -13580963 -13926480 -14200293 -14425087
36769a4425087k06186k12780k24738k15065j61723n7467Q7262K49230M02321N27559
$$ -14425087 -14631273 -14844053 -15068791 -15283856 -15445579 -15503046 -15415784 -15166554 -14764233 -14236674
36759a4236674O18245O78936P20700P55744P92716Q33331Q72092Q99954R08991
$$ -14236674 -13618429 -12939493 -12218793 -11463049 -10670333 -9837002 -8964910 -8064956 -7155965
36750g155965Q93791Q49020P67336O41669M71377K68605O1535j07746j92211j54885
$$ -7155965 -6262174 -5413154 -4645818 -4004149 -3532772 -3264167 -3202632 -3310378 -3502589 -3657474
36740c657474J5838K99115O47700J003332J311930J531617J634573J608606J460717
$$ -3657474 -3641636 -3342521 -2694821 -1691489 -379559 1152058 2786631 4395237 5855954
36731E855954J218176R21891O13716L25244P3532j37598l14394m69015o13399
$$ 5855954 7074130 7996021 8609737 8934981 9008513 8870915 8556521 8087506 7474107
36722G474107p52929q84144r97928j084708j137267j150500j120554j045213r25168
$$ 7474107 6721178 5837034 4839106 3754398 2617131 1466631 346077 -699136 -1624304
36713a624304p65382n76743l77836j94611n5029K1183L2375k714n2737q6993q6219
$$ -1624304 -2389686 -2966429 -3344265 -3538876 -3593905 -3572722 -3540347 -3543061 -3595798 -3682791 -3769010
36702c769010m5934K6560J17100K08279K82332L25642L34608L18384K94145K76961
$$ -3769010 -3814944 -3788384 -3671284 -3463005 -3180673 -2855031 -2520423 -2202039 -1907894 -1630933
36692a630933K72417K78164K91945L17792L65201M42960N52218O81237Q02923
$$ -1630933 -1358516 -1080352 -788407 -470615 -105414 337546 889764 1571001 2373924
36683B373924Q77857Q65986P45021N25527K50925k0107k37829l76557m34329m23820
$$ 2373924 3251781 4117767 4862788 5388315 5639240 5619133 5381304 5004747 4570418 4146598
36673D146598l64278k77023j81184q9235o016O7407J29682J79284K16941K44935
$$ 4146598 3782320 3505297 3324113 3234878 3228862 3296269 3425951 3605235 3822176 4067111
36663D067111K62221K60417K25992J48276K7887j20147k70339l95304m74662n00747
$$ 4067111 4329332 4589749 4815741 4964017 4991904 4871757 4601418 4206114 3731452 3230705
36653C230705m79637m27426l63771l06442k69846k66240l04553l84719m92183
$$ 3230705 2751068 2323642 1959871 1653429 1383583 1117343 812790 428071 -64112
36644f4112o00209o81355p20851p22180p01840o78257o62791o56893o53979o42459
$$ -64112 -664321 -1345676 -2066527 -2788707 -3490547 -4168804 -4831595 -5488488 -6142467 -6784926
36634f784926o08702n41189m35803k99043j45538R398J57110K97977M38037N82519
$$ -6784926 -7393628 -7934817 -8370620 -8669663 -8815201 -8805803 -8648693 -8350716 -7912679 -7330160
36624g330160P30225Q71798R92577J077395J113578J091275J004045Q52150O46455
$$ -7330160 -6599935 -5728137 -4735560 -3658165 -2544587 -1453312 -449267 402883 1049338
36615A049338M08215J62826o9158k78159m64947o33054p78746q86563r36209r17575
$$ 1049338 1457553 1620379 1551221 1273062 808115 175061 -603685 -1490248 -2426457 -3344032
36605c344032q41953p39139o42086n70876n26315m94125m53523l84644k73350
$$ -3344032 -4185985 -4925124 -5567210 -6138086 -6664401 -7158526 -7612049 -7996693 -8270043
36596h270043j14892Q2519K95487M87993O21240O67860O22505N02064L36648J59054
$$ -8270043 -8384935 -8302416 -8006929 -7518936 -6897696 -6229836 -5607331 -5105267 -4768619 -4609565
36586d609565n85j15167j61214j23717l777J77095L81506N68702P07753P83502
$$ -4609565 -4610150 -4725317 -4886531 -5010248 -5014025 -4836930 -4455424 -3886722 -3178969 -2395467
36576b395467P93791P43303O39950M95227L26007J55160R423q6344j17724q8040
$$ -2395467 -1601676 -858373 -218423 276804 602811 757971 767394 681050 563326 475286
36566D75286j9047N6873J08525J14858O7901k8285j59340l02831m32891n27476
$$ 475286 456239 513112 621637 736495 804396 776111 616771 313940 -118951 -646427
36556f46427n75296n79207n54920n25709n14293n34032n83533o48139p07810p46160
$$ -646427 -1221723 -1800930 -2355850 -2881559 -3395852 -3929884 -4513417 -5161556 -5869366 -6615526
36546f615526p54915p32427o79734n98848m94321l74495k48499j20349J3326J57544
$$ -6615526 -7370441 -8102868 -8782602 -9381450 -9875771 -10250266 -10498765 -10619114 -10605788 -10448244
36536a0448244L09082M51424N59299O09095N87962M98086L56627J92217L7774
$$ -10448244 -10139162 -9687738 -9128439 -8519344 -7931382 -7433296 -7076669 -6884452 -6846678
36527f846678p9063j43819j56969j29166p3820k072P7916J59199K34786K98266
$$ -6846678 -6925741 -7069560 -7226529 -7355695 -7429515 -7431587 -7353671 -7194472 -6959686 -6661420
36517f661420L46006L79714M07005M37320M73941N08253N23149N04733M53002
$$ -6661420 -6315414 -5935700 -5528695 -5091375 -4617434 -4109181 -3586032 -3081299 -2628297
36508b628297L82626L13826K60686K23963J91126J43136O5101m4684j72738k96148
$$ -2628297 -2245671 -1931845 -1671159 -1447196 -1256070 -1112934 -1047833 -1092517 -1265255 -1561403
36498a561403l90996m38085m25545l51479k27531p9471N9362J60115K08572K07195
$$ -1561403 -1952399 -2390484 -2816029 -3167508 -3395039 -3474510 -3415148 -3255033 -3046461 -2839266
36488b839266J69721J13859N6137Q918k1423l4671l4820k7362j7486r620q037
$$ -2839266 -2669545 -2555686 -2499549 -2490631 -2512054 -2546725 -2581545 -2608907 -2626393 -2636013 -2644050
36477b644050j8340m8315j05566j91797k98246m06626m95010n44425n44121m95761
$$ -2644050 -2662390 -2710705 -2816271 -3008068 -3306314 -3712940 -4207950 -4752375 -5296496 -5792257
36467e792257m15080l27469k57332k17026k01859j92768j63794r0878M0849K33486
$$ -5792257 -6207337 -6534806 -6792138 -7009164 -7211023 -7403791 -7567585 -7658463 -7617614 -7384128
36457g384128M76895P51200J028767J275971J457341J543039J516908J380581
$$ -7384128 -6907233 -6156033 -5127266 -3851295 -2393954 -850915 665993 2046574
36449B046574J150894Q52274N08786J40186k36932o04561r38129j204309j365747
$$ 2046574 3197468 4049742 4558528 4698714 4461782 3857221 2919092 1714783 349036
36440C49036j393331j279880j045797p32873l91511o9203J96829L83932M85302
$$ 349036 -1044295 -2324175 -3369972 -4102845 -4494356 -4563559 -4366730 -3982798 -3497496
36431c497496N06921M61510L63237K25423O0296j20271l03044m71721o07890o95569
$$ -3497496 -2990575 -2529065 -2165828 -1940405 -1880109 -2000380 -2303424 -2775145 -3383035 -4078604
36421d078604p26581p02802o34357n35582m21211l04041j94077r8062j8493M7118
$$ -4078604 -4805185 -5507987 -6142344 -6677926 -7099137 -7403178 -7597255 -7695317 -7713810 -7666692
36411g666692J04658J59084K09910K49860K67822K54332K06130J26694K2426j01317
$$ -7666692 -7562034 -7402950 -7193040 -6943180 -6675358 -6421026 -6214896 -6088202 -6065776 -6167093
36401f167093k39026l78974m99847n76692n92815n47061m50573l17525j58511
$$ -6167093 -6406119 -6785093 -7284940 -7861632 -8454447 -9001508 -9452081 -9769606 -9928117
36392i928117J9984K12652M12350O08213P85213R25741J012921J034856R89327
$$ -9928117 -9908133 -9695481 -9283131 -8674918 -7889705 -6963964 -5951043 -4916187 -3926860
36383c926860Q88319P59727O41927N70528N63317O13069O92712P68197Q09336
$$ -3926860 -3038541 -2278814 -1636887 -1066359 -503042 110027 802739 1570936 2380272
36374B380272P94027P09642N57238L57048J47247k8379j37863j72154j44430q1231
$$ 2380272 3174299 3883941 4441179 4798227 4945474 4917095 4779232 4607078 4462648 4381417
36364D381417j2653L4707M2230K140q1258j92606l08715m02938m49253m25882
$$ 4381417 4368764 4403471 4445701 4447841 4366583 4173977 3865262 3462324 3013071 2587189
36354B587189l19593j30773J23469M11584O95070R37381J110836J200402J203934
$$ 2587189 2267596 2136823 2260292 2671876 3366946 4304327 5415163 6615565 7819499
36345G819499J128765R86886P93116N67337L35668J25073m6812j78549k82606
$$ 7819499 8948264 9935150 10728266 11295603 11631271 11756344 11709532 11530983 11248377
36336A1248377l75744m68455n58965o33767o73907o64110o00766m95253l71164
$$ 11248377 10872633 10404178 9845213 9211446 8537539 7873429 7272663 6777410 6406246
36327F406246k56906j77315j48190j75215k55642l80573n37374p12013q90335
$$ 6406246 6149340 5972025 5823835 5648620 5392978 5012405 4475031 3763018 2872683
36318B872683j057285j195297j283843j301228j228956j059162q03019m94109
$$ 2872683 1815398 620101 -663742 -1964970 -3193926 -4253088 -5056107 -5550216
36310e550216j81713Q3185K60573L27389K79005J29670q8981l33864n59978p29813
$$ -5550216 -5731929 -5648744 -5388171 -5060782 -4781777 -4652107 -4741088 -5074952 -5634930 -6364743
36300f364743q20541q28392p68794o70285n62958m65844l78976k84489j57243
$$ -6364743 -7185284 -8013676 -8782470 -9452755 -10015713 -10481557 -10860533 -11145022 -11302265
36291a1302265J9985K45329M97139P43344R55153J118361J236780J325036J394137
$$ -11302265 -11282280 -11036951 -10539812 -9796468 -8841315 -7722954 -6486174 -5161138 -3767001
36282c767001J439809J442836J380493J239435J021588P43194M31215J19195j58454
$$ -3767001 -2327192 -884356 496137 1735572 2757160 3500354 3931569 4050764 3892310
36273C892310l73894n12521n75243n74322n24571m35871l12797j60990O672J70611
$$ 3892310 3518416 3005895 2430652 1856330 1331759 895888 583091 422101 428773 599384
36263E99384L11125M14730M75418M91116M59118L74369K32499L5794k02409m58393
$$ 599384 910509 1325239 1800657 2291773 2750891 3125260 3357759 3393553 3191144 2732751
36253B732751p02925r07174j048309j114891j109649j045640r36806p90604o09723
$$ 2732751 2029826 1122652 74343 -1040548 -2150197 -3195837 -4132643 -4923247 -5532970
$$ [...]
##END NTUPLES=NMR SPECTRUM
##END=
