##TITLE=31Pdec_DE-44_EA3_TFA
 DMSO-d6
 24 sc
 9.4.2024
##JCAMPDX= 6.0         $$ Bruker NMR JCAMP-DX V2.0
##DATA TYPE= NMR SPECTRUM
##DATA CLASS= NTUPLES
##ORIGIN= UXNMR, Bruker Analytische Messtechnik GmbH
##OWNER= root
$$ XWIN-NMR		Version 3.5
$$ Tue Apr  9 15:33:23 2024 Russian Standard Time (UT+4h)  she@DPX200
##.OBSERVE FREQUENCY= 81.013821
##.OBSERVE NUCLEUS= ^31P
##.ACQUISITION MODE= SIMULTANEOUS
##.ACQUISITION SCHEME= undefined
##.AVERAGES= 24
##.DIGITISER RES= 16
##SPECTROMETER/DATA SYSTEM= spect
##.PULSE SEQUENCE= zgpg30
##.SOLVENT NAME= CDCl3
##.SHIFT REFERENCE= (INTERNAL, CDCl3, 0, 248.564)
##AUDIT TRAIL= $$ (NUMBER, WHEN, WHO, WHERE, WHAT)
$$ ##TITLE= Audit trail, XWIN-NMR		Version 3.5
$$ ##JCAMPDX= 5.01
$$ ##ORIGIN= Bruker BioSpin GmbH
$$ ##OWNER= she
$$ F:/spectra/data/she/nmr/P31/1/pdata/1/auditp.txt
$$ ##AUDIT TRAIL=  $$ (NUMBER, WHEN, WHO, WHERE, WHAT)
(   1,<2024-04-09 15:32:15.37 +0400>,<she>,<DPX200>,
      <created by zg, POWCHK disabled, PULCHK disabled
       configuration hash MD5:
       00 E9 B6 7A A2 85 ED C7 34 08 36 98 17 FE 4E 26
       data hash MD5: 32K
       04 B4 BA 5F 54 49 B5 AE 4F 53 BD 24 07 A1 02 5E>)
(   2,<2024-04-09 15:32:22.07 +0400>,<she>,<DPX200>,
      <Start of raw data processing
       efp BC_mod = 2 LB = 10 FT_mod = 6 PKNL = 1 PHC0 = -13330.2 PHC1 = 64.08333 SI = 64K 
       data hash MD5: 64K
       60 27 B4 4C 84 E3 83 34 00 97 6C FF A2 A7 16 22>)
(   3,<2024-04-09 15:32:44.23 +0400>,<she>,<DPX200>,
      <pk PHC0 = -85.803 PHC1 = 471.9996 
       data hash MD5: 64K
       64 6A 36 9D 8D D7 F5 F1 6F 3C 95 D4 2F 70 9C 7A>)
(   4,<2024-04-09 15:32:47.04 +0400>,<she>,<DPX200>,
      <abs ABSG = 5 
       data hash MD5: 64K
       08 17 CC C1 99 DC 5B 30 9A 79 60 AA 37 76 41 87>)
$$ ##END=
$$ 
$$ hash MD5
$$ D2 AA 32 67 77 31 1F F8 A7 03 72 33 6E EF D2 D7
##$RELAX= 
##$RELAX= 
##$RELAX= 
##$RELAX= 
##$RELAX= 
##$RELAX= 
##$RELAX= 
##$RELAX= 
##$RELAX= 
$$ Bruker specific parameters
$$ --------------------------
##$DU= <F:/spectra>
##$EXPNO= 1
##$NAME= <P31>
##$PROCNO= 1
##$TYPE= <nmr>
##$USER= <she>
##$AMP= (0..31)
100 100 100 100 100 100 100 100 100 100 100 100 100 100 100 100 100 100 
100 100 100 100 100 100 100 100 100 100 100 100 100 100 
##$AQSEQ= 0
##$AQ_mod= 1
##$AUNM= <au_zg>
##$AUTOPOS= <>
##$BF1= 81.014009
##$BF2= 200.13
##$BF3= 200.13
##$BF4= 200.13
##$BF5= 200.13
##$BF6= 200.13
##$BF7= 200.13
##$BF8= 200.13
##$BYTORDA= 1
##$CFDGTYP= 0
##$CFRGTYP= 5
##$CHEMSTR= <none>
##$CNST= (0..31)
1 1 145 1 1 1 1 1 1 1 1 1 1 1 1 1 1 1 1 1 1 1 1 1 1 1 1 1 1 1 1 1 
##$CPDPRG= <waltz16>
##$CPDPRG1= <>
##$CPDPRG2= <waltz16>
##$CPDPRG3= <>
##$CPDPRG4= <mlev>
##$CPDPRG5= <mlev>
##$CPDPRG6= <mlev>
##$CPDPRG7= <mlev>
##$CPDPRG8= <mlev>
##$CPDPRGB= <>
##$CPDPRGT= <>
##$D= (0..31)
0 1 0 0 0 0 0 0 0 0 0 0.03 2e-05 3e-06 0 0 0 0 0 0 0 0 0 0 0 0 0 0 0 0 
0 0 
##$DATE= 1712662334
##$DBL= (0..7)
120 120 120 11 120 120 24 19 
##$DBP= (0..7)
150 150 150 150 150 150 150 150 
##$DBP07= 0
##$DBPNAM0= <>
##$DBPNAM1= <>
$$ [...]
##$SUBNAM3= <"">
##$SUBNAM4= <"">
##$SUBNAM5= <"">
##$SUBNAM6= <"">
##$SUBNAM7= <"">
##$SUBNAM8= <"">
##$SUBNAM9= <"">
##$SW= 501.771253377433
##$SWIBOX= (0..15)
0 1 3 0 0 0 0 0 0 0 0 0 0 0 0 0 
##$SW_h= 40650.406504065
##$TD= 32768
##$TD0= 1
##$TE= 0
##$TE2= 300
##$TE3= 300
##$TEG= 300
##$TL= (0..7)
0 120 53 12 22 120 120 120 
##$TP= (0..7)
150 150 150 150 150 150 150 150 
##$TP07= 0
##$TPNAME0= <>
##$TPNAME1= <>
##$TPNAME2= <>
##$TPNAME3= <>
##$TPNAME4= <>
##$TPNAME5= <>
##$TPNAME6= <>
##$TPNAME7= <>
##$TPOAL= (0..7)
0.5 0.5 0.5 0.5 0.5 0.5 0.5 0.5 
##$TPOFFS= (0..7)
0 0 0 0 0 0 0 0 
##$TUNHIN= 0
##$TUNHOUT= 0
##$TUNXOUT= 0
##$USERA1= <user>
##$USERA2= <user>
##$USERA3= <user>
##$USERA4= <user>
##$USERA5= <user>
##$V9= 5
##$VALIST= <valist>
##$VCLIST= <CCCCCCCCCCCCCCC>
##$VD= 0
##$VDLIST= <DDDDDDDDDDDDDDD>
##$VPLIST= <PPPPPPPPPPPPPPP>
##$VTLIST= <TTTTTTTTTTTTTTT>
##$WBST= 1024
##$WBSW= 4
##$XGAIN= (0..3)
0 0 0 0 
##$XL= 0
##$YL= 0
##$YMAX_a= 2933
##$YMIN_a= -1135
##$ZGOPTNS= <>
##$ZL1= 120
##$ZL2= 120
##$ZL3= 120
##$ZL4= 120
##$ABSF1= 248.5645
##$ABSF2= -253.2056
##$ABSG= 5
##$ABSL= 3
##$ALPHA= 0
##$AQORDER= 0
##$ASSFAC= 0
##$ASSFACI= 0
##$ASSFACX= 0
##$ASSWID= 0
##$AUNMP= <proc_1d>
##$AZFE= 0.1
##$AZFW= 0.5
##$BCFW= 0
##$BC_mod= 2
##$BYTORDP= 0
##$COROFFS= 0
##$CY= -3
##$DATMOD= 1
##$DC= 0
##$DFILT= <>
##$DTYPP= 0
##$F1P= 0
##$F2P= 0
##$FCOR= 1
##$FTSIZE= 65536
##$FT_mod= 6
##$GAMMA= 0
##$GB= 0
##$INTBC= 1
##$INTSCL= 6.047779e-11
##$ISEN= 30
##$LB= 10
##$LEV0= 0
##$LPBIN= 0
##$MAXI= 10000
##$MC2= 0
##$MEAN= 0
##$ME_mod= 0
##$MI= 50
##$NCOEF= 0
##$NC_proc= -11
##$NLEV= 6
##$NOISF1= 182.463
##$NOISF2= 159.3651
##$NSP= 0
##$NTH_PI= 0
##$NZP= 0
##$OFFSET= 248.5645
##$PC= 4
##$PHC0= -13416
##$PHC1= 536.0829
##$PH_mod= 1
##$PKNL= yes
##$PPARMOD= 0
##$PSCAL= 0
##$PSIGN= 0
##$REVERSE= no
##$SF= 81.0140089999694
##$SI= 65536
##$SIGF1= 159.3651
##$SIGF2= -187.1042
##$SINO= 113.3802
##$SIOLD= 16384
##$SREGLST= <1H.CDCl3>
##$SSB= 0
##$STSI= 65536
##$STSR= 0
##$SW_p= 40650.406504065
##$SYMM= 0
##$S_DEV= 0
##$TDeff= 32768
##$TDoff= 0
##$TI= <>
##$TILT= no
##$TM1= 0
##$TM2= 0
##$TOPLEV= 0
##$USERP1= <user>
##$USERP2= <user>
##$USERP3= <user>
##$USERP4= <user>
##$USERP5= <user>
##$WDW= 1
##$XDIM= 65536
##$YMAX_p= 283325424
##$YMIN_p= -88986411
$$ End of Bruker specific parameters
$$ ---------------------------------
##NTUPLES= NMR SPECTRUM
##VAR_NAME=  FREQUENCY,     SPECTRUM/REAL,   SPECTRUM/IMAG
##SYMBOL=    X,             R,               I
##VAR_TYPE=  INDEPENDENT,   DEPENDENT,       DEPENDENT
##VAR_FORM=  AFFN,          ASDF,            ASDF
##VAR_DIM=   65536,         65536,           65536
##UNITS=     HZ,            ARBITRARY UNITS, ARBITRARY UNITS
##FACTOR=    0.620285442955139, 1,           1
##FIRST=     20137.2065510682, 0,            0
##LAST=      -20513.1999529968, 0,           0
##MIN=       -20513.1999529968, -88986411,   0
##MAX=       20137.2065510682, 283325424,    0
$$ Real data points
##PAGE= N=1
##DATA TABLE= (X++(R..R)), XYDATA
$$ [...]
41316f615082Q41928J037202J276533J527515J767554J979193K138625K212474
41308F165942K169462J999276J723902J391286J053229P41928M62495K06324k8156
41299A5885688k27124l71492m53139m80980m73187m45252m04906l56127l06342
41290A2367139k69643k63598l02850l94370n36545p20216r29696j144172j340736
41281F465313j497202j591279j597314j488148j247524q86651m49815o42M02112
41272a891150P20764R37310J042186J028632Q99720O81001M25530K03595Q0960
41263D128548R6840K51598N06727P94218J032915J151152J110964R22346O37165
41254A0632473L24889M5000j68951l09277l83967m04920l81142l20020k34298
$$ plain form
41316 -6615082 -5773154 -4735952 -3459419 -1931904 -164350 1814843 3953468 6165942
41308 6165942 8335404 10334680 12058582 13449868 14503097 15245025 15707520 15913844 15885688
41299 15885688 15658564 15287072 14833933 14352953 13879766 13434514 13029608 12673481 12367139
41290 12367139 12097496 11833898 11531048 11136678 10600133 9879917 8950221 7806049 6465313
41281 6465313 4968111 3376832 1779518 291370 -956154 -1842805 -2292620 -2293262 -1891150
41272 -1891150 -1170386 -233076 809110 1837742 2737462 3418463 3843993 4047588 4128548
41263 4128548 4225388 4476986 4983713 5777931 6810846 7961998 9072962 9995308 10632473
41254 10632473 10957362 11002362 10833411 10524134 10140167 9735247 9354105 9034085 8799787
41245H799787j47686r2687j00698j90210l59328n85999q36374j077091j283775
41236D125939j441418j541470j582951j575141j532103j458925j345047j176993
41228g528109r60547p29277n30191l99687l47837l56483l87327l97104l56362
41219a1992924k62319j35919n103J11894K11829L01507L91788M95573O26785P95062
41209i461827R96981J211697J407898J559023J654872J700565J705331J671425
41201B445965J590606J448500J233653R47320O08743K51359q8440l82288o13815
41192G441603p76087q67251q87242q35146p07660n01005k17834J23447M83144
41183C255969Q04177J026742J108349J039174Q43524N65389K46098r2190m46961
$$ plain form
41245 8799787 8652101 8559414 8458716 8268506 7909178 7323179 6486805 5409714 4125939
41236 4125939 2684521 1143051 -439900 -2015041 -3547144 -5006069 -6351116 -7528109
41228 -7528109 -8488656 -9217933 -9748124 -10147811 -10495648 -10852131 -11239458 -11636562 -11992924
41219 -11992924 -12255243 -12391162 -12396265 -12284371 -12072542 -11771035 -11379247 -10883674 -10256889 -9461827
41209 -9461827 -8464846 -7253149 -5845251 -4286228 -2631356 -930791 774540 2445965
41201 2445965 4036571 5485071 6718724 7666044 8274787 8526146 8437706 8055418 7441603
41192 7441603 6665516 5798265 4911023 4075877 3368217 2867212 2649378 2772825 3255969
41183 3255969 4060146 5086888 6195237 7234411 8077935 8643324 8889422 8797232 8350271
41174H350271q21722j210875j594893j946484k238649k447807k554002k544392
41166g008553k421083k207211j944766j682889j461418j296542j174885j060047
41158b0257394r11375p07261m59079k04938J3344J73152K78959L55476M36803
41149b1282313N56897P38209R79143J251633J517759J755553J970749K181606
41141a0330764K389299K561259K644340K598622K424344K159864J853362J532091
41133G832417J191757Q09638L68651j22928o26239j085031j451616j708027j864914
41124C343708j939625j935894j846087j672395j443644j209176j014174q76896
41116h594183p84657p08120o19860n04654l60469j96450l0691J14791K21416K77710
$$ plain form
41174 8350271 7528549 6317674 4722781 2776297 537648 -1910159 -4464161 -7008553
41166 -7008553 -9429636 -11636847 -13581613 -15264502 -16725920 -18022462 -19197347 -20257394
41158 -20257394 -21168769 -21876030 -22335109 -22540047 -22526703 -22353551 -22074592 -21719116 -21282313
41149 -21282313 -20725416 -19987207 -19008064 -17756431 -16238672 -14483119 -12512370 -10330764
41141 -10330764 -7941465 -5380206 -2735866 -137244 2287100 4446964 6300326 7832417
41133 7832417 9024174 9833812 10202463 10079535 9453296 8368265 6916649 5208622 3343708
41124 3343708 1404083 -531811 -2377898 -4050293 -5493937 -6703113 -7717287 -8594183
41116 -8594183 -9378840 -10086960 -10706820 -11211474 -11571943 -11768393 -11799084 -11684293 -11462877 -11185167
41106a1185167K76686K13780R2248o9142k38157l83095m86993n50321n83181n96161
41096a3509503n95174n79266n40860m71792l76245k82807k42001l03189m82966
41087a7383803p49158j034897j272376j420610j471061j436097j334646j182187
41079b7284835r84161p32920m12088q874M72545J005908J549800K061739K509247
41070b1823639K870106L123589L243488L202478K986243K606288K101678J528730
41062a61039R44924L95464r0961m96535q05880j004278j084737j056549r46896
41053d306487p94675o41434n22966m62659m68182n33063o40890p67350q79411
41044a0017117r37425r04749p61176n10503j76465K09424O18626J027611J411257
$$ plain form
41106 -11185167 -10908481 -10694701 -10602453 -10671595 -10909752 -11292847 -11779840 -12330161 -12913342 -13509503
41096 -13509503 -14104677 -14683943 -15224803 -15696595 -16072840 -16355647 -16597648 -16900837 -17383803
41087 -17383803 -18132961 -19167858 -20440234 -21860844 -23331905 -24768002 -26102648 -27284835
41079 -27284835 -28268996 -29001916 -29414004 -29422878 -28950333 -27944425 -26394625 -24332886 -21823639
41070 -21823639 -18953533 -15829944 -12586456 -9383978 -6397735 -3791447 -1689769 -161039
41062 -161039 783885 1179349 1088388 591853 -214027 -1218305 -2303042 -3359591 -4306487
41053 -4306487 -5101162 -5742596 -6265562 -6728221 -7196403 -7729466 -8370356 -9137706 -10017117
41044 -10017117 -10954542 -11859291 -12620467 -13130970 -13307435 -13098011 -12479385 -11451774 -10040517
41035a0040517J735656J960384K053555K010631J861520J658028J449901J266669
41027C955827J115311R88962Q75160P58850O24735M64390K85527J14838j0814
41018I172786o0452k2104R3888K60453M43240O10735P43284Q36912Q97052R24414
41008A3900208R04549Q11690O24408L39941k2679m28739q36416j205000j503765
40999A2584197j719276j855631j926131j942976j914231j850388j772626j712103
40991b109165j697350j738733j822182j916149j984608j997506j936190j795577
40983a6997460j582266j306474r71344n69283r1650M53739J031242J582098K041873
40974a6409525K357376K493123K430827K172957J752686J237970P17829K77106
$$ plain form
41035 -10040517 -8304861 -6344477 -4290922 -2280291 -418771 1239257 2689158 3955827
41027 3955827 5071138 6060100 6935260 7694110 8318845 8783235 9068762 9183600 9172786
41018 9172786 9112334 9090230 9184118 9444571 9887811 10498546 11241830 12078742 12975794 13900208
41008 13900208 14804757 15616447 16240855 16580796 16558117 16129378 15292962 14087962 12584197
40999 12584197 10864921 9009290 7083159 5140183 3225952 1375564 -397062 -2109165
40991 -2109165 -3806515 -5545248 -7367430 -9283579 -11268187 -13265693 -15201883 -16997460
40983 -16997460 -18579726 -19886200 -20857544 -21426827 -21518477 -21064738 -20033496 -18451398 -16409525
40974 -16409525 -14052149 -11559026 -9128199 -6955242 -5202556 -3964586 -3246757 -2969651
40966b969651k1487j39956o4322J86369N48371R19529J191447J290951J204994
40957B146245R76095O74392L62850P2259k03141m88225p97609j111221j369646
40948B61999j492908j413268j105191n98886K6529O65215J213234J594129J773746
40939I24599J761586J602545J364624J123317R40936Q46419Q29025Q53443Q84953
40930A1131447R02783Q91978Q26655O66512L74703n5007n81676j122415j576735
40921A1458245j858079j918278j754275j395899q85989k69502M01613J058765
40913D836601J620075K011172K189132K151624J927030J554690J067024M81632
40905A7838980j92256r35780j704810k432759l052514l518765l811976l925085
$$ plain form
40966 -2969651 -2991138 -3131094 -3195416 -3009047 -2460676 -1541147 -349700 941251 2146245
40957 2146245 3122340 3796732 4159582 4231841 4028700 3540475 2742866 1631645 261999
40948 261999 -1230909 -2644177 -3749368 -4348254 -4321725 -3656510 -2443276 -849147 924599
40939 924599 2686185 4288730 5653354 6776671 7717607 8564026 9393051 10246494 11131447
40930 11131447 12034230 12926208 13752863 14419375 14794078 14739071 14157395 13034980 11458245
40921 11458245 9600166 7681888 5927613 4531714 3645725 3376223 3777836 4836601
40913 4836601 6456676 8467848 10656980 12808604 14735634 16290324 17357348 17838980
40905 17838980 17646724 16710944 15006134 12573375 9520861 6002096 2190120 -1734965
40897a734965l850721l583157l133343k544461j894853j281242p86309m48291
40889a9257342k54145j63090j42791j89775l19236n34903q04529j061169j230782
40880b3957762j267588j173110r86924p57988n17906k71890o979K93760O39959
40871b8006428J026012J424711J786422K051496K175614K153285K020032J828133
40863a3540723J612884J375134J092098P45906L47963n5880l99184o17374o67571
40854a0106747n39630k57424J27835N49676R41070J248542J441990J517174J490573
40845c586941J390399J248606J095386R52945Q26913P01442N46915L39792Q0192
40836C595649k07566m90948p46891r69284j167746j364611j590242j870890k209203
$$ plain form
40897 -1734965 -5585686 -9168843 -12302186 -14846647 -16741500 -18022742 -18809051 -19257342
40889 -19257342 -19511487 -19674577 -19817368 -20007143 -20326379 -20861282 -21665811 -22726980 -23957762
40880 -23957762 -25225350 -26398460 -27385384 -28143372 -28661278 -28933168 -28940147 -28646387 -28006428
40871 -28006428 -26980416 -25555705 -23769283 -21717787 -19542173 -17388888 -15368856 -13540723
40863 -13540723 -11927839 -10552705 -9460607 -8714701 -8366738 -8422618 -8821802 -9439176 -10106747
40854 -10106747 -10646377 -10903801 -10775966 -10226290 -9285220 -8036678 -6594688 -5077514 -3586941
40845 -3586941 -2196542 -947936 147450 1100395 1927308 2628750 3175665 3515457 3595649
40836 3595649 3388083 2897135 2150244 1180960 13214 -1351397 -2941639 -4812529 -7021732
40827g021732k568338k872291l025410k942649k578259j943220j106315j78148
40819b4236362P17283J473490K023852K348943K469879K432984K291872K092697
40811h385362J867584J637151J416288J215718J038911Q82059P41915O24910N46199
40802A585373N17210N33305N73211O08935O14767N68001M45726K27361r4084m99249
40792E080556r38312j339242j624315j728533j615342j285656p75970j45519N39965
40783c832368J218106J831684K329902K675163K851160K863767K733517K487320
40775A5158251K155002J767125J348966R14386M69909L0968l63238o53604p85910
40766B0041855p39662n40825k51979N1458L06211M78545N69057O02842O09839
$$ plain form
40827 -7021732 -9590070 -12462361 -15487771 -18430420 -21008679 -22951899 -24058214 -24236362
40819 -24236362 -23519079 -22045589 -20021737 -17672794 -15202915 -12769931 -10478059 -8385362
40811 -8385362 -6517778 -4880627 -3464339 -2248621 -1209710 -327651 414264 1039174 1585373
40802 1585373 2102583 2635888 3209099 3818034 4432801 5000802 5446528 5673889 5579805 5080556
40792 5080556 4142244 2803002 1178687 -549846 -2165188 -3450844 -4226814 -4372333 -3832368
40783 -3832368 -2614262 -782578 1547324 4222487 7073647 9937414 12670931 15158251
40775 15158251 17313253 19080378 20429344 21343730 21813639 21844607 21481369 20827765 20041855
40766 20041855 19302193 18761368 18509389 18560847 18867058 19345603 19914660 20517502 21127341
40757B1127341O07449N96181N67511N12958M25962L00136J33638n8636k36417
40748B3976123l42251l25877j68977J06076M46017P85268J063321J237667J291613
40739B8068980J234804J095343R07486P01084M95974L00897J15584o5269k48157
40730C2606726m37966o34529q27908r96861j116023j169453j159486j102655j017013
40721B4144832r12852p93574o62356n25913l92304k67872j59680q3104o6192j42618
40711B0138367l34534o36501j011997j405046j759673k035926k213978k286081
40703H454631k245620k085909j811995j454014j066405p10134m31195k50401j67028
40694a768070j67830k33609l42639m73687o09883p42234q70417r98245j124239
$$ plain form
40757 21127341 21734790 22330971 22898482 23411440 23837402 24137538 24271176 24212540 23976123
40748 23976123 23633872 23307995 23139018 23245094 23691111 24476379 25539700 26777367 28068980
40739 28068980 29303784 30399127 31306613 32007697 32503671 32804568 32920152 32854883 32606726
40730 32606726 32168760 31534231 30706323 29709462 28593439 27423986 26264500 25161845 24144832
40721 24144832 23231980 22438406 21776050 21250137 20857833 20589961 20430281 20347177 20280985 20138367
40711 20138367 19803833 19167332 18155335 16750289 14990616 12954690 10740712 8454631
40703 8454631 6209011 4123102 2311107 857093 -209312 -919446 -1350641 -1601042 -1768070
40694 -1768070 -1935900 -2169509 -2512148 -2985835 -3595718 -4337952 -5208369 -6206614 -7330853
40685g330853j234233j305273j320727j282137j202740j086197r12681o49291
40677a6324132k77425J86239O90242J166937J556961J829323J988790K064947
40669g118118K088123K069941K003413J878256J693455J457309J181978Q82307
40661F136664N77434K87380K4862k08006m12650n83815p07712p70492p67375p03458
40651B872832n88186m32392k50726o2576J15072K78097M37281O07143P90194R69319
40641D736058J112219J181416J142184R67631O45135J84685l77082r82748j566130
40632G043368k061395k407834k559422k502799k269417j923504j529819j128567
40624i339389p38478l78579q2018J11197J72132R5215j00630l77867o88558r82461
$$ plain form
40685 -7330853 -8565086 -9870359 -11191086 -12473223 -13675963 -14762160 -15674841 -16324132
40677 -16324132 -16601557 -16415318 -15725076 -14558139 -13001178 -11171855 -9183065 -7118118
40669 -7118118 -5029995 -2960054 -956641 921615 2615070 4072379 5254357 6136664
40661 6136664 6714098 7001478 7026340 6818334 6405684 5821869 5114157 4343665 3576290 2872832
40651 2872832 2284646 1852254 1601528 1538952 1654024 1932121 2369402 2976545 3766739 4736058
40641 4736058 5848277 7029693 8171877 9139508 9784643 9969328 9592246 8609498 7043368
40632 7043368 4981973 2574139 14717 -2488082 -4757499 -6681003 -8210822 -9339389
40624 -9339389 -10077867 -10456446 -10538464 -10427267 -10255135 -10159920 -10260550 -10638417 -11326975 -12309436
40614a2309436j213474j344516j353227j239404j030022p75184n31942l41194
40606b0138399k09514j08272O568J64972L63466N69266P43476Q65149R39820R90569
40596a5812899J042344J110853J198502J293872J373871J412035J392419J319210
40588e669793J211759J087311R46604P74502N52736K71045p2717m79767r53300
40579b331620j489673k062927k616430l071865l352722l409310l233350k858071
40571b4425968k345634j766997j182742o33896j44519K71750O09114Q69654J059512
40562b7689726J181153J230284J204280J118340J017076R69155J040411J254715
40554a8674312J566304J868362K041622K016282J807636J504630J223298J056202
$$ plain form
40614 -12309436 -13522910 -14867426 -16220653 -17460057 -18490079 -19265263 -19797205 -20138399
40606 -20138399 -20347913 -20456185 -20449617 -20284645 -19921179 -19351913 -18608437 -17743288 -16803468 -15812899
40596 -15812899 -14770555 -13659702 -12461200 -11167328 -9793457 -8381422 -6989003 -5669793
40588 -5669793 -4458034 -3370723 -2424119 -1649617 -1096881 -825836 -898553 -1378320 -2331620
40579 -2331620 -3821293 -5884220 -8500650 -11572515 -14925237 -18334547 -21567897 -24425968
40571 -24425968 -26771602 -28538599 -29721341 -30355237 -30499756 -30228006 -29618892 -28749238 -27689726
40562 -27689726 -26508573 -25278289 -24074009 -22955669 -21938593 -20969438 -19929027 -18674312
40554 -18674312 -17108008 -15239646 -13198024 -11181742 -9374106 -7869476 -6646178 -5589976
40546e589976J043066J169099J382459J617730J815508J934480J956207J883607
40538G212180J733646J527245J282335J013283P32981M51661J72916j06236l88387
40529A3631624o68148r31178j158429j329247j423156j427027j349078j228681
40521D116680j128082j105163j183275j338170j510592j635120j666548j589859
40513g040129j414317j162564q64039n52446k61852k0030J56140K58909K84294
40504a0616034K30493J03405p6128k71671m39540n40421n47756m51894k62673
40495a2872219j1035K52831M67568N75672N43367L78193J33515j06076k51769
40486a0889953k36005k8278L57236Q61711J394902J863540K202464K389074K433075
$$ plain form
40546 -5589976 -4546910 -3377811 -1995352 -377622 1437886 3372366 5328573 7212180
40538 7212180 8945826 10473071 11755406 12768689 13501670 13953331 14126247 14020011 13631624
40529 13631624 12963476 12032298 10873869 9544622 8121466 6694439 5345361 4116680
40521 4116680 2988598 1883435 700160 -638010 -2148602 -3783722 -5450270 -7040129
40513 -7040129 -8454446 -9617010 -10481049 -11033495 -11295347 -11315377 -11159237 -10900328 -10616034
40504 -10616034 -10385541 -10282136 -10358264 -10629935 -11069475 -11609896 -12157652 -12609546 -12872219
40495 -12872219 -12883254 -12630423 -12162855 -11587183 -11043816 -10665623 -10532108 -10638184 -10889953
40486 -10889953 -11125958 -11154236 -10797000 -9935289 -8540387 -6676847 -4474383 -2085309 347766
40477C47766K352581K155961J841486J411965Q90603L24256k29143p19458j116428
40468G259589j409301j598206j685845j676637j584776j444088j307712j231756
40460d678732j251621j367209j545411j734794j882492j947332j907726j762969
40452a8078286j527292j219009q50736m27920M0954N28124R77911J316498J477234
40443a7762522J427129J181863Q04820L90375L3766k02668l08999l19947k85244
40434a5041427k38656j83878j00991L5620K39509N01683P89009J051120J235898
40425a1712113J310964J281815J193322J109520J083090J134802J254686J418487
40417a925427J602262J783839J935254K019700K000783J858008J596127J243230
$$ plain form
40477 347766 2700347 4856308 6697794 8109759 9000362 9324618 9095475 8376017 7259589
40468 7259589 5850288 4252082 2566237 889600 -695176 -2139264 -3446976 -4678732
40460 -4678732 -5930353 -7297562 -8842973 -10577767 -12460259 -14407591 -16315317 -18078286
40452 -18078286 -19605578 -20824587 -21675323 -22103243 -22062289 -21534165 -20556254 -19239756 -17762522
40443 -17762522 -16335393 -15153530 -14348710 -13958335 -13924569 -14127237 -14436236 -14756183 -15041427
40434 -15041427 -15280083 -15463961 -15564952 -15529332 -15289823 -14788140 -13999131 -12948011 -11712113
40425 -11712113 -10401149 -9119334 -7926012 -6816492 -5733402 -4598600 -3343914 -1925427
40417 -1925427 -323165 1460674 3395928 5415628 7416411 9274419 10870546 12113776
40409A2113776Q41898M37876O6476k59950n53438q34595j109134j355563j533214
40400G814132j603124j547934j382362j151507r16229p28951o10522n41437m73636
40391a141570l56939j65836Q7810L62807O12269Q08000R50082J056391J141169
40382C354183J199444J208806J146489J008192Q14360N98388L83939J67604p7669
40373I803736l77299p26586j083740j391123j605215j709590j705425j596340
40365c91582j384794j080311p07537l04523Q8491M42387P45417R98067J201640
40356c92745J351939J443386J476161J456073J388111J274443J120898R42106
40348A0060372P55009N66880L74915J82444J4647q7483r4308j2442J13953K23942
$$ plain form
40409 12113776 12955674 13393550 13460026 13200076 12646638 11812043 10702909 9347346 7814132
40400 7814132 6211008 4663074 3280712 2129205 1212976 484025 -126497 -667934 -1141570
40391 -1141570 -1498509 -1664345 -1576535 -1213728 -601459 206541 1156623 2213014 3354183
40382 3354183 4553627 5762433 6908922 7917114 8731474 9329862 9713801 9881405 9803736
40373 9803736 9426437 8699851 7616111 6224988 4619773 2910183 1204758 -391582
40365 -391582 -1776376 -2856687 -3564224 -3868747 -3780256 -3337869 -2592452 -1594385 -392745
40356 -392745 959194 2402580 3878741 5334814 6722925 7997368 9118266 10060372
40348 10060372 10815381 11382261 11757176 11939620 11954267 11866784 11772476 11760034 11873987 12097929
40338A2097929K65072K09930O3225j38683l38428m79017n26890m83408l79924
40329A0289806k63325j81440j71882k53668m22501o52724r06337j144490j336143
40320D957296j462680j520733j523107j493374j451760j399398j315434j174463
40312f383653r73357p43625n34632l78704k67221j58163p612K00931M48878O94399
40302h102759Q89764R94625R84987Q58973O36775L51917L6758k89367o21192r56658
40292e216177j282361j567357j770843j858048j813537j645252j379315j048706
40284a7581596o80742k90812J12035N11342Q73523J152132J304819J312624J190544
40275a2096131R83666P50669N43748L95484L16584K99434L21733L51458L57714
$$ plain form
40338 12097929 12363001 12572931 12636156 12497473 12159045 11680028 11153138 10669730 10289806
40329 10289806 10026481 9845041 9673159 9419491 8996990 8344266 7437929 6293439 4957296
40320 4957296 3494616 1973883 450776 -1042598 -2494358 -3893756 -5209190 -6383653
40312 -6383653 -7357010 -8100635 -8635267 -9013971 -9281192 -9439355 -9446967 -9246036 -8797158 -8102759
40302 -8102759 -7212995 -6218370 -5233383 -4374410 -3737635 -3385718 -3348960 -3638327 -4259519 -5216177
40292 -5216177 -6498538 -8065895 -9836738 -11694786 -13508323 -15153575 -16532890 -17581596
40284 -17581596 -18262338 -18553150 -18441115 -17929773 -17056250 -15904118 -14599299 -13286675 -12096131
40275 -12096131 -11112465 -10361796 -9818048 -9422564 -9105980 -8806546 -8484813 -8133355 -7775641
40266g775641L26018K68033K16710K08464K64324L82147N41904P15359Q71136
40257c981546R76040J000709R31329P77781N68403L35845J08876q2974k02743
40248D31720k12550r3555J37840M34530P43134J030770J296199J560363J844674
40239G173125K149783K444680K670288K755568K639333K289658J714646R60742
40231B4797823R8259p99353j670157k464199l135596l640604l947833m051625
40223E186715l975771l764482l467510l127224k771784k415605k065310j726315
40215a8127286j406009j113810q60288o55318n04096m02377l33899k71196j80281
40206b3854560l0502J91869M74256P81335J070475J307628J473333J559236J563697
$$ plain form
40266 -7775641 -7449623 -7181590 -6964880 -6756416 -6492092 -6109945 -5568041 -4852682 -3981546
40257 -3981546 -3005506 -2004797 -1073468 -295687 272716 608561 717437 634463 431720
40248 431720 219170 125615 263455 697985 1441119 2471889 3768088 5328451 7173125
40239 7173125 9322908 11767588 14437876 17193444 19832777 22122435 23837081 24797823
40231 24797823 24896082 24096729 22426572 19962373 16826777 13186173 9238340 5186715
40223 5186715 1210944 -2553538 -6021048 -9148272 -11920056 -14335661 -16400971 -18127286
40215 -18127286 -19533295 -20647105 -21507393 -22162711 -22666807 -23069184 -23403083 -23674279 -23854560
40206 -23854560 -23885062 -23693193 -23218937 -22437602 -21367127 -20059499 -18586166 -17026930 -15463233
40197a5463233J493754J372276J240810J148284J126756J169810J231358J247329
40189e432856J165933R69131O77804L42203K2769k31361l97612m84219n25504
40180c893712n71766o73510q60020j120193j399882j623382j729855j703040j576275
40171a5151635j412607j275568j207496j221426j303331j420549j533343j604350
40163b6130305j601574j498806j281893r60392n71031j62692K28579N94423R48255
40154c0435436J305688J666073K005667K286102K474634K564280K578940K558425
40146a2995627K535473K522783K516500K506284K479119K415751K289657K076131
40138F346071J766898J378220R46061N13135J17490k12610m59687o17671o92575
$$ plain form
40197 -15463233 -13969479 -12597203 -11356393 -10208109 -9081353 -7911543 -6680185 -5432856
40189 -5432856 -4266923 -3297792 -2619988 -2277785 -2255016 -2486377 -2883989 -3368208 -3893712
40180 -3893712 -4465478 -5138988 -5999008 -7119201 -8519083 -10142465 -11872320 -13575360 -15151635
40171 -15151635 -16564242 -17839810 -19047306 -20268732 -21572063 -22992612 -24525955 -26130305
40163 -26130305 -27731879 -29230685 -30512578 -31472970 -32044001 -32206693 -31978114 -31383691 -30435436
40154 -30435436 -29129748 -27463675 -25458008 -23171906 -20697272 -18132992 -15554052 -12995627
40146 -12995627 -10460154 -7937371 -5420871 -2914587 -435468 1980283 4269940 6346071
40138 6346071 8112969 9491189 10437250 10950385 11067875 10855265 10395578 9777907 9085332
40129I085332p00763o63159n97454n12668m08672k79551j18427P6838K97585N22320
40119F701381P23670Q81905R93827J068682J115062J131193J106138J028776Q96381
40110A5647015P17766N11270L00613J10540l8814j40356k08263k78057l93216
40101A6228498n83863q50893j165406j481287j750366j930974j989266j899641
40093D576802j649393j245565p17653j14196N03235J067050J515958J813838J965146
40084G715222K013333K021180K046863K129268K283580K500255K744265K958938
40076B6412904L079476L054729K867536K541520K129643J692270J278195R15502
40068D3971775O09516L44021Q7276j94731n21635q87798j263928j610600j896103
$$ plain form
40129 9085332 8384569 7721410 7123956 6611288 6202616 5923065 5804638 5881476 6179061 6701381
40119 6701381 7425051 8306956 9300783 10369465 11484527 12615720 13721858 14750634 15647015
40110 15647015 16364781 16876051 17176664 17287204 17248390 17108034 16899771 16621714 16228498
40101 16228498 15644635 14793742 13628336 12147049 10396683 8465709 6476443 4576802
40093 4576802 2927409 1681844 964191 849995 1353230 2420280 3936238 5750076 7715222
40084 7715222 9728555 11749735 13796598 15925866 18209446 20709701 23453966 26412904
40076 26412904 29492380 32547109 35414645 37956165 40085808 41778078 43056273 43971775
40068 43971775 44581291 44925312 45012588 44817857 44296222 43408424 42144496 40533896 38637793
40059C8637793k107985k251797k340725k387681k406368k414553k427586k442096
40051A9859002k425673k328361k112885j781377j377421r63514n93684l00288
40043G975799r6127J9690N9829M7730J2540j9014k9686j5576J4529M6254P1440
40032H087408R6507J40274K23824L61080N53846P88088J030364J230566J336963
40023A3848920J319285J185871R81730P66220N83151M41643L18403J77208q027
40014A9614404k38927m92295p32553r30397j076836j184038j274021j364917j463100
40005A0857320j562460j649424j713556j760183j815040j912755k074246k288639
39997c918983k510482k670311k692006k514408k114381j520120q01345l8030P10881
$$ plain form
40059 38637793 36529808 34278011 31937286 29549605 27143237 24728684 22301098 19859002
40051 19859002 17433329 15104968 12992083 11210706 9833285 8869771 8276087 7975799
40043 7975799 7879672 7899362 7959191 8006921 8019461 8000447 7970761 7955185 7969714 8015968 8087408
40032 8087408 8183915 8324189 8548013 8909093 9462939 10251027 11281391 12511957 13848920
40023 13848920 15168205 16354076 17335806 18102026 18685177 19126820 19445223 19622431 19614404
40014 19614404 19375477 18883182 18150629 17220232 16143396 14959358 13685337 12320420 10857320
40005 10857320 9294860 7645436 5931880 4171697 2356657 443902 -1630344 -3918983
39997 -3918983 -6429465 -9099776 -11791782 -14306190 -16420571 -17940691 -18742036 -18780066 -18069185
39988a8069185J415275K054823K592152K962356L089382K921363K464951J798295
39980A229412J053081L73263j29850m07038m76085m03644k72827j50260o7168
39971G48884k1526M687K7317N1811P5880R5686J08150J08513Q9263M5503j7686
39960A316482q6655j53207k30571l55455n70879q99372j322833j780757k187850
39951f271097k460502k537135k385790k005803j432442p41246l9487N59414R67138
39942a6346950J142038J094864Q80874N81419K78792L2320j34358k30061k80576
39933a2981638l10481l32543l50144l68578m04007m80748o16838q06626j011461
39924a7663064j166737j205085j083838q00178l86871J02727O07769J068977J439427
$$ plain form
39988 -18069185 -16653910 -14599087 -12006935 -9044579 -5955197 -3033834 -568883 1229412
39980 1229412 2282493 2655756 2525906 2118868 1642783 1239139 966312 816052 748884
39971 748884 727358 732045 759362 811173 887053 982739 1090889 1199402 1288665 1334168 1316482
39960 1316482 1229827 1076620 846049 490594 -80285 -979657 -2302490 -4083247 -6271097
39951 -6271097 -8731599 -11268734 -13654524 -15660327 -17092769 -17834015 -17873502 -17314088 -16346950
39942 -16346950 -15204912 -14110048 -13229174 -12647755 -12368963 -12336643 -12471001 -12701062 -12981638
39933 -12981638 -13292119 -13624662 -13974806 -14343384 -14747391 -15228139 -15844977 -16651603 -17663064
39924 -17663064 -18829801 -20034886 -21118724 -21918902 -22305773 -22203046 -21595277 -20526300 -19086873
39915a9086873J696884J848177J918825J933223J897816J796591J601453J294713
39907e099191Q94094M64373J02177j02910j08841O2549L41634O44606R02441J074794
39897h24274J152414J153264J112290J065871J037909J033468J037717J016394
39889G785053R22207P13184L76495n9848n37048r88512j360349j622720j773241
39880C455221j831650j823692j759715j622591j377533j001670n14815J2647M85359
39871e978439Q27053J011319J057748J001833Q66771O58367L81859O3642k40566
39862c50413m60396n42279m77124l03861q7727J07598K35634K70233K06539O2383
39852a339413j27124l24974n09119o79655q52864j046908j266371j492890j686540
$$ plain form
39915 -19086873 -17389989 -15541812 -13622987 -11689764 -9791948 -7995357 -6393904 -5099191
39907 -5099191 -4205097 -3740724 -3638547 -3741457 -3850298 -3787749 -3446115 -2801509 -1899068 -824274
39897 -824274 328140 1481404 2593694 3659565 4697474 5730942 6768659 7785053
39889 7785053 8707260 9420444 9796939 9737091 9200043 8211531 6851182 5228462 3455221
39880 3455221 1623571 -200121 -1959836 -3582427 -4959960 -5961630 -6476445 -6463798 -5978439
39871 -5978439 -5151386 -4140067 -3082319 -2080486 -1213715 -555348 -173489 -109847 -350413
39862 -350413 -810809 -1353088 -1830212 -2134073 -2221800 -2114202 -1878568 -1608335 -1401796 -1339413
39852 -1339413 -1466537 -1791511 -2300630 -2980285 -3833149 -4880057 -6146428 -7639318 -9325858
39843i325858j796678j775980j593183j244285p59698j99153L69456Q95859J358519
39834a4071001J754329K079596K319392K449655K445038K286557J968724J505971
39826B738261R34952L11032k97984q17861j177158j326458j265783j063021q41056
39817b805076p29089q03060j053600j401160j742977j997775k124783k117830
39809a4775350j989738j760971j457475j113476p71017m71998k47264j10842o1188
39800b2759319q4258j54822k38846l00191l09365k49652j19355O8173K85942M97373
39790b3364320O64532P61254P88310P80546P94360Q76504J033956J227477J393102
39781a5044279J475135J450931J338176J184640J045500R58101R27097R26791
$$ plain form
39843 -9325858 -11122536 -12898516 -14491699 -15735984 -16495682 -16694835 -16325379 -15429520 -14071001
39834 -14071001 -12316672 -10237076 -7917684 -5468029 -3022991 -736434 1232290 2738261
39826 2738261 3673213 3984245 3686261 2868400 1691242 364784 -900999 -1964020 -2805076
39817 -2805076 -3534165 -4337225 -5390825 -6791985 -8534962 -10532737 -12657520 -14775350
39809 -14775350 -16765088 -18526059 -19983534 -21097010 -21868027 -22340025 -22587289 -22698131 -22759319
39800 -22759319 -22843577 -22998399 -23237245 -23537436 -23846801 -24096453 -24215808 -24147635 -23861693 -23364320
39790 -23364320 -22699788 -21938534 -21150224 -20369678 -19575318 -18698814 -17664858 -16437381 -15044279
39781 -15044279 -13569144 -12118213 -10780037 -9595397 -8549897 -7591796 -6664699 -5737908
39773e737908R17034Q63676P55698O12244M74028L81478L53515L81888M42587
39764e55760N11824N73279O14368O19181N67679M44505K50839O986k60239n35885
39754B236777q24000j137006j478565j835444k181244k482518k700620k794680
39746a3197300k735192k526147k218337j895923j637967j480328j406320j371070
39738b8468584j336874j292348j248222j222811j230922j277905j354215j431301
39730c8863182j465300j411519j243280r64025o05823k16712J54740M70440P07425
39721d3437236Q58063R27784R31908Q93874Q45622Q25591Q67431R80636J137153
39712c5169174J279465J349670J320216J205341J049250R04167Q13614Q05558
$$ plain form
39773 -5737908 -4820874 -3957198 -3201500 -2589256 -2115228 -1733750 -1380235 -998347 -555760
39764 -555760 -43936 529343 1143711 1762892 2330571 2775076 3025915 3032901 2772662 2236777
39754 2236777 1412777 275771 -1202794 -3038238 -5219482 -7702000 -10402620 -13197300
39746 -13197300 -15932492 -18458639 -20676976 -22572899 -24210866 -25691194 -27097514 -28468584
39738 -28468584 -29805458 -31097806 -32346028 -33568839 -34799761 -36077666 -37431881 -38863182
39730 -38863182 -40328482 -41740001 -42983281 -43947306 -44553129 -44769841 -44615101 -44144661 -43437236
39721 -43437236 -42579173 -41651389 -40719481 -39825607 -38979985 -38154394 -37286963 -36306327 -35169174
39712 -35169174 -33889709 -32540039 -31219823 -30014482 -28965232 -28061065 -27247451 -26441893
39704b6441893Q90698J060800J287499J525549J723401J838880J853266J776046
39696a4485754J637212J471221J301662J134156R58482P55759N06497J98686j63737
39687f685816n54977r29263j232905j421089j469680j375858j150666q12639l88679
39678a6021572Q1002N43646R45906J250656J445222J533963J522088J404871J170930
39669f123288Q17454L68378j15683n45628q32085r20162q07813n35856j62152
39660h856835K55765O60448R90630J191095J234296J134815R42366P17121N03048
39651a227251L12306J25348r4474l77241p24251j100473j447831j710538j853803
39642h098208j864094j737380j472542j078786n88755o2082M27362Q14317J062462
$$ plain form
39704 -26441893 -25551195 -24490395 -23202896 -21677347 -19953946 -18115066 -16261800 -14485754
39696 -14485754 -12848542 -11377321 -10075659 -8941503 -7983021 -7227262 -6720765 -6522079 -6685816
39687 -6685816 -7240793 -8170056 -9402961 -10824050 -12293730 -13669588 -14820254 -15632893 -16021572
39678 -16021572 -15940570 -15396924 -14451018 -13200362 -11755140 -10221177 -8699089 -7294218 -6123288
39669 -6123288 -5305834 -4937456 -5053139 -5598767 -6430852 -7351014 -8158827 -8694683 -8856835
39660 -8856835 -8601070 -7940622 -6949992 -5758897 -4524601 -3389786 -2447420 -1730299 -1227251
39651 -1227251 -914945 -789597 -884071 -1261312 -1985563 -3086036 -4533867 -6244405 -8098208
39642 -8098208 -9962302 -11699682 -13172224 -14251010 -14839765 -14901847 -14474485 -13660168 -12597706
39633a2597706J171273J166182J079930R39642P66726N81096L96827K10728N3
39624f285249k61095n77688r21472j237582j462393j543478j457785j223891r00023
39615a5870656n62974k74993n5727J23838L19989N78836R06131J263127J588012
39606a1984417J824494J939136J922940J784907J545841J235349Q90359N52277
39598b89114K61174M8455o8357q7286k2119R7076K25700L12507L13538K07298
39588I98872M679k51560m99616o78971p47966o90781n15387k49392O3166L66748
39578b200208O03115P23003O99451N40945K96625M2712j49494k45285k54885k13355
39568a57376j49843o9350M3270K04610M14654O51237Q78249J058499J160929J161179
$$ plain form
39633 -12597706 -11426433 -10260251 -9180321 -8240679 -7473953 -6892857 -6496030 -6285302 -6285249
39624 -6285249 -6546344 -7124032 -8045504 -9283086 -10745479 -12288957 -13746742 -14970633 -15870656
39615 -15870656 -16433630 -16708623 -16764350 -16640512 -16320523 -15741687 -14835556 -13572429 -11984417
39606 -11984417 -10159923 -8220787 -6297847 -4512940 -2967099 -1731750 -841391 -289114
39598 -289114 -27940 20515 -47842 -135128 -157247 -60171 165529 478036 791574 998872
39588 998872 1003551 751991 252375 -426596 -1174562 -1865343 -2380730 -2630122 -2566956 -2200208
39578 -2200208 -1597093 -874090 -174639 366306 662931 705643 556149 310864 55979 -157376
39568 -157376 -307219 -376569 -333299 -128689 285965 937202 1815451 2873950 4034879 5196058
39558E196058J043280Q06617M71159P1323l59361p99410j236942j658090k037705
39549A496929k338577k518266k541741k397857k112615j748129j382664j081258
39541a4624178q73934p52357o83247o28619n62178m75166l71424k57932j38874
39532a9367909j5874J09875K38408L73505N21983O88075Q67411J046278J206732
39523a4331516J332774J413556J444765J432280J397857J379252J417244J533471
39515b980317J715350J921587K104073K227405K272832K232262K106668J911708
39507A3511568J678592J440968J216675J002279P85263N59389L26555Q5522j76932
39498B0429879m80030q31936j216296j593645j916097k144023k254801k243634
$$ plain form
39558 5196058 6239338 7045955 7517114 7588437 7229076 6429666 5192724 3534634 1496929
39549 1496929 -841648 -3359914 -5901655 -8299512 -10412127 -12160256 -13542920 -14624178
39541 -14624178 -15498112 -16250469 -16933716 -17562335 -18124513 -18599679 -18971103 -19229035 -19367909
39532 -19367909 -19383783 -19273908 -19035500 -18661995 -18140012 -17451937 -16584526 -15538248 -14331516
39523 -14331516 -12998742 -11585186 -10140421 -8708141 -7310284 -5931032 -4513788 -2980317
39515 -2980317 -1264967 656620 2760693 4988098 7260930 9493192 11599860 13511568
39507 13511568 15190160 16631128 17847803 18850082 19635345 20194734 20521289 20606811 20429879
39498 20429879 19949849 19117913 17901617 16307972 14391875 12247852 9993051 7749417
39490G749417k123244j924324j689376j454169j226075r78071o66795k62266K30905
39481b343998P70100J285461J698596J945505J997440J869710J612455J288623
39473A0123892R52285O38692L69032J62796M4756L7496J43026L28710N31179O78160
39463A4010024P15125O21951M13163J25285k00075n29128q40489j121726j362002
39454A1832128j546844j660213j693324j652774j559692j439722j311936j183461
39446b15838j049491q96288p09197m87218k56224o6672K9027P540j05702k40544
39436c990607l09098k44542l3550K76288O01892Q69868J053761J181100J309284
39427G14396J488165J731121K007526K257503K420047K459122K373105K183733
$$ plain form
39490 7749417 5626173 3701849 2012473 558304 -667771 -1645842 -2312637 -2574903 -2343998
39481 -2343998 -1573898 -288437 1410159 3355664 5353104 7222814 8835269 10123892
39473 10123892 11076177 11714869 12083901 12246697 12291453 12328949 12471975 12800685 13331864 14010024
39463 14010024 14725149 15347100 15760263 15885548 15685473 15156345 14315856 13194130 11832128
39454 11832128 10285284 8625071 6931747 5278973 3719281 2279559 967623 -215838
39446 -215838 -1265329 -2161617 -2870814 -3358032 -3614256 -3680928 -3651901 -3644361 -3750063 -3990607
39436 -3990607 -4299705 -4544247 -4577797 -4301509 -3699617 -2829749 -1775988 -594888 714396
39427 714396 2202561 3933682 5941208 8198711 10618758 13077880 15450985 17634718
39419A7634718J916346J589920J224359Q54087N29536K99722J86905J71610J98548
39410B4605751K00354J25619m4054k95198n96021r09370j198632j431794j590252
39401A8866403j678212j721268j750701j784537j819895j840154j828094j774464
39393D669078j679039j548401j394593j233567j079611r36142p90033o16017l89225
39384d997550r6802K57395O53083J054571J412612J670460J775838J696940J437601
39375D864148J043811N93645J71248j61569l78535m81596m84072l99314k40071
39366D527695k3250K26551M76922O90618Q31942Q76062Q17343O70752M64113K26512
39356I785260j8759k53264m58695o14230o97228o85887n64658l34299k2657L13344
$$ plain form
39419 17634718 19551064 21140984 22365343 23219430 23748966 24048688 24235593 24407203 24605751
39410 24605751 24806105 24931724 24887670 24592472 23996451 23087081 21888449 20456655 18866403
39401 18866403 17188191 15466923 13716222 11931685 10111790 8271636 6443542 4669078
39393 4669078 2990039 1441638 47045 -1186522 -2266133 -3202275 -3992308 -4608325 -4997550
39384 -4997550 -5094352 -4836957 -4183874 -3129303 -1716691 -46231 1729607 3426547 4864148
39375 4864148 5907959 6501604 6672852 6511283 6132748 5651152 5167080 4767766 4527695
39366 4527695 4504445 4730996 5207918 5898536 6730478 7606540 8423883 9094635 9558748 9785260
39356 9785260 9766501 9513237 9054542 8440312 7743084 7057197 6492539 6158240 6135583 6448927
39346F448927N99975P67429P67561N83150K31724k32976p25855j148581j419954
39337E871400j505159j426237j245941j034440q38938o72488n23772l76665k24933
39328a977173p3960O8331K01531L34464M76486O25083P59691Q47358Q58195P82326
39318B902332O39131M73346L38922K76580K94499L62706M27309M37822L67959
39309F520606K13786k4419l51424p62326j219204j649223j973663k145146k163519
39300c554532k063402j889528j677556j446194j199468r37359o69660m21830k24811
39291a4084340r5328k4177J7105N8454J18441K04404L20548M74992O80765R49828
39281a1379308J281801J653392K017101K312507K483525K491990K324468J994651
$$ plain form
39346 6448927 7048902 7816331 8583892 9167042 9398766 9165790 8439935 7291354 5871400
39337 5871400 4366241 2940004 1694063 659623 -179315 -851803 -1375575 -1752240 -1977173
39328 -1977173 -2051133 -1982802 -1781271 -1446807 -970321 -345238 414453 1261811 2120006 2902332
39318 2902332 3541463 4014809 4353731 4630311 4924810 5287516 5714825 6152647 6520606
39309 6520606 6734392 6709973 6358549 5596223 4377019 2727796 754133 -1391013 -3554532
39300 -3554532 -5617934 -7507462 -9185018 -10631212 -11830680 -12768039 -13437699 -13859529 -14084340
39291 -14084340 -14179668 -14203845 -14186740 -14128286 -14009845 -13805441 -13484893 -13009901 -12329136 -11379308
39281 -11379308 -10097507 -8444115 -6427014 -4114507 -1630982 861008 3185476 5180127
39273E180127J541362J018829M81017l0582m87812q68355j150596j317610j366992
39264B999388j317099j202872j063134r28384q16858p37527o91958o71718o57367
39255e087529o25282n57559m43573k70904j8529L33079P76841J258925J683882
39246b950649J946638J972416J741853J292064O99790N6382n59291j103657j575930
39237A519616k003184k411618k804757l161935l450685l637267l689389l578821
39229b3218040l291527k840174k266176j625103r64614l11660L21311R18075J446424
39220c1831484J865254K145922K288227K316034K257880K132289J950035J725832
39212a5150011J484503J258402J084383J002889J050102J239253J546221J918636
$$ plain form
39273 5180127 6721489 7740318 8221335 8190753 7702941 6834586 5683990 4366380 2999388
39264 2999388 1682289 479417 -583717 -1512101 -2328959 -3066486 -3758444 -4430162 -5087529
39255 -5087529 -5712811 -6270370 -6713943 -6984847 -7003376 -6670297 -5893456 -4634531 -2950649
39246 -2950649 -1004011 968405 2710258 4002322 4702112 4758494 4199203 3095546 1519616
39237 1519616 -483568 -2895186 -5699943 -8861878 -12312563 -15949830 -19639219 -23218040
39229 -23218040 -26509567 -29349741 -31615917 -33241020 -34205634 -34517294 -34195983 -33277908 -31831484
39220 -31831484 -29966230 -27820308 -25532081 -23216047 -20958167 -18825878 -16875843 -15150011
39212 -15150011 -13665508 -12407106 -11322723 -10319834 -9269732 -8030479 -6484258 -4565622
39204d565622K304940K676451L022044L324664L546218L635387L550043L276515
39196B0770640K835350K274374J656152J046891N09127R4872j64013k65201k38712
39187B8519480j41024m3747j7839j11083l22769n91845q14905q91796p75157m95851
39177B4313464j51684J32436K52134J58098j33857n55363j009938j398218j638979
39168A9968093j685643j537090j238628q69858n22368k76536j86596k75816n37268
39159A2838290r36184j414695j901117k322542k617626k748243k708139k522721
39151d332977k235148j884959j494566j073021o30048j85740K31058N92526Q83700
39142a0129175J110748J298877J477101J658748J833609J977713K069221K095032
$$ plain form
39204 -4565622 -2260682 415769 3437813 6762477 10308695 13944082 17494125 20770640
39196 20770640 23605990 25880364 27536516 28583407 29092534 29187406 29023393 28758192 28519480
39187 28519480 28378456 28334709 28316870 28205787 27883018 27291173 26476268 25584472 24809315 24313464
39177 24313464 24161780 24294216 24546350 24704448 24570591 24015228 23005290 21607072 19968093
39168 19968093 18282450 16745360 15506732 14636874 14114506 13837970 13651374 13375558 12838290
39159 12838290 11902106 10487411 8586294 6263752 3646126 897883 -1810256 -4332977
39151 -4332977 -6568125 -8453084 -9947650 -11020671 -11650719 -11836459 -11605401 -11012875 -10129175
39142 -10129175 -9018427 -7719550 -6242449 -4583701 -2750092 -772379 1296842 3391874
39134C391874K045191J904826J654078J279508P92449K42470k88704p16053r85750
39125I319889j090332j057011r26041p39744n44273l90557l25150l75658n40884
39116C330239p90164j070057j316331j470824j500762j412439j249162j069971
39108f549471r19295q06011p04523n74606l85863j34299J53688M29293O38689
39099h852398P43531P34830O33172M76719L05524J50412K9925m6050p0548l7348
39089e932231N4794J95309L60591N22588O61054P67973Q39631Q65293Q26183P08435
39079a30380N19292K92890Q2678n1313n2992J20311M84974J017639J651894K293216
39069F228209K847850L250367L475060L527612L426207L186104K816126K325530
$$ plain form
39134 3391874 5437065 7341891 8995969 10275477 11067926 11310396 11021692 10305639 9319889
39125 9319889 8229557 7172546 6246505 5506761 4962488 4571931 4246781 3871123 3330239
39116 3330239 2540075 1470018 153687 -1317137 -2817899 -4230338 -5479500 -6549471
39108 -6549471 -7468766 -8274777 -8979300 -9553906 -9939769 -10074068 -9920380 -9491087 -8852398
39099 -8852398 -8108867 -7374037 -6740865 -6264146 -5958622 -5808210 -5778285 -5824335 -5894883 -5932231
39089 -5932231 -5877437 -5682128 -5321537 -4798949 -4137895 -3369922 -2530291 -1664998 -838815 -130380
39079 -130380 388912 681802 764480 713167 660175 780486 1265460 2283099 3934993 6228209
39069 6228209 9076059 12326426 15801486 19329098 22755305 25941409 28757535 31083065
39061C1083065J733212J072197L87588k69663q49730j309329j615162j746657
39053B8485521j699695j491016j160328p66298l75091m3600J96996L49039M40392
39044B3935920N01207N38947N30595M40394K51014j5440l01595n39923o81478
39035B4659641p11951o48939n25821l74739k19466p8763K8671Q5155P8388K223
39025B2294399j45968l63432o33169r18787j175977j377550j531306j672228j832795
39016A2643187k015687k191264k320306k381606k382081k343227k276397k167174
39008e434555j981907j693362j307837q73935m66156j54077K4866P7843N3573
38999a1755547K6917P4478K47536N52953R50849J369434J729523J969310K061884
$$ plain form
39061 31083065 32816277 33888474 34276062 34006399 33156669 31847340 30232178 28485521
39053 28485521 26785826 25294810 24134482 23368184 22993093 22949493 23146489 23495528 23935920
39044 23935920 24437127 24976074 25506669 25947063 26198077 26182637 25881042 25341119 24659641
39035 24659641 23947690 23298751 22772930 22398191 22178725 22099962 22128633 22213788 22292176 22294399
39025 22294399 22148431 21784999 21151830 20233043 19057066 17679516 16148210 14475982 12643187
39016 12643187 10627500 8436236 6115930 3734324 1352243 -990984 -3267381 -5434555
39008 -5434555 -7416462 -9109824 -10417661 -11291596 -11757752 -11911829 -11886963 -11809120 -11755547
38999 -11755547 -11728630 -11654152 -11406616 -10853663 -9902814 -8533380 -6803857 -4834547 -2772663
38990b772663K021169J896061J756392J674906J707610J874787K148563K455444
38982A2762269K698820K796987K720552K507278K240757K002244J827181J696675
38974C1252763J566676J407839J224333J041903Q80646P35636N77548L69438Q7082
38965C9143864k68155o67898j065447j410998j667991j822227j877504j841637
38957B8522007j716110j499345j199085q39497m54226p0415L03356O76341J063157
38948B4786183J468810J880924K271985K606500K847320K962445K936662K785040
38940D4545869K555530K311587K102585J942612J812512J681484J530136J358210
38932E9840525J174188R79592P65398N26676K82582Q0975k0203J8440J98872M84383
$$ plain form
38990 -2772663 -751494 1144567 2900959 4575865 6283475 8158262 10306825 12762269
38982 12762269 15461089 18258076 20978628 23485906 25726663 27728907 29556088 31252763
38974 31252763 32819439 34227278 35451611 36493514 37374160 38109796 38687344 39056782 39143864
38965 39143864 38875709 38207811 37142364 35731366 34063375 32241148 30363644 28522007
38957 28522007 26805897 25306552 24107467 23267970 22813744 22743329 23046685 23723026 24786183
38948 24786183 26254993 28135917 30407902 33014402 35861722 38824167 41760829 44545869
38940 44545869 47101399 49412986 51515571 53458183 55270695 56952179 58482315 59840525
38932 59840525 61014713 61994305 62759703 63286379 63568961 63649936 63629733 63648173 63847045 64331428
38922F4331428Q10394J102264J300122J385135J390340J382238J421641J530814
38914G4654376J687530J842744J943151J944631J816674J544930J136117O22334
38906H7192487N7987m94192r82422j378396j675806j879475j996033k031965j996310
38897G4815875j902660j767373j603491j413662j189556r23384o25802l34984
38889F5054963j07290L925l3240k21584n36426r33239j360045j771098k135464
38880E7960502k436766k666270k814181k863118k788013k565407k188335j675770
38872C7962642j068623m16435K33608Q39179J360721J762194K018387K127550
38864D4819223K123054K073934K066474K171917K418437K783996L210056L622226
$$ plain form
38922 64331428 65141822 66244086 67544208 68929343 70319683 71701921 73123562 74654376
38914 74654376 76341906 78184650 80127801 82072432 83889106 85434036 86570153 87192487
38906 87192487 87250474 86756282 85773860 84395464 82719658 80840183 78844150 76812185 74815875
38897 74815875 72913215 71145842 69542351 68128689 66939133 66015749 65389947 65054963
38889 65054963 64947673 64951598 64918358 64696774 64160348 63227109 61867064 60095966 57960502
38880 57960502 55523736 52857466 50043285 47180167 44392154 41826747 39638412 37962642
38872 37962642 36894019 36477584 36711192 37550371 38911092 40673286 42691673 44819223
38864 44819223 46942277 49016211 51082685 53254602 55673039 58457035 61667091 65289317
38856F5289317L945535M113195M073512L796626L279290K546961J654713O86845
38848H9385994k48207j031606j556411j752355j603354j149484m72029L32638
38840H1905186J180608K020453K838980L650133M471483N299903O099157O805074
38832A14270977P344566P659533P726110P561366P214276O746055O212094N655814
38824A70390791N114890M631084M254350M037778M026429M245239M690169N324385
38816B06715115O079512O862508P569098Q102034Q387006Q377013Q043336P363367
38808B67498989O320928M924547L230779J350181n75112k409898m054270n444683
38800B70841461o534254p274743p618425p539583p059518o256091n249397m171044
$$ plain form
38856 65289317 69234852 73348047 77421559 81218185 84497475 87044436 88699149 89385994
38848 89385994 89137787 88106181 86549770 84797415 83194061 82044577 81572548 81905186
38840 81905186 83085794 85106247 87945227 91595360 96066843 101366746 107465903 114270977
38832 114270977 121615543 129275076 137001186 144562552 151776828 158522883 164734977 170390791
38824 170390791 175505681 180136765 184391115 188428893 192455322 196700561 201390730 206715115
38816 206715115 212794627 219657135 227226233 235328267 243715273 252092286 260135622 267498989
38808 267498989 273819917 278744464 281975243 283325424 282750312 280340414 276286144 270841461
38800 270841461 264307207 257032464 249414039 241874456 234814938 228558847 223309450 219138406
38792B19138406l135133k226613j508344j033963q51537r94016j465189k232517
38784B05691094l230308m368145n538932o627020p521346q135437q428600q417760
38776A53423546q171563p787092p359013o955256o608052o318689o068186n828383
38768I8327312n572539n283779m957449m597105m210717l812156l423626l070750
38760F3399191k771273k528167k334207k182082k069059j992880j945138j909235
38752D5667150j864163j789793j669165j487656j233490r02696n04523n9663M09632
38743C6565633Q88901J371473J849318K301496K687028K947809L025637K888931
38735E4526226K552483K073901J528497R81572M74557K5779l61410o87123r42298
$$ plain form
38792 219138406 216003273 213776660 212268316 211234353 210382816 209388800 207923611 205691094
38784 205691094 202460786 198092641 192553709 185926689 178405343 170269906 161841306 153423546
38776 153423546 145251983 137464891 130105878 123150622 116542570 110223881 104155695 98327312
38768 98327312 92754773 87470994 82513545 77916440 73705723 69893567 66469941 63399191
38760 63399191 60627918 58099751 55765544 53583462 51514403 49521523 47576385 45667150
38752 45667150 43802987 42013194 40344029 38856373 37622883 36720187 36215664 36156001 36565633
38743 36565633 37454534 38826007 40675325 42976821 45663849 48611658 51637295 54526226
38735 54526226 57078709 59152610 60681107 61662679 62137236 62163015 61801605 61114482 60172184
38726F0172184j102611j137637j032827q08421n19256k33657n450J43292K20936
38717E5696553K52649K65933K81299L06969L37211L57774L58749L45778L38285
38708E8541200L54088L92373M27843M18643L21782J08822k22445o43470j100947
38699E8597889j533663j893192k156930k326463k415953k441993k420635k366645
38691D1042415k288350k180867k027351j812029j536116j222942r06471o10410
38683B8457879l33011m9747K65963O17087R69674J260292J418693J392488J163727
38674C5163045P55271K29868l16493p70556j031749j051400q61884n72135l23367
38665C1220600k27142l22427n74684r10036j255916j562235j797972j938045j958955
$$ plain form
38726 60172184 59069573 57931936 56899109 56090688 55571432 55337775 55332325 55475617 55696553
38717 55696553 55949202 56215135 56496434 56803403 57140614 57498388 57857137 58202915 58541200
38708 58541200 58895288 59287661 59715504 60134147 60455929 60564751 60342306 59698836 58597889
38699 58597889 57064226 55171034 53014104 50687641 48271688 45829695 43409060 41042415
38691 41042415 38754065 36573198 34545847 32733818 31197702 29974760 29068289 28457879
38683 28457879 28124868 28075121 28341084 28958171 29927845 31188137 32606830 33999318 35163045
38674 35163045 35918316 36148184 35831691 35061135 34029386 32977986 32116102 31543967 31220600
38665 31220600 30993458 30671031 30096347 29186311 27930395 26368160 24570188 22632143 20673188
38656B0673188j848681j620965j320027j009937p53653n92211n33624n56328o24703
38647A1813059p07098p84952q48182q82643q61788p52235n33355k19542J31606
38638F354870M35948O18585O47985N47685L80809K20023J19700R8751J35641J77805
38628I737802J68165Q0733n7120j77356k16289j60417n6900K0346K2171m5409
38618I315726j30553j71697j32383j4945J48925L20953M79434O30949Q03542J024479
38608A2274430J295979J584073J826225J951702J903582J654019J209838O10174
38600B4310022q0817p85108j426650j950237k335967k600563k783186k922075
38592I425419l032975l100355l088339k967845k742525k452530k151087j871819
$$ plain form
38656 20673188 18824507 17203542 15883515 14873578 14119925 13527714 12994090 12437762 11813059
38647 11813059 11105961 10321009 9472827 8590184 7728396 6976161 6442806 6223264 6354870
38638 6354870 6790818 7409403 8057388 8605073 8985882 9205905 9325605 9424356 9559997 9737802
38628 9737802 9905967 9986700 9929580 9752224 9535935 9375518 9318618 9338964 9361135 9315726
38618 9315726 9185173 9013476 8881093 8866148 9015073 9336026 9815460 10446409 11249951 12274430
38608 12274430 13570409 15154482 16980707 18932409 20835991 22490010 23699848 24310022
38600 24310022 24229205 23444097 22017447 20067210 17731243 15130680 12347494 9425419
38592 9425419 6392444 3292089 203750 -2764095 -5506620 -7959150 -10110237 -11982056
38584a1982056j611550j338464j016603o31198k03170K13970N55331P74530Q65029
38575a4374181Q60657Q17315P88532Q06218Q71743R58572J025961J039348R88241
38566f217594Q92589P94676P41587P66738Q77258J049552J232544J358128J358923
38557B854401J190887Q52515L89095j23447o06660j001429j271376j393091j350210
38548d59315j141488p95124l71991N1008M08604O66850Q21932Q82189Q51461P30135
38538A644261N32690L02478J04419m286n107P1877J65277K14799J89192R5737
38528C311337l1184j53643k51259l27411l98333m74881n52155o15555o57556o89656
38518h40296p37730q23245r44591j072830j165253j187449j128961j003238q35912
$$ plain form
38584 -11982056 -13593606 -14932070 -15948673 -16579871 -16783041 -16569071 -16013740 -15239210 -14374181
38575 -14374181 -13513524 -12696209 -11907677 -11101459 -10229716 -9271144 -8245183 -7205835 -6217594
38566 -6217594 -5325005 -4530329 -3788742 -3022004 -2144746 -1095194 137350 1495478 2854401
38557 2854401 4045288 4897803 5286898 5163451 4556791 3555362 2283986 890895 -459315
38548 -459315 -1600803 -2395927 -2767918 -2716910 -2308306 -1641456 -819524 62665 914126 1644261
38538 1644261 2176951 2479429 2583848 2579562 2574455 2646332 2811609 3026408 3215600 3311337
38528 3311337 3280153 3126510 2875251 2547840 2149507 1674626 1122471 506916 -150640 -840296
38518 -840296 -1578026 -2401271 -3345862 -4418692 -5583945 -6771394 -7900355 -8903593 -9739505
38509i739505o53813m82794l50366k84583l07222m26586o33851r02897j194265
38500a4975882j465337j683491j832256j904636j890202j769005j519175j134051
38492b8174035o38196r0386M32962Q66958J180274J374085J462691J456460J361098
38483b0768089J188551R66027P35796N46181M37021M25583N02102O39613Q10764
38474a4516451R97664J188781J369147J513665J588047J557547J401963J130638
38466c768999P85934M27745J07007j52241l49488m89880n70753n84275n30217
38457e125167m23959k91706j58785m2446M6958J03910J33042J58156K20295L56567
38447e023135N71998Q28365J061241J211239J245674J160245R69239O96724L73478
$$ plain form
38509 -9739505 -10393318 -10876112 -11226478 -11511061 -11818283 -12244869 -12878720 -13781617 -14975882
38500 -14975882 -16441219 -18124710 -19956966 -21861602 -23751804 -25520809 -27039984 -28174035
38492 -28174035 -28812231 -28902617 -28469655 -27602697 -26422423 -25048338 -23585647 -22129187 -20768089
38483 -20768089 -19579538 -18613511 -17877715 -17331534 -16894513 -16468930 -15966828 -15327215 -14516451
38474 -14516451 -13518787 -12330006 -10960859 -9447194 -7859147 -6301600 -4899637 -3768999
38466 -3768999 -2983065 -2555320 -2448313 -2600554 -2950042 -3439922 -4010675 -4594950 -5125167
38457 -5125167 -5549126 -5840832 -5999617 -6042063 -5995105 -5891195 -5758153 -5599997 -5379702 -5023135
38447 -5023135 -4451137 -3622772 -2561531 -1350292 -104618 1055627 2024866 2721590 3095068
38438C095068L7163k68410m99905o29854o64549o48667o46708p10922q57954j067134
38428b861872j293640j482625j579656j541710j350126j018998n92302j31306
38420a1852235K99468O41452Q47185Q86300P54227M79172J20752k42546n33555
38411h599780o97485p16998o15057m42462k54606r0296L5241J23069J80859K21071
38401a0856444K64644L39543M69430O59628Q91352J128295J331333J474577J556224
38392b741418J597958J630076J669529J706364J709600J647491J505330J288507
38384A0013437J013175O96003L51324m867l49671o51714q74546r83388r52707
38375H257046p73092m57246m4286M00649P95540J060840J143919J036998P76896
$$ plain form
38438 3095068 3132231 2863821 2363916 1734062 1069513 420846 -225862 -936784 -1794738 -2861872
38428 -2861872 -4155512 -5638137 -7217793 -8759503 -10109629 -11128627 -11720929 -11852235
38420 -11852235 -11552767 -10911315 -10064130 -9177830 -8423603 -7944431 -7823679 -8066225 -8599780
38411 -8599780 -9297265 -10014263 -10629320 -11071782 -11326388 -11416684 -11381443 -11258374 -11077515 -10856444
38401 -10856444 -10591800 -10252257 -9782827 -9123199 -8231847 -7103552 -5772219 -4297642 -2741418
38392 -2741418 -1143460 486616 2156145 3862509 5572109 7219600 8724930 10013437
38384 10013437 11026612 11722615 12073939 12069072 11719401 11067687 10193141 9209753 8257046
38375 8257046 7483954 7026708 6982422 7383071 8178611 9239451 10383370 11420368 12197264
38366A2197264M24690L7300l50581p23987j070562j365108j569434j648727j593021
38357D337834j427425j202331r70151p65630o01824m79108l95896l53221l52901
38348b210653l91581m53545n07985n16836m51574l08346j11441R4679K57752L29762
38338d269768K78828R9951j80502n11559q34675j103390j296160j416264j479536
38329a0713075j496924j462238j353672j150283q53515m96675j31841J97352M74426
38320a6986445P05304Q98313J050445J150872J192479J176262J105673R80763
38312h726334Q01145N75457L27393R0688j04637k43855l25903l48016k90474j19174
38302h363710J89884O21418J111855J569870J912098K090695K101134J974368
$$ plain form
38366 12197264 12621954 12659254 12308673 11584686 10514124 9149016 7579582 5930855 4337834
38357 4337834 2910409 1708078 737927 -27703 -629527 -1108635 -1504531 -1857752 -2210653
38348 -2210653 -2602234 -3055779 -3563764 -4080600 -4532174 -4840520 -4951961 -4857282 -4599530 -4269768
38338 -4269768 -3990940 -3890989 -4071491 -4583050 -5417725 -6521115 -7817275 -9233539 -10713075
38329 -10713075 -12209999 -13672237 -15025909 -16176192 -17029707 -17526382 -17658223 -17460871 -16986445
38320 -16986445 -16281141 -15382828 -14332383 -13181511 -11989032 -10812770 -9707097 -8726334
38312 -8726334 -7925189 -7349732 -7022339 -6931651 -7036288 -7280143 -7606046 -7954062 -8244536 -8363710
38302 -8363710 -8173826 -7552408 -6440553 -4870683 -2958585 -867890 1233244 3207612
38294C207612J761903J518516J286037J083786R10005P51988N98328M47375L08669
38285A1874219J97029J23348Q9094Q7901J10155J45032J80314K03678K05475J79908
38275A3396153J24777M2885n5046j49682k15731k25812j56281J500K27644M70118
38265A3460525O60022P39764O87517N24691L04054Q5712q6152j93718k40857k43268
38255A5698290k24737k19624k72154m25592p04680j101136j571253k048521k465201
38246F665392k770697k937724k958131k836881k588744k236256j807261j333339
38238a2803641q48753l86837K7338L83988O90326R65945J234626J516505J823350
38229g397153K155996K499743K817194L047482L121580K989527K641357K109339
$$ plain form
38294 3207612 4969515 6488031 7774068 8857854 9767859 10519847 11118175 11565550 11874219
38285 11874219 12071248 12194596 12283690 12371591 12481746 12626778 12807092 13010770 13216245 13396153
38275 13396153 13520930 13563815 13508769 13359087 13143356 12917544 12761263 12762763 12990407 13460525
38265 13460525 14120547 14860311 15547828 16072519 16376573 16462285 16376133 16182415 15941558 15698290
38255 15698290 15473553 15253929 14981775 14556183 13851503 12750367 11179114 9130593 6665392
38246 6665392 3894695 956971 -2001160 -4838041 -7426785 -9663041 -11470302 -12803641
38238 -12803641 -13652394 -14039231 -14011893 -13627905 -12937579 -11971634 -10737008 -9220503 -7397153
38229 -7397153 -5241157 -2741414 75780 3123262 6244842 9234369 11875726 13985065
38221A3985065J457613P71577J47498l25948n93017o48356n34090l19103p2526
38212A3868713J57947L56007N30802O98439Q63683J014934J132642J200056J206989
38203B1030212J148173J022771Q37591O10330L67946J38570n9737k26649l78219
38194B4490988n37296p21936r37121j170809j394405j569646j661107j647120
38186A4851548j522004j292031r73759n96772k02643J65500M75849P11860Q65818
38177A2483366R31411R03997P88234O06155L97345K06363O1584m0483j31503k48972
38167A5957497m10927o04405p93003r37643j018253j041717j027741r82592q86045
38158H255171p07565m38045j05823K38177N49956Q09015J012109J157302J236018
$$ plain form
38221 13985065 15442678 16214255 16361753 16035805 15442788 14794432 14260342 13941239 13868713
38212 13868713 14026660 14382667 14913469 15611908 16475591 17490525 18623167 19823223 21030212
38203 21030212 22178385 23201156 24038747 24649077 25017023 25155593 25095856 24869207 24490988
38194 24490988 23953692 23231756 22294635 21123826 19729421 18159775 16498668 14851548
38186 14851548 13329544 12037513 11063754 10466982 10264339 10429839 10905688 11617548 12483366
38177 12483366 13414777 14318774 15107008 15713163 16110508 16316871 16378455 16337972 16206469 15957497
38167 15957497 15546570 14942165 14149162 13211519 12193266 11151549 10123808 9141216 8255171
38158 8255171 7547606 7109561 7003738 7241915 7791871 8600886 9612995 10770297 12006315
38149A2006315J237696J158267J002509P79601M99750J78734j53283m50847o68197
38140A5590545p82882q09140p87515p56345p26177o76133n73531m00902j71167
38131I906753P7441L00443M66004N62283N92599N67157N00285M12698L30241K73911
38121A3989815K47784K37306K22350J95411J70234J75172K38969L81062O10432
38112A6468535R26301J312981J731475K118753K401195K515302K422628K113244
38104C2010414J602566R28351J48265o65486j434941k085423k552410k788034
38096B5163302k770208k513591k075944j551061j044062o35020l47637j42221
38088A4083558N8388L21390O62420J034841J354254J539702J545838J372542J055871
$$ plain form
38149 12006315 13244011 14402278 15404787 16184388 16684138 16862872 16709589 16258742 15590545
38140 15590545 14807663 13998523 13211008 12454663 11728486 11052353 10478822 10077920 9906753
38131 9906753 9984194 10284637 10750641 11312924 11905523 12472680 12972965 13385663 13715904 13989815
38121 13989815 14237599 14474905 14697255 14892666 15062900 15238072 15477041 15858103 16468535
38112 16468535 17394836 18707817 20439292 22558045 24959240 27474542 29897170 32010414
38104 32010414 33612980 34541331 34689596 34024110 32589169 30503746 27951336 25163302
38096 25163302 22393094 19879503 17803559 16252498 15208436 14573416 14225779 14083558
38088 14083558 14141946 14463336 15125756 16160597 17514851 19054553 20600391 21972933 23028804
38079B3028804O52774K27705j59715m70332p01957q93749j105832j379081j700980
38070A7497637k004370k201617k230077k080260j794923j445916j102495q04854
38062C833125n54190l23775q3287J79668M53649P13458R36965J116953J260513
38053G533079J376259J459031J485950J430288J284104J070834Q35874O21194
38045A7096613M43094K89186J35379l0615j95906l27513l91406l72254k81399
38036A6365179j50149j5950Q8217J37665J17271K4449j28131l15089n06240o73823
38026A4943399p94103q45291q07726o69276m33434j25234K08860N09012P17151
38017A2703358P94676P36432N76149L80670K31446J95383K95691M99312P30372
$$ plain form
38079 23028804 23681578 23909283 23749568 23279236 22577279 21683530 20577698 19198617 17497637
38070 17497637 15493267 13291650 11061573 8981313 7186390 5740474 4637979 3833125
38062 3833125 3278935 2955160 2871873 3051541 3505190 4218648 5155613 6272566 7533079
38053 7533079 8909338 10368369 11854319 13284607 14568711 15639545 16475419 17096613
38045 17096613 17539707 17828893 17964272 17933657 17737751 17410238 17018832 16646578 16365179
38036 16365179 16215030 16199080 16287297 16424962 16542233 16566682 16438551 16123462 15617222 14943399
38026 14943399 14149296 13304005 12496279 11827003 11393569 11268335 11477195 11986207 12703358
38017 12703358 13498034 14234466 14810615 15191285 15422731 15618114 15913805 16413117 17143489
38008A7143489R01492R43742Q22109N37465J22411l65832q56612j280963j587073
37999A6380228j752219j788389j739393j668636j640077j698591j856327k089292
37991B147304k344659k555939k661116k618928k419137k083362j655851j188713
37983a5380401p29404l14112L6013L18242N46899P42104R13527J051856J134074
37974a1681202J135408J037913Q34952N36324J73060k05244n42935p93290r27151
37965a0432165r33429q15072n83066k50194J70847O61007J184996J691199K128594
37956g177283K470018K720778K902578L025606L073057L012336K825073K532968
37948A5385131K199186J902742J702912J616781J620711J668229J709932J707562
$$ plain form
38008 17143489 18044981 18988723 19810832 20348297 20470708 20104876 19248264 17967301 16380228
37999 16380228 14628009 12839620 11100227 9431591 7791514 6092923 4236596 2147304
37991 2147304 -197355 -2753294 -5414410 -8033338 -10452475 -12535837 -14191688 -15380401
37983 -15380401 -16109805 -16423917 -16387904 -16069662 -15522763 -14780659 -13867132 -12815276 -11681202
37974 -11681202 -10545794 -9507881 -8672929 -8136605 -7963545 -8168789 -8711724 -9505014 -10432165
37965 -10432165 -11365594 -12180666 -12763732 -13013926 -12843079 -12182072 -10997076 -9305877 -7177283
37956 -7177283 -4707265 -1986487 916091 3941697 7014754 10027090 12852163 15385131
37948 15385131 17584317 19487059 21189971 22806752 24427463 26095692 27805624 29513186
37940B9513186J641579J511343J326607J096006Q23358N15187J89225j27893m12418
37931C6076180o53309q53143j023702j180849j337399j492386j622629j685991
37923B6226772j638026j452713j136106p28549k96983Q1084L40619M52264M33347
37914B2281709L38417K34560J76421J92286K81269M16058N48613O20027N74024
37905B5663384L70307n650n36998j174824j844801k462435k952415l263163l370934
37896A0422471l275894k997848k575257k063385j525642j018904n80734k24692
37888c839885N6985K87261M96106P10290R44257J196491J451427J682889J857527
37879D843348J941927J915092J780223J566061J315214J067366Q49272O76891
$$ plain form
37940 29513186 31154765 32666108 33992715 35088721 35912079 36427266 36616491 36488598 36076180
37931 36076180 35422871 34569728 33546026 32365177 31027778 29535392 27912763 26226772
37923 26226772 24588746 23136033 21999927 21271378 20974395 21055479 21396098 21848362 22281709
37914 22281709 22620126 22854686 23031107 23223393 23504662 23920720 24469333 25089360 25663384
37905 25663384 26033691 26028041 25491043 24316219 22471418 20008983 17056568 13793405 10422471
37896 10422471 7146577 4148729 1573472 -489913 -2015555 -3034459 -3615193 -3839885
37888 -3839885 -3782900 -3495639 -2999533 -2289243 -1344986 -148495 1302932 2985821 4843348
37879 4843348 6785275 8700367 10480590 12046651 13361865 14429231 15278503 15955394
37871A5955394N64878N32471N97885P63479J002640J259255J461770J545058J470258
37862B5153088J234699Q68031M16542p5528n77152j069908j540302j972558k345631
37853B0091281k634942k818303k883578k832336k676044k429428k109459j740802
37845c3611j359668j009795p33371n62092n07988n53077o45582p13733o95817
37836f814734n68650l56457j17900P7493J72502J40391m509k08443l94799m90932
37826h566038m54009k84362k1653K72480N36130P24115Q14536Q04521P00579N12686
37816d961015K57218l6484l26758n71432p41768q26895q27391p47620n95413l88048
37806i765606j55925O3480K40425L65969M50882N08946N38307N18271M25565K57702
$$ plain form
37871 15955394 16520272 17052743 17650628 18414107 19416747 20676002 22137772 23682830 25153088
37862 25153088 26387787 27255818 27672360 27596832 27019680 25949772 24409470 22436912 20091281
37853 20091281 17456339 14638036 11754458 8922122 6246078 3816650 1707191 -33611
37845 -33611 -1393279 -2403074 -3136445 -3698537 -4206525 -4759602 -5405184 -6118917 -6814734
37836 -6814734 -7383384 -7739841 -7857741 -7780248 -7607746 -7467355 -7471864 -7680307 -8075106 -8566038
37826 -8566038 -9020047 -9304409 -9326062 -9053582 -8517452 -7793337 -6978801 -6174280 -5473701 -4961015
37816 -4961015 -4703797 -4740281 -5067039 -5638471 -6380239 -7207134 -8034525 -8782145 -9377558 -9765606
37806 -9765606 -9921531 -9858051 -9617626 -9251657 -8800775 -8291829 -7753522 -7235251 -6809686 -6551984
37796f551984M6915j43886k41798j92285J8452L59182P68516J178020J531226
37787c227642J794106J957937K034504K044389K004900J925917J814464J680103
37779A2028678J534288J384672J229857J058037Q49392N81091K34512j96105o95558
37770A8008864j224527j725569k137427k409669k508953k416974k128472j656195
37762A801078j040026l51224L15940Q66199J231927J394417J384324J260270J080265
37753G943170Q83712O89336N01473L16869J31225n3658k26106l68989m69721n26836
37743H820475n47147n37598n01925m47263l94849l82663m53168o31546r07398
37734D016918j230512j523247j705524j724253j575587j308392j004875p46384
$$ plain form
37796 -6551984 -6505069 -6648955 -6890753 -7083038 -7064586 -6705404 -5936888 -4758868 -3227642
37787 -3227642 -1433536 524401 2558905 4603294 6608194 8534111 10348575 12028678
37779 12028678 13562966 14947638 16177495 17235532 18084924 18666015 18900527 18704422 18008864
37770 18008864 16784337 15058768 12921341 10511672 8002719 5585745 3457273 1801078
37762 1801078 761052 409828 725768 1591967 2823894 4218311 5602635 6862905 7943170
37753 7943170 8826882 9516218 10017691 10334560 10465785 10412127 10186021 9817032 9347311 8820475
37743 8820475 8273328 7735730 7233805 6786542 6391693 6009030 5555862 4924316 4016918
37734 4016918 2786406 1263159 -442365 -2166618 -3742205 -5050597 -6055472 -6801856
37726f801856n80026n00235m52865l61175j63949J52394N45947R41293J268319
37717e952153J494416J631681J717635J784467J837922J857852J815764J693217
37709G880801J488997J216327Q99112N70975K71739L6500j18289k01853k45019
37700A1799290k89154l73103n19137p20366r38184j116322j204773j176806j029841
37691D431604p78008m49049q6122K56954N32941P21870Q39632R28226J034712
37682G432760J190245J396331J620779J805225J884565J812449J579857J215375
37674A9937586P68113K86533j93161o46231j053316j397117j664546j852465j972659
37665A2212737k051087k118364k194616k277577k342219k352398k276312k096390
$$ plain form
37726 -6801856 -7381882 -7882117 -8334982 -8696157 -8860106 -8707712 -8161765 -7220472 -5952153
37717 -5952153 -4457737 -2826056 -1108421 676046 2513968 4371820 6187584 7880801
37709 7880801 9369798 10586125 11485237 12056212 12327951 12364451 12246162 12044309 11799290
37700 11799290 11510136 11137033 10617896 9897530 8959346 7843024 6638251 5461445 4431604
37691 4431604 3653596 3204547 3118425 3375379 3908320 4630190 5469822 6398048 7432760
37682 7432760 8623005 10019336 11640115 13445340 15329905 17142354 18722211 19937586
37674 19937586 20705699 20992232 20799071 20152840 19099524 17702407 16037861 14185396 12212737
37665 12212737 10161650 8043286 5848670 3571093 1228874 -1123524 -3399836 -5496226
37657e496226j811352j435652j000101n49121j28053K35156N38444P95045J013306
37648g838554J185468J292428J316145J249224J099446Q90417O57726M40956K75462
37639E68718J86707J85383K62248L87439N19352O20443O70731O71706O39386N90373
37629E302486N28664M41859L09620J18229j28029m02612o59915q47549r27454
37620C735299q96124p88773o62173n67639n31304n50034o00097o51339o80301
37611b192485o77340o46110n97870n44879m95309m50874m08548l65870l25307
37602f704592k92009k65462k32967j72778o6057R1081K83744M83954O61441P94049
37592e419596Q73605R05286R02657Q84442Q75896R08493J008649J178053J382441
$$ plain form
37657 -5496226 -7307578 -8743230 -9743331 -10292452 -10420505 -10185349 -9646905 -8851860 -7838554
37648 -7838554 -6653086 -5360658 -4044513 -2795289 -1695843 -805426 -147700 293256 568718
37639 568718 755425 940808 1203056 1590495 2109847 2730290 3401021 4072727 4712113 5302486
37629 5302486 5831150 6273009 6582629 6700858 6572829 6170217 5510302 4662753 3735299
37620 3735299 2839175 2050402 1388229 820590 289286 -260748 -860845 -1512184 -2192485
37611 -2192485 -2869825 -3515935 -4113805 -4658684 -5153993 -5604867 -6013415 -6379285 -6704592
37602 -6704592 -6996601 -7262063 -7495030 -7667808 -7733865 -7642784 -7359040 -6875086 -6213645 -5419596
37592 -5419596 -4545991 -3640705 -2738048 -1853606 -977710 -69217 939432 2117485 3499926
37583C499926J562771J662337J649060J519418J288604R79404O16255K24027j69915
37574A2831887n31251q16029r76322r76466q12777n23682j81463J31422L48457
37565H493776M34686L87184K24813k4413l30480o60399r74469j229220j389472
37556D932006j439603j382914j231444r99221p05780l82556p1862J83133L51840
37547g46401M27882M33852M12905M06843M33048M77642N10046N06296M62342L88964
37537C713419K95178J75573J3162k03855m65541p38051r77495j148836j238051
37528e74497j253517j218897j160719j094489j015448q99505p14018m32793m9467
37519h413350M13563R03734J349352J683673J871178J918861J864980J756047
$$ plain form
37583 3499926 5062697 6725034 8374094 9893512 11182116 12161520 12777775 13001802 12831887
37574 12831887 12300636 11484607 10508285 9531819 8719042 8195360 8013897 8145319 8493776
37565 8493776 8928462 9315646 9540459 9516046 9185566 8525167 7550698 6321478 4932006
37556 4932006 3492403 2109489 878045 -121176 -826956 -1209512 -1281374 -1098241 -746401
37547 -746401 -318519 115333 528238 935081 1368129 1845771 2355817 2862113 3324455 3713419
37537 3713419 4008597 4184170 4197332 3993477 3527936 2789885 1812390 663554 -574497
37528 -574497 -1828014 -3046911 -4207630 -5302119 -6317567 -7217072 -7931090 -8363883 -8413350
37519 -8413350 -7999787 -7096053 -5746701 -4063028 -2191850 -272989 1591991 3348038
37511C348038J630216J514602J429925J393860J421403J523559J702836J945041
37503A5909480K212965K449829K593399K593641K426474K100999J659986J172342
37495C3119115P16907L60335J36047L2140o106n8594k02602m84168q99676j396713
37485C1316685j895760k322808k635887k833235k943517l007096l056067l097535
37477I524780l105652l029390k816217k440164j917689j302695o66154p3352M31308
37468e395225Q30541J134118J373582J590662J821357K082047K363247K631280
37460H431609K835461K920897K847226K607477K234475J786730J320715Q68330
37452B5852920M35147J8588l69846o95925r14200r92689r35803p91474o36655
$$ plain form
37511 3348038 4978254 6492856 7922781 9316641 10738044 12261603 13964439 15909480
37503 15909480 18122445 20572274 23165673 25759314 28185788 30286787 31946773 33119115
37495 33119115 33836022 34196357 34332404 34364544 34358438 34299844 34097242 33613074 32713398 31316685
37485 31316685 29420925 27098117 24462230 21628995 18685478 15678382 12622315 9524780
37477 9524780 6419128 3389738 573521 -1866643 -3784332 -5087027 -5753181 -5826533 -5395225
37468 -5395225 -4564684 -3430566 -2056984 -466322 1355035 3437082 5800329 8431609
37460 8431609 11267070 14187967 17035193 19642670 21877145 23663875 24984590 25852920
37452 25852920 26288067 26306655 25936809 25240884 24326684 23333995 22398192 21606718 20970063
37443B0970063n48155n75550p30310r91855j319946j664402j972114k194261k292374
37434H681096k239947k021672j636314j105204m79897J60700P27836J149115J390157
37425D625870J459921J397916J251973J058012Q29897N62912K49598j00648m52000
37416A0883451p50513r44974j006764r38410p67601n29374k45433Q5885M80930
37407F267197R49868J478880K025065K523266K901019L099054L091464K895651
37399B5231464K565462K170947J774931J417249J112536Q58857O46919M62714
37391C6241079K88280J09201p5106k52765m15952n75012p51750r56103j168638
37382C2443234j345148j440316j435162j352592j251130j197903j235013j358749
$$ plain form
37443 20970063 20421908 19846358 19116048 18124193 16804247 15139845 13167731 10973470 8681096
37434 8681096 6441149 4419477 2783163 1677959 1198062 1358762 2086598 3235713 4625870
37425 4625870 6085791 7483707 8735680 9793692 10623589 11186501 11436099 11335451 10883451
37416 10883451 10132938 9187964 8181200 7242790 6475189 5945815 5700382 5786267 6267197
37407 6267197 7217065 8695945 10721010 13244276 16145295 19244349 22335813 25231464
37399 25231464 27796926 29967873 31742804 33160053 34272589 35131446 35778365 36241079
37391 36241079 36529359 36638560 36563454 36310689 35894737 35319725 34567975 33611872 32443234
37382 32443234 31098086 29657770 28222608 26870016 25618886 24420983 23185970 21827221
37374B1827221j522238j657061j700932j619094j412677j114562p79002m70544
37366A1551111k51648j66011k21321l82319n81450p42235q02775p30302n26749
37357G146301k29758R0534L45105M54207L81043J49776j67157m84496p37161q92128
37347F056266r41481q91398p56177n55848l13497n2924K01593M25763O00477P20999
37337D493773Q02474Q74565R66672J092445J241538J381162J466479J456956J331720
37328A5107784J095388P73044M02886L4361k72984m61353m98347l97595k19986
37319A5563198n3717J4563p5647l43351p59331j249568j713616k057380k226666
37310G098485k220845k077866j844114j552495j219791q56483m77799j10990K02962
$$ plain form
37374 21827221 20304983 18647922 16946990 15327896 13915219 12800657 12021655 11551111
37366 11551111 11299463 11133452 10912131 10529812 9948362 9206127 8403352 7673050 7146301
37357 7146301 6916543 7007077 7352182 7806389 8187432 8337208 8170051 7685555 6948394 6056266
37347 6056266 5114785 4223387 3467210 2911362 2597865 2544941 2746534 3172297 3772774 4493773
37337 4493773 5296247 6170812 7137484 8229929 9471467 10852629 12319108 13776064 15107784
37328 15107784 16203172 16976216 17379102 17413463 17140479 16679126 16180779 15783184 15563198
37319 15563198 15509481 15524044 15448397 15105046 14345715 13096147 11382531 9325151 7098485
37310 7098485 4877640 2799774 955660 -596835 -1816626 -2673109 -3150908 -3261898 -3058936
37301c058936M16648M91963M14982K00185j15108m77369q21462j079581j198795
37292e227473j159661r82230p14707m14544j36351O9089J53901Q1344j58312n37710
37282i026654r99099j473934j901599k237142k448843k512855k412273k144243
37274b5156642j732164j231984p21143k71424P6821L20720M80161N78819O36179
37265b7020657O70486P01946P49764Q25782R29910J048791J157656J227169J236072
37256a8473081J184229J096293J010696R59210R49929R64353R69196R33534Q40065
37247i565576O87129M87353K68879P5595m3524n8006K1343J39810K21781K03930
37237g561286N5995k20348o04061j061466j540936j966400k246162k301297k099018
$$ plain form
37301 -3058936 -2642288 -2150325 -1735343 -1535158 -1650266 -2127635 -2949097 -4028678 -5227473
37292 -5227473 -6387134 -7369364 -8084071 -8498615 -8634966 -8565877 -8411976 -8330632 -8488944 -9026654
37282 -9026654 -10025753 -11499687 -13401286 -15638428 -18087271 -20600126 -23012399 -25156642
37274 -25156642 -26888806 -28120790 -28841933 -29113357 -29036536 -28715816 -28235655 -27656836 -27020657
37265 -27020657 -26350171 -25648225 -24898461 -24072679 -23142769 -22093978 -20936322 -19709153 -18473081
37256 -18473081 -17288852 -16192559 -15181863 -14222653 -13272724 -12308371 -11339175 -10405641 -9565576
37247 -9565576 -8878447 -8391094 -8122215 -8046620 -8090144 -8148150 -8126807 -7986997 -7765216 -7561286
37237 -7561286 -7505291 -7725639 -8329700 -9391166 -10932102 -12898502 -15144664 -17445961 -19544979
37228a9544979j668124j085496m43760J78372P29366J183618J534271J784346
37220a7332386J936850J987796J928430J756234J485520J148845P89466M51072
37212e848173J69442l2764j47645j79997j43066n4341O7845K06605L45768M65081
37202e151245N34395N13232L60343N2283l96720r26185j442019j847046k071780
37193a0374742k088147j904691j555647j093838n86308j06930K76428N18147O09075
37184a6306653N80218M88862L91879L22494K84610K63678K42034K08664J61417
37175a3362797J04200M3214j3768n4171n8776q163J03528K58400M19288N48387
37165a2020658O26276O56188O51531O20205N61075M73407L65962K54740J52323
$$ plain form
37228 -19544979 -21213103 -22298599 -22742359 -22563987 -21834621 -20651003 -19116732 -17332386
37220 -17332386 -15395536 -13407740 -11479310 -9723076 -8237556 -7088711 -6299245 -5848173
37212 -5848173 -5678731 -5711495 -5859140 -6039137 -6182203 -6236544 -6168699 -5962094 -5616326 -5151245
37202 -5151245 -4616850 -4103618 -3743275 -3690992 -4087712 -5013897 -6455916 -8302962 -10374742
37193 -10374742 -12462889 -14367580 -15923227 -17017065 -17603373 -17710303 -17433875 -16915728 -16306653
37184 -16306653 -15726435 -15237573 -14845694 -14523200 -14238590 -13974912 -13732878 -13524214 -13362797
37175 -13362797 -13258597 -13215383 -13229151 -13283322 -13342098 -13350261 -13246733 -12988333 -12569045 -12020658
37165 -12020658 -11394382 -10738194 -10086663 -9466458 -8905383 -8431976 -8066014 -7811274 -7658951
37156g658951N9455l5099j47436k86864m44110n88034o78151o87773o20116n03667
37146a1590746l71796k45495j32268l6003L7569Q6736J21566J60234K14028K75056
37136a1481119L18115L14330K46608J20265l3983j68444k38386k23171j34186
37127a1279971o197J17507J96017J98083J09782n9874k81317n14339p18732q61243
37117a3100284r21677r00915q26127p44352p02887p27439q12012r24130j016760
37108b0676583j038713r44474p07219l30568J50700O83253J211919J689914K080230
37099a7881541K352463K480420K444390K238326J876475J392214Q28882K30568
37091d037803l61206r07843j376451j744369k001771k152661k216029k224047
$$ plain form
37156 -7658951 -7599496 -7634595 -7782031 -8068895 -8513005 -9101039 -9779190 -10466963 -11087079 -11590746
37146 -11590746 -11962542 -12208037 -12340305 -12376308 -12338739 -12252003 -12130437 -11970203 -11756175 -11481119
37136 -11481119 -11163004 -10848674 -10602066 -10481801 -10515784 -10684228 -10922614 -11145785 -11279971
37127 -11279971 -11286168 -11168661 -10972644 -10774561 -10664779 -10724653 -11005970 -11520309 -12239041 -13100284
37117 -13100284 -14021961 -14922876 -15749003 -16493355 -17196242 -17923681 -18735693 -19659823 -20676583
37108 -20676583 -21715296 -22659770 -23366989 -23697557 -23546857 -22863604 -21651685 -19961771 -17881541
37099 -17881541 -15529078 -13048658 -10604268 -8365942 -6489467 -5097253 -4268371 -4037803
37091 -4037803 -4399009 -5306852 -6683303 -8427672 -10429443 -12582104 -14798133 -17022180
37083a7022180k212529k206747k212521k217522k197728k123240j965468j709815
37075c3867750j369307r86830o19670l15222r4711M6748J30666J87930K56033
37066c6632113L73930N71317Q59085J228522J657331K114623K562084K955811
37058b4309410L252591L418880L438159L313286L062764K713289K294389J838393
37050i77659J380938R54493N77119K49129l4195k62445m01298m06474k54425K9704
37040H54887L67545O54453Q05202P91056O46259M43883K59896J46204J22082J81092
37030E272559L03721M65951O41192Q02017R28201J016598J080928J138305J194880
37021A2844352J243699J272151J266218J208037J077230Q63506N82435K80059
$$ plain form
37083 -17022180 -19234709 -21441456 -23653977 -25871499 -28069227 -30192467 -32157935 -33867750
37075 -33867750 -35237057 -36223887 -36843557 -37158779 -37253490 -37206742 -37076076 -36888146 -36632113
37066 -36632113 -36258183 -35686866 -34827781 -33599259 -31941928 -29827305 -27265221 -24309410
37058 -24309410 -21056819 -17637939 -14199780 -10886494 -7823730 -5110441 -2816052 -977659
37050 -977659 403279 1357772 1934891 2184020 2149825 1887380 1486082 1079608 825183 854887
37040 854887 1222432 1876885 2682087 3473143 4119402 4563285 4823181 4969385 5091467 5272559
37030 5272559 5576280 6042231 6683423 7485440 8413641 9430239 10511167 11649472 12844352
37021 12844352 14088051 15360202 16626420 17834457 18911687 19775193 20357628 20637687
37013B0637687K2412j23057j08085P6504L88821P43077J037714J190188J159593
37004B5024854R49565N95329J42027l76584r46225j558173k182056k749101l163875
36995A5735761l339677l235068k870101k315850j666367j009614m10605R0556
36987I79035M72390P25904Q53182Q71167Q16692P44638P12211P53682Q62244R94106
36977H785251J092975J117429J053846R11350P08107M60427J78774j32527m74554
36968A3701078q49028j246535j634029j954504k143935k156218j982238j656759
36960G7832j252324q59232n54813l76923l18134l41221l99463m48100m49129l77857
36950e299364k31322l1293J82292L65267M85988N38398N42566N29130N17640N06557
$$ plain form
37013 20637687 20660099 20537042 20428957 20505461 20894282 21637359 22675073 23865261 25024854
37004 25024854 25974419 26569748 26711775 26335191 25388966 23830793 21648737 18899636 15735761
36995 15735761 12396084 9161016 6290915 3975065 2308698 1299084 888479 979035
36987 979035 1451425 2177329 3030511 3901678 4718370 5463008 6175219 6928901 7791145 8785251
36977 8785251 9878226 10995655 12049501 12960851 13668958 14129385 14308159 14175632 13701078
36968 13701078 12852050 11605515 9971486 8016982 5873047 3716829 1734591 77832
36960 77832 -1174492 -2033724 -2588537 -2965460 -3283594 -3624815 -4024278 -4472378 -4921507 -5299364
36950 -5299364 -5530686 -5561979 -5379687 -5014420 -4528432 -3990034 -3447468 -2918338 -2400698 -1894141
36940a894141M82483M37656L79167L25230K96846L12148L80997M95605O22854
36931A838845P10903P12915O12698M31673K12397o139k02807l73130n20617o50048
36921B766690p65474q70726r68898j058540j127576j150361j093908r33292o67977
36912e870062l28717K9300L42406N54914O31044N62731L74433J21343j24529k99331
36902d006468l71508l50974k78426k02761j59916j63126k06933k79868l76312
36893f396292m98963o50472q21134r82688j094042j116960j033725q57640o30688
36884a4082604m07923k33858j21188m4368M4952J87247L88033O12320Q03962R16846
36874a1936581R38727Q94069Q24645P60057O98297O11026M70341K76989O8596
$$ plain form
36940 -1894141 -1411658 -974002 -594835 -269605 27241 339389 720386 1215991 1838845
36931 1838845 2549748 3262663 3875361 4307034 4519431 4513292 4310485 3937355 3416738 2766690
36921 2766690 2001216 1130490 161592 -896948 -2024524 -3174885 -4268793 -5202085 -5870062
36912 -5870062 -6198779 -6169479 -5827073 -5272159 -4641115 -4078384 -3703951 -3582608 -3707137 -4006468
36902 -4006468 -4377976 -4728950 -5007376 -5210137 -5370053 -5533179 -5740112 -6019980 -6396292
36893 -6396292 -6895255 -7545727 -8366861 -9349549 -10443591 -11560551 -12594276 -13451916 -14082604
36884 -14082604 -14490527 -14724385 -14845573 -14889941 -14844989 -14657742 -14269709 -13657389 -12853427 -11936581
36874 -11936581 -10997854 -10103785 -9279140 -8519083 -7820786 -7209760 -6739419 -6462430 -6393834
36865f393834r8408j80786j73346j11850n5113o0759j68740l94410p23464j106192
36855i466902j459487j685726j705106j486408j061141n14201M6306N28083Q83520
36846a5921062J113066J244828J309042J326262J312317J287987J280295J311639
36838e735626J383014J462675J490713J402213J159382P74704L10984j41205m94490
36829A612364o87661o93509n15658j82775K55558P33535J179052J530227J752477
36820D983610J845457J833041J743202J595386J407113J209797J049710R63859
36812A6631175R50255R63575R44278Q56205P01441N06702L01832J11179m1635
36803B1925007j29523j27836k6497J61589M01539O45435Q44428R60001R72376
$$ plain form
36865 -6393834 -6492242 -6673028 -6846374 -6958224 -7013337 -7074096 -7242836 -7637246 -8360710 -9466902
36855 -9466902 -10926389 -12612115 -14317221 -15803629 -16864770 -17378971 -17332665 -16804582 -15921062
36846 -15921062 -14807996 -13563168 -12254126 -10927864 -9615547 -8327560 -7047265 -5735626
36838 -5735626 -4352612 -2889937 -1399224 2989 1162371 1937075 2248059 2106854 1612364
36829 1612364 924703 231194 -284464 -467239 -211681 521854 1700906 3231133 4983610
36820 4983610 6829067 8662108 10405310 12000696 13407809 14617606 15667316 16631175
36812 16631175 17581430 18545005 19489283 20345488 21046929 21553631 21855463 21966642 21925007
36803 21925007 21795484 21667648 21641151 21802740 22204279 22849714 23694142 24654143 25626519
36794B5626519Q85162P25205N36112L65012K46235J89510J78853J80691J53792
36785B9087091N6120j48569m79401r25017j438471j948186k381171k685574k841125
36776A6295697k855097k750955k559470k316674k063823j841238j674756j563646
36768a329962j479486j376595j206726r32226n36894l3429N36907J114807J638682
36759c604922K056621K330162K432903K349933K081586J650101J103906N13060
36751A0913350m6585n14822q62885j095353j239437j329622j394684j449083j488854
36742A492025j493715j436669j298047j076846p93412m82277j78922R2954L26107
36733d848802N23620O87971Q16410R06878R66579J012287J061378J121818J187996
$$ plain form
36794 25626519 26511681 27236886 27772998 28138010 28384245 28573755 28752608 28933299 29087091
36785 29087091 29143211 28994642 28515241 27590224 26151753 24203567 21822396 19136822 16295697
36776 16295697 13440600 10689645 8130175 5813501 3749678 1908440 233684 -1329962
36768 -1329962 -2809448 -4186043 -5392769 -6324995 -6861889 -6895318 -6358411 -5243604 -3604922
36759 -3604922 -1548301 781861 3214764 5564697 7646283 9296384 10400290 10913350
36751 10913350 10866765 10351943 9489058 8393705 7154268 5824646 4429962 2980879 1492025
36742 1492025 -1690 -1438359 -2736406 -3813252 -4606664 -5088941 -5267863 -5174909 -4848802
36733 -4848802 -4325182 -3637211 -2820801 -1913923 -947344 64943 1126321 2248139 3436135
36724C436135J242263J260560J222500J124328R87353Q54310P74038P82606Q89278
36715A2573371J070923J274791J429256J462059J323293J006038N55311N9564
36707B0754606l73136o46350p04578n51163k45843J20023M58815P12842Q59683
36698B0384899R01489Q51366P25586N43231L30650J24674l1857j02060o5386Q0783
36688B3743375L24856O42444R96910J347128J662746J934682K169528K370413
36680C5192082K519065K573615K485891K227670J807529J266935O61560M3825
36672D8778172n44571j074096j528015j900481k189530k389898k493136k495126
36664C4163319k403435k237285k019244j763872j471420j132697p43374l18395
$$ plain form
36724 3436135 4678398 5938958 7161458 8285786 9273139 10127449 10901487 11684093 12573371
36715 12573371 13644294 14919085 16348341 17810400 19133693 20139731 20695042 20754606
36707 20754606 20381470 19735120 19030542 18479379 18233536 18353559 18812374 19525216 20384899
36698 20384899 21286388 22137754 22863340 23406571 23737221 23861895 23830038 23727978 23662592 23743375
36688 23743375 24068231 24710675 25707585 27054713 28717459 30652141 32821669 35192082
36680 35192082 37711147 40284762 42770653 44998323 46805852 48072787 48734347 48778172
36672 48778172 48233601 47159505 45631490 43731009 41541479 39151581 36658445 34163319
36664 34163319 31759884 29522599 27503355 25739483 24268063 23135366 22391992 22073597
36656B2073597J02237M58331O82490P18859N43805J80180l03602q11337j246428
36647B2398132j538332j658910j623454j477578j278073j077665r17987q27338
36639A1998795q17641q79338r79636j071402j113374j090926j022375r45876q97366
36630C180861q94715r34541r97438j054836j074060j021948q69806o01938k25335
36621d493756K26478O99578J131850J464402J650618J664814J509214J214801
36613E067999Q34842M34457P8345j83286l27472l62564l19561k35549j39094m5268
36603D802849L8344J00205J17792O2028q9138l37161o55790r90609j265485j399823
36593C83212j337104j074156o73384k46440Q6623K44231K13122M6569j65691l36951
$$ plain form
36656 22073597 22175834 22634165 23316655 24035514 24579319 24759499 24455897 23644560 22398132
36647 22398132 20859800 19200890 17577436 16099858 14821785 13744120 12826133 11998795
36639 11998795 11181154 10301816 9322180 8250778 7137404 6046478 5024103 4078227 3180861
36630 3180861 2286146 1351605 354167 -700669 -1774729 -2796677 -3666483 -4268421 -4493756
36621 -4493756 -4267278 -3567700 -2435850 -971448 679170 2343984 3853198 5067999
36613 5067999 5902841 6337298 6415643 6232357 5904885 5542321 5222760 4987211 4848117 4802849
36603 4802849 4841193 4941398 5059190 5121218 5032080 4694919 4039129 3048520 1783035 383212
36593 383212 -953892 -2028048 -2701432 -2947872 -2861249 -2617018 -2403896 -2357327 -2523018 -2859969
36583b859969m10804l66248k06710N1535L79730P27714J020478J173298J122150
36574F31174Q51035L99398j51999p06297j175644j499928j656767j662214j562466
36565f533708j417810j281720j182045j113453j045189r38689p64776n14047k00473
36556a4991910J40046M57022P00374Q40781Q86211Q82956Q96657R81939J156780
36547h049144J393552J629073J789508J821605J716627J512693J272919J053214
36539D140047Q78907P40511O06359M43289K34340j5898k89344n66736q34266j083753
36529D253456j311015j512692j679246j788942j812410j727997j533994j245753
36521h358593q82193m56932J7651N19243J008603J432999J737853J879875J836131
$$ plain form
36583 -2859969 -3270773 -3637021 -3843731 -3792196 -3412466 -2684752 -1664274 -490976 631174
36574 631174 1482209 1881607 1729608 1023311 -152333 -1652261 -3309028 -4971242 -6533708
36565 -6533708 -7951518 -9233238 -10415283 -11528736 -12573925 -13512614 -14277390 -14791437 -14991910
36556 -14991910 -14851864 -14394842 -13694468 -12853687 -11967476 -11084520 -10187863 -9205924 -8049144
36547 -8049144 -6655592 -5026519 -3237011 -1415406 301221 1813914 3086833 4140047
36539 4140047 5018954 5759465 6365824 6809113 7043453 7027555 6738211 6171475 5337209 4253456
36529 4253456 2942441 1429749 -249497 -2038439 -3850849 -5578846 -7112840 -8358593
36521 -8358593 -9240786 -9697718 -9680067 -9160824 -8152221 -6719222 -4981369 -3101494 -1265363
36512a265363J608058J222179P27222J85188l43423q13991j204341j511048j739199
36503c134718j891806j964608j949247j842271j652894j403501j123412q41167
36495a5803624n79120l51009j61990j1108J05077J89986K46302K74799K70726
36486a5819961K19789R9176j12375m18528p93325j182751j520109j745218j816966
36477b3090268j717777j455722j066745o11270j58915K35088N47976P89849R86645
36468b5541139J157914J302924J400769J421163J339050J146873Q59934N12962
36460a6399550J50452j83059m47973o10811o46729n46646l25972k7373K89096
36451a8748565N67382P77883R26654J044651J164617J301790J450160J592566
$$ plain form
36512 -1265363 342695 1564874 2292096 2477284 2133861 1319870 115529 -1395519 -3134718
36503 -3134718 -5026524 -6991132 -8940379 -10782650 -12435544 -13839045 -14962457 -15803624
36495 -15803624 -16382744 -16733753 -16895743 -16906851 -16801774 -16611788 -16365486 -16090687 -15819961
36486 -15819961 -15600172 -15500996 -15613371 -16031899 -16825224 -18007975 -19528084 -21273302 -23090268
36477 -23090268 -24808045 -26263767 -27330512 -27941782 -28100697 -27865609 -27317633 -26527784 -25541139
36468 -25541139 -24383225 -23080301 -21679532 -20258369 -18919319 -17772446 -16912512 -16399550
36460 -16399550 -16249098 -16432157 -16880130 -17490941 -18137670 -18684316 -19010288 -19037661 -18748565
36451 -18748565 -18181183 -17403300 -16476646 -15431995 -14267378 -12965588 -11515428 -9922862
36443i922862J713817J806894J870442J902863J899585J855901J771867J653565
36435D552072J508623J340086J145965R28158P05601N19732M22848M53191O13767
36426A2190043Q70726J169657J452789J664962J755399J689793J471411J151082
36418B3415862Q10885N30541L59381L05669L37826L91988L90802K76365M2132
36409B6861451k60835n51034p56818q40549p95781o31454l63198j7849L58948
36400B3002881P04548R53066J053398R82407P49176L90840l7859m78281q80514
36391B6439662j211168j455834j619276j725829j818163j948779k161580k469423
36383A2029610k841083l207990l488185l613748l549200l298314k903084k435838
$$ plain form
36443 -9922862 -8209045 -6402151 -4531709 -2628846 -729261 1126640 2898507 4552072
36435 4552072 6060695 7400781 8546746 9474904 10180505 10700237 11123085 11576276 12190043
36426 12190043 13060769 14230426 15683215 17348177 19103576 20793369 22264780 23415862
36418 23415862 24226747 24757288 25116669 25422338 25760164 26152152 26542954 26819319 26861451
36409 26861451 26600616 26049582 25292764 24452215 23656434 23024980 22661782 22643933 23002881
36400 23002881 23707429 24660495 25713893 26696300 27445476 27836316 27798457 27320176 26439662
36391 26439662 25228494 23772660 22153384 20427555 18609392 16660613 14499033 12029610
36383 12029610 9188527 5980537 2492352 -1121396 -4670596 -7968910 -10871994 -13307832
36375a3307832j982374j617647j382745j273077j241918j217128j125627r18573
36367b4066921n88901j74029K58099O33623Q96545J020672J006267Q68182O26586
36358a9519877L05807o2719m41107p91702j085220j304421j441739j494531j462489
36349b7297998j348284j158666r03650n95567k51101J05841M48202P59731J049141
36340b9192351J348994J694984K099703K540582K968631L326907L563256L632713
36332h016581L497511L133968K546320J778561R14780O4951o59647j173275j436234
36323F50354j462143j309034j056782p79561n25744l14507j47833k5471N0226
36314d920495Q1215Q2648Q3736J18966K13703L68849N51496P01097P54296O75860
$$ plain form
36375 -13307832 -15290206 -16907853 -18290598 -19563675 -20805593 -22022721 -23148348 -24066921
36367 -24066921 -24655822 -24829851 -24571752 -23938129 -23041584 -22020912 -21014645 -20146463 -19519877
36358 -19519877 -19214070 -19276789 -19717896 -20509598 -21594818 -22899239 -24340978 -25835509 -27297998
36349 -27297998 -28646282 -29804948 -30708598 -31304165 -31555266 -31449425 -31001223 -30241492 -29192351
36340 -29192351 -27843357 -26148373 -24048670 -21508088 -18539457 -15212550 -11649294 -8016581
36332 -8016581 -4519070 -1385102 1161218 2939779 3854559 3919510 3259863 2086588 650354
36323 650354 -811789 -2120823 -3177605 -3957166 -4482910 -4797417 -4945250 -4970721 -4920495
36314 -4920495 -4839280 -4756632 -4672896 -4553930 -4340227 -3971378 -3419882 -2718785 -1964489 -1288629
36304a288629M74649J94663j08662l88772o15547p72543q50280q41249p41302
36295d937672n58534l23287q8458Q5186J52218J01123m2688k31195m17159n72357
36285f832823o89974p72968q21834q33509q09872p63667p12613o65346o11092
36276a3513698n22518l71538j49227J22553L97257O27012P89518Q98507R88289
36267a0733845J084707J188003J281826J356072J417533J476273J522142J516168
36259A08879J406981J160000P78602L05453j93271o49213j007865j235324j318851
36250f44609j265687j100674q60104n81914k97270k8630K06746L94277N25650
$$ plain form
36304 -1288629 -813980 -619317 -727979 -1116751 -1732298 -2504841 -3355121 -4196370 -4937672
36295 -4937672 -5496206 -5819493 -5907951 -5822765 -5670547 -5569424 -5612112 -5843307 -6260466 -6832823
36285 -6832823 -7522797 -8295765 -9117599 -9951108 -10760980 -11524647 -12237260 -12902606 -13513698
36276 -13513698 -14036216 -14407754 -14556981 -14434428 -14037171 -13410159 -12620641 -11722134 -10733845
36267 -10733845 -9649138 -8461135 -7179309 -5823237 -4405704 -2929431 -1407289 108879
36259 108879 1515860 2675860 3454462 3759915 3566644 2917431 1909566 674242 -644609
36250 -644609 -1910296 -3010970 -3871074 -4452988 -4750258 -4778888 -4572142 -4177865 -3652215
$$ [...]
##END NTUPLES=NMR SPECTRUM
##END=
