##TITLE=31Pdec_DE-44_EA2b_w
 D2O
 24 sc
 9.4.2024
##JCAMPDX= 6.0         $$ Bruker NMR JCAMP-DX V2.0
##DATA TYPE= NMR SPECTRUM
##DATA CLASS= NTUPLES
##ORIGIN= UXNMR, Bruker Analytische Messtechnik GmbH
##OWNER= root
$$ XWIN-NMR		Version 3.5
$$ Tue Apr  9 15:41:49 2024 Russian Standard Time (UT+4h)  she@DPX200
##.OBSERVE FREQUENCY= 81.013821
##.OBSERVE NUCLEUS= ^31P
##.ACQUISITION MODE= SIMULTANEOUS
##.ACQUISITION SCHEME= undefined
##.AVERAGES= 24
##.DIGITISER RES= 16
##SPECTROMETER/DATA SYSTEM= spect
##.PULSE SEQUENCE= zgpg30
##.SOLVENT NAME= CDCl3
##.SHIFT REFERENCE= (INTERNAL, CDCl3, 0, 248.564)
##AUDIT TRAIL= $$ (NUMBER, WHEN, WHO, WHERE, WHAT)
$$ ##TITLE= Audit trail, XWIN-NMR		Version 3.5
$$ ##JCAMPDX= 5.01
$$ ##ORIGIN= Bruker BioSpin GmbH
$$ ##OWNER= she
$$ F:/spectra/data/she/nmr/P31/1/pdata/1/auditp.txt
$$ ##AUDIT TRAIL=  $$ (NUMBER, WHEN, WHO, WHERE, WHAT)
(   1,<2024-04-09 15:40:52.20 +0400>,<she>,<DPX200>,
      <created by zg, POWCHK disabled, PULCHK disabled
       configuration hash MD5:
       00 E9 B6 7A A2 85 ED C7 34 08 36 98 17 FE 4E 26
       data hash MD5: 32K
       16 14 DA 3D BC C1 91 B2 59 13 A0 64 D8 EF AC 66>)
(   2,<2024-04-09 15:40:58.32 +0400>,<she>,<DPX200>,
      <Start of raw data processing
       efp BC_mod = 2 LB = 10 FT_mod = 6 PKNL = 1 PHC0 = -13416 PHC1 = 536.0829 SI = 64K 
       data hash MD5: 64K
       48 0E 75 CC E0 FD 06 47 91 D9 EF A5 1B A3 23 7E>)
(   3,<2024-04-09 15:41:11.39 +0400>,<she>,<DPX200>,
      <pk PHC0 = -13.41121 PHC1 = 0 
       data hash MD5: 64K
       07 7E 43 3D 5B BA 1C 58 F1 AD 86 3D 13 06 4E 9A>)
(   4,<2024-04-09 15:41:18.14 +0400>,<she>,<DPX200>,
      <abs ABSG = 5 
       data hash MD5: 64K
       93 FF 2F 51 DD A3 5B 9B 12 C0 ED E2 0E 8D 2B EB>)
$$ ##END=
$$ 
$$ hash MD5
$$ E0 43 88 AB A3 52 88 9C 95 A1 4D BD 1A 4C 06 AD
##$RELAX= 
##$RELAX= 
##$RELAX= 
##$RELAX= 
##$RELAX= 
##$RELAX= 
##$RELAX= 
##$RELAX= 
##$RELAX= 
$$ Bruker specific parameters
$$ --------------------------
##$DU= <F:/spectra>
##$EXPNO= 1
##$NAME= <P31>
##$PROCNO= 1
##$TYPE= <nmr>
##$USER= <she>
##$AMP= (0..31)
100 100 100 100 100 100 100 100 100 100 100 100 100 100 100 100 100 100 
100 100 100 100 100 100 100 100 100 100 100 100 100 100 
##$AQSEQ= 0
##$AQ_mod= 1
##$AUNM= <au_zg>
##$AUTOPOS= <>
##$BF1= 81.014009
##$BF2= 200.13
##$BF3= 200.13
##$BF4= 200.13
##$BF5= 200.13
##$BF6= 200.13
##$BF7= 200.13
##$BF8= 200.13
##$BYTORDA= 1
##$CFDGTYP= 0
##$CFRGTYP= 5
##$CHEMSTR= <none>
##$CNST= (0..31)
1 1 145 1 1 1 1 1 1 1 1 1 1 1 1 1 1 1 1 1 1 1 1 1 1 1 1 1 1 1 1 1 
##$CPDPRG= <waltz16>
##$CPDPRG1= <>
##$CPDPRG2= <waltz16>
##$CPDPRG3= <>
##$CPDPRG4= <mlev>
##$CPDPRG5= <mlev>
##$CPDPRG6= <mlev>
##$CPDPRG7= <mlev>
##$CPDPRG8= <mlev>
##$CPDPRGB= <>
##$CPDPRGT= <>
##$D= (0..31)
0 1 0 0 0 0 0 0 0 0 0 0.03 2e-05 3e-06 0 0 0 0 0 0 0 0 0 0 0 0 0 0 0 0 
0 0 
##$DATE= 1712662851
##$DBL= (0..7)
120 120 120 11 120 120 24 19 
##$DBP= (0..7)
150 150 150 150 150 150 150 150 
##$DBP07= 0
##$DBPNAM0= <>
##$DBPNAM1= <>
$$ [...]
##$SUBNAM3= <"">
##$SUBNAM4= <"">
##$SUBNAM5= <"">
##$SUBNAM6= <"">
##$SUBNAM7= <"">
##$SUBNAM8= <"">
##$SUBNAM9= <"">
##$SW= 501.771253377433
##$SWIBOX= (0..15)
0 1 3 0 0 0 0 0 0 0 0 0 0 0 0 0 
##$SW_h= 40650.406504065
##$TD= 32768
##$TD0= 1
##$TE= 0
##$TE2= 300
##$TE3= 300
##$TEG= 300
##$TL= (0..7)
0 120 53 12 22 120 120 120 
##$TP= (0..7)
150 150 150 150 150 150 150 150 
##$TP07= 0
##$TPNAME0= <>
##$TPNAME1= <>
##$TPNAME2= <>
##$TPNAME3= <>
##$TPNAME4= <>
##$TPNAME5= <>
##$TPNAME6= <>
##$TPNAME7= <>
##$TPOAL= (0..7)
0.5 0.5 0.5 0.5 0.5 0.5 0.5 0.5 
##$TPOFFS= (0..7)
0 0 0 0 0 0 0 0 
##$TUNHIN= 0
##$TUNHOUT= 0
##$TUNXOUT= 0
##$USERA1= <user>
##$USERA2= <user>
##$USERA3= <user>
##$USERA4= <user>
##$USERA5= <user>
##$V9= 5
##$VALIST= <valist>
##$VCLIST= <CCCCCCCCCCCCCCC>
##$VD= 0
##$VDLIST= <DDDDDDDDDDDDDDD>
##$VPLIST= <PPPPPPPPPPPPPPP>
##$VTLIST= <TTTTTTTTTTTTTTT>
##$WBST= 1024
##$WBSW= 4
##$XGAIN= (0..3)
0 0 0 0 
##$XL= 0
##$YL= 0
##$YMAX_a= 3425
##$YMIN_a= -1854
##$ZGOPTNS= <>
##$ZL1= 120
##$ZL2= 120
##$ZL3= 120
##$ZL4= 120
##$ABSF1= 248.5645
##$ABSF2= -253.2056
##$ABSG= 5
##$ABSL= 3
##$ALPHA= 0
##$AQORDER= 0
##$ASSFAC= 0
##$ASSFACI= 0
##$ASSFACX= 0
##$ASSWID= 0
##$AUNMP= <proc_1d>
##$AZFE= 0.1
##$AZFW= 0.5
##$BCFW= 0
##$BC_mod= 2
##$BYTORDP= 0
##$COROFFS= 0
##$CY= -3
##$DATMOD= 1
##$DC= 0
##$DFILT= <>
##$DTYPP= 0
##$F1P= 0
##$F2P= 0
##$FCOR= 1
##$FTSIZE= 65536
##$FT_mod= 6
##$GAMMA= 0
##$GB= 0
##$INTBC= 1
##$INTSCL= 6.047779e-11
##$ISEN= 30
##$LB= 10
##$LEV0= 0
##$LPBIN= 0
##$MAXI= 10000
##$MC2= 0
##$MEAN= 0
##$ME_mod= 0
##$MI= 50
##$NCOEF= 0
##$NC_proc= -12
##$NLEV= 6
##$NOISF1= 182.463
##$NOISF2= 159.3651
##$NSP= 0
##$NTH_PI= 0
##$NZP= 0
##$OFFSET= 248.5645
##$PC= 4
##$PHC0= -13429.41
##$PHC1= 536.0829
##$PH_mod= 1
##$PKNL= yes
##$PPARMOD= 0
##$PSCAL= 0
##$PSIGN= 0
##$REVERSE= no
##$SF= 81.0140089999694
##$SI= 65536
##$SIGF1= 159.3651
##$SIGF2= -187.1042
##$SINO= 113.3802
##$SIOLD= 16384
##$SREGLST= <1H.CDCl3>
##$SSB= 0
##$STSI= 65536
##$STSR= 0
##$SW_p= 40650.406504065
##$SYMM= 0
##$S_DEV= 0
##$TDeff= 32768
##$TDoff= 0
##$TI= <>
##$TILT= no
##$TM1= 0
##$TM2= 0
##$TOPLEV= 0
##$USERP1= <user>
##$USERP2= <user>
##$USERP3= <user>
##$USERP4= <user>
##$USERP5= <user>
##$WDW= 1
##$XDIM= 65536
##$YMAX_p= 270228798
##$YMIN_p= -200608262
$$ End of Bruker specific parameters
$$ ---------------------------------
##NTUPLES= NMR SPECTRUM
##VAR_NAME=  FREQUENCY,     SPECTRUM/REAL,   SPECTRUM/IMAG
##SYMBOL=    X,             R,               I
##VAR_TYPE=  INDEPENDENT,   DEPENDENT,       DEPENDENT
##VAR_FORM=  AFFN,          ASDF,            ASDF
##VAR_DIM=   65536,         65536,           65536
##UNITS=     HZ,            ARBITRARY UNITS, ARBITRARY UNITS
##FACTOR=    0.620285442955139, 1,           1
##FIRST=     20137.2065510682, 0,            0
##LAST=      -20513.1999529968, 0,           0
##MIN=       -20513.1999529968, -200608262,  0
##MAX=       20137.2065510682, 270228798,    0
$$ Real data points
##PAGE= N=1
##DATA TABLE= (X++(R..R)), XYDATA
$$ [...]
$$ plain form
41053 9300841 8925636 7832022 6206138 4248159 2162904 129367 -1737273 -3405920
41045 -3405920 -4915808 -6336833 -7732974 -9153939 -10650294 -12281081 -14091145 -16071587
41037 -16071587 -18140920 -20169305 -22029755 -23637063 -24947815 -25929552 -26533096 -26697231
41029 -26697231 -26383315 -25607203 -24436151 -22949768 -21195223 -19168225 -16825462 -14111391
41021 -14111391 -10982073 -7421728 -3453529 858955 5424735 10146579 14932234 19683125
41013 19683125 24271302 28533106 32299101 35449169 37956662 39889310 41364723 42490496
41005 42490496 43327431 43893315 44193346 44249058 44109368 43847723 43556321 43340484 43308814 43556191
40995 43556191 44141912 45068421 46268467 47610403 48926464 50056000 50883692 51352648 51445214
$$ packed form
41053I300841l75205j093614j625884j957979k085255k033537j866640j668647
41045c405920j509888j421025j396141j420965j496355j630787j810064j980442
41037a6071587k069333k028385j860450j607308j310752r81737o03544j64135
41029b6697231L13916P76112J171052J486383J754545K026998K342763K714071
41021a4111391L129318L560345L968199M312484M565780M721844M785655M750891
41013A9683125M588177M261804L765995L150068K507493J932648J475413J125773
41005D2490496Q36935N65884L00031N5712j39690k61645k91402k15837l1670K47377
40995D3556191N85721R26509J200046J341936J316061J129536Q27692M68956R2566
$$ plain form
40986 51445214 51143561 50396171 49112923 47189088 44535832 41096488 36851657 31831932
40978 31831932 26145122 20001510 13713760 7660790 2221301 -2305358 -5763760 -8163553
40970 -8163553 -9645357 -10408878 -10640563 -10473996 -9993611 -9265480 -8362691 -7360146 -6303297
40961 -6303297 -5181756 -3934155 -2480308 -755330 1271947 3593070 6155306 8855395
40953 8855395 11539673 14019969 16105480 17637372 18508604 18663965 18092749 16826666 14939473
40944 14939473 12537124 9740301 6673922 3469001 263116 -2815997 -5681898 -8319233
40936 -8319233 -10793915 -13231515 -15761353 -18442340 -21207739 -23867996 -26182559 -27968888
40928 -27968888 -29189834 -29968877 -30523526 -31055397 -31658204 -32287471 -32796336 -33009767 -32797830
$$ packed form
40986E1445214l01653p47390j283248j923835k653256l439344m244831n019725
40978C1831932n686810o143612o287750o052970n439489m526659l458402k399793
40970h163553j481804p63521k31685J66567M80385P28131R02789J002545J056849
40961f303297J121541J247601J453847J724978K027277K321123K562236K700089
40953H855395K684278K480296K085511J531892Q71232J55361n71216j266083j887193
40944A4939473k402349k796823l066379l204921l205885l079113k865901k637335
40936h319233k474682k437600k529838k680987k765399k660257k314563j786329
40928b7968888j220946p79043n54649n31871o02807o29267n08865k13431K11937
$$ plain form
40919 -32797830 -32113766 -30983810 -29469196 -27642071 -25598333 -23485197 -21500994 -19854617
40911 -19854617 -18714687 -18182543 -18290336 -19002287 -20207993 -21719032 -23284732 -24631238
40903 -24631238 -25517347 -25794243 -25448021 -24599023 -23447096 -22186699 -20942631 -19766136 -18685199
40894 -18685199 -17761003 -17102703 -16832082 -17029412 -17698746 -18769458 -20127291 -21656882 -23274568
40885 -23274568 -24933244 -26596833 -28206014 -29666809 -30874576 -31754240 -32285581 -32500029
40877 -32500029 -32460358 -32241597 -31919371 -31559403 -31202865 -30852806 -30473208 -30006209 -29399742
40868 -29399742 -28629572 -27704081 -26652670 -25509121 -24303927 -23075121 -21896568 -20907659
40860 -20907659 -20317814 -20366343 -21244739 -23015058 -25562373 -28599828 -31721422 -34486590 -36518399
$$ packed form
40919c2797830O84064J129956J514614J827125K043738K113136J984203J646377
40911a9854617J139930N32144j07793p11951j205706j511039j565700j346506
40903b4631238q86109k76896L46222Q48998J151927J260397J244068J176495J080937
40894a8685199R24196O58300K70621j97330o69334j070712j357833j529591j617686
40885b3274568j658676j663589j609181j460795j207767q79664n31341k14448
40877c2500029L9671K18761L22226L59968L56538L50059L79598M66999O06467
40868b9399742P70170R25491J051411J143549J205194J228806J178553R88909
40860b0907659N89845m8529q78396j770319k547315l037455l121594k765168k031809
$$ plain form
40851 -36518399 -37591979 -37682650 -36948784 -35651674 -34050121 -32323863 -30560924 -28801269
40843 -28801269 -27095416 -25536451 -24252450 -23375751 -23012216 -23219250 -23986307 -25213081 -26695641
40834 -26695641 -28141982 -29230114 -29695788 -29412511 -28424803 -26920634 -25161834 -23407420
40826 -23407420 -21856434 -20618147 -19705898 -19049280 -18519292 -17958787 -17212044 -16153364 -14715312
40817 -14715312 -12908557 -10821072 -8597915 -6420634 -4500157 -3070044 -2354361 -2509784
40809 -2509784 -3577353 -5479786 -8062369 -11142917 -14541699 -18089683 -21628756 -25013103
40801 -25013103 -28114112 -30831295 -33110206 -34960408 -36461504 -37750729 -38995122 -40354374
40793 -40354374 -41940476 -43785895 -45839088 -47998393 -50169327 -52309149 -54431134 -56572785
$$ packed form
40851c6518399j073580r0671P33866J297110J601553J726258J762939J759655
40843b8801269J705853J558965J284001Q76699L63535k07034p67057j226774j482560
40834b6695641j446341j088132m65674K83277R87708J504169J758800J754414
40826b3407420J550986J238287R12249O56618N29988N60505P46743J058680J438052
40817a4715312J806755K087485K223157K177281J920477J430113P15683j55423
40809b509784j067569j902433k582583l080548l398782l547984l539073l384347
40801b5013103l101009k717183k278911j850202j501096j289225j244393j359252
40793d0354374j586102j845419k053193k159305k170934k139822k121985k141651
$$ plain form
40785 -56572785 -58754620 -60950653 -63074246 -64976295 -66455623 -67280149 -67213562 -66047425
40777 -66047425 -63647102 -60012123 -55328223 -49976219 -44479353 -39400075 -35216681 -32216519
40769 -32216519 -30441214 -29704367 -29669849 -29949884 -30183365 -30083355 -29466722 -28276999 -26594307
40760 -26594307 -24616799 -22606966 -20816677 -19421104 -18488471 -17989317 -17825736 -17860466 -17943950
40751 -17943950 -17948570 -17807657 -17538229 -17225391 -16968408 -16816449 -16734260 -16623128 -16386717 -15998359
40741 -15998359 -15524418 -15091633 -14827266 -14813706 -15077058 -15598032 -16322904 -17166737 -18019545
40732 -18019545 -18767312 -19323017 -19646947 -19738889 -19606641 -19236396 -18590231 -17632285 -16358398
40723 -16358398 -14800962 -13006549 -11012815 -8850923 -6569921 -4254866 -2018340 27603
$$ packed form
40785e6572785k181835k196033k123593j902049j479328q24526O6587J166137
40777f6047425K400323L634979M683900N352004N496866N079278M183394L000162
40769c2216519J775305P36847L4518k80035k33481J00010O16633J189723J682692
40760b6594307J977508K009833J790289J395573R32633M99154J63581l4730q3484
40751a7943950m620J40913K69428L12838K56983J51959Q2189J11132K36411L88358
40741a5998359M73941M32785K64367J3560k63352n20974p24872q43833q52808
40732a8019545p47767n55705l23930r1942J32248L70245O46165R57946J273887
40723a6358398J557436J794413J993734K161892K281002K315055K236526K045943
$$ plain form
40715 27603 1797744 3245868 4364443 5178200 5737635 6117380 6418281 6762037 7268149
40706 7268149 8019466 9036543 10274154 11634255 12982112 14161794 15016980 15420088 15302186
40697 15302186 14670874 13607508 12245246 10739040 9241261 7888552 6791936 6016482
40689 6016482 5547636 5261626 4927958 4258105 2982673 916581 -2019050 -5814997 -10401634
40680 -10401634 -15660643 -21421642 -27461971 -33520452 -39317675 -44568680 -48984978 -52278538
40672 -52278538 -54184734 -54509555 -53186958 -50319018 -46174152 -41136243 -35620417 -29987544
40664 -29987544 -24491151 -19275963 -14422589 -10008960 -6149350 -2984767 -630924 878469
40656 878469 1609977 1695492 1268859 416126 -834596 -2488287 -4547566 -6990854 -9774530
$$ packed form
40715B7603J770141J448124J118575Q13757N59435L79745L00901L43756N06112
40706G268149P51317J017077J237611J360101J347857J179682Q55186M03108j17902
40697A5302186o31312j063366j362262j506206j497779j352709j096616p75454
40689F016482m68846k86010l33668o69853j275432k066092k935631l795947m586637
40680a0401634n259009n760999o040329o058481n797223n251005m416298l293560
40672e2278538j906196l24821J322597K867940M144866N037909N515826N632873
40664b9987544N496393N215188M853374M413629L859610L164583K353843J509393
40656H78469P31508Q5515m26633q52733j250722j653691k059279k443288k783676
$$ plain form
40647 -9774530 -12851310 -16184720 -19742981 -23473606 -27276965 -30997002 -34433791 -37371164
40639 -37371164 -39610716 -41005435 -41487737 -41088805 -39947752 -38304322 -36461575 -34711058
40631 -34711058 -33238991 -32058408 -31009247 -29831676 -28276335 -26201025 -23620212 -20699243
40623 -20699243 -17702267 -14913038 -12556521 -10749237 -9488657 -8668396 -8099668 -7535832
40615 -7535832 -6712225 -5406244 -3500428 -1019868 1873869 4929095 7872077 10474082
40607 10474082 12598625 14218433 15399244 16252131 16862628 17218833 17174175 16475146 14852696
40598 14852696 12136867 8338091 3658371 -1564920 -6949917 -12158435 -16956862 -21238430
40590 -21238430 -25004776 -28316565 -31237275 -33795812 -35974952 -37712014 -38900035 -39397317
$$ packed form
40647i774530l076780l333410l558261l730625l803359l720037l436789k937373
40639c7371164k239552j394719m82302L98932J141053J643430J842747J750517
40631c4711058J472067J180583J049161J177571J555341K075310K580813K920969
40623b0699243K996976K789229K356517J807284J260580Q20261N68728N63836
40615g535832Q23607J305981J905816K480560K893737L055226K942982K602005
40607A0474082K124543J619808J180811Q52887O10497L56205m4658o99029j622450
40598A4852696k715829l798776m679720n223291n384997n208518m798427m281568
40590b1238430l766346l311789k920710k558537k179140j737062j188021m97282
$$ plain form
40582 -39397317 -39060668 -37798682 -35619168 -32646390 -29104703 -25279504 -21465520 -17912039
40574 -17912039 -14784113 -12162576 -10085826 -8602591 -7789773 -7712413 -8348440 -9532218 -10962745
40565 -10962745 -12280108 -13168147 -13425655 -12974748 -11822203 -10017448 -7637559 -4794498
40557 -4794498 -1641957 1629690 4807548 7680144 10077466 11916805 13220574 14080893
40549 14080893 14590449 14792316 14684574 14269009 13605434 12840534 12200245 11949007 12330183
40540 12330183 13510622 15548227 18383643 21844558 25657072 29472036 32914720 35652173
40532 35652173 37458560 38255502 38112177 37205696 35760991 33999571 32117489 30289541
40524 30289541 28678667 27431098 26655085 26396847 26629451 27259585 28144979 29112416 29973706
$$ packed form
40582c9397317L36649J261986K179514K972778L541687L825199L813984L553481
40574a7912039L127926K621537K076750J483235Q12818P7360o36027j183778j430527
40565a0962745j317363q88039k57508M50907J152545J804755K379889K843061
40557d794498L152541L271647L177858K872596K397322J839339J303769Q60319
40549A4080893N09556K01867j07742m15565o63575p64900o40289k51238L81176
40540A2330183J180439K037605K835416L460915L812514L814964L442684K737453
40532C5652173J806387P96942j43325r06481j444705j761420j882082j827948
40524C0289541j610874j247569p76013k58238K32604O30134Q85394R67437Q61290
$$ plain form
40515 29973706 30545506 30678063 30287094 29372408 28008589 26309854 24391300 22354030 20302922
40506 20302922 18375025 16740955 15558390 14896148 14677078 14682894 14626953 14260162 13458714
40497 13458714 12255894 10808167 9312165 7908969 6622029 5363347 4003721 2459513
40489 2459513 739779 -1065294 -2827171 -4413804 -5702371 -6581598 -6956949 -6759961 -5957984
40480 -5957984 -4564396 -2650104 -352253 2126844 4534199 6592538 8034382 8639011
40472 8639011 8267005 6885698 4579056 1540439 -1944947 -5519800 -8781397 -11333394
40464 -11333394 -12870046 -13264816 -12611913 -11190386 -9370979 -7517683 -5924246 -4791846
40456 -4791846 -4232442 -4282876 -4925603 -6117874 -7826063 -10049189 -12811200 -16118356 -19906470
$$ packed form
40515B9973706N71800J32557l90969r14686j363819j698735j918554k037270k051108
40506B0302922j927897j634070j182565o62242k19070N816n5941l66791q01448
40497A3458714j202820j447727j496002j403196j286940j258682j359626j544208
40489B459513j719734j805073j761877j586633j288567q79227l75351J96988Q01977
40480e957984J393588J914292K297851K479097K407355K058339J441844O04629
40472H639011l72006j381307k306642l038617l485386l574853l261597k551997
40464a1333394j536652l94770O52903J421527J819407J853296J593437J132400
40456d791846N59404n0434o42727j192271j708189k223126k762011l307156l788114
$$ plain form
40447 -19906470 -24013089 -28189376 -32138949 -35565104 -38220394 -39956817 -40763368 -40770033 -40210436
40438 -40210436 -39359318 -38473459 -37755983 -37342959 -37296219 -37590802 -38105553 -38637942 -38950588
40429 -38950588 -38829150 -38121171 -36744723 -34679903 -31959182 -28658996 -24888633 -20778916
40421 -20778916 -16476116 -12136962 -7912017 -3913528 -184915 3300268 6596883 9722046
40413 9722046 12603130 15071857 16908673 17916640 17996255 17195966 15718493 13874380 11997300
40404 11997300 10358076 9113586 8301810 7870171 7720342 7758420 7936597 8266279 8793701
40395 8793701 9556524 10555502 11758967 13127833 14638050 16291652 18120689 20181863
40387 20181863 22529278 25163749 27984882 30783004 33283621 35219300 36389436 36684667
$$ packed form
40447a9906470m106619m176287l949573l426155k655290j736423q06551o665N59597
40438d0210436Q51118Q85859P17476M13024M6740k94583n14751n32389l12646
40429c8950588J21438P07979J376448K064820K720721L300186L770363M109717
40421b0778916M302800M339154M224945L998489L728613L485183L296615L125163
40413I722046K881084K468727J836816J007967P9615q00289j477473j844113j877080
40404A1997300j639224j244490q11776m31639j49829L8078J78177L29682N27422
40395H793701P62823R98978J203465J368866J510217J653602J829037K061174
40387B0181863K347415K634471K821133K798122K500617J935679J170136K95231
$$ plain form
40379 36684667 36077006 34588822 32256534 29107016 25162218 20472199 15156503 9427283
40371 9427283 3581053 -2036049 -7077942 -11254529 -14384009 -16423796 -17461299 -17662973
40363 -17662973 -17205411 -16222888 -14791779 -12948111 -10720915 -8165077 -5382584 -2525494
40355 -2525494 218533 2648234 4567835 5802503 6214946 5720214 4287613 1926645
40347 1926645 -1328936 -5421106 -10248782 -15643680 -21357411 -27070913 -32430077 -37101191
40339 -37101191 -40828676 -43477100 -45051377 -45696990 -45675306 -45304727 -44875083 -44567506 -44413739
40330 -44413739 -44304394 -44034282 -43372552 -42147805 -40324700 -38034347 -35536564 -33135267
40322 -33135267 -31098980 -29624798 -28840104 -28806280 -29501164 -30795208 -32456946 -34202551 -35764753
$$ packed form
40379C6684667o07661j488184k332288l149518l944798m690019n315696n729220
40371I427283n846230n617102n041893m176587l129480k039787j037503k01674
40363a7662973M57562R82523J431109J843668K227196K555838K782493K857090
40355b525494K744027K429701J919601J234668M12443m94732j432601k360968
40347A926645l255581m092170m827676n394898n713731n713502n359164m671114
40339c7101191l727485k648424j574277o45613K1684L70579M29644L07577J53767
40330d4413739J09345K70112O61730J224747J823105K290353K497783K401297
40322c3135267K036287J474182P84694L3824o94884j294044j661738j745605j562202
$$ plain form
40313 -35764753 -36941877 -37611611 -37725829 -37306499 -36441300 -35262865 -33907085 -32470632 -30999229
40304 -30999229 -29521956 -28111840 -26925678 -26183546 -26091772 -26756850 -28141907 -30080483 -32323188
40295 -32323188 -34584421 -36575152 -38029031 -38736487 -38591755 -37635779 -36060256 -34148765
40287 -34148765 -32172841 -30298999 -28557570 -26879358 -25164319 -23339962 -21388353 -19343837
40279 -19343837 -17274820 -15262363 -13380797 -11679362 -10166613 -8806433 -7532393 -6273702
40271 -6273702 -4978067 -3625039 -2234880 -876827 327886 1212630 1578366 1210216 -96116
40262 -96116 -2490605 -6014816 -10559476 -15855093 -21502487 -27034170 -31987617 -35969975
40254 -35969975 -38701894 -40042483 -40006071 -38775176 -36698009 -34250529 -31955225 -30276853
$$ packed form
40313c5764753j177124o69734j14218M19330Q65199J178435J355780J436453J471403
40304c0999229J477273J410116J186162P42132R1774o65078j385057j938576k242705
40295c2323188k261233j990731j453879p07456J44732R55976J575523J911491
40287c4148765J975924J873842J741429J678212J715039J824357J951609K044516
40279a9343837K069017K012457J881566J701435J512749J360180J274040J258691
40271f273702J295635J353028J390159J358053J204713Q84744L65736l68150j306332
40262i6116k394489l524211m544660n295617n647394n531683m953447l982358
40254c5969975k731919j340589L6412J230895K077167K447480K295304J678372
$$ plain form
40246 -30276853 -29535970 -29871507 -31248568 -33482057 -36258868 -39173149 -41795017 -43760175
40238 -43760175 -44836141 -44931155 -44053287 -42256598 -39607789 -36186162 -32110034 -27567765
40230 -27567765 -22825921 -18199420 -13993087 -10439651 -7655514 -5625510 -4221349 -3248138
40222 -3248138 -2496502 -1774500 -918213 192031 1590732 3183707 4749020 6002972 6700385
40213 6700385 6715793 6075789 4949312 3615049 2413087 1678522 1664502 2480286 4073469
40204 4073469 6264669 8811721 11465471 13994935 16191125 17874715 18917991 19265377
40196 19265377 18931205 17973788 16465872 14479483 12085282 9356745 6376263 3248541
40188 3248541 121699 -2797495 -5253780 -6987494 -7799741 -7609192 -6472546 -4561078
$$ packed form
40246c0276853P40883l35537j377061k233489k776811k914281k621868j965158
40238d3760175j075966r5014Q77868J796689K648809L421627M076128M542269
40230b7567765M741844M626501M206333L553436K784137K030004J404161R73211
40222c248138P51636P22002Q56287J110244J398701J592975J565313J253952O97413
40213F700385J5408o40004j126477j334263j201962p34565j4020Q15784J593183
40204D073469K191200K547052K653750K529464K196190J683590J043276L47386
40196A9265377l34172r57417j507916j986389k394201k728537k980482l127722
40188C248541l126842k919194k456285j733714q12247J90549J136646J911468
$$ plain form
40180 -4561078 -2111872 616026 3362190 5868135 7883949 9192439 9646864 9206384
40172 9206384 7954686 6095230 3922491 1772128 -42501 -1295370 -1900013 -1933845 -1619842
40163 -1619842 -1258738 -1125708 -1369105 -1954166 -2673504 -3214808 -3256897 -2562866 -1044371
40154 -1044371 1222264 4034916 7145076 10341853 13499492 16568195 19523736 22314355
40146 22314355 24834692 26929740 28417407 29124451 28934260 27830909 25912176 23360145
40138 23360145 20389135 17201821 13967555 10819371 7864874 5206734 2957576 1227278
40130 1227278 78081 -527001 -745125 -824506 -1035948 -1596237 -2616306 -4091172 -5922846
40121 -5922846 -7948955 -9956042 -11683948 -12849097 -13204253 -12616389 -11117522 -8893974
$$ packed form
40180d561078K449206K727898K746164K505945K015814J308490M54425m40480
40172I206384j251698j859456k172739k150363j814629j252869o04643l3832L14003
40163a619842L61104J33030k43397n85061p19338n41304m2089O94031J518495
40154a044371K266635K812652L110160L196777L157639L068703K955541K790619
40146B2314355K520337K095048J487667P07044j90191j103351j918733k552031
40138B3360145k971010l187314l234266l148184k954497k658140k249158j730298
40130A227278j149197o05082k18124p9381k11442n60289j020069j474866j831674
40121e922846k026109k007087j727906j165149l55156N87864J498867K223548
$$ plain form
40113 -8893974 -6218577 -3362178 -521915 2215014 4868906 7530673 10304206 13252148
40105 13252148 16366933 19572243 22745559 25750483 28468312 30813616 32720989 34111894
40097 34111894 34875829 34897579 34125062 32631824 30623111 28372722 26128969 24048965 22193525
40088 22193525 20565653 19149208 17920343 16838625 15841364 14854733 13816885 12698401
40080 12698401 11506418 10266737 8990243 7640805 6124268 4309869 2079367 -617946
40072 -617946 -3734987 -7141754 -10678666 -14218355 -17705108 -21158197 -24641254 -28208125
40064 -28208125 -31845330 -35440397 -38796429 -41682007 -43879907 -45209075 -45531564 -44774903
40056 -44774903 -42975333 -40308580 -37072155 -33622969 -30308919 -27421952 -25162194 -23591516
$$ packed form
40113h893974K675397K856399K840263K736929K653892K661767K773533K947942
40105A3252148L114785L205310L173316L004924K717829K345304J907373J390905
40097C4111894P63935K1750p72517j493238k008713k250389k243753k080004j855440
40088B2193525j627872j416445j228865j081718r97261r86631j037848j118484
40080A2698401j191983j239681j276494j349438j516537j814399k230502k697313
40072f17946l117041l406767l536912l539689l486753l453089l483057l566871
40064b8208125l637205l595067l356032k885578k197900j329168l22489P56661
40056d4774903J799570K666753L236425L449186L314050K886967K259758J570678
$$ plain form
40048 -23591516 -22586813 -21836818 -20916209 -19423479 -17127513 -14061095 -10523101 -6987985
40040 -6987985 -3958187 -1819341 -755508 -750432 -1657141 -3286558 -5463912 -8030646 -10810403
40031 -10810403 -13581103 -16084221 -18069703 -19349493 -19832645 -19533465 -18560990 -17099792
40023 -17099792 -15381843 -13644350 -12079321 -10795385 -9808778 -9058656 -8428318 -7765587 -6912904
40014 -6912904 -5751980 -4243732 -2434093 -417286 1719028 3929314 6207133 8557440
40006 8557440 10976358 13456811 16006970 18654882 21431063 24345800 27379332 30485397
39998 30485397 33597741 36631903 39479676 41998774 44011084 45327780 45801288 45376074
39990 45376074 44106847 42139450 39672510 36915479 34048324 31189748 28384953 25616321
$$ packed form
40048b3591516J004703P49995R20609J492730K295966L066418L537994L535116
40040f987985L029798K138846J063833N076r06709j629417k177354k566734k779757
40031a0810403k770700k503118j985482j279790m83152K99180R72475J461198
40023a7099792J717949J737493J565029J283936R86607P50122O30338O62731Q52683
40014f912904J160924J508248J809639K016807K136314K210286K277819K350307
40006H557440K418918K480453K550159K647912K776181K914737L033532L106065
39998C0485397L112344L034162K847773K519098K012310J316696M73508m25214
39990D5376074j269227j967397k466940k757031k867155k858576k804795k768632
$$ plain form
39982 25616321 22829670 19967779 17004458 13967610 10939432 8035413 5376047 3059503
39974 3059503 1132265 -439769 -1781274 -3079225 -4517526 -6199711 -8096215 -10047202
39966 -10047202 -11827645 -13245497 -14221753 -14814341 -15183923 -15527150 -16009998 -16730826 -17730738
39957 -17730738 -19040032 -20718418 -22847815 -25476894 -28557836 -31919939 -35296227 -38388489
39949 -38388489 -40940198 -42786318 -43864763 -44200833 -43891157 -43098415 -42038458 -40935431
39941 -40935431 -39950678 -39125460 -38376736 -37548145 -36479773 -35053715 -33199408 -30876930 -28068509
39932 -28068509 -24791551 -21121122 -17202230 -13245402 -9510235 -6275393 -3786055 -2184374
39924 -2184374 -1455938 -1429408 -1834578 -2387394 -2862379 -3129588 -3150629 -2942573 -2535520 -1955164
$$ packed form
39982B5616321k786651k861891k963321l036848l028178k904019k659366k316544
39974C059503j927238j572034j341505j297951j438301j682185j896504j950987
39966a0047202j780443j417852r76256n92588l69582l43227m82848p20828r99912
39957a7730738j309294j678386k129397k629079l080942l362103l376288l092262
39949c8388489k551709j846120j078445l36070L09676P92742J059957J103027
39941d0935431R84753Q25218P48724Q28591J068372J426058J854307K322478K808421
39932b8068509L276958L670429L918892L956828L735167L234842K489338J601681
39924b184374P28436K6530m05170n52816m74985k67209k1041K08056M07053N80356
$$ plain form
39914 -1955164 -1236954 -442904 349626 1081061 1731230 2311875 2843883 3338713 3788054
39905 3788054 4161766 4423330 4566999 4657176 4837805 5297614 6208817 7674073 9709083
39896 9709083 12264798 15269238 18659693 22387570 26398428 30601543 34844893 38910833
39888 38910833 42542684 45495298 47583857 48708021 48852982 48085576 46552515 44466571
39880 44466571 42064484 39540681 36983173 34344775 31470548 28175267 24335238 19948326
39872 19948326 15136824 10104725 5082098 280543 -4137736 -8082644 -11546738 -14591820
39864 -14591820 -17310023 -19777447 -22024431 -24030792 -25735091 -27045973 -27857274 -28074869
39856 -28074869 -27652518 -26621219 -25098596 -23276420 -21389794 -19669741 -18285929 -17300372
$$ packed form
39914a955164P18210P94050P92530P31435O50169N80645N32008M94830M49341
39905C788054L73712K61564J43669R0177J80629M59809R11203J465256K035010
39896I709083K555715L004440L390455L727877M010858M203115M243350M065940
39888C8910833L631851K952614K088559J124164J44961p67406j533061k085944
39880D4466571k402087k523803k557508k638398k874227l295281l840029m386912
39872A9948326m811502n032099n022627m801555m418279l944908l464094l045082
39864a4591820k718203k467424k246984k006361j704299j310882q11301k17595
39856b8074869M22351J031299J522623J822176J886626J720053J383812R85557
$$ plain form
39848 -17300372 -16657005 -16210986 -15772824 -15140208 -14119049 -12556986 -10394503 -7700847 -4654847
39839 -4654847 -1470072 1690998 4762635 7761259 10726092 13647949 16418630 18821398
39831 18821398 20565137 21349869 20944553 19255044 16359281 12496891 8021128 3332896
39823 3332896 -1191931 -5277789 -8806510 -11817354 -14433604 -16755459 -18788737 -20447423
39815 -20447423 -21610984 -22191037 -22176266 -21647781 -20767770 -19745903 -18789629 -18048057 -17564574
39806 -17564574 -17257271 -16939053 -16369276 -15312800 -13586625 -11090890 -7828729 -3913814
39798 -3913814 439487 4942000 9263575 13069243 16058818 18010753 18822173 18528841
39790 18528841 17291564 15350736 12969168 10389480 7818603 5428643 3351810 1657688
$$ packed form
39848a7300372O43367M46019M38162O32616J021159J562063K162483K693656L046000
39839d654847L184775L161070L071637K998624K964833K921857K770681K402768
39831A8821398J743739P84732m05316j689509k895763l862390m475763m688232
39823C332896m524827m085858l528721l010844k616250k321855k033278j658686
39815b0447423j163561n80053J4771N28485Q80011J021867R56274P41572M83483
39806a7564574L07303L18218N69777J056476J726175K495735L262161L914915
39798c913814M353301M502513M321575L805668K989575J951935Q11420k93332
39790A8528841j237277j940828k381568k579688k570877k389960k076833j694122
$$ plain form
39782 1657688 323305 -781238 -1875668 -3221967 -5059348 -7537937 -10668110 -14303239
39774 -14303239 -18168080 -21928891 -25282383 -28030769 -30114585 -31591727 -32574762 -33158168
39766 -33158168 -33368186 -33150288 -32390302 -30958749 -28765831 -25806737 -22175753 -18048283
39758 -18048283 -13655533 -9273496 -5217154 -1813795 649716 1979983 2101731 1049009
39750 1049009 -1062878 -4069930 -7788572 -12036550 -16641560 -21436152 -26242418 -30857853
39742 -30857853 -35060424 -38645375 -41484779 -43577055 -45049763 -46102089 -46910575 -47548557
39734 -47548557 -47965411 -48034709 -47638117 -46739071 -45420894 -43887203 -42425996 -41337444 -40840824
39725 -40840824 -40997515 -41686461 -42642121 -43536511 -44074625 -44074328 -43510812 -42518077 -41350147 -40310058
$$ packed form
39782A657688j334383j104543j094430j346299j837381k478589l130173l635129
39774a4303239l864841l760811l353492k748386k083816j477142r83035n83406
39766c3158168k10018K17898P59986J431553K192918K959094L630984M127470
39758a8048283M392750M382037M056342L403359K463511J330267J21748j052722
39750A049009k111887l007052l718642m247978m605010m794592m806266m615435
39742c0857853m202571l584951k839404k092276j472708j052326q08486o37982
39734d7548557m16854o9298L96592Q99046J318177J533691J461207J088552M96620
39725d0840824j56691o88946r55660q94390n38114K97N63516R92735J167930J040089
$$ plain form
39715 -40310058 -39662799 -39561824 -40020996 -40939707 -42156092 -43495565 -44801396 -45949475 -46844924
39706 -46844924 -47396430 -47483173 -46948088 -45637620 -43468309 -40474324 -36802769 -32661726 -28257431
39697 -28257431 -23761464 -19325645 -15126811 -11399193 -8418221 -6434297 -5591953 -5878392
39689 -5878392 -7121355 -9025232 -11223467 -13334885 -15021207 -16041250 -16291992 -15825467
39681 -15825467 -14831717 -13583139 -12352803 -11341414 -10646997 -10278164 -10179306 -10242139 -10311594
39672 -10311594 -10208739 -9772380 -8896410 -7542625 -5730247 -3517417 -988030 1752474
39664 1752474 4578105 7349403 9929129 12198545 14066853 15478352 16425923 16966167
39656 16966167 17219704 17350006 17535398 17953862 18782128 20190648 22315596 25209133 28793609
$$ packed form
39715d0310058O47259J00975m59172r18711j216385j339473j305831j148079q95449
39706d6844924n51506q6743N35085J310468K169311K993985L671555M141043M404295
39697b8257431M495967M435819M198834L727618K980972J983924Q42344k86439
39689e878392j242963j903877k198235k111418j686322j020043k50742M66525
39681a5825467R93750J248578J230336J011389O94417L68833R8858o2833o9455
39672a0311594J02855M36359Q75970J353785J812378K212830K529387K740504
39664A752474K825631K771298K579726K269416J868308J411499R47571N40244
39656A6966167K53537J30302J85392M18464Q28266J408520K124948K893537L584476
$$ plain form
39647 28793609 32854137 37086042 41178735 44893084 48096507 50750524 52873153 54505617
39639 54505617 55701714 56539681 57140221 57668280 58305144 59197163 60405462 61884744 63503874
39630 63503874 65094794 66498381 67581160 68220503 68277342 67581232 65946125 63221795 59364710
39621 59364710 54491545 48880076 42912777 36990686 31448121 26480461 22090957 18075882
39613 18075882 14070258 9649280 4446411 -1757644 -8997771 -17135117 -25898495 -34935330
39605 -34935330 -43851677 -52232060 -59651550 -65706542 -70077939 -72607383 -73344360 -72533245
39597 -72533245 -70546184 -67797824 -64677635 -61510706 -58535101 -55882597 -53566302 -51492526
39589 -51492526 -49507632 -47466700 -45292803 -43001941 -40692426 -38513745 -36627550 -35167059
$$ packed form
39647B8793609M060528M231905M092693L714349L203423K654017K122629J632464
39639E4505617J196097Q37967O00540N28059O36864Q92019J208299J479282J619130
39630F3503874J590920J403587J082779O39343N6839o96110j635107k724330l857085
39621E9364710m873165n611469n967299n922091n542565m967660m389504m015075
39613A8075882m005624m420978n202869o204055p240127q137346q763378r036835
39605c4935330q916347q380383p419490o054992m371397k529444p36977Q11115
39597g2533245J987061K748360L120189L166929K975605K652504K316295K073776
39589e1492526J984894K040932K173897K290862K309515K178681J886195J460491
$$ plain form
39581 -35167059 -34206299 -33757278 -33801432 -34335056 -35394027 -37036728 -39291878 -42098385 -45271331
39572 -45271331 -48523258 -51547752 -54133777 -56248919 -58040047 -59751110 -61609164 -63739648
39564 -63739648 -66139185 -68693214 -71208365 -73437912 -75096563 -75874018 -75461811 -73604113
39556 -73604113 -70168763 -65214518 -59019190 -52044837 -44847186 -37965595 -31836588 -26755123
39548 -26755123 -22878417 -20246412 -18793643 -18347660 -18633481 -19308911 -20033160 -20539942 -20676400
39539 -20676400 -20391408 -19689039 -18577427 -17035212 -15004306 -12410118 -9204302 -5414795
39531 -5414795 -1179573 3255930 7581811 11490178 14732497 17136893 18582282 18965476
39523 18965476 18209553 16322142 13452227 9879539 5926022 1850503 -2199101 -6156907
$$ packed form
39581c5167059R60760M49021m4154n33624j058971j642701k255150k806507l172946
39572d5271331l251927l024494k586025k115142j791128j711063j858054k130484
39564f3739648k399537k554029k515151k229547j658651p77455M12207J857698
39556g3604113L435350M954245O195328O974353P197651O881591O129007N081465
39548b6755123L876706K632005J452769M45983k85821o75430p24249n06782j36458
39539b0676400K84992P02369J111612J542215K030906K594188L205816L789507
39531e414795M235222M435503M325881L908367L242319K404396J445389L83194
39523A8965476p55923j887411k869915l572688l953517m075519m049604l957806
$$ plain form
39515 -6156907 -9977530 -13598526 -16948676 -19984698 -22724415 -25252477 -27693095 -30163640
39507 -30163640 -32733382 -35404814 -38117455 -40763649 -43209226 -45316993 -46967327 -48066147
39499 -48066147 -48538037 -48316317 -47345147 -45596939 -43093753 -39916809 -36194910 -32075103
39491 -32075103 -27690857 -23145771 -18519986 -13890955 -9355650 -5048620 -1154198 2096398
39483 2096398 4457122 5727896 5818582 4781451 2796606 125144 -2940492 -6109202
39475 -6109202 -9106506 -11682021 -13616288 -14730748 -14905568 -14105680 -12400240 -9952188
39467 -9952188 -6973648 -3675782 -247107 3140440 6332049 9220403 11786051 14105472
39459 14105472 16306936 18495650 20692421 22821824 24754586 26372750 27610622 28446118
$$ packed form
39515f156907l820623l620996l350150l036022k739717k528062k440618k470545
39507c0163640k569742k671432k712641k646194k445577k107767j650334j098820
39499d8066147m71890K21720R71170J748208K503186L176944L721899M119807
39491c2075103M384246M545086M625785M629031M535305M307030L894422L250596
39483B096398K360724J270774R0686j037131j984845k671462l065636l168710
39475f109202k997304k575515j934267j114460j74820P99888J705440K448052
39467i952188K978540L297866L428675L387547L191609K888354K565648K319421
39459A4105472K201464K188714K196771K129403J932762J618164J237872Q35496
$$ plain form
39451 28446118 28858901 28794425 28160826 26860609 24843440 22156800 18963180 15501932 12010214
39442 12010214 8651519 5494480 2542816 -217995 -2792665 -5179429 -7395133 -9500026
39434 -9500026 -11599809 -13815782 -16235297 -18868563 -21634011 -24377453 -26912829 -29063302
39426 -29063302 -30686555 -31684856 -32014302 -31701415 -30852510 -29628634 -28177298 -26550322 -24660083
39417 -24660083 -22309717 -19285651 -15460168 -10850783 -5620945 -45898 5527068 10718767
39409 10718767 15170604 18609709 20903442 22074644 22268429 21687420 20527494 18944843
39401 18944843 17068361 15044614 13080618 11449509 10446878 10313356 11154034 12886028
39393 12886028 15238938 17818510 20217176 22126492 23400550 24048472 24177488 23929825
$$ packed form
39451B8446118M12783o4476o33599j300217k017169k686640l193620l461248l491718
39442A2010214l358695l157039k951664k760811k574670k386764k215704k104893
39434i500026k099783k215973k419515k633266k765448k743442k535376k150473
39426b9063302j623253r98301l29446L12887Q48905J223876J451336J626976J890239
39417b4660083K350366L024066L825483M609385N229838N575047N572966N191699
39409A0718767M451837L439105K293733J171202J93785n81009j159926j582651
39401A8944843j876482k023747j963996j631109j002631j33522Q40678J731994
39393A2886028K352910K579572K398666J909316J274058O47922J29016k47663
$$ plain form
39385 23929825 23443736 22841888 22234764 21727234 21421689 21414104 21781850 22565163 23747418
39376 23747418 25244483 26917877 28618964 30247303 31785568 33282941 34795965 36323984
39368 36323984 37770850 38941207 39568331 39372099 38138079 35787225 32396366 28153821
39360 28153821 23277886 17951657 12313475 6499150 692567 -4864586 -9919241 -14277827
39352 -14277827 -17852058 -20658106 -22791033 -24406978 -25715046 -26951894 -28325133 -29951295
39344 -29951295 -31828844 -33856763 -35871930 -37676071 -39050353 -39774141 -39656214 -38570037
39336 -38570037 -36480739 -33458424 -29678311 -25409003 -20988813 -16788065 -13156425 -10363533
39328 -10363533 -8554098 -7739826 -7832632 -8699548 -10208693 -12243216 -14680344 -17356946 -20058863
$$ packed form
39385B3929825m86089o01848o07124n07530l05545p585L67746P83313J182255
39376B3747418J497065J673394J701087J628339J538265J497373J513024J528019
39368C6323984J446866J170357O27124j96232j234020k350854l390859m242545
39360B8153821m875935n326229n638182n814325n806583n557153n054655m358586
39352a4277827l574231k806048k132927j615945j308068j236848j373239j626162
39344b9951295j877549k027919k015167j804141j374282p23788J17927J086177
39336c8570037K089298L022315L780113M269308M420190M200748L631640K792892
39328a0363533J809435Q14272r2806q66916j509145k034523k437128k676602k701917
$$ plain form
39319 -20058863 -22561379 -24710556 -26498133 -28080549 -29728163 -31731469 -34307500 -37540337
39311 -37540337 -41369558 -45620611 -50056929 -54430235 -58513203 -62110339 -65052240 -67186115
39303 -67186115 -68379801 -68549927 -67705866 -65984042 -63648112 -61048150 -58551204 -56465748
39295 -56465748 -54982784 -54148070 -53865655 -53922129 -54023343 -53844690 -53095153 -51580267 -49239062
39286 -49239062 -46142132 -42461956 -38436345 -34333199 -30409103 -26857015 -23756512 -21052005
39278 -21052005 -18575240 -16105522 -13443713 -10474553 -7200945 -3742282 -295258 2932575
39270 2932575 5789556 8213810 10219693 11854283 13158838 14157975 14873509 15344762 15639048
39261 15639048 15844856 16048635 16304249 16609235 16898322 17055434 16939203 16414949 15381917
$$ packed form
39319b0058863k502516k149177j787577j582416j647614k003306k576031l232837
39311c7540337l829221m251053m436318m373306m082968l597136k941901k133875
39303f7186115j193686j70126Q44061J721824K335930K599962K496946K085456
39295e6465748J482964Q34714K82415n6474j01214J78653P49537J514886K341205
39286d9239062L096930L680176M025611M103146L924096L552088L100503K704507
39278b1052005K476765K469718K661809K969160L273608L458663L447024L227833
39270B932575K856981K424254K005883J634590J304555R99137P15534M71253K94286
39261A5639048K05808K03779K55614L04986K89087J57112j16231n24254j033032
$$ plain form
39252 15381917 13782769 11595030 8825953 5534495 1873289 -1891371 -5419402 -8388775
39244 -8388775 -10587676 -11954399 -12552253 -12511461 -11984785 -11139396 -10166709 -9272078 -8627479
39235 -8627479 -8310824 -8272993 -8352664 -8326094 -7966256 -7094224 -5615981 -3540999 -980472
39226 -980472 1873258 4781439 7501106 9824814 11607947 12781672 13358807 13437316 13192682
39217 13192682 12844219 12594758 12567717 12776133 13141784 13550523 13908358 14168426 14324062
39208 14324062 14384348 14352154 14216188 13958747 13572019 13068868 12477564 11826637 11139875 10452526
39198 10452526 9834210 9390097 9225884 9389957 9823532 10346514 10689419 10560910 9727017
39189 9727017 8078137 5668725 2721341 -410713 -3319176 -5632873 -7088230 -7548159
$$ packed form
39252A5381917j599148k187739k769077l291458l661206l764660l528031k969373
39244h388775k198901j366723n97854M0792N26676Q45389R72687Q94631O44599
39235h627479L16655L7831p9671K6570L59838Q72032J478243K074982K560527
39226i80472K853730K908181K719667K323708J783133J173725N77135P8509k44634
39217A3192682l48463k49461k7041K08416L65651M08739L57835K60068J55636
39208A4324062O0286l2194j35966k57441l86728n03151n91304o50927o86762o87349
39198A0452526o18316m44113j64213J64073M33575N22982L42905j28509q33893
39189I727017j648880k409412k947384l132054k908463k313697j455357m59929
$$ plain form
39181 -7548159 -6971481 -5368779 -2787043 664020 4773150 9221928 13633335 17653280
39173 17653280 21022573 23608052 25387914 26409031 26746273 26488286 25746738 24657122
39165 24657122 23344395 21868554 20198253 18243912 15932441 13275433 10395194 7506495
39157 7506495 4875417 2778945 1474961 1174017 1998562 3930651 6772226 10148968
39149 10148968 13572099 16545312 18680962 19780646 19848658 19041946 17593031 15744014
39141 15744014 13703099 11614475 9539914 7467710 5359308 3213929 1107018 -831696
39133 -831696 -2492769 -3865935 -5070222 -6317122 -7832488 -9781870 -12232648 -15161167
39125 -15161167 -18488746 -22115424 -25926245 -29774565 -33474053 -36822282 -39640958 -41798396
$$ packed form
39181g548159N76678J602702K581736L451063M109130M448778M411407M019945
39173A7653280L369293K585479J779862J021117L37242k57987p41548j089616
39165B4657122j312727j475841j670301j954341k311471k657008k880239k888699
39157G506495k631078k096472j303984l00944Q24545J932089K841575L376742
39149A0148968L423131K973213K135650J099684O8012q06712j448915j849017
39141A5744014k040915k088624k074561k072204k108402k145379k106911j938714
39133h31696j661073j373166j204287j246900j515366j949382k450778k928519
39125a5161167l327579l626678l810821l848320l699488l348229k818676k157438
$$ plain form
39117 -41798396 -43204806 -43807184 -43609353 -42704628 -41279827 -39563349 -37733508 -35837855
39109 -35837855 -33774064 -31349977 -28396143 -24874026 -20922174 -16811379 -12827155 -9142281
39101 -9142281 -5754461 -2526807 698426 3988949 7279440 10407024 13185299 15465981
39093 15465981 17162823 18245342 18722971 18630498 18013466 16914692 15371828 13430184 11157471
39084 11157471 8643774 5990015 3305063 720379 -1595315 -3448620 -4672267 -5199628
39076 -5199628 -5128952 -4737599 -4422722 -4584500 -5505596 -7281736 -9820471 -12883878 -16141402
39067 -16141402 -19219211 -21753836 -23456831 -24177185 -23933256 -22896430 -21337456 -19563652
39059 -19563652 -17865110 -16468505 -15494906 -14932523 -14643431 -14413211 -14033116 -13386973 -12505160
$$ packed form
39117d1798396j406410o02378J97831R04725J424801J716478J829841J895653
39109c5837855K063791K424087K953834L522117L951852M110795L984224L684874
39101i142281L387820L227654L225233L290523L290491L127584K778275K280682
39093A5465981J696842J082519M77629r2473o17032j098774j542864j941644k272713
39084A1157471k513697k653759k684952k584684k315694j853305j223647n27361
39076e199628P0676L91353L14877j61778r21096j776140k538735l063407l257524
39067a6141402l077809k534625j702995p20354K43929J036826J558974J773804
39059a9563652J698542J396605R73599N62383K89092K30220L80095O46143Q81813
$$ plain form
39050 -12505160 -11555098 -10768627 -10344961 -10381342 -10859238 -11675466 -12686556 -13740224 -14687660
39041 -14687660 -15387352 -15714580 -15579979 -14947898 -13844713 -12357639 -10631910 -8870212 -7328844
39032 -7328844 -6298312 -6056107 -6791502 -8526105 -11072243 -14060211 -17026991 -19525944
39024 -19525944 -21216075 -21912916 -21604069 -20437237 -18683365 -16674298 -14720782 -13030878
39016 -13030878 -11659116 -10509145 -9389216 -8097165 -6501373 -4585425 -2436043 -180386
39008 -180386 2089403 4355940 6657658 9030061 11449989 13817575 15982313 17791940
39000 17791940 19133024 19947495 20236515 20073048 19624331 19158548 19009615 19502223 20867214
38991 20867214 23182528 26359965 30176777 34333554 38512590 42418486 45799884 48463853
$$ packed form
39050a2505160R50062P86471M23666l6381m77896q16228j011090j053668r47436
39041a4687660o99692l27228J34601O32081J103185J487074J725729J761698J541368
39032g328844J030532K42205p35395j734603k546138k987968k966780k498953
39024a9525944j690131o96841L08847J166832J753872K009067J953516J689904
39016a3030878J371762J149971J119929J292051J595792J915948K149382K255657
39008a80386K269789K266537K301718K372403K419928K367586K164738J809627
39000A7791940J341084Q14471K89020j63467m48717m65783j48933M92608J364991
38991B0867214K315314L177437L816812M156777M179036L905896L381398K663969
$$ plain form
38983 48463853 50293126 51263822 51449205 50994880 50067100 48797931 47257673 45466380 43427844
38974 43427844 41156700 38679827 36013622 33135406 29975132 26448554 22530100 18331569
38966 18331569 14135902 10353497 7413796 5644695 5196197 6030885 7962472 10709446
38958 10709446 13947340 17361508 20699302 23807244 26639903 29243829 31731304 34255253
38950 34255253 36989925 40118969 43826265 48274767 53560215 59648239 66327512 73214896
38942 73214896 79827666 85706472 90543963 94261853 96999335 99025943 100636479 102085162
38934 102085162 103573925 105269877 107322756 109872804 113052315 116981250 121753983 127419736
38926 127419736 133966002 141312606 149317643 157792762 166525087 175301315 183925344 192218021
$$ packed form
38983D8463853J829273R70696J85383m54325r27780j269169j540258j791293k038536
38974D3427844k271144k476873k666205k878216l160274l526578l918454m198531
38966A8331569m195667l782405k939701j769101m48498Q34688J931587K746974
38958A0709446L237894L414168L337794L107942K832659K603926K487475K523949
38950C4255253K734672L129044L707296M448502N285448O088024O679273O887384
38942G3214896O612770N878806M837491L717890K737482K026608J610536J448683
38934A02085162J488763J695952K052879K550048L179511L928935M772733N665753
38926A27419736O546266P346604Q005037Q475119Q732325Q776228Q624029Q292677
$$ plain form
38918 192218021 199991280 207000982 212900701 217231290 219472753 219152033 215963805 209851988
38910 209851988 201025675 189919594 177125690 163315793 149165324 135287167 122186140
38903 122186140 110237873 99685921 90647615 83123496 77010300 72120395 68212613 65037430
38895 65037430 62388543 60139068 58240597 56684574 55451450 54478614 53657684 52848111
38887 52848111 51891665 50629797 48937106 46770287 44206342 41437895 38720106 36298544
38879 36298544 34355546 32989190 32213620 31967737 32132178 32557004 33091354 33601872 33978270
38870 33978270 34135088 34013685 33578847 32808120 31683476 30194867 28352226 26194632 23790609
38861 23790609 21230642 18614601 16038349 13586950 11337062 9358332 7700995 6372068
$$ packed form
38918A92218021P773259P009702N899719M330589K241463l20720l188228o111817
38910B09851988q826313j1106081j2793904j3809897j4150469j3878157j3101027
38903A22186140j1948267j0551952r038306p524119o113196m889905l907782l175183
38895F5037430k648887k249475j898471j556023j233124r72836q20930q09573
38887E2848111r56446j261868j692691k166819k563945k768447k717789k421562
38879C6298544j942998j366356p75570k45883J64441M24826N34350N10518L76398
38870C3978270J56818j21403m34838p70727j124644j488609j842641k157594k404023
38861B3790609k559967k616041k576252k451399k249888j978730j657337j328927
$$ plain form
38853 6372068 5315934 4409909 3474511 2302088 714703 -1354352 -3794726 -6317543
38845 -6317543 -8531157 -10056548 -10625413 -10125655 -8596273 -6197001 -3175653 164076
38837 164076 3506722 6583393 9219665 11340101 12926078 13964136 14428959 14310502 13655382
38828 13655382 12584429 11271157 9894599 8593333 7440640 6442980 5551199 4676844
38820 4676844 3716846 2590581 1279073 -155735 -1586196 -2862319 -3862411 -4530832
38812 -4530832 -4891070 -5030380 -5060009 -5065043 -5065545 -5008720 -4797043 -4336277 -3574893 -2515185
38802 -2515185 -1200657 299406 1895766 3483950 4962337 6261867 7368653 8322886
38794 8322886 9193716 10042660 10891128 11705033 12402426 12878490 13032806 12785739 12081804
$$ packed form
38853F372068j056134r06025r35398j172423j587385k069055k440374k522817
38845f317543k213614j525391n68865M99758J529382K399272L021348L339729
38837A64076L342646L076671K636272K120436J585977J038058M64823j18457o55120
38828A3655382j070953j313272j376558j301266j152693r97660q91781q74355
38820D676844r59998j126265j311508j434808j430461j276123j000092o68421
38812d530832l60238j39310k9629n034n02N6825K11677M60766P61384J059708
38802b515185J314528J500063J596360J588184J478387J299530J106786R54233
38794H322886Q70830Q48944Q48468Q13905O97393M76064J54316k47067p03935
$$ plain form
38785 12081804 10886853 9187600 6998415 4373535 1415458 -1728893 -4879918 -7831375
38777 -7831375 -10349472 -12187613 -13139794 -13120562 -12223554 -10715448 -8964608 -7342518 -6141515
38768 -6141515 -5531916 -5558804 -6165844 -7230288 -8597266 -10108736 -11627575 -13057042 -14351928
38759 -14351928 -15513571 -16560472 -17475772 -18153356 -18381398 -17892503 -16468347 -14042879 -10741128
38750 -10741128 -6829998 -2612084 1677264 5920203 10099343 14233371 18304537 22215550
38742 22215550 25792948 28827770 31130970 32585527 33184988 33046129 32381834 31437086 30419036
38733 30419036 29460044 28627152 27957603 27489839 27274127 27363167 27788899 28534463 29515193
38724 29515193 30582683 31555363 32264264 32594600 32507547 32039698 31291881 30421510 29637815
$$ packed form
38785A2081804j194951j699253k189185k624880k958077l144351l151025k951457
38777g831375k518097j838141r52181J9232Q97008J508106J750840J622090J201003
38768f141515O09599k6888o07040j064444j366978j511470j518839j429467j294886
38759a4351928j161643j046901r15300o77584k28042M88895J424156K425468L301751
38750a0741128L911130M217914M289348M242939M179140M134028M071166L911013
38742B2215550L577398L034822K303200J454557N99461j38859o64295r44748j018050
38733C0419036r58992q32892o69549m67764k15712Q9040M25732P45564R80730
38724B9515193J067490R72680P08901L30336q7053m67849p47817q70371p83695
$$ plain form
38715 29637815 29181644 29274260 30046790 31487811 33443230 35671308 37923614 40013609 41847957
38706 41847957 43416494 44753482 45893308 46846985 47615597 48232159 48797850 49475411 50430068
38697 50430068 51748268 53385379 55178823 56922942 58463472 59758367 60875457 61938565
38689 61938565 63060879 64300190 65647283 67041591 68405649 69689454 70908095 72151107
38681 72151107 73553484 75242239 77287795 79682495 82347618 85156231 87960958 90622075
38673 90622075 93029765 95110604 96817025 98116054 98996200 99489214 99680472 99687870 99619795
38664 99619795 99545121 99500101 99528357 99724444 100246691 101285830 103009843 105524726 108875040
38655 108875040 113071610 118112796 123977274 130592669 137802138 145354515 152935339 160235325
$$ packed form
38715B9637815m56171R2616P72530J441021J955419K228078K252306K089995J834348
38706D1847957J568537J336988J139826R53677P68612O16562N65691O77561R54657
38697E0430068J318200J637111J793444J744119J540530J294895J117090J063108
38689F1938565J122314J239311J347093J394308J364058J283805J218641J243012
38681G2151107J402377J688755K045556K394700K665123K808613K804727K661117
38673I0622075K407690K080839J706421J299029Q80146M93014J91258P398o8075
38664I9619795p4674m5020K8256J96087N22247J039139J724013K514883L350314
38655A08875040M196570N041186N864478O615395P209469P552377P580824P299986
$$ plain form
38647 160235325 167028065 173221581 178868725 184148702 189339039 194783834 200850569 207866422
38639 207866422 216032562 225327215 235425018 245673784 255166153 262914176 268087093 270228798
38631 270228798 269363318 265944484 260688571 254385926 247773493 241483872 236032135 231799416
38623 231799416 229005216 227687735 227713051 228816809 230662080 232887904 235131461 237027496
38615 237027496 238205632 238307567 237032058 234195048 229777098 223932216 216953515 209215256
38607 209215256 201115250 193024906 185240860 177940127 171158196 164810364 158754182 152864051
38599 152864051 147080812 141416382 135924075 130666084 125702928 121101624 116938346 113279838
38591 113279838 110154531 107538003 105363502 103545263 101995323 100626462 99347755 98062612
$$ packed form
38647A60235325O792740O193516N647144N279977N190337N444795O066735P015853
38639B07866422Q166140R294653J0097803J0248766R492369P748023N172917K141705
38631B70228798q65480l418834n255913o302645o612433o289621n451737m232719
38623B31799416k794200j317481K5316J103758J845271K225824K243557J896035
38615B37027496J178136J01935j275509k837010m417950n844882o978701p738259
38607B09215256q100006q090344p784046p300733o781931o347832o056182n890131
38599A52864051n783239n664430n492307n257991m963156m601304m163278l658508
38591A13279838l125307k616528k174501j818239j549940j368861j278707j285143
$$ plain form
38583 98062612 96674322 95098178 93273684 91165981 88749011 85978662 82781626 79084016
38575 79084016 74875851 70274321 65540588 61029911 57092737 53969408 51722758 50234482
38567 50234482 49260739 48514307 47733274 46715733 45328702 43511291 41280923 38734356
38559 38734356 36030838 33354399 30865861 28663481 26769913 25151797 23762925 22591011
38551 22591011 21687117 21162578 21148642 21729899 22880504 24438933 26140940 27696959 28872799
38542 28872799 29532290 29628647 29166451 28169624 26672474 24720494 22358128 19601630 16421305
38533 16421305 12757397 8567633 3879989 -1176682 -6374737 -11418084 -15992713 -19831048
38525 -19831048 -22779782 -24848107 -26204916 -27108840 -27795523 -28381569 -28838114 -29039629 -28846982
$$ packed form
38583I8062612j388290j576144j824494k107703k416970k770349l197036l697610
38575G9084016m208165m601530m733733m510677l937174l123329k246650j488276
38567E0234482r73743p46432p81033j017541j387031j817411k230368k546567
38559C8734356k703518k676439k488538k202380j893568j618116j388872j171914
38551B2591011r03894n24539j3936N81257J150605J558429J702007J556019J175840
38542B8872799O59491R6357m62196r96827j497150j951980k362366k756498l180325
38533A6421305l663908m189764m687644n056671n198055n043347m574629l838335
38525a9831048k948734k068325j356809r03924o86683n86046m56545k01515J92647
$$ plain form
38516 -28846982 -28174515 -27015306 -25427989 -23504197 -21337704 -19007964 -16576412 -14085718
38508 -14085718 -11558869 -9006230 -6445002 -3917610 -1487051 796382 2936216 5008585
38500 5008585 7144813 9487767 12142157 15132078 18370568 21648131 24652335 27021392
38492 27021392 28412999 28560281 27303080 24604250 20559312 15390589 9415353 2998124
38484 2998124 -3489877 -9696112 -15310668 -20099488 -23934261 -26795014 -28737658 -29844063
38476 -29844063 -30181332 -29785532 -28668649 -26840161 -24335717 -21244530 -17720248 -13959376
38468 -13959376 -10148686 -6408705 -2767691 820179 4426933 8098480 11816372 15484000
38460 15484000 18943014 22018194 24576872 26579346 28094845 29266029 30227984 31020534
$$ packed form
38516b8846982O72467J159209J587317J923792K166493K329740K431552K490694
38508a4085718K526849K552639K561228K527392K430559K283433K139834K072369
38500E008585K136228K342954K654390K989921L238490L277563L004204K369057
38492B7021392J391607J47282j257201k698830m044938n168723n975236o417229
38484B998124o488001o206235n614556m788820l834773k860753j942644j106405
38476b9844063l37269L95800J116883J828488K504444L091187L524282L760872
38468a3959376L810690L739981L641014L587870L606754L671547L717892L667628
38460A5484000L459014L075180K558678K002474J515499J171184R61955P92550
$$ plain form
38452 31020534 31549511 31627471 31068629 29774139 27758278 25117721 21986226 18513720 14872959
38443 14872959 11265219 7896594 4926610 2422578 356019 -1354190 -2786596 -3994675
38435 -3994675 -5030974 -5987426 -7006423 -8245240 -9817502 -11748810 -13964387 -16304226
38427 -16304226 -18557520 -20511917 -22007198 -22972963 -23434162 -23485378 -23247894 -22826110 -22279794
38418 -22279794 -21626940 -20879093 -20088499 -19374394 -18908031 -18863038 -19357879 -20418967 -21978467
38409 -21978467 -23899965 -26012156 -28135073 -30098622 -31760894 -33026489 -33855639 -34256862
38401 -34256862 -34265575 -33916886 -33220965 -32150083 -30646714 -28655055 -26164620 -23245056 -20054852
38392 -20054852 -16819660 -13788611 -11183482 -9157105 -7775872 -7033920 -6891099 -7310886
$$ packed form
38452C1020534N28977P7960n58842j294490k015861k640557l131495l472506l640761
38443A4872959l607740l368625k969984k504032k066559j710209j432406j208079
38435c994675j036299r56452j018997j238817j572262j931308k215577k339839
38427a6304226k253294j954397j495281r65765m61199n1216K37484M21784N46316
38418b2279794O52854P47847P90594P14105M66363M4993m94841j061088j559500
38409b1978467j921498k112191k122917j963549j662272j265595q29150m01223
38401c4256862q713L48689O95921J070882J503369J991659K490435K919564L190204
38392b0054852L235192L031049K605129K026377J381233P41952J42821m19787
$$ plain form
38384 -7310886 -8273801 -9760750 -11722149 -14052002 -16573772 -19037156 -21129973 -22513210
38376 -22513210 -22876996 -21999289 -19784106 -16266506 -11587199 -5951067 413354 7281750
38368 7281750 14445027 21702570 28838572 35592047 41644926 46651407 50305934 52418315
38360 52418315 52960795 52073837 50038713 47229382 44051282 40875598 37983977 35541461
38352 35541461 33607327 32176129 31223438 30726584 30648041 30897283 31303380 31622686 31582769
38343 31582769 30943485 29549763 27358194 24434113 20928074 17043077 12999464 9001486
38335 9001486 5212261 1745376 -1324833 -3942505 -6052792 -7598248 -8530607 -8830839
38327 -8830839 -8526689 -7699848 -6480451 -5029878 -3513852 -2071543 -792511 286321
$$ packed form
38384g310886r62915j486949j961399k329853k521770k463384k092817j383237
38376b2513210l63786Q77707K215183L517600M679307N636132O364421O868396
38368G281750P163277P257543P136002O753475O052879N006481L654527K112381
38360E2418315N42480q86958k035124k809331l178100l175684k891621k442516
38352C5541461j934134j431198r52691m96854p8543K49242M06097L19306l9917
38343C1582769o39284j393722k191569k924081l506039l884997m043613l997978
38335I001486l789225l466885l070209k617672k110287j545456r32359l00232
38327h830839L04150Q26841J219397J450573J516026J442309J279032J078832
$$ plain form
38319 286321 1162814 1844943 2337381 2645928 2791052 2817267 2793364 2808032 2964255 3366050
38309 3366050 4087744 5129407 6382699 7636413 8629512 9127578 8983628 8157121 6691942
38300 6691942 4674452 2197725 -649469 -3765702 -7006774 -10168142 -12998714 -15243161
38292 -15243161 -16692076 -17221056 -16814465 -15576712 -13725229 -11551144 -9345066 -7312734
38284 -7312734 -5523744 -3926272 -2425363 -984796 303885 1225708 1521148 1000796 -359863
38275 -359863 -2388167 -4756071 -7075870 -9007913 -10333778 -10967103 -10912264 -10213992 -8939605
38266 -8939605 -7198162 -5162279 -3056052 -1105944 515746 1723388 2518074 2967346
38258 2967346 3179524 3280182 3392021 3617030 4019798 4614123 5360025 6177489 6973719
$$ packed form
38319B86321Q76493O82129M92438L08547J45124K6215k3903J4668J56223M01795
38309C366050P21694J041663J253292J253714R93099M98066j43950q26507j465179
38300F691942k017490k476727k847194l116233l241072l161368k830572k244447
38292a5243161j448915n28980M06591J237753J851483K174085K206078K032332
38284g312734J788990J597472J500909J440567J288681R21823K95440n20352j360659
38275c59863k028304k367904k319799j932043j325865o33325N4839O98272J274387
38266h939605J741443K035883K106227J950108J621690J207642P94686M49272
38258B967346K12178J00658J11839K25009M02768N94325P45902Q17464P96230
$$ plain form
38249 6973719 7670997 8223870 8625361 8909097 9149875 9456632 9950774 10732251 11846487
38240 11846487 13267140 14900993 16609281 18233632 19617267 20619108 21124295 21055732
38232 21055732 20387487 19154685 17451742 15415510 13198890 10944873 8767909 6745100
38224 6745100 4918840 3312145 1953107 898234 241759 100687 573418 1685087 3350103
38215 3350103 5383390 7564373 9719159 11771723 13737652 15671547 17601153 19480558
38207 19480558 21181228 22522146 23323924 23464794 22922099 21791595 20278755 18657422
38199 18657422 17203601 16130179 15551232 15485162 15881746 16650393 17676528 18826386 19947332
38190 19947332 20871027 21424525 21451959 20844858 19570978 17684537 15306238 12582180 9649545
$$ packed form
38249F973719O97278N52873M01491K83736K40778L06757M94142P81477J114236
38240A1846487J420653J633853J708288J624351J383635J001841N05187o8563
38232B1055732o68245j232802j702943k036232k216620k254017k176964k022809
38224F745100j826260j606695j359038j054873o56475j41072M72731J111669J665016
38215C350103K033287K180983K154786K052564J965929J933895J929606J879405
38207A9480558J700670J340918Q01778J40870n42695j130504j512840j621333
38199A8657422j453821j073422n78947o6070L96584P68647J026135J149858J120946
38190A9947332R23695N53498K7434o07101j273880j886441k378299k724058k932635
$$ plain form
38181 9649545 6631909 3660422 895342 -1475262 -3265167 -4338768 -4661251 -4326137
38173 -4326137 -3538658 -2555282 -1609983 -868371 -427169 -338451 -620296 -1234680 -2053064 -2853325
38163 -2853325 -3373389 -3400112 -2841742 -1748387 -286993 1301780 2751881 3829893 4398436
38154 4398436 4460011 4156816 3725271 3423813 3456379 3914209 4760692 5871893 7111887
38145 7111887 8393775 9687568 10979043 12218691 13298683 14071313 14402141 14241388 13685840
38136 13685840 12992698 12517830 12592637 13398389 14903232 16886949 19025842 20985601 22483566
38127 22483566 23313081 23346863 22541071 20949884 18743582 16213767 13750970 11786668 10701574
38118 10701574 10719188 11824316 13750044 16048638 18218396 19833885 20636039 20564102 19733182
$$ packed form
38181I649545l017636k971487k765080k370604j789905j073601l22483L35114
38173d326137P87479R83376R45299P41612M41202Q8718k81845o14384q18384q00261
38163b853325n20064k6723N58370J093355J461394J588773J450101J078012N68543
38154D398436O1575l03195m31545l01458L2566M57830Q46483J111201J239994
38145G111887J281888J293793J291475J239648J079992P72630L30828j60753n55548
38136A3685840o93142m74868P4807Q05752J504843J983717K138893J959759J497965
38127B2483566Q29515L3782q05792j591187k206302k529815k462797j964302j085094
38118A0701574J7614J105128J925728K298594K169758J615489Q02154p1937q30920
$$ plain form
38109 19733182 18375816 16774816 15210526 13927506 13110856 12866740 13214458 14097228 15406123
38100 15406123 17007027 18768755 20592930 22434264 24294224 26189983 28125743 30091135
38092 30091135 32080109 34100002 36151023 38186512 40081368 41629556 42576814 42683843
38084 42683843 41805697 39960734 37356209 34349129 31349620 28703641 26604184 25066542
38076 25066542 23971155 23145973 22446567 21800430 21202472 20671332 20194213 19693887 19036866
38067 19036866 18072207 16671150 14749090 12280126 9324610 6065816 2820369 -11400
38059 -11400 -2048560 -3036513 -2902381 -1738972 257878 2855284 5824762 8959184 12079874
38050 12079874 15043849 17751127 20148932 22231917 24036820 25626626 27062354 28371637
$$ packed form
38109A9733182j357366j601000j564290j283020q16650k44116L47718Q82770J308895
38100A5406123J600904J761728J824175J841334J859960J895759J935760J965392
38092C0091135J988974K019893K051021K035489J894856J548188R47258J07029
38084D2683843q78146j844963k604525l007080k999509k645979k099457j537642
38076B5066542j095387q25182o99406o46137n97958n31140m77119n00326o57021
38067A9036866r64659j401057j922060k468964k955516l258794l245447k831769
38059a1400k037160r87953J34132J163409J996850K597406K969478L134422L120690
38050A2079874K963975K707278K397805K082985J804903J589806J435728J309283
$$ plain form
38042 28371637 29531004 30471486 31099519 31315347 31019754 30117294 28531107 26234754 23291332
38033 23291332 19881332 16299944 12910317 10055700 7959603 6661216 6021787 5800213
38025 5800213 5761239 5769817 5836531 6097956 6739823 7898113 9587165 11687334 13987746
38016 13987746 16253774 18290348 19987965 21348145 22485821 23605130 24947139 26716392
38008 26716392 29008509 31772306 34828304 37932176 40847170 43397291 45496466 47156339
38000 47156339 48466713 49545539 50475011 51250131 51752998 51754358 50950998 49049957 45881715
37991 45881715 41488410 36137412 30257676 24337502 18825017 14055249 10216907 7363347
37983 7363347 5453591 4394581 4065206 4324443 5013949 5959150 6973843 7882324 8566045
$$ packed form
38042B8371637J159367R40482O28033K15828k95593r02460j586187k296353k943422
38033B3291332l410000l581388l389627k854617k096097j298387o39429k21574
38025E800213l8974Q578O6714K61425O41867J158290J689052K100169K300412
38016A3987746K266028K036574J697617J360180J137676J119309J342009J769253
38008B6716392K292117K763797L055998L103872K914994K550121K099175J659873
38000D7156339J310374J078826R29472P75120N02867J360q03360j901041l168242
37991D5881715m393305n350998n879736n920174n512485m769768l838342k853560
37983G363347j909756j059010l29375K59237O89506R45201J014693R08481O83721
$$ plain form
37974 8566045 9013815 9335857 9719826 10346863 11311367 12581605 14011274 15386219 16479904
37965 16479904 17097948 17105579 16438570 15097193 13126179 10595167 7597210 4264511 776366
37956 776366 -2666807 -5902352 -8866277 -11617934 -14307470 -17092587 -20036688 -23033441
37948 -23033441 -25794918 -27912491 -28967995 -28655342 -26874672 -23773448 -19723775 -15241227
37940 -15241227 -10867294 -7050912 -4068094 -2007707 -825184 -432638 -772393 -1830181
37932 -1830181 -3582978 -5918580 -8579702 -11167525 -13205971 -14240634 -13934633 -12127882
37924 -12127882 -8844223 -4255451 1371881 7723649 14473071 21310071 27968906 34246035
37916 34246035 39996818 45113024 49501648 53088324 55847116 57830669 59168876 60028387
$$ packed form
37974H566045M47770L22042L83969O27037R64504J270238J429669J374945J093685
37965A6479904O18044P631o67009j341377j971014k531012k997957l332699l488145
37956G76366l443173l235545k963925k751657k689536k785117k944101k996753
37948b3033441k761477k117573j055504L12653J780670L101224M049673M482548
37940a5241227M373933L816382K982818K060387J182523L92546l39755j057788
37932a830181j752797k335602k661122k587823k038446j034663L06001J806751
37924a2127882L283659M588772N627332O351768O749422O837000O658835O277129
37916C4246035N750783N116206M388624L586676K758792J983553J338207Q59511
$$ plain form
37908 60028387 60556532 60843512 60921482 60795861 60488165 60064772 59633249 59306742 59158219
37899 59158219 59192948 59353429 59547959 59681305 59671364 59452522 58978215 58230194 57226440 56014885
37889 56014885 54655493 53208100 51733490 50292621 48929188 47648840 46424204 45230105
37881 45230105 44075759 42998621 42022042 41113972 40183226 39119733 37852661 36386313
37873 36386313 34788221 33139998 31490819 29846193 28187219 26489108 24720497 22836873
37865 22836873 20791029 18560607 16167687 13669734 11130488 8600237 6124033 3766358
37857 3766358 1624314 -186164 -1563110 -2452614 -2872215 -2916931 -2741672 -2519758 -2392485
37848 -2392485 -2434998 -2657152 -3039756 -3589142 -4381818 -5568767 -7323734 -9751741 -12803954
$$ packed form
37908F0028387N28145K86980P7970j25621l07696m23393m31523l26507j48523
37899E9158219L4729J60481J94530J33346r941k18842m74307p48021j003754j211555
37889E6014885j359392j447393j474610j440869j363433j280348j224636j194099
37881D5230105j154346j077138r76579r08070r30746j063493j267072j466348
37873C6386313j598092j648223j649179j644626j658974j698111j768611j883624
37865B2836873k045844k230422k392920k497953k539246k530251k476204k357675
37857C766358k142044j810478j376946q89504m19601m4716J75259K21914J27273
37848b392485m2513k22154l82604n49386p92676j186949j754967k428007l052213
$$ plain form
37839 -12803954 -16248219 -19717065 -22817133 -25257110 -26942671 -27997032 -28695881 -29347846
37831 -29347846 -30181043 -31286951 -32629786 -34090344 -35509406 -36717963 -37555809 -37875280
37823 -37875280 -37526520 -36341331 -34150023 -30845683 -26462530 -21210693 -15438318 -9544218
37815 -9544218 -3889221 1261189 5757560 9556237 12683138 15181271 17063532 18295693
37807 18295693 18818755 18595802 17655817 16112843 14153768 11999735 9853966 7856502
37799 7856502 6068970 4499685 3153451 2071045 1329598 1003399 1112527 1592380 2299831
37790 2299831 3048028 3650571 3959943 3894324 3451183 2705662 1792752 875781 107757 -404480
37780 -404480 -621177 -566856 -305029 98367 608561 1240060 2049763 3104105 4437117
$$ packed form
37839a2803954l444265l468846l100068k439977j685561j054361o98849o51965
37831b9347846q33197j105908j342835j460558j419062j208557q37846l19471
37823c7875280L48760J185189K191308L304340M383153N251837N772375N894100
37815i544218N654997N150410M496371L798677L126901K498133J882261J232161
37807A8295693N23062k22953r39985j542974j959075k154033k145769j997464
37799G856502j787532j569285j346234j082406p41447l26199J09128M79853P07451
37790B299831P48197O02543L09372o5619m43141p45521r12910r16971p68024n12237
37780d04480k16697N4321K61827M03396N10194O31499Q09703J054342J333012
$$ plain form
37771 4437117 6029211 7825191 9778557 11887304 14194707 16755854 19592293 22661303
37763 22661303 25855952 29032685 32044622 34755909 37031045 38716433 39636304 39609512
37755 39609512 38476882 36127507 32522106 27716061 21876819 15279878 8271898 1211105
37747 1211105 -5585962 -11868450 -17449816 -22202992 -26065116 -29044718 -31218830 -32718791
37739 -32718791 -33711071 -34374172 -34867092 -35292587 -35671859 -35947538 -36013168 -35747794 -35035776
37730 -35035776 -33774633 -31891361 -29377904 -26330171 -22963442 -19590823 -16569267 -14222596
37722 -14222596 -12755118 -12186356 -12348008 -12958758 -13740460 -14508462 -15189155 -15769776 -16226339
37713 -16226339 -16482257 -16424130 -15959426 -15069913 -13820277 -12320169 -10673372 -8946943 -7165002
$$ packed form
37771D437117J592094J795980J953366K108747K307403K561147K836439L069010
37763B2661303L194649L176733L011937K711287K275136J685388R19871k6792
37755C9609512j132630k349375l605401m806045n839242o596941p007980p060793
37747A211105o797067o282488n581366m753176l862124k979602k174112j499961
37739c2718791r92280o63101m92920m25495l79272k75679o5630K65374P12018
37730c5035776J261143J883272K513457L047733L366729L372619L021556K346671
37722a4222596J467478N68762j61652o10750p81702p68002o80693n80621m56563
37713a6226339k55918N8127M64704Q89513J249636J500108J646797J726429J781941
$$ plain form
37704 -7165002 -5312105 -3336655 -1159158 1308230 4134251 7343351 10900048 14704537
37696 14704537 18599763 22391350 25878923 28889451 31298308 33030656 34050706 34354123
37688 34354123 33970334 32967709 31452612 29563418 27465253 25342238 23376298 21711520
37680 21711520 20421494 19499363 18870845 18412945 17967148 17355862 16417102 15054931 13281116
37671 13281116 11221049 9076790 7064912 5356883 4040795 3108215 2464413 1964111
37663 1964111 1470593 915642 322629 -226658 -657571 -951475 -1148467 -1314754 -1504784
37654 -1504784 -1737581 -1989504 -2199326 -2281778 -2146348 -1720416 -976152 47499 1245081
37645 1245081 2474340 3596228 4495735 5078688 5270400 5036850 4411649 3491746 2391289
$$ packed form
37704g165002J852897J975450K177497K467388K826021L209100L556697L804489
37696A4704537L895226L791587L487573L010528K408857J732348J020050L03417
37688C4354123l83789j002625j515097j889194k098165k123015j965940j664778
37680B1711520j290026r22131o28518m57900m45797o11286r38760j362171j773815
37671A3281116k060067k144259k011878j708029j316088r32580o43802n00302
37663A964111m93518n54951n93013n49287m30913k93904j96992j66287j90030
37654a504784k32797k51923k09822q2452J35430M25932P44264J023651J197582
37645A245081J229259J121888Q99507N82953J91712k33550o25201r19903j100457
$$ plain form
37636 2391289 1186176 -108670 -1519321 -3074733 -4779388 -6607045 -8510728 -10440146
37628 -10440146 -12354855 -14219388 -15977752 -17528382 -18732973 -19473263 -19732351 -19654604 -19547561
37619 -19547561 -19817986 -20862011 -22946200 -26119938 -30188112 -34750647 -39293791 -43306427
37611 -43306427 -46392087 -48349046 -49197707 -49149286 -48528133 -47673760 -46853489 -46213296 -45782222
37602 -45782222 -45523975 -45404669 -45433624 -45648081 -46049172 -46533009 -46869329 -46751432 -45894844
37593 -45894844 -44133372 -41468746 -38062145 -34184626 -30152941 -26272228 -22799381 -19932735
37585 -19932735 -17820934 -16570255 -16229739 -16754628 -17975206 -19603876 -21290729 -22707871
37577 -22707871 -23629189 -23976903 -23818470 -23314880 -22645172 -21947098 -21299383 -20734821 -20253671
$$ packed form
37636B391289j205113j294846j410651j555412j704655j827657j903683j929418
37628a0440146j914709j864533j758364j550630j204591p40290k59088P7747J07043
37619a9547561k70425j044025k084189l173738m068174m562535m543144m012636
37611d3306427l085660j956959q48661M8421O21153Q54373Q20271O40193M31074
37602d5782222K58247J19306k8955k14457m01091m83837l36320J17897Q56588
37593d5894844J761472K664626L406601L877519M031685L880713L472847K866646
37585a9932735K111801J250679L40516n24889j220578j628670j686853j417142
37577b2707871r21318l47714J58433N03590O69708O98074O47715N64562M81150
$$ plain form
37568 -20253671 -19824101 -19384040 -18858315 -18180314 -17297018 -16156095 -14696326 -12858642 -10613030
37559 -10613030 -7985424 -5074569 -2054488 845284 3387257 5388429 6765779 7538644
37551 7538644 7792106 7632057 7161165 6480428 5698259 4925543 4249903 3703333 3249466
37542 3249466 2808209 2307748 1728399 1106186 496824 -67246 -593107 -1109830 -1635737
37533 -1635737 -2154183 -2611593 -2939276 -3090322 -3074272 -2969824 -2905108 -3011749 -3371167 -3973220
37523 -3973220 -4702036 -5356796 -5705721 -5557578 -4822385 -3534275 -1829071 105967 2083344
37514 2083344 3952029 5620847 7073982 8377088 9668139 11130289 12947973 15250352
37506 15250352 18054243 21230714 24518125 27580412 30080157 31730739 32315764 31692798
$$ packed form
37568b0253671M29570M40061N25725O78001Q83296J140923J459769J837684K245612
37559a0613030K627606K910855L020081K899772K541973K001172J377350P72865
37551G538644K53462j60049m70892o80737p82169p72716o75640n46570m53867
37542C249466m41257n00461n79349o22213o09362n64070n25861n16723n25907
37533a635737n18446m57410l27683j51046J6050J04448O4716j06641l59418o02053
37523c973220p28816o54760l48925J48143P35193J288110J705204J935038J977377
37514B083344J868685J668818J453135J303106J291051J462150J817684K302379
37506A5250352K803891L176471L287411L062287K499745J650582N85025o22966
$$ plain form
37498 31692798 29806530 26719976 22647739 17961887 13150187 8732623 5164676 2756872
37490 2756872 1625560 1680267 2653142 4169645 5839513 7333395 8422637 8985022 8989822
37481 8989822 8468389 7473324 6039840 4169743 1846566 -930116 -4112486 -7589798
37473 -7589798 -11195408 -14730151 -17991174 -20795376 -22993802 -24482039 -25214252 -25221649 -24624058
37464 -24624058 -23616132 -22419167 -21215138 -20098931 -19074379 -18086313 -17059989 -15930037
37456 -15930037 -14662662 -13276837 -11856005 -10537535 -9481264 -8832561 -8693736 -9104944
37448 -9104944 -10025947 -11311512 -12687639 -13754430 -14043726 -13131586 -10764024 -6936630 -1891622
37439 -1891622 3960852 10158508 16293712 22077235 27348030 32042737 36152160 39689163
$$ packed form
37498C1692798j886268l086554m072237m685852m811700m417564l567947k407804
37490B756872j131312N4707R72875J516503J669868J493882J089242N62385M800
37481H989822n21433r95065j433484j870097k323177k776682l182370l477312
37473g589798l605610l534743l261023k804202k198426j488237p32213p397N97591
37464b4624058J007926J196965J204029J116207J024552R88066J026324J129952
37456a5930037J267375J385825J420832J318470J056271O48703J38825m11208
37448i104944r21003j285565j376127j066791k89296R12140K367562L827394N045008
37439a891622N852474O197656O135204N783523N270795M694707M109423L537003
$$ plain form
37431 39689163 42679840 45175055 47265121 49072501 50709474 52219143 53542581 54543365
37423 54543365 55078867 55073589 54553208 53629923 52458118 51184302 49905273 48642119 47339495
37414 47339495 45896707 44220331 42270084 40071342 37691520 35201713 32649698 30057974
37406 30057974 27445605 24861552 22408115 20230884 18466322 17167725 16253086 15512060
37398 15512060 14674433 13504967 11877052 9796286 7376095 4787519 2207078 -221164
37390 -221164 -2401501 -4280786 -5831138 -7037932 -7906247 -8484159 -8883950 -9275554 -9838239
37381 -9838239 -10682118 -11773544 -12902139 -13710712 -13784096 -12769708 -10487017 -6982247 -2505097
37372 -2505097 2579411 7900169 13161833 18172684 22823916 27049035 30795648 34025839
$$ packed form
37431C9689163K990677K495215K090066J807380J636973J509669J323438J000784
37423E4543365N35502n278n20381r23285j171805j273816j279029j263154j302624
37414D7339495j442788j676376j950247k198742k379822k489807k552015k591724
37406C0057974k612369k584053k453437k177231j764562j298597r14639p41026
37398A5512060q37627j169466j627915k080766k420191k588576k580441k428242
37390b21164k180337j879285j550352j206794q68315n77912l99791l91604n62685
37381i838239q43879j091426j128595q08573p3384J014388K282691L504770M477150
37372b505097N084508N320758N261664N010851M651232M225119L746613L230191
$$ plain form
37364 34025839 36735963 38970253 40809027 42337086 43618707 44700249 45632458 46483108
37356 46483108 47322820 48200162 49133740 50123253 51153373 52174728 53082052 53721826 53933950
37347 53933950 53600054 52669594 51156117 49114072 46612583 43719829 40499421 37005754
37339 37005754 33268175 29275752 24985752 20358561 15395030 10154884 4758906 -614231
37331 -614231 -5739805 -10377655 -14317230 -17418930 -19636840 -21016674 -21665412 -21696936 -21176616
37322 -21176616 -20097200 -18400456 -16028657 -12975738 -9315485 -5198408 -821202 3615790
37314 3615790 7940839 12016833 15722826 18928991 21486917 23247762 24102391 24020936 23068075
37305 23068075 21387732 19170753 16623045 13941570 11298639 8837657 6684683 4970149
$$ packed form
37364C4025839K710124K234290J838774J528059J281621J081542R32209Q50650
37356D6483108Q39712Q77342R33578R89513J030120J021355R07324O39774K12124
37347E3933950l33896r30460j513477k042045k501489k892754l220408l493667
37339C7005754l737579l992423m290000m627191m963531n240146n395978n373137
37331f14231n125574m637850l939575l101700k217910j379834o48738l1524N20320
37322b1176616J079416J696744K371799L052919L660253M117077M377206M436992
37314C615790M325049M075994L705993L206165K557926J760845Q54629q1455r52861
37305B3068075j680343k216979k547708k681475k642931k460982k152974j714534
$$ plain form
37297 4970149 3842453 3456311 3936980 5340267 7629226 10671275 14243813 18040137
37289 18040137 21684632 24773005 26936581 27905595 27542450 25838918 22897243 18915594
37281 18915594 14174164 9000951 3711660 -1448892 -6328401 -10848021 -14973716 -18703922
37273 -18703922 -22063743 -25080458 -27742309 -29976399 -31676815 -32774821 -33309750 -33459012
37265 -33459012 -33509437 -33779985 -34525250 -35855120 -37697860 -39817232 -41876985 -43531047 -44506858
37256 -44506858 -44651407 -43929862 -42392476 -40135778 -37275424 -33936300 -30260507 -26427560
37248 -26427560 -22667556 -19241243 -16378135 -14197646 -12658958 -11572563 -10669709 -9694173
37240 -9694173 -8474507 -6953348 -5175581 -3251799 -1313676 526151 2197160 3665216
$$ packed form
37297D970149j127696l86142M80669J403287K288959L042049L572538L796324
37289A8040137L644495L088373K163576R69014l63145j703532k941675l981649
37281A8915594m741430n173213n289291n160552m879509m519620m125695l730206
37273a8703922l359821l016715k661851k234090j700416j098006n34929j49262
37265c3459012n0425k70548p45265j329870j842740k119372k059753j654062r75811
37256d4506858j44549P21545J537386K256698K860354L339124L675793L832947
37248b6427560L760004L426313K863108K180489J538688J086395R02854R75536
37240i694173J219666J521159J777767J923782J938123J839827J671009J468056
$$ plain form
37232 3665216 4900427 5844480 6412180 6537399 6232690 5614572 4872133 4200012 3738077
37223 3738077 3547173 3623163 3932866 4451163 5183804 6169565 7463028 9103593 11081976
37214 11081976 13323012 15701371 18085292 20378649 22532676 24527128 26344064 27951936
37206 27951936 29299288 30314079 30915312 31044447 30707175 30000103 29099600 28210468 27496665
37197 27496665 27030665 26791464 26713665 26758748 26967506 27466580 28428796 30008335 32278928
37188 32278928 35197172 38600472 42237183 45817458 49065742 51754485 53711705 54816412
37180 54816412 55002915 54276407 52719479 50471044 47683269 44480208 40938010 37090599
37172 37090599 32950763 28530329 23848101 18930341 13820408 8604013 3432844 -1479761
$$ packed form
37232C665216J235211R44053N67700J25219l04709o18118p42439o72121m61935
37223C738077j90904P5990L09703N18297P32641R85761J293463J640565J978383
37214A1081976K241036K378359K383921K293357K154027J994452J816936J607872
37206B7951936J347352J014791O01233J29135l37272p07072r00503q89132p13803
37197B7496665m66000k39201p7799M5083K08758M99074R62216J579539K270593
37188C2278928K918244L403300L636711L580275L248284K688743J957220J104707
37180E4816412J86503p26508j556928k248435k787775l203061l542198l847411
37172C7090599m139836m420434m682228m917760n109933n216395n171169m912605
$$ plain form
37164 -1479761 -5900338 -9639103 -12608399 -14847771 -16498825 -17739606 -18716651 -19512146
37156 -19512146 -20148806 -20605091 -20820861 -20700638 -20128522 -18993029 -17209998 -14737975 -11586355
37147 -11586355 -7814558 -3522064 1162685 6086621 11074080 15938598 20508397 24656881
37139 24656881 28324879 31523371 34310493 36749512 38871205 40665385 42103934 43171938
37131 43171938 43880134 44250603 44288024 43957077 43182849 41878831 39990853 37536031 34620769
37122 34620769 31433777 28216561 25214860 22619751 20517425 18870979 17547770 16385213
37114 16385213 15266253 14166317 13148016 12314836 11763474 11567399 11787518 12479033 13675763
37105 13675763 15367312 17498417 19997165 22806911 25892442 29218355 32725041 36325331
$$ packed form
37164a479761m420577l738765k969296k239372j651054j240781r77045p95495
37156a9512146o36660m56285k15770J20223N72116J135493J783031K472023L151620
37147a1586355L771797M292494M684749M923936M987459M864518M569799M148484
37139B4656881L667998L198492K787122K439019K121693J794180J438549J068004
37131D3171938P08196L70469L7421l30947p74228j304018j887978k454822k915262
37122C4620769l186992l217216l001701k595109k102326j646446j323209j162557
37114A6385213j118960j099936j018301q33180n51362j96075K20119O91515J196730
37105A3675763J691549K131105K498748K809746L085531L325913L506686L600290
$$ plain form
37097 36325331 39918094 43396466 46638560 49493831 51788811 53360614 54102584 53996341
37089 53996341 53113814 51590071 49579773 47213047 44564901 41649526 38445020 34940776
37081 34940776 31183904 27296620 23452810 19828088 16553022 13692275 11251394 9194704
37073 9194704 7455837 5938672 4526799 3119653 1685341 290254 -928160 -1834056
37065 -1834056 -2359601 -2519781 -2375968 -1988212 -1395655 -631007 257091 1202817 2145518
37056 2145518 3050008 3898697 4658265 5251926 5568116 5509780 5058854 4316102 3483315 2783932
37046 2783932 2359519 2204245 2180606 2106270 1857023 1428529 934091 555240 479669 851462
37036 851462 1736595 3096061 4770236 6492915 7945553 8833944 8952273 8211661 6634324
$$ packed form
37097C6325331L592763L478372L242094K855271K294980J571803P41970j06243
37089E3996341q82527j523743k010298k366726k648146k915375l204506l504244
37081C4940776l756872l887284l843810l624722l275066k860747k440881k056690
37073I194704j738867j517165j411873j407146j434312j395087j218414r05896
37065a834056n25545j60180J43813L87756N92557P64648Q88098R45726R42701
37056B145518R04490Q48689P59568N93661L16190n8336m50926p42752q32787o99383
37046B783932m24413j55274k3639p4336k49247m28494m94438l78851p5571L71793
37036H51462Q85133J359466J674175J722679J452638Q88391J18329p40612j577337
$$ plain form
37027 6634324 4325094 1430911 -1898442 -5529906 -9335796 -13160973 -16793929 -19964927
37019 -19964927 -22377918 -23765274 -23945221 -22864320 -20615891 -17429881 -13630074 -9561904
37011 -9561904 -5512448 -1656193 1951416 5337747 8558323 11649845 14608344 17395019
37003 17395019 19953831 22217600 24096769 25471216 26207391 26196911 25391806 23819991 21585037
36994 21585037 18859371 15870037 12869820 10091113 7690388 5703577 4040138 2531567
36986 2531567 1017153 -576779 -2201559 -3701802 -4866087 -5492893 -5453510 -4732861 -3434296
36977 -3434296 -1748163 104795 1940672 3671453 5331766 7055663 9009886 11313903
36969 11313903 13981101 16900260 19856252 22574624 24771300 26196922 26677331 26152343
$$ packed form
37027F634324k309230k894183l329353l631464l805890l825177l632956l170998
37019a9964927k412991j387356j79947J080901K248429L186010L799807M068170
37011i561904M049456L856255L607609L386331L220576L091522K958499K786675
37003A7395019K558812K263769J879169J374447P36175j0480q05105j571815k234954
36994B1585037k725666k989334l000217k778707k400725j986811j663439j508571
36986B531567j514414j593932j624780j500243j164285o26806L9383P20649J298565
36977c434296J686133J852958J835877J730781J660313J723897J954223K304017
36969A1313903K667198K919159K955992K718372K196676J425622M80409n24988
$$ plain form
36961 26152343 24702174 22541880 19974970 17320152 14839593 12694062 10935970 9534530
36953 9534530 8415240 7496692 6720770 6082005 5653978 5594562 6111350 7390584 9517038
36944 9517038 12417193 15845389 19417506 22686288 25242189 26811756 27319843 26892094
36936 26892094 25799607 24374039 22930860 21724841 20937682 20682522 21010715 21914239 23322554
36927 23322554 25096795 27031574 28879403 30402917 31436423 31922052 31898341 31453754 30681913
36918 30681913 29664949 28479453 27200582 25890847 24582829 23274039 21942358 20575732
36910 20575732 19201195 17898138 16788620 16010161 15684277 15889396 16637572 17854071 19367142
36901 19367142 20917961 22192378 22866343 22654109 21348656 18844918 15143115 10340785
$$ packed form
36961B6152343j450169k160294k566910k654818k480559k145531j758092j401440
36953I534530j119290r18548p75922o38765m28027n9416N16788J279234K126454
36944I517038K900155L428196L572117L268782K555901J569567N08087m27749
36936B6892094j092487j425568j443179j206019p87159k55160L28193R03524J408315
36927B3322554J774241J934779J847829J523514J033506M85629k3711m44587p71841
36918C0681913j016964j185496j278871j309735j308018j308790j331681j366626
36910B0575732j374537j303057j109518p78459l25884K05119P48176J216499J513071
36901A9367142J550819J274417O73965k12234j305453k503738l701803m802330
$$ plain form
36893 10340785 4624033 -1743623 -8445078 -15146344 -21531170 -27322559 -32298956 -36318158
36885 -36318158 -39344541 -41460292 -42851036 -43776021 -44535404 -45431434 -46713189 -48511533
36877 -48511533 -50794645 -53376638 -55984629 -58354689 -60312119 -61805786 -62894522 -63703291
36869 -63703291 -64369793 -64996599 -65619361 -66197669 -66627765 -66767872 -66463912 -65568323 -63953436
36860 -63953436 -61526389 -58250058 -54165750 -49406858 -44196283 -38829557 -33648389 -29003123
36852 -29003123 -25200498 -22445146 -20799464 -20187519 -20448433 -21416172 -22984338 -25119947
36844 -25119947 -27820735 -31049048 -34690704 -38563268 -42456891 -46171859 -49533017 -52386984
36836 -52386984 -54597117 -56044086 -56632504 -56302259 -55043157 -52911775 -50048879 -46689702
$$ packed form
36893A0340785n716752o367656o701455o701266o384826n791389m976397m019202
36885c6318158l026383k115751j390744r24985p59383q96030j281755j798344
36877d8511533k283112k581993k607991k370060j957430j493667j088736q08769
36869f3703291o66502o26806o22762n78308m30096j40107L03960Q95589J614887
36860f3953436K427047L276331M084308M758892N210575N366726N181168M645266
36852b9003123L802625K755352J645682O11945k60914r67739j568166k135609
36844b5119947k700788l228313l641656l872564l893623l714968l361158k853967
36836e2386984k210133j446969n88418L30245J259102K131382K862896L359177
$$ plain form
36828 -46689702 -43150440 -39778009 -36874001 -34628521 -33097271 -32226075 -31898904 -31979440 -32328392
36819 -32328392 -32796705 -33211542 -33378679 -33111306 -32268794 -30778592 -28634755 -25893147 -22680622
36810 -22680622 -19205702 -15739186 -12549856 -9817032 -7564653 -5654141 -3841944 -1870754
36802 -1870754 454724 3238976 6503641 10196651 14184957 18251568 22127198 25554342
36794 25554342 28346807 30411724 31735593 32359990 32364939 31857188 30952467 29749336 28303761
36785 28303761 26617281 24646461 22330717 19625900 16529170 13088132 9396575 5583391
36777 5583391 1800171 -1789333 -5017924 -7725346 -9772925 -11057376 -11513238 -11101426
36769 -11101426 -9797387 -7596981 -4542722 -753096 3565671 8132975 12627589 16733537
$$ packed form
36828d6689702L539262L372431K904008K245480J531250Q71196L27171q0536l48952
36819c2328392m68313m14837j67137K67373Q42512J490202K143837K741608L212525
36810b2680622L474920L466516L189330K732824K252379J910512J812197J971190
36802a870754K325478K784252L264665L693010L988306M066611L875630L427144
36794B5554342K792465K064917J323869O24397M949n07751r04721j203131j445575
36785B8303761j686480j970820k315744k704817l096730l441038l691557l813184
36777E583391l783220l589504l228591k707422k047579j284451m55862M11812
36769a1101426J304039K200406L054259L789626M318767M567304M494614M105948
$$ plain form
36761 16733537 20186929 22805466 24483627 25157663 24771338 23276788 20676358 17076787
36753 17076787 12717335 7951779 3190569 -1172638 -4820398 -7536234 -9198029 -9766876
36745 -9766876 -9296307 -7956497 -6040184 -3922742 -1981028 -501554 388507 743633 764369
36736 764369 714251 826970 1250032 2042948 3205681 4699423 6448118 8341244 10258112
36727 10258112 12104923 13834957 15435616 16899106 18210185 19366215 20410901 21447470
36719 21447470 22613089 24025770 25732182 27681130 29732108 31691886 33360833 34569348
36711 34569348 35194906 35163988 34449231 33068287 31084841 28608985 25791794 22807995 19825870
36702 19825870 16974212 14321433 11874433 9592097 7403526 5225887 2982305 620302
$$ packed form
36761A6733537L453392K618537J678161O74036l86325j494550k600430l599571
36753A7076787m359452m765556m761210m363207l647760k715836j661795n68847
36745i766876M70569J339810J916313K117442J941714J479474Q90061L55126K0736
36736G64369n0118J12719M23062P92916J162733J493742J748695J893126J916868
36727A0258112J846811J730034J600659J463490J311079J156030J044686J036569
36719B1447470J165619J412681J706412J948948K050978J959778J668947J208515
36711C4569348O25558l0918p14757j380944j983446k475856k817191k983799k982125
36702A9825870k851658k652779k447000k282336k188571k177639k243582k362003
$$ plain form
36694 620302 -1871746 -4454450 -7037516 -9492788 -11680947 -13488895 -14868744 -15863362
36686 -15863362 -16605053 -17286828 -18120243 -19294424 -20939361 -23092921 -25684141 -28553175
36678 -28553175 -31507514 -34380735 -37054962 -39441809 -41451157 -42977628 -43910311 -44154635
36670 -44154635 -43655993 -42418400 -40512212 -38070175 -35278846 -32368681 -29592004 -27175849
36662 -27175849 -25257660 -23835874 -22767324 -21818924 -20754122 -19420815 -17807368 -16045341
36654 -16045341 -14361053 -13002734 -12176911 -12010969 -12536575 -13683517 -15287092 -17122891
36646 -17122891 -18972438 -20697836 -22288290 -23852875 -25563982 -27580230 -29980654 -32728655
36638 -32728655 -35668697 -38549366 -41062518 -42889449 -43749617 -43450796 -41934069 -39296859
$$ packed form
36694F20302k492048k582704k583066k455272k188159j807948j379849r94618
36686a5863362p41691o81775q33415j174181j644937k153560k591220k869034
36678b8553175k954339k873221k674227k386847k009348j526471r32683k44324
36670d4154635M98642J237593J906188K442037K791329K910165K776677K416155
36662b7175849J918189J421786J068550R48400J064802J333307J613447J762027
36654a6045341J684288J358319Q25823J65942n25606j146942j603575j835799
36646a7122891j849547j725398j590454j564585j711107k016248k400424k748001
36638c2728655k940042k880669k513152j826931q60168K98821J516727K637210
$$ plain form
36630 -39296859 -35776571 -31695511 -27392386 -23173012 -19294210 -15968365 -13366226 -11606151
36622 -11606151 -10732920 -10696647 -11345410 -12447216 -13747613 -15044865 -16244913 -17368622 -18517094
36613 -18517094 -19821648 -21396264 -23294149 -25472743 -27783620 -29999139 -31866504 -33166765
36605 -33166765 -33762270 -33624741 -32836109 -31557001 -29973870 -28251914 -26516424 -24862148
36597 -24862148 -23370934 -22117211 -21154666 -20493681 -20088736 -19852239 -19694644 -19568960 -19488448
36588 -19488448 -19501879 -19643252 -19894848 -20189723 -20440627 -20557592 -20436851 -19947756 -18957369
36579 -18957369 -17393290 -15297790 -12826850 -10195682 -7614797 -5257124 -3260373 -1739444
36571 -1739444 -783163 -430316 -642108 -1295710 -2211813 -3207189 -4146953 -4969620 -5670461
$$ packed form
36630c9296859L520288M081060M303125M219374L878802L325845K602139J760075
36622a1606151Q73231L6273o48763j101806j300397j297252j200048j123709j148472
36613a8517094j304554j574616j897885k178594k310877k215519j867365j300261
36605c3166765n95505J37529P88632J279108J583131J721956J735490J654276
36597b4862148J491214J253723R62545O60985M04945K36497J57595J25684Q0512
36588a9488448j3431j41373k51596k94875k50904j16965J20741M89095R90387
36579a8957369J564079K095500K470940K631168K580885K357673J996751J520929
36571a739444R56281L52847k11792o53602r16103r95376r39764q22667p00841
$$ plain form
36562 -5670461 -6250958 -6665749 -6806119 -6536548 -5760093 -4466041 -2730621 -679540 1557208
36553 1557208 3874816 6202321 8496720 10730608 12878773 14904867 16747249 18308039
36545 18308039 19457075 20060910 20032025 19377460 18222790 16797752 15385509 14252250 13583872
36536 13583872 13455160 13840135 14649536 15769302 17080219 18455272 19744903 20765308
36528 20765308 21302146 21133691 20067994 17983294 14861714 10808450 6049081 900205
36520 900205 -4281737 -9156653 -13442734 -16936145 -19515981 -21149654 -21907821 -21982225 -21684217
36511 -21684217 -21401227 -21509977 -22275978 -23780724 -25899979 -28329417 -30644942 -32391235
36503 -32391235 -33187261 -32815405 -31251938 -28625898 -25141405 -21017072 -16466600 -11699751
$$ packed form
36562e670461n80497m14791j40370K69571P76455J294052J735420K051081K236748
36553A557208K317608K327505K294399K233888K148165K026094J842382J560790
36545A8308039J149036O03835k8885o54565j154670j425038j412243j133259o68378
36536A3583872j28712L84975Q09401J119766J310917J375053J289631J020405
36528B0765308N36838j68455j065697k084700l121580m053264m759369n148876
36520I00205n181942m874916m286081l493411k579836j633673p58167p4404K98008
36511b1684217K82990j08750p66001j504746k119255k429438k315525j746293
36503c2391235p96026L71856J563467K626040L484493M124333M550472M766849
$$ plain form
36495 -11699751 -6908596 -2229602 2293792 6715227 11145260 15684862 20363136 25102715
36487 25102715 29720678 33959711 37537684 40202644 41782820 42224379 41611492 40164396
36479 40164396 38214398 36158708 34399796 33274313 32981504 33530928 34734616 36258655
36471 36258655 37723485 38815152 39359985 39332602 38804094 37869094 36594501 35008761 33121509
36462 33121509 30951236 28544682 25982986 23377322 20860468 18579962 16691942 15347416
36454 15347416 14664311 14691579 15384854 16612465 18193818 19950956 21746108 23489477 25122485
36445 25122485 26594468 27848703 28824950 29479158 29814356 29906421 29902960 29985060 30305987 30937449
36435 30937449 31848380 32919705 33979499 34838966 35319829 35275633 34610053 33286198 31318715
$$ packed form
36495a1699751M791155M678994M523394M421435M430033M539602M678274M739579
36487B5102715M617963M239033L577973K664960J580176M41559o12887j447096
36479D0164396j949998k055690j758912j125483k92809N49424J203688J524039
36471C6258655J464830J091667N44833k7383n28508r35000j274593j585740j887252
36462C3121509k170273k406554k561696k605664k516854k280506j888020j344526
36454A5347416o83105K7268O93275J227611J581353J757138J795152J743369J633008
36445B5122485J471983J254235R76247O54208L35198R2065l461Q2100L20927O31462
36435C0937449R10931J071325J059794Q59467M80863m4196o65580j323855j967483
$$ plain form
36426 31318715 28755392 25669782 22176607 18452102 14727314 11243909 8196850 5699767
36418 5699767 3789373 2458008 1689333 1475901 1812803 2679167 4025684 5776152 7837370
36409 7837370 10111558 12513491 14991424 17536309 20162872 22870790 25618929 28338178
36401 28338178 30974896 33534133 36099495 38826412 41912790 45547333 49840093 54755116
36393 54755116 60074886 65417806 70309772 74291595 77030454 78396924 78477486 77520847
36385 77520847 75850458 73788566 71617116 69566606 67805751 66415660 65358693 64470256
36377 64470256 63495496 62165272 60277936 57748975 54613479 50994621 47060322 42980094
36369 42980094 38887135 34858382 30930615 27152411 23638967 20584750 18217451 16720968
$$ packed form
36426C1318715k563323l085610l493175l724505l724788l483405l047059k497083
36418E699767j910394j331365p68675k13432L36902Q66364J346517J750468K061218
36409G837370K274188K401933K477933K544885K626563K707918K748139K719249
36401B8338178K636718K559237K565362K726917L086378L634543M292760M915023
36393E4755116N319770N342920M891966L981823K738859J366470Q0562r56639
36385G7520847j670389k061892k171450k050510j760855j390091j056967q88437
36377F4470256r74760j330224j887336k528961l135496l618858l934299m080228
36369D2980094m092959m028753l927767l778204l513444l054217k367299j496483
$$ plain form
36361 16720968 16172287 16514566 17557543 18990230 20407898 21366216 21464204 20436473 18224089
36352 18224089 14997848 11123521 7080200 3361246 389632 -1536425 -2269647 -1817705
36344 -1817705 -325415 1964435 4761613 7772961 10726103 13368272 15451163 16727193
36336 16727193 16982460 16105770 14156789 11385486 8185200 5004175 2256223 255357
36328 255357 -820872 -940261 -197485 1225463 3106118 5222786 7383788 9439914 11274596
36319 11274596 12775654 13811425 14240587 13962787 12982131 11441977 9609679 7820209
36311 7820209 6401153 5599749 5532394 6177654 7418528 9109608 11127679 13380197 15779242
36302 15779242 18208102 20504405 22471128 23915102 24699877 24788415 24252649 23245446 21951794
$$ packed form
36361A6720968n48681L42279J042977J432687J417668R58318R7988j027731k212384
36352A8224089l226241l874327m043321l718954k971614j926057p33222M51942
36344a817705J492290K289850K797178L011348K953142K642169K082891J276030
36336A6727193K55267q76690j948981k771303l200286l181025k747952k000866
36328B55357j076229j19389P42776J422948J880655K116668K161002K056126J834682
36319A1274596J501058J035771M29162k77800r80656j540154j832298j789470
36311G820209j419056q01404o7355O45260J240874J691080K018071K252518K399045
36302A5779242K428860K296303J966723J443974P84775Q8538n35766j007203j293652
$$ plain form
36293 21951794 20543332 19152154 17866374 16740262 15807927 15091124 14597319 14311015 14186557
36284 14186557 14152441 14132347 14075705 13978384 13875552 13807763 13782521 13757055 13652012 13386054
36274 13386054 12913046 12246058 11458971 10664621 9978697 9486398 9226467 9194973 9358774
36265 9358774 9666005 10047927 10416029 10663217 10676208 10358811 9657262 8575440 7173125
36256 7173125 5550390 3826296 2116604 509150 -963663 -2347153 -3765846 -5392061
36248 -5392061 -7384985 -9821757 -12650325 -15686352 -18656772 -21271910 -23297345 -24600901
36240 -24600901 -25165416 -25074676 -24488032 -23615751 -22697681 -21980903 -21691761 -22002231 -22996418
36231 -22996418 -24648175 -26821538 -29298056 -31821277 -34139568 -36032918 -37322565 -37870473
$$ packed form
36293B1951794j408462j391178j285780j126112r32335p16803m93805k86304j24458
36284A4186557l4116k0094n6642r7321j02832o7789k5242k5466j05043k65958
36274A3386054m73008o66988p87087p94350o85924m92299k59931l1494J63801
36265I358774L07231L81922L68102K47188J2991l17397p01549j081822j402315
36256G173125j622735j724094j709692j607454j472813j383490j418693j626215
36248e392061j992924k436772k828568l036027k970420k615138k025435j303556
36240b4600901n64515R0740N86644Q72281R18070P16778K89142l10470r94187
36231b2996418j651757k173363k476518k523221k318291j893350j289647n47908
$$ plain form
36223 -37870473 -37574112 -36359315 -34176529 -31006423 -26871715 -21842378 -16027615 -9566871
36215 -9566871 -2637155 4528775 11644983 18419963 24632340 30184555 35095700 39439321
36207 39439321 43268480 46571574 49275431 51281264 52503695 52889894 52417169 51084035
36199 51084035 48908669 45936727 42253851 37998698 33369126 28608489 23967856 19664067
36191 19664067 15863768 12698919 10283515 8698931 7951709 7940910 8466750 9279753 10145552
36182 10145552 10899587 11476980 11913330 12320289 12845160 13624635 14741474 16193802 17887392
$$ packed form
36223c7870473K96361J214797K182786L170106M134708N029337N814763O460744
36215i566871O929716P165930P116208O774980O212377N552215M911145M343621
36207C9439321L829159L303094K703857K005833J222431L86199m72725j333134
36199E1084035k175366k971942l682876m255153m629572m760637m640633m303789
36191A9664067l800299l164849k415404j584584p47222j0799N25840Q13003Q65799
36182A0145552P54035N77393M36350M06959N24871P79475J116839J452328J693590
$$ [...]
##END NTUPLES=NMR SPECTRUM
##END=
