##TITLE=31Pdec_DE-44_EA2_TFA
 DMSO-d6
 24 sc
 8.4.2024
##JCAMPDX= 6.0         $$ Bruker NMR JCAMP-DX V2.0
##DATA TYPE= NMR SPECTRUM
##DATA CLASS= NTUPLES
##ORIGIN= UXNMR, Bruker Analytische Messtechnik GmbH
##OWNER= root
$$ XWIN-NMR		Version 3.5
$$ Mon Apr  8 16:15:46 2024 Russian Standard Time (UT+4h)  she@DPX200
##.OBSERVE FREQUENCY= 81.013821
##.OBSERVE NUCLEUS= ^31P
##.ACQUISITION MODE= SIMULTANEOUS
##.ACQUISITION SCHEME= undefined
##.AVERAGES= 24
##.DIGITISER RES= 16
##SPECTROMETER/DATA SYSTEM= spect
##.PULSE SEQUENCE= zgpg30
##.SOLVENT NAME= CDCl3
##.SHIFT REFERENCE= (INTERNAL, CDCl3, 0, 248.564)
##AUDIT TRAIL= $$ (NUMBER, WHEN, WHO, WHERE, WHAT)
$$ ##TITLE= Audit trail, XWIN-NMR		Version 3.5
$$ ##JCAMPDX= 5.01
$$ ##ORIGIN= Bruker BioSpin GmbH
$$ ##OWNER= she
$$ F:/spectra/data/she/nmr/P31/1/pdata/1/auditp.txt
$$ ##AUDIT TRAIL=  $$ (NUMBER, WHEN, WHO, WHERE, WHAT)
(   1,<2024-04-08 16:14:58.89 +0400>,<she>,<DPX200>,
      <created by zg, POWCHK disabled, PULCHK disabled
       configuration hash MD5:
       00 E9 B6 7A A2 85 ED C7 34 08 36 98 17 FE 4E 26
       data hash MD5: 32K
       70 A3 54 13 0C A8 9F 1D BD C0 7C 44 49 B5 1A C5>)
(   2,<2024-04-08 16:15:01.26 +0400>,<she>,<DPX200>,
      <Start of raw data processing
       efp BC_mod = 2 LB = 10 FT_mod = 6 PKNL = 1 PHC0 = -13200.88 PHC1 = 65.08333 SI = 64K 
       data hash MD5: 64K
       15 FD FB C6 50 8D 5D 08 F4 69 0D 3D CC 74 39 4C>)
(   3,<2024-04-08 16:15:14.17 +0400>,<she>,<DPX200>,
      <pk PHC0 = -35.80058 PHC1 = 0 
       data hash MD5: 64K
       20 AB D9 3D D9 6B 35 2B 4A 31 7B 0D 99 49 8E 5B>)
$$ ##END=
$$ 
$$ hash MD5
$$ 6B 16 1F 87 E4 D2 5D 8D 42 AD D5 98 2B C1 C1 A1
##$RELAX= 
##$RELAX= 
##$RELAX= 
##$RELAX= 
##$RELAX= 
##$RELAX= 
##$RELAX= 
##$RELAX= 
##$RELAX= 
$$ Bruker specific parameters
$$ --------------------------
##$DU= <F:/spectra>
##$EXPNO= 1
##$NAME= <P31>
##$PROCNO= 1
##$TYPE= <nmr>
##$USER= <she>
##$AMP= (0..31)
100 100 100 100 100 100 100 100 100 100 100 100 100 100 100 100 100 100 
100 100 100 100 100 100 100 100 100 100 100 100 100 100 
##$AQSEQ= 0
##$AQ_mod= 1
##$AUNM= <au_zg>
##$AUTOPOS= <>
##$BF1= 81.014009
##$BF2= 200.13
##$BF3= 200.13
##$BF4= 200.13
##$BF5= 200.13
##$BF6= 200.13
##$BF7= 200.13
##$BF8= 200.13
##$BYTORDA= 1
##$CFDGTYP= 0
##$CFRGTYP= 5
##$CHEMSTR= <none>
##$CNST= (0..31)
1 1 145 1 1 1 1 1 1 1 1 1 1 1 1 1 1 1 1 1 1 1 1 1 1 1 1 1 1 1 1 1 
##$CPDPRG= <waltz16>
##$CPDPRG1= <>
##$CPDPRG2= <waltz16>
##$CPDPRG3= <>
##$CPDPRG4= <mlev>
##$CPDPRG5= <mlev>
##$CPDPRG6= <mlev>
##$CPDPRG7= <mlev>
##$CPDPRG8= <mlev>
##$CPDPRGB= <>
##$CPDPRGT= <>
##$D= (0..31)
0 1 0 0 0 0 0 0 0 0 0 0.03 2e-05 3e-06 0 0 0 0 0 0 0 0 0 0 0 0 0 0 0 0 
0 0 
##$DATE= 1712578498
##$DBL= (0..7)
120 120 120 11 120 120 24 19 
##$DBP= (0..7)
150 150 150 150 150 150 150 150 
##$DBP07= 0
##$DBPNAM0= <>
##$DBPNAM1= <>
##$DBPNAM2= <>
##$DBPNAM3= <>
##$DBPNAM4= <>
##$DBPNAM5= <>
##$DBPNAM6= <>
##$DBPNAM7= <>
##$DBPOAL= (0..7)
0.5 0.5 0.5 0.5 0.5 0.5 0.5 0.5 
##$DBPOFFS= (0..7)
$$ [...]
##$SUBNAM2= <"">
##$SUBNAM3= <"">
##$SUBNAM4= <"">
##$SUBNAM5= <"">
##$SUBNAM6= <"">
##$SUBNAM7= <"">
##$SUBNAM8= <"">
##$SUBNAM9= <"">
##$SW= 501.771253377433
##$SWIBOX= (0..15)
0 1 3 0 0 0 0 0 0 0 0 0 0 0 0 0 
##$SW_h= 40650.406504065
##$TD= 32768
##$TD0= 1
##$TE= 0
##$TE2= 300
##$TE3= 300
##$TEG= 300
##$TL= (0..7)
0 120 53 12 22 120 120 120 
##$TP= (0..7)
150 150 150 150 150 150 150 150 
##$TP07= 0
##$TPNAME0= <>
##$TPNAME1= <>
##$TPNAME2= <>
##$TPNAME3= <>
##$TPNAME4= <>
##$TPNAME5= <>
##$TPNAME6= <>
##$TPNAME7= <>
##$TPOAL= (0..7)
0.5 0.5 0.5 0.5 0.5 0.5 0.5 0.5 
##$TPOFFS= (0..7)
0 0 0 0 0 0 0 0 
##$TUNHIN= 0
##$TUNHOUT= 0
##$TUNXOUT= 0
##$USERA1= <user>
##$USERA2= <user>
##$USERA3= <user>
##$USERA4= <user>
##$USERA5= <user>
##$V9= 5
##$VALIST= <valist>
##$VCLIST= <CCCCCCCCCCCCCCC>
##$VD= 0
##$VDLIST= <DDDDDDDDDDDDDDD>
##$VPLIST= <PPPPPPPPPPPPPPP>
##$VTLIST= <TTTTTTTTTTTTTTT>
##$WBST= 1024
##$WBSW= 4
##$XGAIN= (0..3)
0 0 0 0 
##$XL= 0
##$YL= 0
##$YMAX_a= 1088
##$YMIN_a= -2853
##$ZGOPTNS= <>
##$ZL1= 120
##$ZL2= 120
##$ZL3= 120
##$ZL4= 120
##$ABSF1= 0
##$ABSF2= 0
##$ABSG= 0
##$ABSL= 0
##$ALPHA= 0
##$AQORDER= 0
##$ASSFAC= 0
##$ASSFACI= 0
##$ASSFACX= 0
##$ASSWID= 0
##$AUNMP= <proc_1d>
##$AZFE= 0.1
##$AZFW= 0.5
##$BCFW= 0
##$BC_mod= 2
##$BYTORDP= 0
##$COROFFS= 0
##$CY= -3
##$DATMOD= 1
##$DC= 0
##$DFILT= <>
##$DTYPP= 0
##$F1P= 0
##$F2P= 0
##$FCOR= 1
##$FTSIZE= 65536
##$FT_mod= 6
##$GAMMA= 0
##$GB= 0
##$INTBC= 1
##$INTSCL= 6.047779e-11
##$ISEN= 30
##$LB= 10
##$LEV0= 0
##$LPBIN= 0
##$MAXI= 10000
##$MC2= 0
##$MEAN= 0
##$ME_mod= 0
##$MI= 50
##$NCOEF= 0
##$NC_proc= -12
##$NLEV= 6
##$NOISF1= 182.463
##$NOISF2= 159.3651
##$NSP= 0
##$NTH_PI= 0
##$NZP= 0
##$OFFSET= 248.5645
##$PC= 4
##$PHC0= -13236.68
##$PHC1= 65.08333
##$PH_mod= 1
##$PKNL= yes
##$PPARMOD= 0
##$PSCAL= 0
##$PSIGN= 0
##$REVERSE= no
##$SF= 81.0140089999694
##$SI= 65536
##$SIGF1= 159.3651
##$SIGF2= -187.1042
##$SINO= 113.3802
##$SIOLD= 16384
##$SREGLST= <1H.CDCl3>
##$SSB= 0
##$STSI= 65536
##$STSR= 0
##$SW_p= 40650.406504065
##$SYMM= 0
##$S_DEV= 0
##$TDeff= 32768
##$TDoff= 0
##$TI= <>
##$TILT= no
##$TM1= 0
##$TM2= 0
##$TOPLEV= 0
##$USERP1= <user>
##$USERP2= <user>
##$USERP3= <user>
##$USERP4= <user>
##$USERP5= <user>
##$WDW= 1
##$XDIM= 65536
##$YMAX_p= 454500660
##$YMIN_p= -175110032
$$ End of Bruker specific parameters
$$ ---------------------------------
##NTUPLES= NMR SPECTRUM
##VAR_NAME=  FREQUENCY,     SPECTRUM/REAL,   SPECTRUM/IMAG
##SYMBOL=    X,             R,               I
##VAR_TYPE=  INDEPENDENT,   DEPENDENT,       DEPENDENT
##VAR_FORM=  AFFN,          ASDF,            ASDF
##VAR_DIM=   65536,         65536,           65536
##UNITS=     HZ,            ARBITRARY UNITS, ARBITRARY UNITS
##FACTOR=    0.620285442955139, 1,           1
##FIRST=     20137.2065510682, 0,            0
##LAST=      -20513.1999529968, 0,           0
##MIN=       -20513.1999529968, -175110032,  0
##MAX=       20137.2065510682, 454500660,    0
$$ Real data points
##PAGE= N=1
##DATA TABLE= (X++(R..R)), XYDATA
$$ [...]
41199C4655255m041363m170266m043453l730434l343750k991158k743762k621918
$$ 34655255 30613892 26443626 22400173 18669739 15325989 12334831 9591069 6969151
41191F969151k593102k588479k542786k436637k305938k207249k167387k157844
$$ 6969151 4376049 1787570 -755216 -3191853 -5497791 -7705040 -9872427 -12030271
41183a2030271k110038j955471j661341j240409p33481j82409L84100R46374J485796
$$ -12030271 -14140309 -16095780 -17757121 -18997530 -19731011 -19913420 -19529320 -18582946 -17097150
41174a7097150J985500K433035K812946L096278L247053L247604L118173K909707
$$ -17097150 -15111650 -12678615 -9865669 -6769391 -3522338 -274734 2843439 5753146
41166E753146K678229K464526K288457K150363K034668J919151J787725J635407
$$ 5753146 8431375 10895901 13184358 15334721 17369389 19288540 21076265 22711672
41158B2711672J460845J257453J015879P35472M31404J29466j48065l97672o44196
$$ 22711672 24172517 25429970 26445849 27181321 27612725 27742191 27594126 27196454 26552258
41149B6552258r38777j341184j890143k575948l332774m058623m653880n057856
$$ 26552258 25613481 24272297 22382154 19806206 16473432 12414809 7760929 2703073
41141B703073n265300n318182n280522n209238n132945n047038m925722m741981
$$ 2703073 -2562227 -7880409 -13160931 -18370169 -23503114 -28550152 -33475874 -38217855
41133c8217855m481652m143056l724598l211943k578683j807220r20035L077Q41613
$$ -38217855 -42699507 -46842563 -50567161 -53779104 -56357787 -58165007 -59085042 -59081965 -58240352
41124e8240352J478703J843186J922498J746236J363405Q35059K42076l12179
$$ -58240352 -56761649 -54918463 -52995965 -51249729 -49886324 -49051265 -48809189 -49121368
41116d9121368p22824r21632r02002p05629l79090O4302O49245J410819K354858
$$ -49121368 -49844192 -50765824 -51667826 -52373455 -52752545 -52688243 -52038998 -50628179 -48273321
41107d8273321L426429M499976N398831N940969N994292N520378M591491L372744
$$ -48273321 -44846892 -40346916 -34948085 -29007116 -23012824 -17492446 -12900955 -9528211
41099i528211K070522Q66996j23752q55315j318433j515729j458888j174498p00300
$$ -9528211 -7457689 -6590693 -6714445 -7569760 -8888193 -10403922 -11862810 -13037308 -13737608
41090a3737608p3904O70164J488062K309376L033319L549089L772913L678185
$$ -13737608 -13811512 -13141348 -11653286 -9343910 -6310591 -2761502 1011411 4689596
41082D689596L298070K702469J970905J178767L95185l19344r22091j401433j785403
$$ 4689596 7987666 10690135 12661040 13839807 14234992 13915648 12993557 11592124 9806721
41073I806721k132670k499135k895692l272053l548127l671324l651737l548565
$$ 9806721 7674051 5174916 2279224 -992829 -4540956 -8212280 -11864017 -15412582
41065a5412582l427430l328881l267141l244637l258096l289634l297827l226730
$$ -15412582 -18840012 -22168893 -25436034 -28680671 -31938767 -35228401 -38526228 -41752958
41057d1752958l034053k720461k337495j964622j666768j458949j303987j148653
$$ -41752958 -44787011 -47507472 -49844967 -51809589 -53476357 -54935306 -56239293 -57387946
41049e7387946r73087q13142p34031p74231r03988j029507j035751q34585l90444
$$ -57387946 -58361033 -59174175 -59908206 -60682437 -61586425 -62615932 -63651683 -64486268 -64876712
41040f4876712K79064J113987K026204K920672L723046M395932M925421N288139
$$ -64876712 -64597648 -63483661 -61457457 -58536785 -54813739 -50417807 -45492386 -40204247
41032d0204247N436101N322621M947928M380495L736578L141042K699030K482067
$$ -40204247 -34768146 -29445525 -24497597 -20117102 -16380524 -13239482 -10540452 -8058385
41024h058385K514668K759292L115509L445861L620028L555501L237956K718857
$$ -8058385 -5543717 -2784425 331084 3776945 7396973 10952474 14190430 16909287
41016A6909287K095753J480478R59836N58771K24069j55027o90656j430827k322071
$$ 16909287 19005040 20485518 21445354 22004125 22228194 22073167 21382511 19951684 17629613
41007A7629613l222567l956682m379137m419380m095720l503470k784144k083123
$$ 17629613 14407046 10450364 6071227 1651847 -2443873 -5947343 -8731487 -10814610
40999a0814610j509291j113009q88823p93865p69203p59397p30703o83457o49484
$$ -10814610 -12323901 -13436910 -14325733 -15119598 -15888801 -16648198 -17378901 -18062358 -18711842
40990a8711842o70329p63899q97194r86234r33097o82128k52848K81539Q53908
$$ -18711842 -19382171 -20146070 -21043264 -22029498 -22962595 -23644723 -23897571 -23616032 -22762124
40981b2762124J447802K088872K796779L543928M253417M831998N210777N367029
$$ -22762124 -21314322 -19225450 -16428671 -12884743 -8631326 -3799328 1411449 6778478
40973F778478N316650N087744M698996M158729L477750K677029J784390Q32604
$$ 6778478 12095128 17182872 21881868 26040597 29518347 32195376 33979766 34812370
40965C4812370j32851j047934j842584k468006k916022l214532l404976l518038
$$ 34812370 34679519 33631585 31789001 29320995 26404973 23190441 19785465 16267427
40957A6267427l558057l501090l311733k975756k526447k036890j577409j173465
$$ 16267427 12709370 9208280 5896547 2920791 394344 -1642546 -3219955 -4393420
40949d393420q02287m29106m9187K96187N34742N96819M53015J38899k52191o11738
$$ -4393420 -5195707 -5624813 -5674000 -5377813 -4843071 -4246252 -3793237 -3654338 -3906529 -4518267
40939d518267q68325j013627j089754j156495j261862j424786j630956j844880
$$ -4518267 -5386592 -6400219 -7489973 -8646468 -9908330 -11333116 -12964072 -14808952
40931a4808952k034257k187276k304834k375433k360828k208652j881172j380666
$$ -14808952 -16843209 -19030485 -21335319 -23710752 -26071580 -28280232 -30161404 -31542070
40923c1542070p63329j38848L53836N98559N59421L05904j0475k08053j27951
$$ -31542070 -32305399 -32444247 -32090411 -31491852 -30932431 -30626527 -30637002 -30845055 -30973006
40914c0973006L18981J110205K093716L024874L657642L841772L566959K936530
$$ -30973006 -30654025 -29543820 -27450104 -24425230 -20767588 -16925816 -13358857 -10422327
40906a0422327K104324J222137M17645k11929o14296q07033q87953j004740j289327
$$ -10422327 -8318003 -7095866 -6678221 -6890150 -7504446 -8311479 -9199432 -10204172 -11493499
40897a1493499j796503k485181l245289l941051m443381m648226m491225l960407
$$ -11493499 -13290002 -15775183 -19020472 -22961523 -27404904 -32053130 -36544355 -40504762
40889d0504762l097466j983780p22401N69728J761294K715449L319991L528330
$$ -40504762 -43602228 -45586008 -46308409 -45738681 -43977387 -41261938 -37941947 -34413617
40881c4413617L386087L025308K626118K357943K319846K506314K821262L136921
$$ -34413617 -31027530 -28002222 -25376104 -23018161 -20698315 -18192001 -15370739 -12233818
40873a2233818L360834L467235L478827L422635L296357L066385K695685K182523
$$ -12233818 -8872984 -5405749 -1926922 1495713 4792070 7858455 10554140 12736663
40865A2736663J584375J008689N73153L58616L80994N92976R07688J227709J466132
$$ 12736663 14321038 15329727 15902880 16261496 16642490 17235466 18143154 19370863 20836995
40856B0836995J556586J458495J164486P07782J59721l88386q52040j174452j331044
$$ 20836995 22393581 23852076 25016562 25724344 25884065 25495679 24643639 23469187 22138143
40847B2138143j317811j134516p79511k66814L43723R31854J342604J445626J190805
$$ 22138143 20820332 19685816 18906305 18639491 18983214 19915068 21257672 22703298 23894103
40838B3894103O23338j46027r86873j778660k416035k808158k892729k663853
$$ 23894103 24517441 24371414 23384541 21605881 19189846 16381688 13488959 10825106
40830A0825106k190211j600903j041521o28722m30543m73352p53317j235349j845909
$$ 10825106 8634895 7033992 5992471 5363749 4933206 4459854 3706537 2471188 625279
40821F25279k475838k996073l276902l210466k746609j935681r41924M662P01139
$$ 625279 -1850559 -4846632 -8123534 -11334000 -14080609 -16016290 -16958214 -16953552 -16252413
40812a6252413J049632J074579Q85745O25908M30849M03882O00346J023630J634100
$$ -16252413 -15202781 -14128202 -13242457 -12616549 -12185700 -11781818 -11181472 -10157842 -8523742
40803h523742K362983L119752L791220M245639M359530M067714L407664K518817
$$ -8523742 -6160759 -3041007 750213 4995852 9355382 13423096 16830760 19349577
40795A9349577J586245P64300J30816l09132n92429p70961q97515j015538j146640
$$ 19349577 20935822 21700122 21830938 21521806 20929377 20158416 19260901 18245363 17098723
40786A7098723j280556j375999j376190j234767r39272n17700k4865M78825R40728
$$ 17098723 15818167 14442168 13065978 11831211 10891939 10374239 10349374 10828199 11768927
40777A1768927J318641J581128J709865J699156J548269J252766Q06675K19325
$$ 11768927 13087568 14668696 16378561 18077717 19625986 20878752 21685427 21904752
40769B1904752m64477j160687j770718k224945k515755k693382k825402k950654
$$ 21904752 21440275 20279588 18508870 16283925 13768170 11074788 8249386 5298732
40761E298732l061252l119177l085025k933747k653094k238095j692249j032991
$$ 5298732 2237480 -881697 -3966722 -6900469 -9553563 -11791658 -13483907 -14516898
40753a4516898k95277M66399J175493J737972K066295K118875J926275J574375
$$ -14516898 -14812175 -14345776 -13170283 -11432311 -9366016 -7247141 -5320866 -3746491
40745c746491J148581O80337J37131n40265j384097k361464l364383m228874m781064
$$ -3746491 -2597910 -1917573 -1780442 -2320707 -3704804 -6066268 -9430651 -13659525 -18440589
40736a8440589m896606m542716l777648k715363j489221k36084R08527J821775
$$ -18440589 -23337195 -27879911 -31657559 -34372922 -35862143 -36098227 -35189700 -33367925
40728c3367925K410130K618689K433058J885220J063519J09571q09813j545069
$$ -33367925 -30957795 -28339106 -25906048 -24020828 -22957309 -22847738 -23657551 -25202620
40720b5202620j998534k139233j999185j656267j207945p42676l17825N0454L84426
$$ -25202620 -27201154 -29340387 -31339572 -32995839 -34203784 -34946460 -35264285 -35213831 -34829405
40711c4829405P29786J131809J611911K155784K716899L229603L624549L843419
$$ -34829405 -34099619 -32967810 -31355899 -29200115 -26483216 -23253613 -19629064 -15785645
40703a5785645L849963L631112L186917K521835J654067O40136m13854j379879
$$ -15785645 -11935682 -8304570 -5117653 -2595818 -941751 -301615 -715469 -2095348
40695b095348k162499k735448l129345l387862l536724l586191l547121l433436
$$ -2095348 -4257847 -6993295 -10122640 -13510502 -17047226 -20633417 -24180538 -27613974
40687b7613974l251714k998510k673276k291720j883340j476034j084913p17354
$$ -27613974 -30865688 -33864198 -36537474 -38829194 -40712534 -42188568 -43273481 -43990835
40679d3990835l90025j41300k3444p4218k85920n94319q94513j071641j030647
$$ -43990835 -44380860 -44522160 -44545604 -44619822 -44905742 -45500061 -46394574 -47466215 -48496862
40670d8496862p19431j45514O18814J452888K227849K856128L323723L682805
$$ -48496862 -49216293 -49361807 -48742993 -47290105 -45062256 -42206128 -38882405 -35199600
40662c5199600M004728M321909M598536M749647M690584M379158L827237L087124
$$ -35199600 -31194872 -26872963 -22274427 -17524780 -12834196 -8455038 -4627801 -1540677
40654a540677K231242J336547M75377k87691q93769j287559j423021j278399q72702
$$ -1540677 690565 2027112 2502489 2214798 1321029 33470 -1389551 -2667950 -3540652
40645c540652k72574M15804J067080J562321J812847J777892J473982R74749L98450
$$ -3540652 -3813226 -3397422 -2330342 -768021 1044826 2822718 4296700 5271449 5669899
40636E669899j19665m67556n96094n37307l86576k55737k25298l24374n43101
$$ 5669899 5550234 5082678 4486584 3949277 3562701 3306964 3081666 2757292 2214191
40627B214191q56669j237782j653944k062397k410992k640373k683604k472859
$$ 2214191 1357522 119740 -1534204 -3596601 -6007593 -8647966 -11331570 -13804429
40619a3804429j965003j176638j98389Q31614J778089K543817L071348L331264
$$ -13804429 -15769432 -16946070 -17144459 -16312845 -14534756 -11990939 -8919591 -5588327
40611e588327L325977L107242K776791K450773K206147K046846J911046J710491
$$ -5588327 -2262350 844892 3621683 6072456 8278603 10325449 12236495 13946986
40603A3946986J376194Q86276K63694m50005j222503k037866k881002l717095
$$ 13946986 15323180 16209456 16473150 16023145 14800642 12762776 9881774 6164679
40595F164679m483387n096314n468876n534752n273938m727309l988030l171767
$$ 6164679 1681292 -3415022 -8883898 -14418650 -19692588 -24419897 -28407927 -31579694
40587c1579694k380987j677801j071387n22427L2727O42083J299500J931041K417881
$$ -31579694 -33960681 -35638482 -36709869 -37232296 -37199569 -36557486 -35257986 -33326945 -30909064
40578c0909064K643723K538702K097353J371240M54030n28126j426303k090867
$$ -30909064 -28265341 -25726639 -23629286 -22258046 -21804016 -22332142 -23758445 -25849312
40570b5849312k405292k316748j850526j106587k40246N74586J195430J554423
$$ -25849312 -28254604 -30571352 -32421878 -33528465 -33768711 -33194125 -31998695 -30444272
40562c0444272J668992J614000J477079J326161J199762J110505J051475J005847
$$ -30444272 -28775280 -27161280 -25684201 -24358040 -23158278 -22047773 -20996298 -19990451
40554a9990451R61701R23488R07536R23092R56079R68966R12143P34899L96204
$$ -19990451 -19028750 -18105262 -17197726 -16274634 -15318555 -14349589 -13437446 -12702547 -12306343
40545a2306343j15037p53313j407144j929054k196575k166166j883553j445599
$$ -12306343 -12421380 -13174693 -14581837 -16510891 -18707466 -20873632 -22757185 -24202784
40537b4202784r42065m14904J43879P60083J433155K107537K679109L035733L105327
$$ -24202784 -25144849 -25559753 -25415874 -24655791 -23222636 -21115099 -18435990 -15400257 -12294930
40528a2294930K875497K371233J615667O14898o17071k016820l452324m746712
$$ -12294930 -9419433 -7048200 -5432533 -4817635 -5434706 -7451526 -10903850 -15650562
40520a5650562n735904o330262o545468o482238o266080n987157n677691n329659
$$ -15650562 -21386466 -27716728 -34262196 -40744434 -47010514 -52997671 -58675362 -64005021
40512f4005021m923856m442906l867223l171908k337300j368112l04989P82972
$$ -64005021 -68928877 -73371783 -77239006 -80410914 -82748214 -84116326 -84421315 -83638343
40504h3638343J819940K741872L498132M040951M319822M291194L937847L286736
$$ -83638343 -81818403 -79076531 -75578399 -71537448 -67217626 -62926432 -58988585 -55701849
40496e5701849K418804J464919N78252j16928n74615q36447r88009j093793j161050
$$ -55701849 -53283045 -51818126 -51239874 -51356802 -51931417 -52767864 -53755873 -54849666 -56010716
40487e6010716j155601j048962q57038o44783m96895m72311n67072p07222p78269
$$ -56010716 -57166317 -58215279 -59072317 -59717100 -60213995 -60686306 -61253378 -61960600 -62738869
40478f2738869o75332l45684J95717Q76708J590968K222212K665273K843324K721142
$$ -62738869 -63414201 -63759885 -63564168 -62687460 -61096492 -58874280 -56209007 -53365683 -50644541
40469e0644541K313749J687690R50348K26165l73082p72237r43455r03695p02273
$$ -50644541 -48330792 -46643102 -45692754 -45466589 -45839671 -46611908 -47555363 -48459058 -49161331
40460d9161331m01623n6022L03247O68871J045647J436301J836274K237921K632683
$$ -49161331 -49562954 -49618976 -49315729 -48646858 -47601211 -46164910 -44328636 -42090715 -39458032
40451c9458032L001078L296560L443155L359730K999642K378064J567467O66611
$$ -39458032 -36456954 -33160394 -29717239 -26357509 -23357867 -20979803 -19412336 -18745725
40443a8745725k33374j064667j777208k326689k673043k791670k684216k377934
$$ -18745725 -18979099 -20043766 -21820974 -24147663 -26820706 -29612376 -32296592 -34674526
40435c4674526j918795j371168q23797l85806j60693k07823n15600j004172j557125
$$ -34674526 -36593321 -37964489 -38788286 -39174092 -39334785 -39542608 -40058208 -41062380 -42619505
40426d2619505k066216k467133k749471k939254l068755l152895l181850l127400
$$ -42619505 -44685721 -47152854 -49902325 -52841579 -55910334 -59063229 -62245079 -65372479
40418f5372479k955873k641363k174262j563028q32258k1996Q11413J598219K265582
$$ -65372479 -68328352 -70969715 -73143977 -74707005 -75539263 -75561259 -74749846 -73151627 -70886045
40409g0886045K752457L022371L068642K910485K583366K131549J609898J092236
$$ -70886045 -68133588 -65111217 -62042575 -59132090 -56548724 -54417175 -52807277 -51715041
40401e1715041O72941M49717M91425Q10959J364075K077839K890024L771352M715091
$$ -51715041 -51042100 -50592383 -50100958 -49289999 -47925924 -45848085 -42958061 -39186709 -34471618
40392c4471618N704178O682967P553771Q197296Q502481Q394599P857577O945149
$$ -34471618 -28767440 -22084473 -14530702 -6333406 2169075 10563674 18421251 25366400
40384B5366400N771783M482344L214841K074616J125295L88742j50083n26590
$$ 25366400 31138183 35620527 38835368 40909984 42035279 42424021 42273938 41747348
40376D1747348p65442q51927p33264l58061K72051J078150J924249K663286L176494
$$ 41747348 40981906 40129979 39396715 39038654 39310705 40388855 42313104 44976390 48152884
40367D8152884L390635L280517K867826K214973J407616N29173l60742j237329
$$ 48152884 51543519 54824036 57691862 59906835 61314451 61843624 61482882 60245553
40359F0245553k111841l019682l988237m993545n938678o680433p089847p101028
$$ 60245553 58133712 55114030 51125793 46132248 40193570 33513137 26423290 19322262
40351A9322262o719443o001355n030247l897146k678462j417415j27167J179922
$$ 19322262 12602819 6601464 1571217 -2325929 -5004391 -6421806 -6548973 -5369051
40343e369051K456965L607373M500637N011056N060437M643965L829029K735669
$$ -5369051 -2912086 695287 5195924 10206980 15267417 19911382 23740411 26476080
40335B6476080J515497L32852o63621j382064j819731k058682k221032k408896
$$ 26476080 27991577 28324429 27660808 26278744 24459013 22400331 20179299 17770403
40327A7770403k661073k943873l173952l256494l118435k726474k094456j286389
$$ 17770403 15109330 12165457 8991505 5735011 2616576 -109898 -2204354 -3490743
40319c490743m08864M17508J099925J601276J934524K133011K223190K215345
$$ -3490743 -3899607 -3482099 -2382174 -780898 1153626 3286637 5509827 7725172
40311G725172K107709J894047J572996J161548P07080K84292l0939j99568k43261
$$ 7725172 9832881 11726928 13299924 14461472 15168552 15452844 15421905 15222337 14979076
40302A4979076k34320k56385l62148n54770q01070j063534j328776j615249j957837
$$ 14979076 14744756 14488371 14126223 13571453 12770383 11706849 10378073 8762824 6804987
40293F804987k380913k875349l389405l837062m122977m175692l970979l530561
$$ 6804987 4424074 1548725 -1840680 -5677742 -9800719 -13976411 -17947390 -21477951
40285b1477951k901875k140482j307561m73465K86300R02185J321418J519601
$$ -21477951 -24379826 -26520308 -27827869 -28301334 -28015034 -27112849 -25791431 -24271830
40277b4271830J516621J385351J233543J159341J209598J371072J595688J835105
$$ -24271830 -22755209 -21369858 -20136315 -18976974 -17767376 -16396304 -14800616 -12965511
40269a2965511K060301K260635K432567K571046K668182K713804K691975K577871
$$ -12965511 -10905210 -8644575 -6212008 -3640962 -972780 1741024 4432999 7010870
40261G010870K345996J990270J540226J057931O19150K95299J44550K05056M82540
$$ 7010870 9356866 11347136 12887362 13945293 14564443 14859742 15004292 15209348 15691888
40252A5691888R37655J486462K019653K431844K645844K622385K356712J870390
$$ 15691888 16629543 18116005 20135658 22567502 25213346 27835731 30192443 32062833
40244C2062833J205889M25764l87790j139980j741159k130494k292414k255325
$$ 32062833 33268722 33694486 33306696 32166716 30425557 28295063 26002649 23747324
40236B3747324k076549j827742j588057j436242j430610j582009j840308k109908
$$ 23747324 21670775 19843033 18254976 16818734 15388124 13806115 11965807 9855899
40228I855899k288612k307006k145677j824332j376484q31382k14700M38689J075406
$$ 9855899 7567287 5260281 3114604 1290272 -86212 -917594 -1132294 -693605 381801
40219C81801J627204K025698K220016K188890J942120J513518R53849L29599k77090
$$ 381801 2009005 4034703 6254719 8443609 10385729 11899247 12853096 13182695 12905605
40210A2905605p76975j092761j179856j037934p08542k59847K35252P17052J143314
$$ 12905605 12128630 11035869 9856013 8818079 8109537 7849690 8084942 8801994 9945308
40201I945308J479698J686426J713355J510276J050112L50417n29272j523082
$$ 9945308 11425006 13111432 14824787 16335063 17385175 17735592 17206320 15683238
40193A5683238k602602l785100n089452o474012p809689q909140r588295r723090
$$ 15683238 13080636 9295536 4206084 -2267928 -10077617 -18986757 -28575052 -38298142
40185c8298142r280691q322058o980699n427869l837654k360336j103765j22626
$$ -38298142 -47578833 -55900891 -62881590 -68309459 -72147113 -74507449 -75611214 -75733840
40177g5733840N79340J032674J281688J373825J360366J298556J248160J263866
$$ -75733840 -75154500 -74121826 -72840138 -71466313 -70105947 -68807391 -67559231 -66295365
40169f6295365J385269J622056J937572K245386K432944K408142K145096J703041
$$ -66295365 -64910096 -63288040 -61350468 -59105082 -56672138 -54263996 -52118900 -50415859
40161e0415859J206380P93436N58079N15373O10783P63832R13277J035891J138196
$$ -50415859 -49209479 -48416043 -47857964 -47342591 -46731808 -45967976 -45054699 -44018808 -42880612
40152d2880612J239873J361770J517259J704356J903716K086452K224636K294465
$$ -42880612 -41640739 -40278969 -38761710 -37057354 -35153638 -33067186 -30842550 -28548085
40144b8548085K273190K141348J895643J562068J193491Q49133N72143L84424
$$ -28548085 -26274895 -24133547 -22237904 -20675836 -19482345 -18633212 -18061069 -17676645
40136a7676645K99579L34217M99650P81224J130519J481958J775434J960182J982955
$$ -17676645 -17377066 -17042849 -16543199 -15761975 -14631456 -13149498 -11374064 -9413882 -7430927
40127g430927J789204J352773P11418k9265p31747j272493j565918j565905j266160
$$ -7430927 -5641723 -4288950 -3577532 -3606797 -4338544 -5611037 -7176955 -8742860 -10009020
40118a0009020p06808K9096Q41031J642279K370235K973951L404836L629606L652722
$$ -10009020 -10715828 -10686732 -9845701 -8203422 -5833187 -2859236 545600 4175206 7827928
40109G827928L520048L293418L012959K672771K224376J605734P80482k33147
$$ 7827928 11347976 14641394 17654353 20327124 22551500 24157234 24937716 24704569
40101B4704569j357891k476747l464336m218717m686527m875249m846758m692131
$$ 24704569 23346678 20869931 17405595 13186878 8500351 3625102 -1221656 -5913787
40093e913787m496821m310867m137734l947001l701872l381132k979816k492413
$$ -5913787 -10410608 -14721475 -18859209 -22806210 -26508082 -29889214 -32869030 -35361443
40085c5361443j897644j159727k45449Q53125K099700L404502M628680N603825
$$ -35361443 -37259087 -38418814 -38664263 -37811138 -35711438 -32306936 -27678256 -22074431
40077b2074431O166331O203897N702875M771572L614942K463013J489897P67096
$$ -22074431 -15908100 -9704203 -4001328 770244 4385186 6848199 8338096 9105192
40069I105192K67891r2331m05190p26481j052859j325182j456720j372490j040701
$$ 9105192 9373083 9280752 8875562 8149081 7096222 5771040 4314320 2941830 1901129
40060A901129m82803K38752J043052J846388K562346L095574L348334L248106
$$ 1901129 1418326 1657078 2700130 4546518 7108864 10204438 13552772 16800878
40052A6800878K781338K006677J034024j7155j050538j997309k800436l404753
$$ 16800878 19582216 21588893 22622917 22605762 21555224 19557915 16757479 13352726
40044A3352726l768275l884023l789189l551225l241204k911632k588766k279315
$$ 13352726 9584451 5700428 1911239 -1639986 -4881190 -7792822 -10381588 -12660903
40036a2660903j983997j705802j444711j184845q90278n16927k9103N93801J358257
$$ -12660903 -14644900 -16350702 -17795413 -18980258 -19870536 -20387463 -20416566 -19822765 -18464508
40027a8464508K250598L220013M166111M950183N433474N526452N223634M603144
$$ -18464508 -16213910 -12993897 -8827786 -3877603 1555871 7082323 12305957 16909101
40019A6909101L789379K903338K034054J242140N73182N4394l22804o06765q60936
$$ 16909101 20698480 23601818 25635872 26878012 27451194 27505588 27182784 26576019 25715083
40010B5715083j127429j407523j669360j870049j974386j961805j824213j563805
$$ 25715083 24587654 23180131 21510771 19640722 17666336 15704531 13880318 12316513
40002A2316513j199180p76925l72880p0017P8103P1382m3628k02221l46177m29798
$$ 12316513 11117333 10340408 9967528 9897511 9975614 10046996 10003368 9801147 9454970 9025172
39992I025172m15171k74232l285L64338P68433J158654J532951J941687K445319
$$ 9025172 8610001 8335769 8332484 8696822 9465255 10623909 12156860 14098547 16543866
39983A6543866L054624L700622M256736M592807M621025M311909L688433K816861
$$ 16543866 19598490 23299112 27555848 32148655 36769680 41081589 44770022 47586883
39975D7586883J799132P56152k04939j027305j719366k333735k923351l506255
$$ 47586883 49386015 50142167 49937228 48909923 47190557 44856822 41933471 38427216
39967C8427216m059663m535530m875470n017722m910422m541118l964854l299187
$$ 38427216 34367553 29832023 24956553 19938831 15028409 10487291 6522437 3223250
39959C223250k678204k194671j868458j653708j470253j241267r27657n49135
$$ 3223250 545046 -1649625 -3518083 -5171791 -6642044 -7883311 -8810968 -9360103
39951i360103j76963J04890K47082K55561J71992L6096j34820l35912n52744p54115
$$ -9360103 -9537066 -9432176 -9185094 -8929533 -8757541 -8721445 -8856265 -9192177 -9744921 -10499036
39941a0499036r06838r95479j026382j012912r58065q52935o94799n10339l62912
$$ -10499036 -11405874 -12401353 -13427735 -14440647 -15398712 -16251647 -16946446 -17456785 -17819697
39932a7819697l32653m77635p99339j235239j685443k059005k312639k458348
$$ -17819697 -18152350 -18629985 -19429324 -20664563 -22350006 -24409011 -26721650 -29179998
39924b9179998k536131k571255k546407k408843k107901j636440j045880m22545
$$ -29179998 -31716129 -34287384 -36833791 -39242634 -41350535 -42986975 -44032855 -44455400
39916d4455400J58751O70320J132025J580931K036966K489119K907275L267782
$$ -44455400 -44296649 -43626329 -42494304 -40913373 -38876407 -36387288 -33480013 -30212231
39908c0212231L574238L857256M149418M452429M724421M899349M920817M763110
$$ -30212231 -26637993 -22780737 -18631319 -14178890 -9454469 -4555120 365697 5128807
39900E128807M430760L947242L342801K643998J870554J047176K24072n15581
$$ 5128807 9559567 13506809 16849610 19493608 21364162 22411338 22635410 22119829
39892B2119829j073895j369251j358195j044049m82672K14177Q94171J408458
$$ 22119829 21045934 19676683 18318488 17274439 16791767 17005944 17900115 19308573
39884A9308573J667238J672197J504217J275994J079149R50170Q61284P32490
$$ 19308573 20975811 22648008 24152225 25428219 26507368 27457538 28318822 29051312
39876B9051312M61703l2457p72104j706668k730268l714169m534943n093324n329127
$$ 29051312 29513015 29480558 28708454 27001786 24271518 20557349 16022406 10929082 5599955
39867E599955n232981m847612m253566l544190k802349k090358j455481r40766
$$ 5599955 366974 -4480638 -8734204 -12278394 -15080743 -17171101 -18626582 -19567348
39859a9567348n86448m17544m28872n81542q13274j053623j235044j297019j186503
$$ -19567348 -20153796 -20571340 -21000212 -21581754 -22395028 -23448651 -24683695 -25980714 -27167217
39850b7167217q62813l13940M21461J246852K031786K658120L058642L224851
$$ -27167217 -28030030 -28343970 -27922509 -26675657 -24643871 -21985751 -18927109 -15702258
39842a5702258L186748K985996K660733K243828J764237J245259P07758J88064
$$ -15702258 -12515510 -9529514 -6868781 -4624953 -2860716 -1615457 -907699 -719635
39834g19635k41038m77274m36252j07551M27498J026327J532987J817873J814078
$$ -719635 -960673 -1437947 -1874199 -1981750 -1554252 -527925 1005062 2822935 4637013
39825D637013J552849J168322Q40754O99873P55843R05326R96917R04395N71837
$$ 4637013 6189862 7358184 8198938 8898811 9654654 10559980 11556897 12461292 13033129
39816A3033129K5198o44091j318027j899740k346498k672306k926432l166604
$$ 13033129 13058327 12414236 11096209 9196469 6849971 4177665 1251233 -1915371
39808a915371l438134l758264m105673m422000m629419m655823m454739m015814
$$ -1915371 -5353505 -9111769 -13217442 -17639442 -22268861 -26924684 -31379423 -35395237
39800c5395237l370001k589372j775391j034707m51897o9455J22001J81652J99096
$$ -35395237 -38765238 -41354610 -43130001 -44164708 -44616605 -44686060 -44564059 -44382407 -44183311
39791d4183311K58664M05585O36897R19725J215467J488685J701335J807326J755118
$$ -44183311 -43924647 -43519062 -42882165 -41962440 -40746973 -39258288 -37556953 -35749627 -33994509
39782c3994509J493574R77869J81960q77625k118161l390033m510072n314263
$$ -33994509 -32500935 -31523066 -31341106 -32218731 -34336892 -37726925 -42236997 -47551260
39774d7551260n700592n643454n183792m410543l441605k401284j391992m69951
$$ -47551260 -53251852 -58895306 -64079098 -68489641 -71931246 -74332530 -75724522 -76194473
39766g6194473L59471J122092J844776K535007L178267L745628M202668M519996
$$ -76194473 -75835002 -74712910 -72868134 -70333127 -67154860 -63409232 -59206564 -54686568
39758e4686568M687434M723599M667885M556106M399433M184734L892692L514249
$$ -54686568 -49999134 -45275535 -40607650 -36051544 -31652111 -27467377 -23574685 -20060436
39750b0060436L052266K512746J897866J207258M45596l69027j201148k001748
$$ -20060436 -17008170 -14495424 -12597558 -11390300 -10944704 -11313731 -12514879 -14516627
39742a4516627k719387l313888l766330m081031m278315m379739m391388m295024
$$ -14516627 -17236014 -20549902 -24316232 -28397263 -32675578 -37055317 -41446705 -45741729
39734d5741729m056149l649182l087106k437020j809229j322551j061128j041746
$$ -45741729 -49797878 -53447060 -56534166 -58971186 -60780415 -62102966 -63164094 -64205840
39726f4205840j205231j435581j599923j594472j378336r80268m74231O4000N93826
$$ -64205840 -65411071 -66846652 -68446575 -70041047 -71419383 -72399651 -72873882 -72809882 -72216056
39717g2216056J118449J664671K254200K885255L524319M099247M498534M593835
$$ -72216056 -71097607 -69432936 -67178736 -64293481 -60769162 -56669915 -52171381 -47577546
39709d7577546M288130L563806K499412J249033K970j052275j770708k077679
$$ -47577546 -43289416 -39725610 -37226198 -35977165 -35974195 -37026470 -38797178 -40874857
39701d0874857j983414j568643r47739k28533N13192J236547J918398K529235
$$ -40874857 -42858271 -44426914 -45374653 -45603186 -45089994 -43853447 -41935049 -39405814
39693c9405814L022120L346535L475644L420212L215948K899604K498740K040896
$$ -39405814 -36383694 -33037159 -29561515 -26141303 -22925355 -20025751 -17527011 -15486115
39685a5486115J566395J129402P86562N81337N31782O26970Q31802J090594J321067
$$ -15486115 -13919720 -12790318 -12003756 -11422419 -10890637 -10263667 -9431865 -8341271 -7020204
39676g020204J410473J240488P45716l2296r44657j796141k426147k760717k816223
$$ -7020204 -5609731 -4369243 -3623527 -3655823 -4600480 -6396621 -8822768 -11583485 -14399708
39667a4399708k665767k393235k063005j721977j422239j230726j205179j352680
$$ -14399708 -17065475 -19458710 -21521715 -23243692 -24665931 -25896657 -27101836 -28454516
39659b8454516j606701j843756j933810j801339j466560j040771o74976m94249
$$ -28454516 -30061217 -31904973 -33838783 -35640122 -37106682 -38147453 -38822429 -39316678
39651c9316678n56997q49991j302103j802180k221474k439489k362370j930055
$$ -39316678 -39873675 -40723666 -42025769 -43827949 -46049423 -48488912 -50851282 -52781337
39643e2781337j124920R551J355809K738471L968740M889302N396556N443864
$$ -52781337 -53906257 -53896706 -52540897 -49802426 -45833686 -40944384 -35547828 -30103964
39635c0103964N043584M272929L269835K205337J238048M72825n7420l83915n77315
$$ -30103964 -25060380 -20787451 -17517616 -15312279 -14074231 -13601406 -13658826 -14042741 -14620056
39626a4620056p16839q63322j046419j269800j524778j797360k065307k294998
$$ -14620056 -15336895 -16200217 -17246636 -18516436 -20041214 -21838574 -23903881 -26198879
39618b6198879k445501k475967k351896k054335j594649j024323m26153J10383
$$ -26198879 -28644380 -31120347 -33472243 -35526578 -37121227 -38145550 -38571703 -38461320
39610c8461320N11896P31637P54380O02759L36671L3230k45301m68336o21972
$$ -38461320 -37949424 -37217787 -36463407 -35860648 -35523977 -35490747 -35736048 -36204384 -36826356
39601c6826356o81315o08470l89042p4012K19850L60867K67278n7611n30418j015568
$$ -36826356 -37507671 -38116141 -38505183 -38579195 -38359345 -37998478 -37731200 -37788811 -38319229 -39334797
39591c9334797j363011j455464j256313q30976l20675J17683L65431L61017Q9658
$$ -39334797 -40697808 -42153272 -43409585 -44240561 -44561236 -44443553 -44078122 -43717105 -43627447
39582d3627447m29199j138287j928624k637805l081401l118176k720291k002712
$$ -43627447 -44056646 -45194933 -47123557 -49761362 -52842763 -55960939 -58681230 -60683942
39574f0683942j183332m91612q0558J0686j61228m87176q44545j124427j254165
$$ -60683942 -61867274 -62358886 -62439444 -62428758 -62589986 -63077162 -63921707 -65046134 -66300299
39565f6300299j218354j069177r10104q46152r19430j072790j176390j105844
$$ -66300299 -67518653 -68587830 -69497934 -70344086 -71263516 -72336306 -73512696 -74618540
39557g4618540q15538l54227J79575O98770J160529J559905J904896K199807K446825
$$ -74618540 -75434078 -75788305 -75608730 -74909960 -73749431 -72189526 -70284630 -68084823 -65637998
39548f5637998K652343K816960K908571K849078K546778J964844J172467L31371
$$ -65637998 -62985655 -60168695 -57260124 -54411046 -51864268 -49899424 -48726957 -48395586
39540d8395586l75537q20815r67345q55707n70635k13221J14592L22903L53046
$$ -48395586 -48771123 -49591938 -50559283 -51414990 -51985625 -52198846 -52084254 -51761351 -51408305
39531e1408305J97544r6039m46668p74924j028727j188820j261917j271767j247519
$$ -51408305 -51210761 -51306800 -51753468 -52528392 -53557119 -54745939 -56007856 -57279623 -58527142
39522e8527142j205992j135898r99034p52670l79684R3542O02972J073343J449273
$$ -58527142 -59733134 -60869032 -61868066 -62620736 -63000420 -62906878 -62303906 -61230563 -59781290
39513e9781290J711962J873841J962310K009364K049596K114204K214725K328200
$$ -59781290 -58069328 -56195487 -54233177 -52223813 -50174217 -48060013 -45845288 -43517088
39505d3517088K399166K358931K150170J747552J171005M86739k09025q18218
$$ -43517088 -41117922 -38758991 -36608821 -34861269 -33690264 -33203525 -33412550 -34230768
39497c4230768j264551j499547j493721j227613o96467O9820R85657J909813K678435
$$ -34230768 -35495319 -36994866 -38488587 -39716200 -40412667 -40342847 -39357190 -37447377 -34768942
39488c4768942L158814L296020L130247K778879K387963K067374J839590J638173
$$ -34768942 -31610128 -28314108 -25183861 -22404982 -20017019 -17949645 -16110055 -14471882
39480a4471882J365584R73043N03176O4850k37446l66772l68742l35741l51680
$$ -14471882 -13106298 -12133255 -11630079 -11565229 -11802675 -12169447 -12538189 -12873930 -13225610
39471a3225610m55504o39022q64405j078157j216512j216212j040081p05508k92268
$$ -13225610 -13681114 -14320136 -15184541 -16262698 -17479210 -18695422 -19735503 -20441011 -20733279
39462b0733279Q3805L22001L84857L12062J87011P5434k1170j63298m26692q50066
$$ -20733279 -20649474 -20327473 -19942616 -19630554 -19443543 -19368109 -19389279 -19552577 -19979269 -20829335
39452b0829335j416977k077985k783948l497098m175542m756748n164246n333887
$$ -20829335 -22246312 -24324297 -27108245 -30605343 -34780885 -39537633 -44701879 -50035766
39444e0035766n236361m881487m309000l575122k738181j848380r51665j06469
$$ -50035766 -55272127 -60153614 -64462614 -68037736 -70775917 -72624297 -73575962 -73682431
39436g3682431O08425J113142J359503J343937J090535O31044P913p09802j428623
$$ -73682431 -73074006 -71960864 -70601361 -69257424 -68166889 -67535845 -67527932 -68237734 -69666357
39427f9666357k058716k541695k850746k965299k847073k441740j709072o62216
$$ -69666357 -71725073 -74266768 -77117514 -80082813 -82929886 -85371626 -87080698 -87742914
39419h7742914O12640J973725L269179M380852N241595N824713O121933O126462
$$ -87742914 -87130274 -85156549 -81887370 -77506518 -72264923 -66440210 -60318277 -54191815
39411e4191815N829976N235120M376176L331340K212756J138283K04772n20918
$$ -54191815 -48361839 -43126719 -38750543 -35419203 -33206447 -32068164 -31863392 -32384310
39403c2384310r95052j188822j090695p18866j33014N66187J252020J793235K075131
$$ -32384310 -33379362 -34568184 -35658879 -36377745 -36510759 -35944572 -34692552 -32899317 -30824186
39394c0824186K021888J621594R41052J10464p22854j444080j993472k359242
$$ -30824186 -28802298 -27180704 -26239652 -26129188 -26852042 -28296122 -30289594 -32648836
39386c2648836k562079k646365k670953k688156k718064k739471k706556k575148
$$ -32648836 -35210915 -37857280 -40528233 -43216389 -45934453 -48673924 -51380480 -53955628
39378e3955628k315244j906905j338267o18714K05664J056880J851753K527610
$$ -53955628 -56270872 -58177777 -59516044 -60134758 -59929094 -58872214 -57020461 -54492851
39370e4492851L047771L392138L550955L529473L356531L085762K781556K489967
$$ -54492851 -51445080 -48052942 -44501987 -40972514 -37615983 -34530221 -31748665 -29258698
39362b9258698K209647J888938J460912Q93631K15487n01001j175812j747372
$$ -29258698 -27049051 -25160113 -23699201 -22805570 -22590083 -23091084 -24266896 -26014268
39354b6014268k177523k444256k531291k419036k084687j519297p55456J17139
$$ -26014268 -28191791 -30636047 -33167338 -35586374 -37671061 -39190358 -39945814 -39828675
39346c9828675R66980J661595K108576K275662K188905J920096J568300J232002
$$ -39828675 -38861695 -37200100 -35091524 -32815862 -30626957 -28706861 -27138561 -25906559
39338b5906559R75316Q06136O82952N46091L51217Q6857k25987n44817q20616
$$ -25906559 -24931243 -24125107 -23442155 -22896064 -22544847 -22457990 -22683977 -23228794 -24049410
39329b4049410j011319j088597j038008q59140n70115k10719J65081N07035P83842
$$ -24049410 -25060729 -26149326 -27187334 -28046474 -28616589 -28827308 -28662227 -28155192 -27371350
39320b7371350R80885J079704J038642Q00997L36523l12883j025501j643142k035690
$$ -27371350 -26390465 -25310761 -24272119 -23471122 -23134599 -23447482 -24472983 -26116125 -28151815
39311b8151815k146006k000810j697305j372602j154263j104115j189019j305417
$$ -28151815 -30297821 -32298631 -33995936 -35368538 -36522801 -37626916 -38815935 -40121352
39303d0121352j345207j257569j067306q45723o60991n40455m61713l69565k04829
$$ -40121352 -41466559 -42724128 -43791434 -44637157 -45298148 -45838603 -46300316 -46669881 -46874710
39294d6874710O7814M40089Q53710J214068J425417J433242J248223R36700N89360
$$ -46874710 -46806896 -46366807 -45513097 -44299029 -42873612 -41440370 -40192147 -39255447 -38666087
39285c8666087K94344J26790J42794L63177P54419J229964J682524K029565K240836
$$ -38666087 -38371743 -38244953 -38102159 -37738982 -36984563 -35754599 -34072075 -32042510 -29801674
39276b9801674K331218K329249K248731K085004J833698J509062J142035P62991
$$ -29801674 -27470456 -25141207 -22892476 -20807472 -18973774 -17464712 -16322677 -15559686
39268a5559686L91458M4470k48913m46210n07027m14804j94369Q1097L02043L58852
$$ -15559686 -15168228 -15123758 -15372671 -15818881 -16325908 -16740712 -16935081 -16853984 -16551941 -16193089
39258a6193089J89882j88910o95976j230567j721007k145041k517278k861187
$$ -16193089 -16003207 -16192117 -16888093 -18118660 -19839667 -21984708 -24501986 -27363173
39250b7363173l186259l478957l704807l817076l769456l528328l078525k422795
$$ -27363173 -30549432 -34028389 -37733196 -41550272 -45319728 -48848056 -51926581 -54349376
39242e4349376j584064o16599L82656J279815J934084K241466K173373J793631
$$ -54349376 -55933440 -56550039 -56167383 -54887568 -52953484 -50712018 -48538645 -46745014
39234d6745014J242652O86423K46532n3653k93009o02102j088201j778467k606076
$$ -46745014 -45502362 -44815939 -44569407 -44623060 -44916069 -45518171 -46606372 -48384839 -50990915
39225e0990915l434778m102031m465340m444343m047700l367336k534157j658304
$$ -50990915 -54425693 -58527724 -62993064 -67437407 -71485107 -74852443 -77386600 -79044904
39217g9044904p93542N3367Q84646J679265K387285K948240L320390L507463L568809
$$ -79044904 -79838446 -79785079 -78900433 -77221168 -74833883 -71885643 -68565253 -65057790 -61488981
39208f1488981L600348L688019L858360M060548M195287M170338L941784L514876
$$ -61488981 -57888633 -54200614 -50342254 -46281706 -42086419 -37916081 -33974297 -30459421
39200c0459421K916427K175268J333775M75672k67987p57246r08065p37687l55509
$$ -30459421 -27542994 -25367726 -24033951 -23558279 -23826266 -24583512 -25491577 -26229264 -26584773
39191b6584773R4471M97405P95564R74572J038177J002648R08472Q19867P94859
$$ -26584773 -26490302 -25992897 -25197333 -24222761 -23184584 -22181936 -21273464 -20453597 -19658738
39182a9658738Q47886R45305J045607J149098J309195J594291K034540K594450
$$ -19658738 -18810852 -17865547 -16819940 -15670842 -14361647 -12767356 -10732816 -8138366
39174h138366L180664L667405L926187L862436L457755K795351K039968J371037
$$ -8138366 -4957702 -1290297 2635890 6498326 9956081 12751432 14791400 16162437
39166A6162437R06041O62588N79356N73227N88911O12797O55609P27957Q27643
$$ 16162437 17068478 17731066 18310422 18883649 19472560 20085357 20740966 21468923 22296566
39157B2296566R40607J048256J135394J196491J237493J269626J295661J296534
$$ 22296566 23237173 24285429 25420823 26617314 27854807 29124433 30420094 31716628
39149C1716628J229919J046118P13785K39441l30499r24320j467978j907638k222625
$$ 31716628 32946547 33992665 34706450 34945891 34615392 33691072 32223094 30315456 28092831
39140B8092831k420557k517505k521897k438415k282513k079095j838135j535071
$$ 28092831 25672274 23154769 20632872 18194457 15911944 13832849 11994714 10459643
39132A0459643j126655n96132J1309N93909J035423J254797J234866J018136O77897
$$ 10459643 9332988 8736856 8748165 9342074 10377497 11632294 12867160 13885296 14563193
39123A4563193K87527r1837m05826o03147o48269n41919l26753o6650J88189M25415
$$ 14563193 14850720 14758883 14353057 13749910 13101641 12559722 12232969 12166319 12354508 12779923
39113A2779923O67404R45602J273318J636133K002070K338119K618420K819855
$$ 12779923 13447327 14392929 15666247 17302380 19304450 21642569 24260989 27080844
39105B7080844K911874K852551K600530K140962J508009P82736O2738n75580j095839
$$ 27080844 29992718 32845269 35445799 37586761 39094770 39877506 39940244 39364664 38268825
39096C8268825j494502j782499j973910k086796k148329k193688k254767k344673
$$ 38268825 36774323 34991824 33017914 30931118 28782789 26589101 24334334 21989661
39088B1989661k450391k543586k607621k664689k780909l036843l474342m053189
$$ 21989661 19539270 16995684 14388063 11723374 8942465 5905622 2431280 -1621909
39080a621909m651233n112045n308656n184383m757667m105315l340048k583483
$$ -1621909 -6273142 -11385187 -16693843 -21878226 -26635893 -30741208 -34081256 -36664739
39072c6664739j932202j425752j031181o50577j50361N89218J613477K851661
$$ -36664739 -38596941 -40022693 -41053874 -41704451 -41854812 -41265594 -39652117 -36800456
39064c6800456M131232N251786O071569O547368O712627O630357O362271N960046
$$ -36800456 -32669224 -27417438 -21345869 -14798501 -8085874 -1455517 4906754 10866800
39056A0866800N459971M873419M185786L374090K434333J400651L47212o24450
$$ 10866800 16326771 21200190 25385976 28760066 31194399 32595050 32942262 32317812
39048C2317812j406409j908733k082496j934855j527893r55624l05909L69078
$$ 32317812 30911403 29002670 26920174 24985319 23457426 22501802 22195893 22564971
39040B2564971J049809J717474K328606K826915L180206L398583L509677L515879
$$ 22564971 23614780 25332254 27660860 30487775 33667981 37066564 40576241 44092120
39032D4092120L378927L048182K507193J801641J031863L17396k47317o25223
$$ 44092120 47471047 50519229 53026422 54828063 55859926 56177322 55930005 55304782
39024E5304782q41674r61218j052472j162938j314175j510842j749881k021176
$$ 55304782 54463108 53501890 52449418 51286480 49972305 48461463 46711582 44690406
39016D4690406k301257k548485k708151k729269k587320k303886j954073j652990
$$ 44690406 42389149 39840664 37132513 34403244 31815924 29512038 27557965 25904975
39008B5904975j518174j621129j956397k448639k988197l465693l789480l894968
$$ 25904975 24386801 22765672 20809275 18360636 15372439 11906746 8117266 4222298
39000D222298l756970l398277k882893k298432j741014j302588j050838j006168
$$ 4222298 465328 -2932949 -5815842 -8114274 -9855288 -11157876 -12208714 -13214882
38992a3214882j136631j379818j672526j963350k206033k351187k349356k163082
$$ -13214882 -14351513 -15731331 -17403857 -19367207 -21573240 -23924427 -26273783 -28436865
38984b8436865j780155j223341n53716J36062P41323J176234J407449J473613
$$ -28436865 -30217020 -31440361 -31994077 -31858015 -31116692 -29940458 -28533009 -27059396
38976b7059396J474061J526603J716638K065239K527591L014861L427856L692238
$$ -27059396 -25585335 -24058732 -22342094 -20276855 -17749264 -14734403 -11306547 -7614309
38968g614309L782928L726308L581082L411900L269604L181983L153436L172634
$$ -7614309 -3831381 -105073 3476009 6887909 10157513 13339496 16492932 19665566
38960A9665566L224528L297724L381400L457483L499337L479625L379080L188828
$$ 19665566 22890094 26187818 29569218 33026701 36526038 40005663 43384743 46573571
38952D6573571K909448K554439K158179J778693J487452J349439J403421J647647
$$ 46573571 49483019 52037458 54195637 55974330 57461782 58811221 60214642 61862289
38944F1862289K030953K453759K789370K927257K819376K501076K072386J651510
$$ 61862289 63893242 66347001 69136371 72063628 74883004 77384080 79456466 81107976
38936H1107976J328741J147337J119266J256723J584299K113556K802652L546506
$$ 81107976 82436717 83584054 84703320 85960043 87544342 89657898 92460550 96007056
38928I6007056M217799M729794N071020N287817N433136N520978N515742N358538
$$ 96007056 100224855 104954649 110025669 115313486 120746622 126267600 131783342 137141880
38920A37141880N007712M463612L763485K957569K089475J194372L10116n13835
$$ 137141880 142149592 146613204 150376689 153334258 155423733 156618105 156928221 156414386
38912A56414386j221237j766922k136121k352718k473103k570105k710422k927389
$$ 156414386 155193149 153426227 151290106 148937388 146464285 143894180 141183758 138256369
38904A38256369l198366l443306l551485l422453k998858k280906j325926k37660
$$ 138256369 135058003 131614697 128063212 124640759 121641901 119360995 118035069 117797409
38896A17797409Q52882J809372K506984K844760K763353K271217J464348N17985
$$ 117797409 118650291 120459663 122966647 125811407 128574760 130845977 132310325 132828310
38888A32828310l56939r77022j241051j152622q03671l30629J32787M83681O53796
$$ 132828310 132471371 131494349 130253298 129100676 128297005 127966376 128099163 128582844 129236640
38879A29236640O07186L56062o892k99121l02227J32941J000363K138165L312044
$$ 129236640 129843826 130199888 130192996 129893875 129591648 129724589 130724952 132863117 136175161
38870A36175161M320390N057843N516782N744766N791003N674682N393116M957680
$$ 136175161 140495551 145553394 151070176 156814942 162605945 168280627 173673743 178631423
38862A78631423M422919L883622L445642L192790L163182L336921L639884L971536
$$ 178631423 183054342 186937964 190383606 193576396 196739578 200076499 203716383 207687919
38854B07687919M251526M459472M639211M861417N170341N552893N948133O279109
$$ 207687919 211939445 216398917 221038128 225899545 231069886 236622779 242570912 248850021
38846B48850021O475124O476397O244086N793251N227209M729435M497624M656833
$$ 248850021 255325145 261801542 268045628 273838879 279066088 283795523 288293147 292949980
38838B92949980N209176O047448P012308P950698Q747249R327954R651503R703365
$$ 292949980 298159156 304206604 311218912 319169610 327916859 337244813 346896316 356599681
38830C56599681R498960R091281Q568971Q032527P555534P157970O812427O473082
$$ 356599681 366098641 375189922 383758893 391791420 399346954 406504924 413317351 419790433
38822D19790433O099343N663271N153306M580095L969471L335814K661926J915841
$$ 419790433 425889776 431553047 436706353 441286448 445255919 448591733 451253659 453169500
38814D53169500J093088K38072n79446j305084j915502k403385k762245k994383
$$ 453169500 454262588 454500660 453921214 452616130 450700628 448297243 445534998 442540615
38806D42540615l131181l238936l400690l689045m148181m787262n577979o458051
$$ 442540615 439409434 436170498 432769808 429080763 424932582 420145320 414567341 408109290
38798D08109290p351266q202252r002509r784620j0588593j1425656j2258626
$$ 408109290 400758024 392555772 383553263 373768643 363180050 351754394 339495768
38791C39495768j3000375j3527942j3714643j3477043j2817573j1836375j0698589
$$ 339495768 326495393 312967451 299252808 285775765 272958192 261121817 250423228
38784B50423228r569299q553165p679155o939571o344532n937652n759569n801220
$$ 250423228 240853929 232300764 224621609 217682038 211337506 205399854 199640285 193839065
38776A93839065n996357o258616o527384o786801p048769p314622p542806p649909
$$ 193839065 187842708 181584092 175056708 168269907 161221138 153906516 146363710 138713801
38768A38713801p550375p206187o647816n957206n237765m593946m115106l849335
$$ 138713801 131163426 123957239 117309423 111352217 106114452 101520506 97405400 93556065
38760I3556065l774165l789447l746649l503009k974974k169292j181868j67551
$$ 93556065 89781900 85992453 82245804 78742795 75767821 73598529 72416661 72249110
38752G2249110P04686J294211J519714J376995R40025L38951k81879q06575j169700
$$ 72249110 72953796 74248007 75767721 77144716 78084741 78423692 78141813 77335238 76165538
38743G6165538j354052j378398j286615j134724r68774q00746o01409l20436P7166
$$ 76165538 74811486 73433088 72146473 71011749 70042975 69242229 68640820 68320384 68397550
38734F8397550N82072J137659J664450K095615K398826K569699K607210K498179
$$ 68397550 68979622 70117281 71781731 73877346 76276172 78845871 81453081 83951260
38726H3951260K226715J796344J241219O19465R45n41089r39485j149651j165800
$$ 83951260 86177975 87974319 89215538 89835003 89835948 89294859 88355374 87205723 86039923
38717H6039923j024564p93843n54679l82010l26142m00612n86462q54910j194805
$$ 86039923 85015359 84221516 83666837 83284827 82958685 82558073 81971611 81116701 79921896
38708G9921896j624685k179350k878728l698938m565153n373169o028345o478221
$$ 79921896 78297211 76117861 73239133 69540195 64975042 59601873 53573528 47095307
38700D7095307o718991o774292o664211o387957n931312n289573m485166l566433
$$ 47095307 40376316 33602024 26937813 20549856 14618544 9328971 4843805 1277372
38692A277372k592715j621014p01492J24711Q32141J415928J882723K228547K422086
$$ 1277372 -1315343 -2936357 -3637849 -3513138 -2680997 -1265069 617654 2846201 5268287
38683E268287K411625K154290J647709R43183J33646o73543j380472j906739k187146
$$ 5268287 7679912 9834202 11481911 12425094 12558740 11885197 10504725 8597986 6410840
38674F410840k177499j876791j347641p06595q1123M35006P94627R80235R88214
$$ 6410840 4233341 2356550 1008909 302314 221191 656197 1450824 2431059 3419273
38665C419273Q34509N68421K68038J1024j59139k47962k99147l68058m94288o86631
$$ 3419273 4253782 4822203 5090241 5101265 4942126 4694164 4395017 4026959 3532671 2846040
38655B846040r29109j205576j524186j917230k409129k974870l523826l925778
$$ 2846040 1916931 711355 -812831 -2730061 -5139190 -8114060 -11637886 -15563664
38647a5563664m064713l889870l439413k827112k197276j668228j293224j057159
$$ -15563664 -19628377 -23518247 -26957660 -29784772 -31982048 -33650276 -34943500 -36000659
38639c6000659r01967p58515n71679l19191k2154K64221M82048O03946O42371
$$ -36000659 -36902626 -37661141 -38232820 -38552011 -38574165 -38309944 -37827896 -37223950 -36581579
38630c6581579O32844O12688O13660O66447Q04498J059591J447613J945414K467585
$$ -36581579 -35948735 -35336047 -34722387 -34055940 -33251442 -32191851 -30744238 -28798824 -26331239
38621b6331239K864494K960688K626057J840894P13123n61537j766241k716243
$$ -26331239 -23466745 -20506057 -17880000 -16039106 -15325983 -15887520 -17653761 -20370004
38613b0370004l282841l400874l075284k383016j456146m46132N11412J313424
$$ -20370004 -23652845 -27053719 -30129003 -32512019 -33968165 -34414297 -33902885 -32589461
38605c2589461J889316K199231K239102K046423J695908J281725Q93364N96715
$$ -32589461 -30700145 -28500914 -26261812 -24215389 -22519481 -21237756 -20344392 -19747677
38597a9747677M27811L97620N00137P18007J026235J396325J799767K208671K595898
$$ -19747677 -19319866 -18922246 -18422109 -17704102 -16677867 -15281542 -13481775 -11273104 -8677206
38588h677206K939892L234160L492577L740030L987735M207215M323418M237041
$$ -8677206 -5737314 -2503154 989423 4729453 8717188 12924403 17247821 21484862
38580B1484862L864846L173894K194759J017262k22261j363610k260463k823717
$$ 21484862 25349708 28523602 30718361 31735623 31513362 30149752 27889289 25065572
38572B5065572l046614k996401k781597k516623k296226k177774k167671k217194
$$ 25065572 22018958 19022557 16240960 13724337 11428111 9250337 7082666 4865472
38564D865472k238928k146841j903973j546864j164204q39146n94177l75873q5808
$$ 4865472 2626544 479703 -1424270 -2971134 -4135338 -4974484 -5568661 -5944534 -6030342
38555f030342L66719J021284J849688K765922L651235M381051M847182M977300
$$ -6030342 -5663623 -4642339 -2792651 -26729 3624506 8005557 12852739 17830039
38547A7830039M753155M221296L487106K691389J977920J460022J190242J140769
$$ 17830039 22583194 26804490 30291596 32982985 34960905 36420927 37611169 38751938
38539C8751938J208920J255949J165292Q87231M42445j13784p37266j419510k183014
$$ 38751938 39960858 41216807 42382099 43269330 43711775 43597991 42860725 41441215 39258201
38530C9258201l059863m067211n184435o337771p406568q259695q806905r031797
$$ 39258201 36198338 32131127 26946692 20608921 13202353 4942658 -3864247 -12896044
38522a2896044q981553q718116q262076p568776o559283n191273l519803j699948
$$ -12896044 -21877597 -30595713 -38857789 -46426565 -52985848 -58177121 -61696924 -63396872
38514f3396872P0744J624089K859192L739133M273560M509901M528822M427282
$$ -63396872 -63326128 -61702039 -58842847 -55103714 -50830154 -46320253 -41791431 -37364149
38506c7364149M287101M148327M009458L855308L687691L531820L416660L353326
$$ -37364149 -33077048 -28928721 -24919263 -21063955 -17376264 -13844444 -10427784 -7074458
38498g074458L332770L337968L349984L339078L254291L030929K620017K023167
$$ -7074458 -3741688 -403720 2946264 6285342 9539633 12570562 15190579 17213746
38490A7213746J307862N88761j6680m33199o51591p27178p61211q72805j164976
$$ 17213746 18521608 19110369 19093689 18660490 18008899 17281721 16520510 15647705 14482729
38481A4482729j690030k424017l261833m042454m604979m856413m814302m595298
$$ 14482729 12792699 10368682 7106849 3064395 -1540584 -6396997 -11211299 -15806597
38473a5806597m355754m221139m239402m370239m505980m515955m300377l831153
$$ -15806597 -20162351 -24383490 -28622892 -32993131 -37499111 -42015066 -46315443 -50146596
38465e0146596l159959k391793j639774r83744m52854m0182K65532M62452N49637
$$ -50146596 -53306555 -55698348 -57338122 -58321866 -58774720 -58814902 -58549370 -58086918 -57537281
38456e7537281N53409N32167N52828O65275Q96558J255574J728987K271856K813174
$$ -57537281 -56983872 -56451705 -55898877 -55233602 -54337044 -53081470 -51352483 -49080627 -46267453
38447d6267453L280300L622190L814215L849351L728506L451831L007970K369865
$$ -46267453 -42987153 -39364963 -35550748 -31701397 -27972891 -24521060 -21513090 -19143225
38439a9143225J511214M41057p67439j977612l022403l753861m087465m022836
$$ -19143225 -17632011 -17190954 -17958393 -19936005 -22958408 -26712269 -30799734 -34822570
38431c4822570l632184l024365k307009j566321q65844k52127K41933N96774Q08252
$$ -34822570 -38454754 -41479119 -43786128 -45352449 -46218293 -46470420 -46228487 -45631713 -44823461
38422d4823461Q92362Q87400Q44100Q03804P80560P63982P40763P14413P05361
$$ -44823461 -43931099 -43043699 -42199599 -41395795 -40615235 -39851253 -39110490 -38396077 -37690716
38413c7690716P33312P99356Q83083R54834R90145R74467Q98591P55731N48586
$$ -37690716 -36957404 -36158048 -35274965 -34320131 -33329986 -32355519 -31456928 -30701197 -30152611
38404c0152611L02056O8869q0577q1537J00028M53225R25457J439935J916766
$$ -30152611 -29850555 -29781686 -29862263 -29943800 -29843772 -29390547 -28465090 -27025155 -25108389
38395b5108389K288448K510064K570406K503739K390058K330587K401063K604913
$$ -25108389 -22819941 -20309877 -17739471 -15235732 -12845674 -10515087 -8114024 -5509111
38387e509111K854944K999311K883553K418615J617873N81894n57352j694463
$$ -5509111 -2654167 345144 3228697 5647312 7265185 7847079 7289727 5595264
38379E595264k775432l785271m722908n586248o366231p035101p528418p742269
$$ 5595264 2819832 -965439 -5688347 -11274595 -17640826 -24675927 -32204345 -39946614
38371c9946614p565391o936977n893513m570995l160271j844910p56079M2328
$$ -39946614 -47512005 -54448982 -60342495 -64913490 -68073761 -69918671 -70674750 -70632422
38363g0632422N48624Q12261R17453R55515R92223J051516J129742J227495J368369
$$ -70632422 -70083798 -69271537 -68354084 -67398569 -66406346 -65354830 -64225088 -62997593 -61629224
38354f1629224J587364J901490K289385K694368L044747L277456L356752L285591
$$ -61629224 -60041860 -58140370 -55850985 -53156617 -50111870 -46834414 -43477662 -40192071
38346d0192071L107550K896223K732175K673854K734858K881428L055023L206053
$$ -40192071 -37084521 -34188298 -31456123 -28782269 -26047411 -23165983 -20110960 -16904907
38338a6904907L311260L357865L310047L096007K638374J908334R57825r7520
$$ -16904907 -13593647 -10235782 -6925735 -3829728 -1191354 716980 1674805 1577285
38330A577285j128789k037335k765746l283213l570646l623229l468166l180292
$$ 1577285 448496 -1588839 -4354585 -7637798 -11208444 -14831673 -18299839 -21480131
38322b1480131k876076k678064k662563k820909l062007l257471l301069l147403
$$ -21480131 -24356207 -27034271 -29696834 -32517743 -35579750 -38837221 -42138290 -45285693
38314d5285693k814087k355435j825990j251134o19054R8895R09148J764354K563368
$$ -45285693 -48099780 -50455215 -52281205 -53532339 -54151393 -54052498 -53143350 -51378996 -48815628
38305d8815628L184315L529727L558915L296226K818419K230227J636977J123325
$$ -48815628 -45631313 -42101586 -38542671 -35246445 -32428026 -30197799 -28560822 -27437497
38297b7437497P46791N46564N53100P78308J185629J670310K084551K304125K289061
$$ -27437497 -26690706 -26144142 -25591042 -24812734 -23627105 -21956795 -19872244 -17568119 -15279058
38288a5279058K092665J819914J574943J429986J416228J523493J705969J897700
$$ -15279058 -13186393 -11366479 -9791536 -8361550 -6945322 -5421829 -3715860 -1818160
38280a818160K032173K053131J913154J571933J007452K40314o42789j485831
$$ -1818160 214013 2267144 4180298 5752231 6759683 6999997 6357208 4871377
38272D871377k094485k300284k034521j372564n17021K77565P98380R36860O97272
$$ 4871377 2776892 476608 -1557913 -2930477 -3447498 -3169933 -2371553 -1434693 -737421
38263g37421J65607n31486j259786j902256k379910k666849k791937k821445k825581
$$ -737421 -571814 -1103300 -2363086 -4265342 -6645252 -9312101 -12104038 -14925483 -17751064
38254a7751064k843556k867895k859271k780649k623640k407448k155232j870857
$$ -17751064 -20594620 -23462515 -26321786 -29102435 -31726075 -34133523 -36288755 -38159612
38246c8159612j535051j120282o08735p06O84577J407605K108442K718318L182472
$$ -38159612 -39694663 -40814945 -41423680 -41424386 -40739809 -39332204 -37223762 -34505444 -31322972
38237c1322972L474697L587750L512401L234388K757282K125267J417032P12457
$$ -31322972 -27848275 -24260525 -20748124 -17513736 -14756454 -12631187 -11214155 -10501698
38229a0501698O0172n30110j069903j566624k011588k391922k718488l046462
$$ -10501698 -10441526 -10971636 -12041539 -13608163 -15619751 -18011673 -20730161 -23776623
38221b3776623l465770m056850m831079n690650o439663o851885o761540o122442
$$ -23776623 -27242393 -31299243 -36130322 -41820972 -48260635 -55112520 -61874060 -67996502
38213f7996502n002604l530801j842736o1111J694091L293936M611380N554091
$$ -67996502 -72999106 -76529907 -78372643 -78433754 -76739663 -73445727 -68834347 -63280256
38205f3280256O096131O282948O203565N947601N571058N084095M462604L679518
$$ -63280256 -57184125 -50901177 -44697612 -38750011 -33178953 -28094858 -23632254 -19952736
38197a9952736K742284J712341O89477k27933r75022j524561j872814k029654
$$ -19952736 -17210452 -15498111 -14808634 -15036567 -16011589 -17536150 -19408964 -21438618
38189b1438618k020875j890139j685937j436479j133582p45175k51756L22581
$$ -21438618 -23459493 -25349632 -27035569 -28472048 -29605630 -30350805 -30602561 -30279980
38181c0279980R11221J435318J836197K088391K194687K177291K074999J946594
$$ -30279980 -29368759 -27933441 -26097244 -24008853 -21814166 -19636875 -17561876 -15615282
38173a5615282J872878J945157K234024K751217L430908M145408M744032N091487
$$ -15615282 -13742404 -11797247 -9563223 -6812006 -3381098 764310 5508342 10599829
38165A0599829N092122M699166L911751K764281J318378l34077k062394l700274
$$ 10599829 15691951 20391117 24302868 27067149 28385527 28051450 25989056 22288782
38157B2288782n072555o040676o548445o644599o463627o165864n865915n590950
$$ 22288782 17216227 11175551 4627106 -2017493 -8481120 -14646984 -20512899 -26103849
38149b6103849n290625m883578m305993l537894k605097j567013m99740N19532
$$ -26103849 -31394474 -36278052 -40584045 -44121939 -46727036 -48294049 -48793789 -48274257
38141d8274257J421805K146708K638968K852933K772489K435513J938394J407174
$$ -48274257 -46852452 -44705744 -42066776 -39213843 -36441354 -34005841 -32067447 -30660273
38133c0660273R51842O36603M81569M80257O08668Q20853J045569J197489J201987
$$ -30660273 -29708431 -29071828 -28590259 -28110002 -27501334 -26680481 -25634912 -24437423 -23235436
38124b3235436J022070O73526K17523k69377p31783j155692j561575j979462k423267
$$ -23235436 -22213366 -21539840 -21322317 -21591694 -22323477 -23479169 -25040744 -27020206 -29443473
38115b9443473k875157l283284l572998l667395l507550l064556k344469j390911
$$ -29443473 -32318630 -35601914 -39174912 -42842307 -46349857 -49414413 -51758882 -53149793
38107e3149793k83942Q70501J960573K890922L601467M079677M360365M505799
$$ -53149793 -53433735 -52563234 -50602661 -47711739 -44110272 -40030595 -35670230 -31164431
38099c1164431M570213M568668M471004M224539L790626L173996K429635J644869
$$ -31164431 -26594218 -22025550 -17554546 -13330007 -9539381 -6365385 -3935750 -2290881
38091b290881R09146K90308j73489m72175o21448o58832o33202n91112n69005
$$ -2290881 -1381735 -1091427 -1264916 -1737091 -2358539 -3017371 -3650573 -4241685 -4810690
38082d810690n92423o74322q09305r72200j130717j269094j406004j588933j862834
$$ -4810690 -5403113 -6077435 -6886740 -7858940 -8989657 -10258751 -11664755 -13253688 -15116522
38073a5116522k235098k669151l116286l554938l994308m436658m840025n122931
$$ -15116522 -17351620 -20020771 -23137057 -26691995 -30686303 -35122961 -39962986 -45085917
38065d5085917n205773n047591m651733m051669l300466k468122j635469q80679
$$ -45085917 -50291690 -55339281 -59991014 -64042683 -67343149 -69811271 -71446740 -72327419
38057g2327419k66246J70654M31903N75810P16879R86567J467010K142758K907696
$$ -72327419 -72593665 -72423011 -71991108 -71415298 -70698419 -69711852 -68244842 -66102084 -63194388
38048f3194388L620822M170551M510255M653321M638609M490549M202368L756016
$$ -63194388 -59573566 -55403015 -50892760 -46239439 -41600830 -37110281 -32907913 -29151897
38040b9151897L161335K478776J808110J258824R25943Q73677J114798J587134
$$ -29151897 -25990562 -23511786 -21703676 -20444852 -19518909 -18645232 -17530434 -15943300
38032a5943300K149624K617736K830762K716441K314404J744169J140077N97025
$$ -15943300 -13793676 -11175940 -8345178 -5628737 -3314333 -1570164 -430087 166938
38024A66938J58510j56364l17455k71415L5531O13819J398128K254396L025231
$$ 166938 325448 169084 -148371 -419786 -384255 229564 1627692 3882088 6907319
38015F907319L582039L852039L816774L499836K955211K253233J462780O37883
$$ 6907319 10489358 14341397 18158171 21658007 24613218 26866451 28329231 28967114
38007B8967114j85152r84258j747082k464103l118229l677169m096052m329809
$$ 28967114 28781962 27797704 26050622 23586519 20468290 16791121 12695069 8365260
37999H365260m348102m145553l742776l178284k498818j758320j025023l82333
$$ 8365260 4017158 -128395 -3871171 -7049455 -9548273 -11306593 -12331616 -12713949
37991a2713949Q7792L31075L37257J36890k13809o48044j099373j511042j844937
$$ -12713949 -12626157 -12295082 -11957825 -11820935 -12034744 -12682788 -13782161 -15293203 -17138140
37982a7138140k087558k249591k358185k444647k531361k620482k686461k678282
$$ -17138140 -19225698 -21475289 -23833474 -26278121 -28809482 -31429964 -34116425 -36794707
37974c6794707k539215k241345j813326j334208q88934n16046j89443J51249N48121
$$ -36794707 -39333922 -41575267 -43388593 -44722801 -45611735 -46127781 -46317224 -46165975 -45617854
37965d5617854R91598J425553J778201J995138K061394K009214J908128J836984
$$ -45617854 -44626256 -43200703 -41422502 -39427364 -37365970 -35356756 -33448628 -31611644
37957c1611644J851514J969467K180860K466436K801788L143902L418436L528822
$$ -31611644 -29760130 -27790663 -25609803 -23143367 -20341579 -17197677 -13779241 -10250419
37949a0250419L394428L004796K457637J943066J663293J727242K089078K571433
$$ -10250419 -6855991 -3851195 -1393558 549508 2212801 3940043 6029121 8600554
37941H600554K950875L045614K762514K101299J133969k5855j253410k431646
$$ 8600554 11551429 14597043 17359557 19460856 20594825 20568970 19315560 16883914
37933A6883914l454462m226850m678245m786731m592551m184699l668523l136293
$$ 16883914 13429452 9202602 4524357 -262374 -4854925 -9039624 -12708147 -15844440
37925a5844440k654242k261913j971977j764983j585640j354244r99327m97361
$$ -15844440 -18498682 -20760595 -22732572 -24497555 -26083195 -27437439 -28436766 -28934127
37917b8934127J09120P32024J282586J707434J995688K164894K245121K269452
$$ -28934127 -28825007 -28092983 -26810397 -25102963 -23107275 -20942381 -18697260 -16427808
37909a6427808K266539K251493K218871K143033J987202J719487J332620Q59644
$$ -16427808 -14161269 -11909776 -9690905 -7547872 -5560670 -3841183 -2508563 -1648919
37901a648919L73518l6700l04194m13770m02112l30820k54742k07129k03723k52824
$$ -1648919 -1275401 -1312101 -1616295 -2030065 -2432177 -2762997 -3017739 -3224868 -3428591 -3681415
37891c681415l60855n32901p69816j060220j369565j637914j797851j807836j679050
$$ -3681415 -4042270 -4575171 -5344987 -6405207 -7774772 -9412686 -11210537 -13018373 -14697423
37882a4697423j474546j279301j161503j150142j238189j398872j596669j789308
$$ -14697423 -16171969 -17451270 -18612773 -19762915 -21001104 -22399976 -23996645 -25785953
37874b5785953j933189k000036j992563j939293j867121j774757j631150j398911
$$ -25785953 -27719142 -29719178 -31711741 -33651034 -35518155 -37292912 -38924062 -40322973
37866d0322973j059847o21084j01279M85096J128793J812799K501043L141978
$$ -40322973 -41382820 -42003904 -42105183 -41620087 -40491294 -38678495 -36177452 -33035474
37858c3035474L683647M085064M314717M342596M139361L688467L005057K150859
$$ -33035474 -29351827 -25266763 -20952046 -16609450 -12470089 -8781622 -5776565 -3625706
37850c625706J235886M00247k26015n73961o70388o26880n79071o09217p02926
$$ -3625706 -2389820 -1989573 -2215588 -2789549 -3459937 -4086817 -4665888 -5275105 -5978031
37841e978031p69285p07943m75389j08633L02055O68462R53430J186146J433841
$$ -5978031 -6747316 -7455259 -7930648 -8039281 -7737226 -7068764 -6115334 -4929188 -3495347
37832c495347J743655K089985K365235K425935K167709J581866P60349j49888
$$ -3495347 -1751692 338293 2703528 5129463 7297172 8879038 9639387 9489499
37824I489499j012577j748771k339104k786224l071316l143529k951592k487792
$$ 9489499 8476922 6728151 4389047 1602823 -1468493 -4612022 -7563614 -10051406
37816a0051406j804879r95821j61223O07135J223537J605394J686303J442223
$$ -10051406 -11856285 -12852106 -13013329 -12406194 -11182657 -9577263 -7890960 -6448737
37808f448737R13824K09478n15118j093345j388080j324905r08775k16432O36259
$$ -6448737 -5534913 -5325435 -5840553 -6933898 -8321978 -9646883 -10555658 -10772090 -10135831
37799a0135831J538849K418626L242699L994001M644203N145007N440222N483840
$$ -10135831 -8596982 -6178356 -2935657 1058344 5702547 10847554 16287776 21771616
37791B1771616N248420M721073L896865K781660J407796j46094j747386l227268
$$ 21771616 27020036 31741109 35637974 38419634 39827430 39681336 37933950 34706682
37783C4706682m422347n220257n584265n547070n186630m604070l909839l209038
$$ 34706682 30284335 25064078 19479813 13932743 8746113 4142043 232204 -2976834
37775b976834k579225k050372j605348j207401q38210n16944k82209j49051p7584
$$ -2976834 -5556059 -7606431 -9211779 -10419180 -11257390 -11774334 -12056543 -12205594 -12283178
37766a2283178J5942K09345N22324R00081J242835J459697J512431J424255J251849
$$ -12283178 -12267236 -12057891 -11535567 -10635486 -9392651 -7932954 -6420523 -4996268 -3744419
37757c744419J042141Q04356N14050J39405l36168r12386j583819k341971l155924
$$ -3744419 -2702278 -1897922 -1383872 -1244467 -1580635 -2493021 -4076840 -6418811 -9574735
37748i574735l948663m601258m996428n072901m845763m376959l725162k919132
$$ -9574735 -13523398 -18124656 -23121084 -28193985 -33039748 -37416707 -41141869 -44061001
37740d4061001j971640r13808J84082J223635K112612K797107L271426L565476
$$ -44061001 -46032641 -46946449 -46762367 -45538732 -43426120 -40629013 -37357587 -33792111
37732c3792111L723930L787359L774990L670847L426057K988389K348656J573434
$$ -33792111 -30068181 -26280822 -22505832 -18834985 -15408928 -12420539 -10071883 -8498449
37724h498449P96596J67781k13579l37426k71724j15512M4165J46970J56477O1794
$$ -8498449 -7701853 -7534072 -7747651 -8085077 -8356801 -8472313 -8428148 -8281178 -8124701 -8062907
37714h062907j16354l33007n44267p31428r04189j083015j275511j461062j590112
$$ -8062907 -8179261 -8512268 -9056535 -9787963 -10692152 -11775167 -13050678 -14511740 -16101852
37705a6101852j595451j406683r63557k34780P54051J901762L050595M044168
$$ -16101852 -17697303 -19103986 -20067543 -20302323 -19548272 -17646510 -14595915 -10551747
37697a0551747M786557N261446N506128N567754N470309N204739M742176M061581
$$ -10551747 -5765190 -503744 5002384 10570138 16040447 21245186 25987362 30048943
37689C0048943L175151K135723J023744p5637j092421j980447k714180l282292
$$ 30048943 33224094 35359817 36383561 36307924 35215503 33235056 30520876 27238584
37681B7238584l690266l971380m186943m399638m631671m840166m930812m801642
$$ 27238584 23548318 19576938 15389995 10990357 6358686 1518520 -3412292 -8213934
37673h213934m391519l710495k840766j910980j058982l99423k131J20414J3351
$$ -8213934 -12605453 -16315948 -19156714 -21067694 -22126676 -22526099 -22528230 -22407816 -22394465
37664b2394465k38713n41551q12901r85706j007048q51731n45367j69001J73112
$$ -22394465 -22633178 -23174729 -23987630 -24973336 -25980384 -26832115 -27377482 -27546483 -27373371
37655b7373371M06810N23890N73890O20119O93818P75443Q07708P26879M96615
$$ -27373371 -26966561 -26442671 -25868781 -25248662 -24554844 -23779401 -22971693 -22244814 -21748199
37646b1748199J30891l07280p34258j081961j311938j399265j311167j009163
$$ -21748199 -21617308 -21924588 -22658846 -23740807 -25052745 -26452010 -27763177 -28772340
37638b8772340m73818K74680J179978K171101L182088M157168N044590N790952
$$ -28772340 -29246158 -28971478 -27791500 -25620399 -22438311 -18281143 -13236553 -7445601
37630g445601O343921O659644O704939O452956N885100N009381L883056K611267
$$ -7445601 -1101680 5557964 12262903 18715859 24600959 29610340 33493396 36104663
37622C6104663J308776M8082j163626k356675l541096m665269n623645o306373
$$ 36104663 37413439 37461521 36297895 33941220 30400124 25734855 20111210 13804837
37614A3804837o653123o675319o438375o023272n496543m906593m301284l741993
$$ 13804837 7151714 476395 -5961980 -11985252 -17481795 -22388388 -26689672 -30431665
37606c0431665l290879k974100k750953k517518k143793j518597n81569O57755
$$ -30431665 -33722544 -36696644 -39447597 -41965115 -44108908 -45627505 -46209074 -45551319
37598d5551319K107427L593474M888552N772464O104371N872018N190291M246794
$$ -45551319 -43443892 -39850418 -34961866 -29189402 -23085031 -17213013 -12022722 -7775928
37590g775928L222497K231613J313189M71242k73482q61584j216282j286677j080687
$$ -7775928 -4553431 -2321818 -1008629 -537387 -810869 -1672453 -2888735 -4175412 -5256099
37581e256099o71591j82874K38739M58162L90401K8197n59069j258218j957128
$$ -5256099 -5927690 -6110564 -5871825 -5413663 -5023262 -4995065 -5554134 -6812352 -8769480
37572h769480k574121l061167l394557l572793l622973l597642l551106l511145
$$ -8769480 -11343601 -14404768 -17799325 -21372118 -24995091 -28592733 -32143839 -35654984
37564c5654984l473550l423914l361026l296515l234299l153772l012250k762075
$$ -35654984 -39128534 -42552448 -45913474 -49209989 -52444288 -55598060 -58610310 -61372385
37556f1372385k368995j821789j130045l15527N90207J534593K430151L159695
$$ -61372385 -63741380 -65563169 -66693214 -67008741 -66418534 -64883941 -62453790 -59294095
37548e9294095L609565L714962L490038L024685K449574J888320J421966J079930
$$ -59294095 -55684530 -51969568 -48479530 -45454845 -43005271 -41116951 -39694985 -38615055
37540c8615055Q51003O99313N81278M67879L64154L04981L23264M18755N57044
$$ -38615055 -37764052 -37064739 -36483461 -36015582 -35651428 -35346447 -35023183 -34604428 -34047384
37531c4047384O92262P82136P83354O48331L43685j18912o65353j168499j480612
$$ -34047384 -33355122 -32572986 -31789632 -31141301 -30797616 -30916528 -31581881 -32750380 -34230992
37522c4230992j479722j116307m36884M34299J344711K157398K763137L071992
$$ -34230992 -35710714 -36827021 -37263905 -36829606 -35484895 -33327497 -30564360 -27492368
37514b7492368L014240K562684J760341P30417l42833j260817j871132k113334
$$ -27492368 -24478128 -21915444 -20155103 -19424686 -19767519 -21028336 -22899468 -25012802
37506b5012802k019669j668415j125971m20972M38756J430241K488720L503169
$$ -25012802 -27032471 -28700886 -29826857 -30247829 -29809073 -28378832 -25890112 -22386943
37498b2386943M335051M853654M970505M653843L922887K840330J512798Q5776
$$ -22386943 -18051892 -13198238 -8227733 -3573890 348997 3189327 4702125 4787901
37490D787901j281548k451791l332090l876666m080742l974883l616033l071188
$$ 4787901 3506353 1054562 -2277528 -6154194 -10234936 -14209819 -17825852 -20897040
37482b0897040k399305j641557q26589R650Q01902J454581J875426K025373J943975
$$ -20897040 -23296345 -24937902 -25764491 -25754841 -24952939 -23498358 -21622932 -19597559 -17653584
37473a7653584J728330J485538J296899J210015J244439J392200J613619J844067
$$ -17653584 -15925254 -14439716 -13142817 -11932802 -10688363 -9296163 -7682544 -5838477
37465e838477K019890K110620K132179K128246K133771K149950K148158K095999
$$ -5838477 -3818587 -1707967 424212 2552458 4686229 6836179 8984337 11080336
37457A1080336J984303J836589J693884J582395J485072J339559J067448O16831
$$ 11080336 13064639 14901228 16595112 18177507 19662579 21002138 22069586 22686417
37449B2686417o998p36536j462410k069554k472937k635715k566249k307704j932938
$$ 22686417 22679419 21942883 20480473 18410919 15937982 13302267 10736018 8428314 6495376
37440F495376j537115j211604j003269q88945p90355o21038l31329P5569N56414
$$ 6495376 4958261 3746657 2743388 1854443 1064088 443050 111721 187290 743704
37431G43704J051533J502613J859319K077749K117819J948154J562949J002480
$$ 743704 1795237 3297850 5157169 7234918 9352737 11300891 12863840 13866320
37423A3866320L57467k56367p43486j065376j247992j360824j482589j667919
$$ 13866320 14223787 13967420 13223934 12158558 10910566 9549742 8067153 6399234
37415F399234j925989k219492k483796k654596k690797k587817k379681k124487
$$ 6399234 4473245 2253753 -230043 -2884639 -5575436 -8163253 -10542934 -12667421
37407a2667421j874280j648865j437556j228363j037528r15859r32527j148042
$$ -12667421 -14541701 -16190566 -17628122 -18856485 -19894013 -20809872 -21742399 -22890441
37399b2890441j582275k185313k832200l358339l620211l540990l115830k389516
$$ -22890441 -24472716 -26658029 -29490229 -32848568 -36468779 -40009769 -43125599 -45515115
37391d5515115j435682l49787P53870J752912K535793L020982L168007K975815
$$ -45515115 -46950797 -47300584 -46546714 -44793802 -42258009 -39237027 -36069020 -33093205
37383c3093205K471401J699441P21810l76123j483497k470415l197883l531161
$$ -33093205 -30621804 -28922363 -28200553 -28576676 -30060173 -32530588 -35728471 -39259632
37375c9259632l366748k675025j536029j36232J281945K493212L351662L823648
$$ -39259632 -42626380 -45301405 -46837434 -46973666 -45691721 -43198509 -39846847 -36023199
37367c6023199L986543L992705M005880M132635M378992M651937M806101M718067
$$ -36023199 -32036656 -28043951 -24038071 -19905436 -15526444 -10874507 -6068406 -1350339
37359a350339M355162L799131L204852K718258K409866K265693K228220K244775
$$ -1350339 3004823 6803954 10008806 12727064 15136930 17402623 19630843 21875618
37351B1875618K288822K352097K426684K493297K520615K474991K337001K114676
$$ 21875618 24164440 26516537 28943221 31436518 33957133 36432124 38769125 40883801
37343D0883801J839202J540480J221042Q52453L96567j70717q52363j634127k483260
$$ 40883801 42723003 44263483 45484525 46336978 46733545 46562828 45710465 44076338 41593078
37334D1593078l342920m139944m813614n348347n784052o191236o619179p043307
$$ 41593078 38250158 34110214 29296600 23948253 18164201 11972965 5353786 -1689521
37326a689521p346121p354029o917989n992991m670735l151112j671803m30220
$$ -1689521 -9035642 -16389671 -23307660 -29300651 -33971386 -37122498 -38794301 -39224521
37318c9224521M70193J030067J323442J449607J493658J507122J506935J488652
$$ -39224521 -38754328 -37724261 -36400819 -34951212 -33457554 -31950432 -30443497 -28954845
37310b8954845J447470J392815J343950J312597J293987J277325J262614J264130
$$ -28954845 -27507375 -26114560 -24770610 -23458013 -22164026 -20886701 -19624087 -18359957
37302a8359957J299206J378010J503838J675098J876338K063300K163566K105474
$$ -18359957 -17060751 -15682741 -14178903 -12503805 -10627467 -8564167 -6400601 -4295127
37294d295127J859711J460795R91469N45185J95368j5948p9017j7412J13772K41835
$$ -4295127 -2435416 -974621 16848 562033 757401 741453 662436 645024 758796 1000631
37284A000631L02911K68795J58593K6517p0380j08447j16284j62582l18101o14811
$$ 1000631 1303542 1572337 1730930 1757447 1687067 1578620 1462336 1299754 981653 366842
37274C66842j028668j497458j960579k392512k807469l234748l684122m124674
$$ 366842 -661826 -2159284 -4119863 -6512375 -9319844 -12554592 -16238714 -20363388
37266b0363388m488990m697558m686929m427387l928990l243521k462674j700448
$$ -20363388 -24852378 -29549936 -34236865 -38664252 -42593242 -45836763 -48299437 -49999885
37258d9999885j054264n64190k03124Q9374L53158N72805O84841O19599L49752
$$ -49999885 -51054149 -51618339 -51821463 -51732089 -51378931 -50806126 -50121285 -49501686 -49151934
37249d9151934q3809n81824j021547j294028j330392j118716p12825k23156K18165
$$ -49151934 -49235743 -49817567 -50839114 -52133142 -53463534 -54582250 -55295075 -55518231 -55300066
37240e5300066N05263N92357M97059K79605J5168k28481m03440m83102m54830
$$ -55300066 -54794803 -54202446 -53705387 -53425782 -53410614 -53639095 -54042535 -54525637 -54980467
37231e4980467l10823m5699L34986P99253J279042J681649J925037J977003J867634
$$ -54980467 -55291290 -55336989 -55002003 -54202750 -52923708 -51242059 -49317022 -47340019 -45472385
37222d5472385J664056J430095J204782J009692Q64644P88432P84275Q27831Q70893
$$ -45472385 -43808329 -42378234 -41173452 -40163760 -39299116 -38510684 -37726409 -36898578 -36027685
37213c6027685Q58413P49776N37720K59691m581j51319q0458K75814R27451J806828
$$ -36027685 -35169272 -34419496 -33881776 -33622085 -33626666 -33777985 -33858443 -33582629 -32655178 -30848350
37203c0848350K766751L611955M162961M322812M105794L608590K943186K176277
$$ -30848350 -28081599 -24469644 -20306683 -15983871 -11878077 -8269487 -5326301 -3150024
37195c150024J312954L29081p76642j948634l075976m020726m654438m891596
$$ -3150024 -1837070 -1507989 -2284631 -4233265 -7309241 -11329967 -15984405 -20876001
37187b0876001m714755m183459l418558k564705j747516j044828m82865n5771
$$ -20876001 -25590756 -29774215 -33192773 -35757478 -37504994 -38549822 -39032687 -39088458
37179c9088458K44554M09497M22202K88392O1104j68811l15726l43943k79402
$$ -39088458 -38843904 -38434407 -38012205 -37723813 -37662709 -37831520 -38147246 -38491189 -38770591
37170c8770591j82128j04511o6101n4286l7620K2895J63981M03475P19661J043748
$$ -38770591 -38952719 -39057230 -39123331 -39177617 -39215237 -39192342 -39028361 -38624886 -37905225 -36861477
37160c6861477J279165J341566J198436Q89227N17881K18382J02146K07868M80897
$$ -36861477 -35582312 -34240746 -33042310 -32153083 -31635202 -31416820 -31314674 -31106806 -30625909
37151c0625909P95979J009944J014068P65129K94524k98699q73353j292525j475018
$$ -30625909 -29829930 -28819986 -27805918 -27040789 -26746265 -27044964 -27918317 -29210842 -30685860
37142c0685860j421298j197237q91676n79718l08544r7422O2132K07048L94576
$$ -30685860 -32107158 -33304395 -34196071 -34775789 -35084333 -35181755 -35119623 -34912575 -34517999
37133c4517999O81161J097638J636593K260083K919717L570308M164076M632210
$$ -34517999 -33836838 -32739200 -31102607 -28842524 -25922807 -22352499 -18188423 -13556213
37125a3556213M876698M792048M314750L474438K411472J339310M61589j14922
$$ -13556213 -8679515 -3887467 427283 3901721 6313193 7652503 8114092 7999170
37117G999170m22629o06755q46618j269126j899199k667627l462601m186132m779106
$$ 7999170 7576541 6969786 6123168 4854042 2954843 287216 -3175385 -7361517 -12140623
37108a2140623n209792n453541n493485n342096n055896m721481m421687m209999
$$ -12140623 -17350415 -22803956 -28297441 -33639537 -38695433 -43416914 -47838601 -52048600
37100e2048600m108888m120753m230834m398261m551025m598202m453638m056232
$$ -52048600 -56157488 -60278241 -64509075 -68907336 -73458361 -78056563 -82510201 -86566433
37092h6566433l382157k454374j347606j77004R32027J875095K581351L008654
$$ -86566433 -89948590 -92402964 -93750570 -93927574 -92995547 -91120452 -88539101 -85530447
37084h5530447L139132K984622K593851K050600J462864R48035O14262N35340
$$ -85530447 -82391315 -79406693 -76812842 -74762242 -73299378 -72351343 -71737081 -71201741
37076g1201741P24398J121656J611286K067139K404931K608490K714485K773430
$$ -71201741 -70477343 -69355687 -67744401 -65677262 -63272331 -60663841 -57949356 -55175926
37068e5175926K821529K879489K962805L080775L224056L360052L446814L453010
$$ -55175926 -52354397 -49474908 -46512103 -43431328 -40207272 -36847220 -33400406 -29947396
37060b9947396L365240L180977K902211K540180K123006J691074J278833Q98339
$$ -29947396 -26582156 -23401179 -20498968 -17958788 -15835782 -14144708 -12865875 -11967536
37052a1967536N37483J69647k35588p01670j229275j781656k289461k682095k925471
$$ -11967536 -11430053 -11260406 -11495994 -12197664 -13426939 -15208595 -17498056 -20180151 -23105622
37043b3105622l035936l061077l046494l013602k957266k856192k686512k433029
$$ -23105622 -26141558 -29202635 -32249129 -35262731 -38219997 -41076189 -43762701 -46195730
37035d6195730k093943j676212j186245o28050j5184O15311J207966J716994K133645
$$ -46195730 -48289673 -49965885 -51152130 -51780180 -51795364 -51180053 -49972087 -48255093 -46121448
37026d6121448K483831K794614L058633L226372L230654L025334K617052K076876
$$ -46121448 -43637617 -40843003 -37784370 -34557998 -31327344 -28302010 -25684958 -23608082
37018b3608082J526361J100322Q98434R44761J173798J452856J634973J619007
$$ -23608082 -22081721 -20981399 -20082965 -19138204 -17964406 -16511550 -14876577 -13257570
37010a3257570J386754R99632N60905J64698j45386l90158o32854r32440j303124
$$ -13257570 -11870816 -10871184 -10310279 -10145581 -10290967 -10681125 -11313979 -12246419 -13549543
37001a3549543j707781k083535k371743k530225k531359k363366k040996j614272
$$ -13549543 -15257324 -17340859 -19712602 -22242827 -24774186 -27137552 -29178548 -30792820
36993c0792820j160632p59306m63410k89376k28854k67922l93848n87076q14529
$$ -30792820 -31953452 -32712758 -33176168 -33465544 -33694398 -33962320 -34356168 -34943244 -35757773
36984c5757773j037630j230157j390288j537769j699031j889083k099187k296746
$$ -35757773 -36795403 -38025560 -39415848 -40953617 -42652648 -44541731 -46640918 -48937664
36976d8937664k437016k478764k395979k185165j871170j508229j166925r04286
$$ -48937664 -51374680 -53853444 -56249423 -58434588 -60305758 -61813987 -62980912 -63885198
36968f3885198p29930n90499l87408k3421N45183J279120K065702K762442L251766
$$ -63885198 -64615128 -65205627 -65593035 -65616456 -65071273 -63792153 -61726451 -58964009 -55712243
36959e5712243L479339L458346L241839K883862K414889J843436J175353M33165
$$ -55712243 -52232904 -48774558 -45532719 -42648857 -40233968 -38390532 -37215179 -36782014
36951c6782014l35493j061455j667375k088388k293357k295166k142073j893634
$$ -36782014 -37117507 -38178962 -39846337 -41934725 -44228082 -46523248 -48665321 -50558955
36943e0558955j594199j257416q68400m01297J57006P88792J441258K036918K493972
$$ -50558955 -52153154 -53410570 -54278970 -54680267 -54523261 -53734469 -52293211 -50256293 -47762321
36934d7762321K749657K778636K598256K256888J811885J311937P95570L04222
$$ -47762321 -45012664 -42234028 -39635772 -37378884 -35566999 -34255062 -33459492 -33155270
36926c3155270j04231l57182l90356j83484K12840O81031J076178J280562J240145
$$ -33155270 -33259501 -33616683 -34007039 -34190523 -33977683 -33296652 -32220474 -30939912 -29699767
36917b9699767R65344N06173p4872p18417j372993j993510k535496k950184l190040
$$ -29699767 -28734423 -28228250 -28303122 -29021539 -30394532 -32388042 -34923538 -37873722 -41063762
36908d1063762l228332l080541k806475k482783k158940j826206j423458q79232
$$ -41063762 -44292094 -47372635 -50179110 -52661893 -54820833 -56647039 -58070497 -58949729
36900e8949729j63510O84202J567292K374955L028062L501748L814681L995354
$$ -58949729 -59113239 -58429037 -56861745 -54486790 -51458728 -47956980 -44142299 -40146945
36892d0146945M048713L944375L632757L078137K288517J325168K87158p17429
$$ -40146945 -36098232 -32153857 -28521100 -25442963 -23154446 -21829278 -21542120 -22259549
36884b2259549j592592k254839k621936k614254k183736j357910k65916Q81369
$$ -22259549 -23852141 -26106980 -28728916 -31343170 -33526906 -34884816 -35150732 -34269363
36876c4269363J857726K505278K792653K816903K749261K754587K924415L249914
$$ -34269363 -32411637 -29906359 -27113706 -24296803 -21547542 -18792955 -15868540 -12618626
36868a2618626L637543L952053M066327L902252L453903K788490K023945J289625
$$ -12618626 -8981083 -5029030 -962703 2939549 6393452 9181942 11205887 12495512
36860A2495512O86823K67074L2775n1580n0371m7782j25871l28043o29225r41007
$$ 12495512 13182335 13449409 13482184 13430604 13380233 13332451 13206580 12878537 12249312 11308305
36850A1308305j156664j206939j088410q51725n68993l05873j06675J2068O1573
$$ 11308305 10151641 8944702 7856292 7004567 6435574 6129701 6023026 6035094 6096667
36841F096667P3356Q9544J57435L23121O12580J005257J426224J776353J985763
$$ 6096667 6170023 6259567 6417002 6740123 7352703 8357960 9784184 11560537 13546300
36832A3546300K051311K029599J991404J970553J941433J837292J594028J192608
$$ 13546300 15597611 17627210 19618614 21589167 23530600 25367892 26961920 28154528
36824B8154528O81635J74238j83268k69223n1377L78468Q26517J067359R27463
$$ 28154528 28836163 29010401 28827133 28557910 28506533 28885001 29711518 30778877 31706340
36815C1706340L46661o02976j746175k867913l779984m361793m571136m438736
$$ 31706340 32053001 31450025 29703850 26835937 23055953 18694160 14123024 9684288
36807I684288m052540l525784k953145k379291j801524j201954n84737L314M78107
$$ 9684288 5631748 2105964 -847181 -3226472 -5027996 -6229950 -6814687 -6811373 -6333266
36798f333266P48836P61822N33756J52502k55794n72994p25869p03902n58880
$$ -6333266 -5584430 -4822608 -4288852 -4136350 -4392144 -4965138 -5691007 -6394909 -6953789
36789f953789l87715k99610l75367o35062j028741j452495j781142j907835j783654
$$ -6953789 -7341504 -7641114 -8016481 -8651543 -9680284 -11132779 -12913921 -14821756 -16605410
36780a6605410j445287j011142o34377m29802m17523n20828o19444o21092n05653
$$ -16605410 -18050697 -19061839 -19696216 -20126018 -20543541 -21064369 -21683813 -22304905 -22810558
36771b2810558l21834j51921p4159j37788l47598o58259r91326j278053j499308
$$ -22810558 -23132392 -23284313 -23358472 -23496260 -23843858 -24502117 -25493443 -26771496 -28270804
36762b8270804j683800j861919k018230k086598j988857j681969j182067n58717
$$ -28270804 -29954604 -31816523 -33834753 -35921351 -37910208 -39592177 -40774244 -41332961
36754d1332961R0602O72115J120145J406215J536098J545259J496750J474228
$$ -41332961 -41242359 -40570244 -39450099 -38043884 -36507786 -34962527 -33465777 -31991549
36746c1991549J562262J816822K238400K760724L262528L601505L658822L374221
$$ -31991549 -30429287 -28612465 -26374065 -23613341 -20350813 -16749308 -13090486 -9716265
36738i716265K755215J860875P77456l96309j551899k573125l347679l786860
$$ -9716265 -6961050 -5100175 -4322719 -4719028 -6270927 -8844052 -12191731 -15978591
36730a5978591l846460l543352k962084k242138j541234r86356o36217m72436
$$ -15978591 -19825051 -23368403 -26330487 -28572625 -30113859 -31100215 -31736432 -32208868
36722c2208868m19281l80673k81277r7749J33542L37103M37138L95732K33649
$$ -32208868 -32628149 -33008822 -33290099 -33387848 -33254306 -32917203 -32480065 -32084333 -31850684
36713c1850684K3709j43391k04596j50710j0821J93306M80758Q98671J472429
$$ -31850684 -31826975 -31970366 -32174962 -32325672 -32336493 -32143187 -31662429 -30763758 -29291329
36704b9291329K163710K872381L475893L870964L994532L830844L418260K849707
$$ -29291329 -27127619 -24255238 -20779345 -16908381 -12913849 -9083005 -5664745 -2815038
36696b815038K250593J737365J382063J201238J162850J197407J214812J134907
$$ -2815038 -564445 1172920 2554983 3756221 4919071 6116478 7331290 8466197
36688H466197R21965N95580K02946k26827p03763j249727j845525k405022k807248
$$ 8466197 9388162 9983742 10186688 9959861 9256098 8006371 6160846 3755824 948576
36679I48576k961400k847933k507792k006512j415770q19606l17401k878O9412
$$ 948576 -2012824 -4860757 -7368549 -9375061 -10790831 -11610437 -11927838 -11930716 -11861304
36670a1861304r6064m42547q87237j350352j771653k108816k325976k388344k272152
$$ -11861304 -11957368 -12399915 -13287152 -14637504 -16409157 -18517973 -20843949 -23232293 -25504445
36661b5504445j984171j575186j133563p57361n19904m51517n46621p81094j118468
$$ -25504445 -27488616 -29063802 -30197365 -30954726 -31474630 -31926147 -32472768 -33253862 -34372330
36652c4372330j505085j874026k165869k346962k403702k320421k070752j638164
$$ -34372330 -35877415 -37751441 -39917310 -42264272 -44667974 -46988395 -49059147 -50697311
36644e0697311j049142l89024K14144O29353P66330O04368J94483l64617r61743
$$ -50697311 -51746453 -52135477 -51921333 -51291980 -50525650 -49921282 -49726799 -50091416 -51053159
36635e1053159j499083j900549k112627k110066j902607j528793j035817m63150
$$ -51053159 -52552242 -54452791 -56565418 -58675484 -60578091 -62106884 -63142701 -63605851
36627f3605851J56191P85296J381896J909282K348191K702366K999132L283351
$$ -63605851 -63449660 -62664364 -61282468 -59373186 -57024995 -54322629 -51323497 -48040146
36619d8040146L598943L963222M352606M709989M962129N031211M844161M355224
$$ -48040146 -44441203 -40477981 -36125375 -31415386 -26453257 -21422046 -16577885 -12222661
36611a2222661L580611K618281J625303P56201R9827l42085o23298q00670r08347
$$ -12222661 -8642050 -6023769 -4398466 -3642265 -3542438 -3884523 -4507821 -5308491 -6216838
36602f216838r74719j051212j210427j507405j939395k440087k909016l249324
$$ -6216838 -7191557 -8242769 -9453196 -10960601 -12899996 -15340083 -18249099 -21498423
36594b1498423l393240l315800l043484k652637k246095j909519j669803j483028
$$ -21498423 -24891663 -28207463 -31250947 -33903584 -36149679 -38059198 -39729001 -41212029
36586d1212029j262265r30348m67975P0397N84332R85997J255791J459293J714184
$$ -41212029 -42474294 -43404642 -43872617 -43802220 -43217888 -42231891 -40976100 -39516807 -37802623
36577c7802623K129945K758954L582876M529572N499085O382622P073856P480764
$$ -37802623 -35672678 -32913724 -29330848 -24801276 -19302191 -12919569 -5845713 1635051
36569A635051P542930P250744O656909N869950N024382M234055L549806K946786
$$ 1635051 9177981 16428725 23085634 28955584 33979966 38214021 41763827 44710613
36561D4710613K350416J683435R04346K0247r21705j851825k697708l404279l948160
$$ 44710613 47061029 48744464 49648810 49669057 48747352 46895527 44197819 40793540 36845380
36552C6845380m336685m588409m707076m671037m452092m053864l540496l031376
$$ 36845380 32508695 27920286 23213210 18542173 14090081 10036217 6495721 3464345
36544C464345k662330k534350k673068l015368l431869l780406l964374l961604
$$ 3464345 802015 -1732335 -4405403 -7420771 -10852640 -14633046 -18597420 -22559024
36536b2559024l809371l561855l248307k851787k319214j604644p26121K06542
$$ -22559024 -26368395 -29930250 -33178557 -36030344 -38349558 -39954202 -40680323 -40473781
36528d0473781J025190J582799J825034J810010J674343J573565J626085J878503
$$ -40473781 -39448591 -37865792 -36040758 -34230748 -32556405 -30982840 -29356755 -27478252
36520b7478252K299204K796166L247212L533037L569856L336149K880105K297730
$$ -27478252 -25179048 -22382882 -19135670 -15602633 -12032777 -8696628 -5816523 -3518793
36512c518793J690194J124621O19636J60106k71006o63497r70397j123160j062290
$$ -3518793 -1828599 -703978 -84342 75764 -195242 -858739 -1829136 -2952296 -4014586
36503d014586p68142k80207L01682Q37920J189191J262057J038723N77543j1421
$$ -4014586 -4782728 -5062935 -4761253 -3923333 -2734142 -1472085 -433362 144181 132760
36494A32760n99424j066150j316815j293733r87471m45495K32179R19499J507386
$$ 132760 -466664 -1532814 -2849629 -4143362 -5130833 -5576328 -5344149 -4424650 -2917264
36485b917264J941436K232334K435580K616660K820706L053952L275222L398450
$$ -2917264 -975828 1256506 3692086 6308746 9129452 12183404 15458626 18857076
36477A8857076L313226K925411K203703J205522O2427j069870k066818k861808
$$ 18857076 22170302 25095713 27299416 28504938 28567365 27497495 25430677 22568869
36469B2568869l432596l766878l840824l629668l138763k425255j590549p50717
$$ 22568869 19136273 15369395 11528571 7898903 4760140 2334885 744336 -6381
36461f381p769N64959R29259J089390J093095J009924Q88469P22959M61818N5967
$$ -6381 -14150 550809 1480068 2569458 3662553 4672477 5560946 6283905 6745723 6801690
36451F801690m92799j123070j746811k290709k712653k989328l096379l002883
$$ 6801690 6308891 5185821 3439010 1148301 -1564352 -4553680 -7650059 -10652942
36443a0652942k683786k139042j406475n61703K95740J066727J678819K102871
$$ -10652942 -13336728 -15475770 -16882245 -17443948 -17148208 -16081481 -14402662 -12299791
36435a2299791K352384K468302K499943K492213K481457K494129K540943K606857
$$ -12299791 -9947407 -7479105 -4979162 -2486949 -5492 2488637 5029580 7636437
36427G636437K648340K609489K452481K180063J830522J449279J060156O54525
$$ 7636437 10284777 12894266 15346747 17526810 19357332 20806611 21866767 22521292
36419B2521292J97860l56002j047638j892083k861168l879114m838706n632978
$$ 22521292 22719152 22363150 21315512 19423429 16562261 12683147 7844441 2211463
$$ [...]
##END NTUPLES=NMR SPECTRUM
##END=
