##TITLE=31Pdec_DE-44EA3_D2O_b
 D2O, 64 sc
 15.7.2024
##JCAMPDX= 6.0         $$ Bruker NMR JCAMP-DX V2.0
##DATA TYPE= NMR SPECTRUM
##DATA CLASS= NTUPLES
##ORIGIN= UXNMR, Bruker Analytische Messtechnik GmbH
##OWNER= root
$$ XWIN-NMR		Version 3.5
$$ Mon Jul 15 14:33:22 2024 Russian Standard Time (UT+4h)  she@DPX200
##.OBSERVE FREQUENCY= 81.013821
##.OBSERVE NUCLEUS= ^31P
##.ACQUISITION MODE= SIMULTANEOUS
##.ACQUISITION SCHEME= undefined
##.AVERAGES= 64
##.DIGITISER RES= 17
##SPECTROMETER/DATA SYSTEM= spect
##.PULSE SEQUENCE= zgpg30
##.SOLVENT NAME= D2O
##.SHIFT REFERENCE= (INTERNAL, D2O, 0, 198.062)
##AUDIT TRAIL= $$ (NUMBER, WHEN, WHO, WHERE, WHAT)
$$ ##TITLE= Audit trail, XWIN-NMR		Version 3.5
$$ ##JCAMPDX= 5.01
$$ ##ORIGIN= Bruker BioSpin GmbH
$$ ##OWNER= she
$$ F:/spectra/data/she/nmr/P31/2/pdata/1/auditp.txt
$$ ##AUDIT TRAIL=  $$ (NUMBER, WHEN, WHO, WHERE, WHAT)
(   1,<2024-07-15 14:32:02.76 +0400>,<she>,<DPX200>,
      <created by zg, POWCHK disabled, PULCHK disabled
       configuration hash MD5:
       00 E9 B6 7A A2 85 ED C7 34 08 36 98 17 FE 4E 26
       data hash MD5: 32K
       3F 91 FB 94 84 5F 45 37 E6 2F 4E 2D 4C A2 B3 B8>)
(   2,<2024-07-15 14:32:04.85 +0400>,<she>,<DPX200>,
      <Start of raw data processing
       efp BC_mod = 2 LB = 1.5 FT_mod = 6 PKNL = 1 PHC0 = 2674.793 PHC1 = 16.88698 SI = 64K 
       data hash MD5: 64K
       01 1A B9 8C FA C4 32 AD 3A 89 98 FB 88 49 99 52>)
(   3,<2024-07-15 14:32:24.51 +0400>,<she>,<DPX200>,
      <pk PHC0 = -6.561467 PHC1 = 0 
       data hash MD5: 64K
       0C 25 FD C2 77 1D A1 B2 BE 9C DF 7E 04 D4 79 7F>)
(   4,<2024-07-15 14:32:31.95 +0400>,<she>,<DPX200>,
      <abs ABSG = 5 
       data hash MD5: 64K
       B8 2E 88 74 B7 27 72 50 E3 73 14 02 9F A4 F1 BB>)
$$ ##END=
$$ 
$$ hash MD5
$$ 61 D0 AC B0 C4 B2 4E AC 7E CD CE 23 EA 3E 67 3F
##$RELAX= 
##$RELAX= 
##$RELAX= 
##$RELAX= 
##$RELAX= 
##$RELAX= 
##$RELAX= 
##$RELAX= 
$$ Bruker specific parameters
$$ --------------------------
##$DU= <F:/spectra>
##$EXPNO= 2
##$NAME= <P31>
##$PROCNO= 1
##$TYPE= <nmr>
##$USER= <she>
##$AMP= (0..31)
100 100 100 100 100 100 100 100 100 100 100 100 100 100 100 100 100 100 
100 100 100 100 100 100 100 100 100 100 100 100 100 100 
##$AQSEQ= 0
##$AQ_mod= 1
##$AUNM= <au_zg>
##$AUTOPOS= <>
##$BF1= 81.014009
##$BF2= 200.13
##$BF3= 200.13
##$BF4= 200.13
##$BF5= 200.13
##$BF6= 200.13
##$BF7= 200.13
##$BF8= 200.13
##$BYTORDA= 1
##$CFDGTYP= 0
##$CFRGTYP= 5
##$CHEMSTR= <none>
##$CNST= (0..31)
1 1 145 1 1 1 1 1 1 1 1 1 1 1 1 1 1 1 1 1 1 1 1 1 1 1 1 1 1 1 1 1 
##$CPDPRG= <waltz16>
##$CPDPRG1= <>
##$CPDPRG2= <waltz16>
##$CPDPRG3= <>
##$CPDPRG4= <mlev>
##$CPDPRG5= <mlev>
##$CPDPRG6= <mlev>
##$CPDPRG7= <mlev>
##$CPDPRG8= <mlev>
##$CPDPRGB= <>
##$CPDPRGT= <>
##$D= (0..31)
0 1 0 0 0 0 0 0 0 0.06 0 0.03 2e-05 3e-06 0 0 0.0002 0 0 0 0 0 0 0 0 0 
0 0 0 0 0 0 
##$DATE= 1721039522
##$DBL= (0..7)
120 120 120 11 120 120 24 19 
##$DBP= (0..7)
150 150 150 150 150 150 150 150 
##$DBP07= 0
##$DBPNAM0= <>
##$DBPNAM1= <>
$$ [...]
##$SUBNAM3= <"">
##$SUBNAM4= <"">
##$SUBNAM5= <"">
##$SUBNAM6= <"">
##$SUBNAM7= <"">
##$SUBNAM8= <"">
##$SUBNAM9= <"">
##$SW= 400.765351723535
##$SWIBOX= (0..15)
0 1 3 0 0 0 0 0 0 0 0 0 0 0 0 0 
##$SW_h= 32467.5324675325
##$TD= 32768
##$TD0= 1
##$TE= 0
##$TE2= 300
##$TE3= 300
##$TEG= 300
##$TL= (0..7)
0 120 53 12 22 120 120 120 
##$TP= (0..7)
150 150 150 150 150 150 150 150 
##$TP07= 0
##$TPNAME0= <>
##$TPNAME1= <>
##$TPNAME2= <>
##$TPNAME3= <>
##$TPNAME4= <>
##$TPNAME5= <>
##$TPNAME6= <>
##$TPNAME7= <>
##$TPOAL= (0..7)
0.5 0.5 0.5 0.5 0.5 0.5 0.5 0.5 
##$TPOFFS= (0..7)
0 0 0 0 0 0 0 0 
##$TUNHIN= 0
##$TUNHOUT= 0
##$TUNXOUT= 0
##$USERA1= <user>
##$USERA2= <user>
##$USERA3= <user>
##$USERA4= <user>
##$USERA5= <user>
##$V9= 5
##$VALIST= <valist>
##$VCLIST= <CCCCCCCCCCCCCCC>
##$VD= 0
##$VDLIST= <DDDDDDDDDDDDDDD>
##$VPLIST= <PPPPPPPPPPPPPPP>
##$VTLIST= <TTTTTTTTTTTTTTT>
##$WBST= 1024
##$WBSW= 4
##$XGAIN= (0..3)
0 0 0 0 
##$XL= 0
##$YL= 0
##$YMAX_a= 3160
##$YMIN_a= -3239
##$ZGOPTNS= <>
##$ZL1= 120
##$ZL2= 120
##$ZL3= 120
##$ZL4= 120
##$ABSF1= 198.0616
##$ABSF2= -202.7028
##$ABSG= 5
##$ABSL= 3
##$ALPHA= 0
##$AQORDER= 0
##$ASSFAC= 0
##$ASSFACI= 0
##$ASSFACX= 0
##$ASSWID= 0
##$AUNMP= <proc_1d>
##$AZFE= 0.1
##$AZFW= 0.5
##$BCFW= 0
##$BC_mod= 2
##$BYTORDP= 0
##$COROFFS= 0
##$CY= -3
##$DATMOD= 1
##$DC= 0
##$DFILT= <>
##$DTYPP= 0
##$F1P= 0
##$F2P= 0
##$FCOR= 1
##$FTSIZE= 65536
##$FT_mod= 6
##$GAMMA= 0
##$GB= 0
##$INTBC= 1
##$INTSCL= 9.790993e-09
##$ISEN= 30
##$LB= 1.5
##$LEV0= 0
##$LPBIN= 0
##$MAXI= 10000
##$MC2= 0
##$MEAN= 0
##$ME_mod= 0
##$MI= 50
##$NCOEF= 0
##$NC_proc= -11
##$NLEV= 6
##$NOISF1= 182.463
##$NOISF2= 159.3651
##$NSP= 0
##$NTH_PI= 0
##$NZP= 0
##$OFFSET= 198.0616
##$PC= 4
##$PHC0= 2668.231
##$PHC1= 16.88698
##$PH_mod= 1
##$PKNL= yes
##$PPARMOD= 0
##$PSCAL= 0
##$PSIGN= 0
##$REVERSE= no
##$SF= 81.0140089999434
##$SI= 65536
##$SIGF1= 159.3651
##$SIGF2= -187.1042
##$SINO= 113.3802
##$SIOLD= 16384
##$SREGLST= <1H.CDCl3>
##$SSB= 0
##$STSI= 65536
##$STSR= 0
##$SW_p= 32467.5324675325
##$SYMM= 0
##$S_DEV= 0
##$TDeff= 32768
##$TDoff= 0
##$TI= <>
##$TILT= no
##$TM1= 0
##$TM2= 0
##$TOPLEV= 0
##$USERP1= <user>
##$USERP2= <user>
##$USERP3= <user>
##$USERP4= <user>
##$USERP5= <user>
##$WDW= 1
##$XDIM= 65536
##$YMAX_p= 384872336
##$YMIN_p= -387361794
$$ End of Bruker specific parameters
$$ ---------------------------------
##NTUPLES= NMR SPECTRUM
##VAR_NAME=  FREQUENCY,     SPECTRUM/REAL,   SPECTRUM/IMAG
##SYMBOL=    X,             R,               I
##VAR_TYPE=  INDEPENDENT,   DEPENDENT,       DEPENDENT
##VAR_FORM=  AFFN,          ASDF,            ASDF
##VAR_DIM=   65536,         65536,           65536
##UNITS=     HZ,            ARBITRARY UNITS, ARBITRARY UNITS
##FACTOR=    0.49542278885378, 1,            1
##FIRST=     16045.7642231865, 0,            0
##LAST=      -16421.768244346, 0,            0
##MIN=       -16421.768244346, -387361794,   0
##MAX=       16045.7642231865, 384872336,    0
$$ Real data points
##PAGE= N=1
##DATA TABLE= (X++(R..R)), XYDATA
$$ [...]
##PAGE= N=2
##DATA TABLE= (X++(I..I)), XYDATA
9054 -12579106 -22529636 -24491269 -19563457 -17173856 -20815044 -23858518 -18416553 -9593654
9046 -9593654 -15184652 -43037998 -74812544 -85222949 -72984328 -56892336 -44819546
9039 -44819546 -27218314 -3031705 9792090 -2235208 -30919090 -60088497 -81016777
9032 -81016777 -87872797 -75667316 -52558454 -38141404 -38637548 -38130377 -24012516 -4637584
9024 -4637584 10009572 27191658 54142034 76608043 74125267 47767595 16615255
9017 16615255 -4604654 -10326569 1041425 19099519 19374929 -9612997 -44516775 -52992145
9009 -52992145 -35355743 -19655592 -20802710 -27970157 -30315132 -30718417 -31546137 -29000475
9001 -29000475 -26248029 -32307920 -42975182 -42087760 -27594378 -17568353 -23259501 -34385210
8993 -34385210 -39175323 -40431316 -41343453 -33851245 -15572849 -3232237 -12694182 -36007417
8985 -36007417 -53136554 -57154712 -53012688 -40655682 -17491464 7101398 17742065
8978 17742065 13373216 7292282 7144428 8996360 11675047 20907310 34497319 38731788
8970 38731788 28815230 20409660 28093553 41344144 38004315 17353458 833093 -2418834
8962 -2418834 -10094777 -35149350 -57515908 -48497201 -14454705 8478658 2725447 -12361288
8954 -12361288 -15734347 -12958335 -16674374 -22378062 -23472943 -31318283 -55501982 -77973001
8946 -77973001 -74541776 -53458292 -43411438 -47994008 -43890758 -24972661 -14550310 -25670920
8938 -25670920 -41191471 -47035267 -55144559 -73817729 -82375252 -61615077 -29541316 -18011708
8930 -18011708 -26901562 -30041637 -18236108 -7210504 -5803255 -4952003 -1365154 -5998990
8922 -5998990 -20428483 -26124231 -9240886 18893521 37033574 37760638 26013758 5811054
8914 5811054 -18339355 -34710118 -34033334 -24060648 -21853357 -30290157 -33084082 -17241825
8906 -17241825 8293158 22637399 14803082 -12124478 -51675749 -95346228 -125394386
8899 -125394386 -124224718 -98021119 -75758978 -73402984 -73482199 -56117657 -35327619 -38427412
8891 -38427412 -57121091 -52292916 -12515198 23952621 20740199 -8460595 -23039571
8884 -23039571 -6895082 25341249 57277247 79912905 81057583 52902744 10644928
8877 10644928 -16710692 -16809350 -1598482 13841151 25128238 32031209 33162593 29198602
8869 29198602 20739152 3914082 -21404230 -42352253 -45015260 -33380883 -23144570
8862 -23144570 -18528403 -9117897 11211562 35855469 55246826 61937673 47950473 12703194
8854 12703194 -26005316 -43885132 -34709054 -11067685 16133865 42062764 54844595
8847 54844595 41026220 8216313 -19007899 -32166188 -46876818 -70060730 -83161408
8840 -83161408 -73373789 -60451051 -70464070 -96190092 -106406578 -87842256 -57140213
8833 -57140213 -33956188 -21259852 -13545399 -8485400 -5757008 -4862594 -7899006 -16974861
8825 -16974861 -26931062 -27723108 -16208761 -1856 11836173 16767139 15996130 9043992
8817 9043992 -4942793 -22203351 -34605877 -37544428 -37129744 -44860655 -61472260 -71129275
8809 -71129275 -60477345 -41183800 -40595268 -66059126 -91166274 -87033227 -58079678 -33619223
8801 -33619223 -28481105 -27780500 -13943447 5455821 8815531 -6190656 -15511999 -230535
8793 -230535 25666899 31150045 7374393 -24119060 -43429221 -53958181 -62764284 -58625460
8785 -58625460 -30928651 404504 243190 -36626162 -78592729 -98440745 -98827447 -90256597
8777 -90256597 -68245504 -28320965 13758373 36083479 36592327 30794419 30369952 35412447
8769 35412447 40812338 40041427 29723068 18589231 21587807 35962618 37028657 11879706
8761 11879706 -16260116 -16468629 7528848 25887628 27114647 28690273 43105402 58297094
8753 58297094 59172015 48483393 36212335 23957740 11068459 4167528 8793367 19293431
8745 19293431 26477513 28970541 29066224 23993838 10723386 -4235772 -8284151 4697856
8737 4697856 29281967 52971339 61935239 47399332 13820273 -20601117 -38008090
8730 -38008090 -36884121 -31197361 -33759325 -42993975 -46157158 -33801346 -10882902 6398944
8722 6398944 6624043 -3527765 -5303858 10675339 32685658 41637219 33267891 20090803
8714 20090803 12499014 7001944 -3242145 -14647267 -17972232 -11920954 -2668775 7094961
8706 7094961 17420623 20564257 5828685 -20801061 -36670550 -31467202 -23126572 -31380939
8698 -31380939 -46337474 -41403196 -12157159 16487084 21866177 6605739 -10588074
8691 -10588074 -12889235 5865807 35170359 50065886 35112324 6771325 -5220943
8684 -5220943 1061476 -1135457 -23315647 -41981501 -34495086 -13212402 -8062201 -30357557
8676 -30357557 -66759699 -94183057 -90049337 -46846737 9169302 32948752 11040753
8669 11040753 -21379274 -30130944 -25085701 -30423411 -37367995 -22044446 6284571 15400614
8661 15400614 1979777 -5946518 2420126 8268095 4259847 9834833 32862145 49666394
8653 49666394 41716520 25665292 26721978 42730357 54732344 56955941 55941750 50869603
8645 50869603 34424811 9543639 -8140960 -4241098 22439483 57188038 77099809
8638 77099809 70397878 50409331 40904642 46421681 48431345 31981441 3385182 -20176069
8630 -20176069 -26088712 -11440268 12976356 24985307 14058326 68069 9262819
8623 9262819 34570158 45741643 38129670 38181718 53719125 55603593 25980003 -9599649
8615 -9599649 -22823213 -25270126 -40024490 -55610577 -44735388 -13798324 3156230
8608 3156230 -6153848 -20859882 -22644330 -14775760 -5777508 1059835 1074278 -7184688
8600 -7184688 -11016179 1976485 19370479 15477243 -11931225 -37292110 -40743197 -24897792
8592 -24897792 3382363 43742805 86347758 105606728 83857555 31706806 -22294979
8585 -22294979 -53428735 -50387681 -18047099 21098346 38482839 21707243 -17404174
8578 -17404174 -57284974 -82298757 -85435026 -67564739 -38916901 -14302398 -2905836
8571 -2905836 -5041834 -15869196 -26445761 -26079259 -13137150 -219399 565775 -6912107
8563 -6912107 -11713692 -13329906 -16705339 -16248345 -2536314 17718952 26880722 21901818
8555 21901818 17268199 21411113 28032541 33379574 43437679 58442681 67520838 65683949
8547 65683949 60090563 51771403 27768247 -16625217 -60139856 -73232892 -47855982
8540 -47855982 -2412565 36083556 49670626 38633626 20975610 17230501 30652559
8533 30652559 46397018 50423808 41955980 28815510 21247072 28990248 50681543 66266599
8525 66266599 55851710 27488570 8631445 7427553 3066795 -19353680 -46556923
8518 -46556923 -60024425 -59223697 -47808573 -18971696 24486994 53690416 43981355 12641717
8510 12641717 992087 21593575 45055081 40156496 8882556 -21887035 -30360278
8503 -30360278 -18019453 -6004142 -13961383 -37827817 -53358978 -46506300 -29956940
8496 -29956940 -20554573 -13777430 3509780 26762581 41548791 50238696 66491787 84768503
8488 84768503 80570931 45976540 3072635 -25503875 -39526131 -45379867 -37641491 -12601096
8480 -12601096 14034883 22186469 14145596 9819587 17391123 23495058 14356412 -5853715
8472 -5853715 -23448773 -33228131 -39381429 -42210866 -34789457 -16741594 -3068004 -9170416
8464 -9170416 -28962373 -38817119 -25710047 -901843 19075685 33039934 47272905
8457 47272905 58293447 58806354 54831809 59893736 72903570 77294111 64140630 42711367
8449 42711367 25430443 15049606 9521349 6162776 -3174799 -26759682 -55771079 -65980804
8441 -65980804 -46589494 -16645080 -2485131 -8480885 -20592411 -28193188 -28151927 -16405495
8433 -16405495 5663026 19764865 5376276 -31098646 -58406581 -57156214 -39703396
8426 -39703396 -26624914 -19679400 -11486001 -8388908 -22515680 -44965265 -49055027 -26262086
8418 -26262086 -1916516 -4506169 -31332516 -56888871 -65930981 -62775206 -53017606 -34832584
8410 -34832584 -11633756 2275647 -2538858 -17606344 -25828117 -17814148 4153264 29659319
8402 29659319 43437202 35705501 16484403 9795620 24820125 42331821 40173486 22605203
8394 22605203 11390442 16544193 31416669 48825632 62781780 59529445 30197484
8387 30197484 -7149408 -22019204 -13640434 -15538092 -48237018 -89687553 -107444741
8380 -107444741 -99839859 -85145275 -66611773 -34364945 5751917 31281357 31450008
8373 31450008 16461508 -1717220 -18199607 -23135457 -2805089 37720912 69133697
8366 69133697 66990494 36918445 2793869 -20462834 -33849987 -43212941 -51620514 -58134361
8358 -58134361 -57392027 -45524366 -30759312 -28848527 -40441999 -43150111 -18057760 23013889
8350 23013889 50108216 50185028 35286321 19006293 2520158 -13045552 -17477824 -4902014
8342 -4902014 13740992 22606739 21117126 23872418 41505331 66488992 78260306 62431488
8334 62431488 27607880 1314195 2759703 20781488 28144115 17695945 10773928 24766392
8326 24766392 47450088 55522428 46803484 37263474 32289606 19750647 -7592626 -39310957
8318 -39310957 -62447812 -77357229 -91250305 -104054023 -108285873 -99291343 -80431896
8311 -80431896 -59816059 -44636270 -37807806 -38917675 -46960168 -58271599 -62105004 -47433480
8303 -47433480 -19381897 992369 2697301 757338 12764827 29101449 26257837 5074941
8295 5074941 -7156556 5819156 31090249 49438612 54625828 44817757 19416850 -4979437
8287 -4979437 -248695 34569689 60848609 46072296 4483265 -27751858 -39666748
8280 -39666748 -42991473 -38891982 -19177155 6337086 15472511 7290122 3054975 11381203
8272 11381203 17817913 13220392 7273953 5952197 -1171978 -19323709 -33114602 -26527800
8264 -26527800 -5691516 9679903 8499759 -5659893 -22329673 -32907266 -39202711
8257 -39202711 -53492488 -79598537 -97380914 -83739646 -48003675 -23935400 -23190748
8250 -23190748 -22407885 -5915519 6153114 -8841160 -36614016 -43976792 -22978997 5502986
8242 5502986 22931737 26470348 18152911 2842038 -4626426 10129705 40149637 59477436
8234 59477436 49106572 12884186 -31244477 -68027175 -93666949 -112150980 -120803599
8227 -120803599 -102317093 -45231782 25386935 59017389 34488684 -14227545 -42690052
8220 -42690052 -47211857 -49950115 -52437359 -36468872 -2140882 28903239 47273547 62057235
8212 62057235 71443550 58387740 22968452 -9531659 -23670157 -31456061 -43103060
8205 -43103060 -45664912 -27178653 -39770 18574011 31318938 46185731 53808055
8198 53808055 41724863 19895799 9292810 11588372 10629284 -456966 -13345939 -23701170
8190 -23701170 -37620102 -57444828 -76202342 -88560309 -95642411 -97928069 -93869298 -85458387
8182 -85458387 -74941647 -57324404 -27733295 4690507 23235291 25054455 23701397
8175 23701397 28403931 33800387 34016310 33732318 38190988 42742504 40540315 33039706
8167 33039706 25864772 21278729 20929668 27559922 35555910 28172599 -3624222 -43941534
8159 -43941534 -66249210 -63843712 -54250868 -52397813 -51594212 -36156648 -3637193 32137382
8151 32137382 54177904 53240422 32017290 5032824 -10959754 -13994146 -20221232 -42481171
8143 -42481171 -69881264 -79002580 -62822029 -36003224 -11686913 11091653 30784205
8136 30784205 30572033 -1710940 -47881566 -70883056 -53744061 -15489794 14491318
8129 14491318 27281277 33617315 40309909 38426281 17041438 -16997401 -40047892 -35591897
8121 -35591897 -13379087 2264656 2145510 -264705 5813495 9244385 -4856423 -27387975
8113 -27387975 -33238156 -14835491 8916569 18818280 14804484 5510643 -5080708 -12320902
8105 -12320902 -7194476 9374109 19405587 9660904 -6682515 -6134759 10625009 17789227
8097 17789227 955360 -21254874 -22119020 -3685450 5198871 -12852858 -39657212 -42672050
8089 -42672050 -14251572 20345168 34011467 26296488 15973650 15213436 21631941 29114676
8081 29114676 31943981 20333673 -11292587 -47602072 -59465386 -36603459 -1757294
8074 -1757294 17084926 18501958 20901145 33072262 45795457 49198657 45082930 40826999
8066 40826999 39614184 38155739 29943847 12682349 -4572201 -7939623 2086994 6302664
8058 6302664 -8871638 -30573869 -36135917 -24954456 -17864062 -26411111 -39596034 -43818115
8050 -43818115 -39935367 -33683839 -22659933 -3298640 17442591 27954153 26308576 21589217
8042 21589217 22776173 30640379 38183028 35782189 19133933 -4163870 -18543652 -14639955
8034 -14639955 2027543 18951425 30721188 41168880 52023488 54745138 39071098
8027 39071098 9812938 -11965589 -11473578 413470 1666141 -7771732 -3407623 26839928
8019 26839928 60079196 67410377 52395865 41177883 42587444 40934231 26337728 9222790
8011 9222790 1529528 3985679 16622781 41436616 67490846 73780668 57640472 42569263
8003 42569263 46651350 60558723 68499149 71099968 71019701 55571242 16635962 -26874961
7995 -26874961 -51665107 -63840333 -82661953 -99270910 -84686808 -39320398 -1311017
7988 -1311017 4076811 -4727390 912477 20287922 35752972 44474565 54387362 60679617
7980 60679617 51064951 31237420 24064366 41060871 69686836 91568134 100273321 97213509
7972 97213509 82026979 54836539 21823208 -7613678 -25895278 -26760340 -6150328
7965 -6150328 29737295 61109420 68790387 54645543 42113501 51507072 77204396 94162811
7957 94162811 86038229 61427058 41753277 39543822 52001724 69604765 83586967
7950 83586967 87335509 78325648 60721650 42799157 31660130 32083831 46373519 69442989
7942 69442989 87239619 88355422 76578120 64075212 53158079 35295238 9535831
7935 9535831 -10697553 -15508988 -12334900 -12152812 -10047035 7901040 41662901 73681195
7927 73681195 89432019 92085396 93904048 100151441 104996014 98845096 77527669 47986345
7919 47986345 25566960 20464730 25481056 23192097 7831681 -6685084 -5489229 7025249
7911 7025249 14187579 10596094 7784803 15195515 26116933 28781981 24238263 24197136
7903 24197136 33402208 42318373 38488855 19902181 -4054918 -20718187 -22309426 -10416448
7895 -10416448 5068394 13067047 8550637 -6548850 -25500038 -36976229 -29125465 -1565792
7887 -1565792 29838410 49199100 58696168 69334697 77128310 66070942 37271737 15245984
7879 15245984 15609440 24274280 22401441 15737324 20879002 35405942 43586316 43728835
7871 43728835 47151228 54071405 52731631 40798178 26082450 7088317 -23853697 -56847134
7863 -56847134 -68746106 -56503462 -42508635 -39987685 -37894279 -29555698 -29164598 -43429992
7855 -43429992 -51271772 -33310174 -2663679 16023290 22337330 31443572 43105682 44784525
7847 44784525 36959113 30761453 25953131 14367418 995776 -1628157 1790148 -6949856
7839 -6949856 -29781993 -47538321 -49193696 -48314977 -63760130 -94871637 -119315067 -109893832
7831 -109893832 -58536035 8093087 46442632 41414342 21601367 15427334 12122964
7824 12122964 -8611736 -29902975 -21203548 3961552 3596022 -19060509 -11758848 41315334
7816 41315334 83214395 64398423 15470997 -1297640 19223146 31631279 15658653
7809 15658653 -3763231 -6558830 -3292732 -5476065 -5248990 4765971 16842836 23378324
7801 23378324 27417127 30367490 26073682 14236287 5426799 5898449 8416280 3158012
7793 3158012 -11161938 -29547245 -45822365 -54712843 -56462638 -58118178 -62827437 -62246980
7785 -62246980 -49376095 -33273428 -27999975 -31417019 -29691492 -19821332 -11829760 -9841163
7777 -9841163 -7355856 -2187392 -221498 -1780220 863451 8502472 11009520 3295836
7769 3295836 -5929595 -6519733 -20476 2598889 -9048991 -34913114 -57686873 -52426113
7761 -52426113 -15357976 23278354 31055709 12209843 -4386132 -9876351 -21574336
7754 -21574336 -44581355 -58004678 -49465292 -35898284 -34399437 -35964562 -27329952 -18292145
7746 -18292145 -23591162 -32644327 -23810306 -989083 10162642 1433058 -6197643 5281213
7738 5281213 26206627 35590405 28581570 16289762 5626317 -7932519 -26299613 -36944909
7730 -36944909 -24006031 8929255 36002695 35637015 14854519 -1169274 -183909 6561807
7722 6561807 2749043 -15256106 -38747952 -53796552 -48566149 -25580266 -6204606 -9649460
7714 -9649460 -28423532 -40041150 -40915655 -46998685 -59259497 -55503228 -26566652 5333688
7706 5333688 20497266 30456192 51734744 70995477 62839920 30395874 2717964 -1652579
7698 -1652579 12858708 35590441 56230390 59020925 33011091 -10794424 -48298790
7691 -48298790 -66717985 -67409891 -52387637 -26828485 -9256159 -17725362 -46218175 -71361468
7683 -71361468 -79584494 -71678757 -48373405 -14264749 9175991 1888263 -22524223 -29190272
7675 -29190272 -10579735 3752717 -5946455 -18712326 -3096284 40597051 82906258
7668 82906258 97187079 78808849 44826786 22824663 28242743 46767800 51139193
7661 51139193 36875113 23322085 17325616 1754412 -29013464 -48188340 -30802582
7654 -30802582 9942145 41126074 49860546 43965197 27138368 -1404706 -29950580
7647 -29950580 -41756052 -38580168 -36891218 -40499838 -35119107 -12224260 17953156 41733424
7639 41733424 57522649 70662944 81842247 85952569 77831883 57013677 30086330
7632 30086330 7927602 -2722413 -3755367 -613749 2139397 -1811183 -18418737 -41850588
7624 -41850588 -53693421 -43200413 -22396874 -11627393 -15400242 -21711411 -19208295 -4640214
7616 -4640214 19848027 43234430 44944694 15226278 -23599668 -33423691 -3285943 37467225
7608 37467225 55624873 50895825 45592402 48052033 44062304 24865501 6130108 7146507
7600 7146507 20348125 19100282 -3439802 -21739400 -14027808 5483476 8979313 -1818308
7592 -1818308 -630327 17802976 25591845 2648964 -35094599 -60722329 -67913602 -63026358
7584 -63026358 -46760575 -22800844 -6851594 -5410302 -245377 23667396 49275205
7577 49275205 52751046 45385599 58660516 92849307 113334478 99842589 68406729
7570 68406729 38216676 7079775 -27068070 -46801027 -37617879 -13686546 -2147642
7563 -2147642 -10396051 -23734443 -29566111 -30529499 -34308080 -39116123 -33404380 -11154489
7555 -11154489 14441641 21818637 10027565 3341930 15278817 24422609 7655928 -17446919
7547 -17446919 -15572090 8538652 14250431 -10133554 -27647322 -10707044 20672701
7540 20672701 40221877 57861209 89649527 115541750 105735533 70202567 43632298
7533 43632298 33215497 19175025 -164911 -3263103 13699151 26659023 21211273
7526 21211273 9708654 2625525 -8288244 -26417967 -35510332 -23585229 -1329743
7519 -1329743 17831885 37350935 61063308 73343859 55324097 12287219 -31047302
7512 -31047302 -56586840 -62136661 -52728916 -37476384 -30773612 -42391821 -65878478 -85194037
7504 -85194037 -91405536 -86263480 -73542280 -55844726 -37658675 -23525037 -14890413 -14636690
7496 -14636690 -29360268 -57435977 -79333489 -73341182 -41361304 -6842327 14342792
7489 14342792 26844313 35079559 26926384 -6427190 -44879828 -55074962 -32289118
7482 -32289118 -7695523 -6871497 -17635306 -12111330 11984034 30993991 31071517 23698262
7474 23698262 22839821 25247965 22112512 15679811 12495905 10786393 7707709 11402841
7466 11402841 30943982 57528676 69813164 58407426 34036169 11055703 -6182013
7459 -6182013 -19090848 -27974888 -33481615 -36781805 -34674905 -22001392 -3007206 6541130
7451 6541130 -5749336 -35176479 -64296881 -78205340 -74476149 -62339732 -53693116 -51453924
7443 -51453924 -47047761 -34395527 -24629564 -36959223 -71777846 -102638767 -102858614 -74952592
7435 -74952592 -46102689 -37565004 -46508157 -57651181 -64479616 -73524433 -90144610 -106513294
7427 -106513294 -108243423 -92024440 -71730297 -64740473 -75609811 -94949712 -108574348
7420 -108574348 -103385378 -71785821 -20875154 25068194 42006885 28031276 2063260
7413 2063260 -17443346 -24693932 -20456651 -5870568 15866591 40527184 65524012 82917346
7405 82917346 75029368 34590628 -11854469 -24480276 -2400418 7879061 -27811865
7398 -27811865 -83187980 -105673241 -84467237 -57654259 -58165322 -80867191 -103986801
7391 -103986801 -115286740 -108118587 -75682474 -25679103 14471153 24200549 13556246
7384 13556246 6610788 8148678 2282323 -18665433 -40502172 -47022610 -41677373 -40576144
7376 -40576144 -49234898 -55745268 -47895421 -30260316 -19466441 -24648723 -37512016 -42848640
7368 -42848640 -35965136 -27798639 -33267319 -54034656 -72101585 -64327583 -28381015 8935636
7360 8935636 17680875 -1769736 -21061321 -19573577 -4630261 6831373 10306661 8858441
7352 8858441 3004719 -567642 13894179 45757812 63138848 39115953 -5283607 -23773160
7344 -23773160 -8513775 1214129 -19944319 -46674369 -43398191 -13934051 11253565
7337 11253565 16674898 6353364 -17455010 -52684572 -82337604 -86833458 -70728044
7330 -70728044 -57355256 -57149547 -58282016 -48053590 -27033134 -1489944 22862911 38114808
7322 38114808 38687865 30418172 24367188 22222295 18134775 11227083 3365008 -10278252
7314 -10278252 -31512092 -44272523 -30777821 -2806111 5596291 -18302139 -49956632
7307 -49956632 -61562833 -52179444 -36282135 -23124886 -18545625 -27270009 -39198846 -31501068
7299 -31501068 -445991 25730805 24004856 10574746 15291509 34606436 36698698 9124233
7291 9124233 -23705619 -32674090 -14301117 14167719 34580518 39483194 35241790 34824522
7283 34824522 40047906 36947923 19719925 8811991 25960896 58457036 71820655
7276 71820655 55090893 28106216 4212951 -23841573 -53192693 -57565008 -24001727
7269 -24001727 19330547 33894720 15303324 -10943744 -24544810 -22145039 -6248753
7262 -6248753 15488940 26119387 14471140 -8291171 -22106334 -22534991 -16772896 -3885029
7254 -3885029 19778364 40499900 37565271 15965357 5581413 20705634 39963785
7247 39963785 35201480 2612537 -44508180 -94954670 -135497300 -142962949 -103851329
7240 -103851329 -39729341 4817624 3746571 -29178820 -59790491 -64606001 -42936900
7233 -42936900 -9716270 17533469 29636417 29270229 23924743 15824958 1208054 -21076589
7225 -21076589 -44162522 -57914549 -57533733 -47096806 -35908200 -31262434 -33380117 -36832687
7217 -36832687 -36281364 -29612982 -17025942 -1648452 8391270 5090428 -7859870 -14294431
7209 -14294431 -3617862 13768971 17783177 4145640 -11362771 -15390667 -12446462 -12195861
7201 -12195861 -12318043 -5601323 2163439 -3701832 -23839028 -39017423 -32901715 -12183076
7193 -12183076 1944629 -3827974 -25948466 -50479102 -62458952 -55936303 -42868738
7186 -42868738 -45644404 -70308195 -91959668 -79117035 -30655405 23422701 55980940
7179 55980940 63379962 53662330 34035393 16404103 15755259 29125711 30443429 2951920
7171 2951920 -33011093 -42234760 -18512789 11233595 22690352 15192093 -1966862 -23333418
7163 -23333418 -41387047 -44397285 -30802241 -14575292 -6968724 -2041693 10467551 25670842
7155 25670842 27602765 9266293 -19770381 -44234984 -55754280 -55915281 -51467231 -47116332
7147 -47116332 -42685485 -38065309 -36874125 -38985471 -33882747 -13607851 8717084 9474334
7139 9474334 -11513186 -24254731 -6230453 27523553 45485548 38203431 19155471
7132 19155471 -1660435 -22686350 -34451148 -23005167 6973952 33102807 45003258
7125 45003258 54526722 69798070 79267875 73318130 62880132 59534033 52345382 25815358
7117 25815358 -9269508 -27131609 -25412803 -27839375 -46614423 -65958291 -70232261 -65558885
7109 -65558885 -60443617 -45591902 -13080150 18761822 23612206 3709976 -15336651
7102 -15336651 -24098732 -38916238 -67843278 -91462337 -89634472 -68151925 -43700562
7095 -43700562 -18277424 12711457 38520594 41323316 22417990 1189745 -9994786
7088 -9994786 -11896943 -2207247 23749466 52448930 56350894 30648007 6546322 12023520
7080 12023520 34727505 42896981 31226133 22149760 26147466 26768879 10770833 -8815596
7072 -8815596 -12864370 -5009455 -4263847 -15720273 -24814182 -21015040 -13982206 -20754018
7064 -20754018 -44819473 -74151396 -94886139 -99728326 -85871058 -54891536 -18427167
7057 -18427167 3746505 -122650 -20184484 -33210077 -25228427 -2898903 16506461
7050 16506461 21630209 13677058 2041518 -4678763 -6436030 -11043330 -22707183 -32836719
7042 -32836719 -28440214 -9747836 7543983 9185068 -4999289 -26151598 -44651393
7035 -44651393 -49676158 -31183829 8158102 48098902 66452966 58205486 35588511
7028 35588511 14701374 7082931 17015666 37411657 51563582 47656341 30669680 14982465
7020 14982465 8889889 11353320 17383187 18653488 5887842 -18087229 -33164297 -23176012
7012 -23176012 829909 12449120 3105775 -12163210 -22152551 -34384906 -56132180
7005 -56132180 -76194694 -76512841 -52953227 -16632546 16876476 32624941 20594821
6998 20594821 -14447358 -52761070 -77249738 -86344173 -84083070 -66897368 -31012846
6991 -31012846 13351421 47565352 62681251 63423668 57505380 50312628 46849877 47898743
6983 47898743 45428031 32461245 16835292 13496175 22267807 26377389 17407995 8653183
6975 8653183 14837368 29160206 33362112 24979404 19968574 27772524 37182790 32933446
6967 32933446 16841298 3395057 -747681 -2520233 -7747103 -10216409 -80228 22736410
6959 22736410 49473151 73120277 90409581 93924897 71650274 20819423 -41197065
6952 -41197065 -86594298 -99086362 -83587621 -55044875 -23507916 6687555 28652994
6945 28652994 33193423 19555652 -483853 -14215795 -20268215 -24806528 -29329356 -29114207
6937 -29114207 -21945178 -10957669 484763 9112313 8094979 -6670353 -26066715 -35944355
6929 -35944355 -38695115 -51857908 -78165938 -93273165 -76792046 -42046389 -17913588
6922 -17913588 -12111321 -12435193 -14899883 -25118731 -35436659 -29219501 -11858860 -9995108
6914 -9995108 -29779310 -40764017 -16403287 29655770 64032384 72202009 58782611
6907 58782611 27335204 -15579618 -46976442 -44479874 -15544200 9750792 14252760
6900 14252760 5982960 -2262254 -7379094 -9617010 -8189393 -5968017 -6759535 -8087206
6892 -8087206 -7643276 -12934586 -30051884 -47220144 -47733706 -36832394 -34891215 -43885528
6884 -43885528 -44473763 -31033370 -23874119 -34905877 -44765024 -32069100 -7215646 4013644
6876 4013644 -1830985 -6156227 966122 11310329 17301263 21872442 28158039 33225790
6868 33225790 33953771 29303210 17765411 2384920 -4736766 4493462 18172813 15206337
6860 15206337 -7236976 -30587593 -41129300 -44874488 -50935115 -54102481 -44175052 -23510825
6852 -23510825 -4295682 6880511 12238554 13448454 8308479 -2424370 -11355379 -10760072
6844 -10760072 -1040479 8495558 8264227 -1090561 -8563135 -6105552 750623 1986396
6836 1986396 593309 10061886 32086074 49494184 49696318 44006306 49992815 61748874
6828 61748874 55543417 24887652 -8105814 -22857095 -26464167 -38159843 -58754295
6821 -58754295 -71388317 -68914476 -64738749 -72808442 -87093896 -86907369 -59023130 -12958942
6813 -12958942 23025917 24450102 -3322314 -24498293 -10135933 24388348 34762226
6806 34762226 4969571 -29518846 -28744030 -1346051 11367968 -5810719 -27012128
6799 -27012128 -28317288 -15881579 -1232095 23300309 62864411 93116233 83009819
6792 83009819 37842514 -5347692 -23968773 -28404956 -32690924 -31496654 -17122822 -242830
6784 -242830 2001215 -12021735 -31166240 -47544752 -57771551 -56131766 -40091245 -17997968
6776 -17997968 708167 18502188 40665226 57833175 53082165 25720655 -6921581
6769 -6921581 -32668019 -54235832 -72399232 -75914951 -57640424 -28847780 -7002758
6762 -7002758 2593432 4461945 1143435 -6199371 -13034719 -17991925 -27048338 -39723579
6754 -39723579 -39169293 -12438212 23366067 34104477 9943610 -23140605 -37991451
6747 -37991451 -35834496 -32355817 -29913626 -19611383 -3365926 2999982 -10589934 -36304061
6739 -36304061 -56962304 -59367904 -40393162 -9735945 11736184 6662015 -19293678
6732 -19293678 -38206128 -26735417 10359719 47981995 67940634 71592634 68618398
6725 68618398 64416646 60992570 58823008 50195802 20920639 -28409295 -70063657 -76252420
6717 -76252420 -57252209 -51224849 -70355382 -80354769 -49199508 3637684 30911278
6710 30911278 18656063 -4228042 -12917435 -13577960 -19621950 -29484622 -39687419 -56611456
6702 -56611456 -79539810 -90522262 -78939653 -62040225 -62424758 -75490166 -78131258 -62950631
6694 -62950631 -45299309 -39587105 -45389700 -56125304 -66168866 -67517681 -51861750 -20250858
6686 -20250858 15492083 41769895 49894631 38105222 13971772 -8169180 -18007583
6679 -18007583 -14446401 1814460 30827786 62889788 78553794 70327849 52916639
6672 52916639 38972747 16919424 -29860784 -91492184 -138411906 -152903359 -136317868
6665 -136317868 -94579743 -39117726 5731719 23779740 33268254 64918722 113670137
6658 113670137 141203002 130215466 105750157 93651469 88077273 74841716 58628129
6651 58628129 46049968 24250964 -19150173 -68977123 -96932519 -93421635 -68596686
6644 -68596686 -33358829 3175369 27422716 30687844 19125797 2386899 -18109559
6637 -18109559 -38001998 -41069582 -18521861 13857743 35272411 46330449 58037177
6630 58037177 65677620 56175875 34742980 20917996 20091355 19780204 13905122 11172188
6622 11172188 17132790 24456767 24114908 13677486 -6124435 -31650916 -54522579 -70420132
6614 -70420132 -85950589 -105615830 -119380597 -117936451 -111195543 -111641022 -107590081 -79277000
6606 -79277000 -38582507 -22860922 -43872590 -70598680 -73335442 -59749373 -52160013
6599 -52160013 -50744028 -39416880 -14512452 12041505 30913647 41161206 42718520
6592 42718520 35843359 24996677 13885824 -51510 -18661526 -34433322 -36251467
6585 -36251467 -22020491 -1615211 10336723 4103344 -16515635 -34160695 -34234404 -22450862
6577 -22450862 -17076830 -22928311 -25350077 -13132187 6780660 23964905 39389864 55228760
6569 55228760 62880073 55462661 43108381 39844135 40475000 27526345 983115 -15550740
6561 -15550740 -5018156 18276775 24806878 6813640 -11816653 -5965556 18616362
6554 18616362 33165500 23423391 6165463 3312203 12942602 18818856 19305370 28475247
6546 28475247 50141671 68207834 66236910 43609874 10106340 -22000438 -37518493
6539 -37518493 -24690749 11009262 48900077 72832869 80779047 76281146 64252111
6532 64252111 54925355 54791462 51775632 28448754 -6825706 -24168633 -14343586 -2389694
6524 -2389694 -7892932 -17314563 -13637331 -8842274 -20971100 -36728376 -26640901 11280000
6516 11280000 49720387 69364664 74634297 75202079 73889805 72898865 73945873 72343139
6508 72343139 65098775 60328110 63040044 58940906 32997659 -317195 -7775098 21464816
6500 21464816 64407925 92941128 95352054 72325511 34851352 7481865 10513209
6493 10513209 33960119 48979693 48058416 51585980 69824211 83681961 75059142 54744391
6485 54744391 44681785 48300847 53446629 52699676 46799042 36339510 21511484 5026588
6477 5026588 -9835747 -17345900 -6352055 25859575 55495706 48870749 5619953 -33611252
6469 -33611252 -33806170 -2885144 28180144 42553995 39388681 18004836 -17781751 -51358088
6461 -51358088 -68983814 -74339638 -71685421 -49207865 -1087515 46431612 57762535
6454 57762535 30696616 -7831778 -41560400 -71973028 -90073022 -76580951 -37881500
6447 -37881500 -9716264 -9920972 -13822028 4967457 33076700 41498036 33977298 40949920
6439 40949920 70525325 94599973 89341315 67346265 57895741 68802978 80970977
6432 80970977 74972828 51774147 27189720 12959566 6158138 -4669752 -24736034
6425 -24736034 -45297998 -51484064 -37065913 -9632000 18146708 38874198 51445558
6418 51445558 56735769 56914242 56635098 58785101 58562145 47749293 27346523 10144254
6410 10144254 6201161 11057124 14833066 17755195 26187430 35578946 30977481 8216532
6402 8216532 -17129218 -28257543 -24497995 -13177211 3936470 23953768 33217881 22535817
6394 22535817 7375249 12085474 32305250 34757929 3489974 -33802234 -42414327 -28541448
6386 -28541448 -26890426 -46242741 -54316862 -23643674 29780469 68747707 80869904
6379 80869904 83024210 87346729 85528621 70402711 53555892 49225279 51926936 44573363
6371 44573363 24802947 10013492 15074628 34813363 51565240 52829923 38262649
6364 38262649 16171588 -1193431 -3264188 10605220 28068001 33241190 20937323
6357 20937323 301582 -15270383 -19531986 -14687298 -5028811 6883879 18128929 24011582
6349 24011582 22066392 15761239 10907294 9252967 8849020 9510520 13289658 19780227
6341 19780227 25858203 30052589 31903269 27992709 16692509 7115090 12806860 33284358
6333 33284358 52587524 60888959 65720865 75387134 85280204 91002943 100332898 117063775
6325 117063775 126523425 116305293 99544461 94398595 90177627 62521036 17870766
6318 17870766 -9368173 -7034701 -830618 -11361076 -26330904 -28809091 -23746745 -18468912
6310 -18468912 -4476452 18630753 26090292 2424993 -26962277 -28507853 -9336027
6303 -9336027 -2452256 -15932765 -31155779 -43833979 -69114449 -104457809 -122635508
6296 -122635508 -110081765 -83357232 -58696800 -32938293 -5994472 5223302 -7119844
6289 -7119844 -23173309 -21915302 -10074805 -6131277 -9088587 -3207136 14753601 32154729
6281 32154729 40236622 40998508 36106955 23240353 4763803 -10259876 -14844567 -9145149
6273 -9145149 2348163 13247807 17222893 14099001 12553957 19972949 29758190 25550087
6265 25550087 1021032 -28365481 -37633949 -16952267 17793540 40272000 37693826
6258 37693826 17125222 -8061086 -28868349 -37825322 -29177853 -10316396 -2239917 -16734277
6250 -16734277 -40566031 -53714496 -54131642 -50023438 -38525011 -14175400 7653555 2653277
6242 2653277 -25586741 -46004531 -42019931 -27795803 -16054312 1030889 24252214
6235 24252214 30009634 5686493 -19470853 -10258303 19005896 17389331 -34172752 -94212834
6227 -94212834 -107961859 -65665523 -6319359 24676587 14562824 -12648800 -24326706
6220 -24326706 -10883905 11489315 26295022 33461694 37703615 36155319 29203209 29658631
6212 29658631 43968125 54058411 37838475 2745152 -21489170 -22330450 -16563704 -20036110
6204 -20036110 -24489555 -13823953 9124115 23518526 14893906 -7799707 -21214961
6197 -21214961 -14673108 -5317389 -16819391 -42812072 -49191759 -22148756 6244259 -196890
6189 -196890 -31881892 -52780271 -57042422 -70973667 -101153710 -119018835 -106460256 -82412871
6181 -82412871 -67560459 -52333767 -21973860 10969353 25369724 25306137 28033987 30530908
6173 30530908 16738886 -7559759 -16136229 -1470570 11949860 2596738 -17255377
6166 -17255377 -17983282 8692547 38255218 39752373 9163028 -25035832 -30849838 -6192271
6158 -6192271 22209201 33142979 32779882 36452591 41862284 34593674 12678991 -10714986
6150 -10714986 -26645192 -37386379 -44550118 -45176534 -41861954 -42794915 -47256650 -43428968
6142 -43428968 -26493720 -8348414 -3058991 -12131537 -29961819 -52367589 -70330883
6135 -70330883 -66828959 -35726675 1372785 14449542 2399975 -4568648 14828289
6128 14828289 44792735 55151115 41360558 26684447 29212884 43428675 55754856
6121 55754856 61460854 58119972 36592956 -6758669 -55301785 -84264952 -87054899 -78710551
6113 -78710551 -73907386 -72563711 -67802933 -56536752 -38847516 -16936060 1073198 5374773
6105 5374773 -2411227 -8153929 -2113953 10292186 18899270 21756028 22318270 21852859
6097 21852859 20921548 20751487 17030226 1568195 -21610424 -31759535 -15436809 11434680
6089 11434680 18991590 -2135655 -33681614 -54338154 -59032305 -54647926 -49255526 -48107189
6081 -48107189 -51542680 -55314476 -58866189 -69799080 -90624292 -105693613 -95895715 -65465177
6073 -65465177 -38346954 -25952758 -15078639 7630048 37217209 65341306 95514446
6066 95514446 128237972 145752570 132619496 103942919 90364200 95047391 87215039
6059 87215039 45597235 -8934893 -36227817 -21956174 12536980 39264545 48897175
6052 48897175 47762757 43078882 39125952 42501919 60511104 89481930 108943713 96403224
6044 96403224 52817179 8632757 -3828084 15821620 37345526 36429821 20359931
6037 20359931 11704866 16984109 24554460 28103458 34651587 46264739 50218536 37216986
6029 37216986 18148274 10699658 16672288 25057699 32174716 44284791 61686921 74381588
6021 74381588 75653355 68709949 58251964 46777089 40402087 44289292 48024401 30524745
6013 30524745 -11855069 -54952022 -75213390 -77232102 -80103554 -86145574 -80065313 -55406121
6005 -55406121 -25443391 -6207625 -752164 -3054310 -8423567 -16418249 -28359875 -43381116
5997 -43381116 -54647431 -52537347 -35683945 -14681877 54498 8899978 16397373 21642566
5989 21642566 22617233 21422211 15818742 -3932902 -36148851 -56120790 -42456739 -8157017
5981 -8157017 16086349 25109658 40201442 66198294 77096253 55948539 24296833
5974 24296833 13327746 22162340 24635895 8376137 -10961989 -11441896 11934919 44884986
5966 44884986 67365772 71010772 66119930 67524621 74638178 75094101 66764833 60370316
5958 60370316 57805501 47412999 29011880 23586503 43781394 71171491 79206915 65145058
5950 65145058 43079361 19883935 -1810719 -9384565 6372968 29423801 32873187
5943 32873187 13147132 -9499828 -21837804 -29390111 -39038918 -49667082 -60299944
5936 -60299944 -69261284 -65381716 -39056971 -2987081 17242166 15176399 7127133 2279304
5928 2279304 -8633078 -28784011 -41482418 -32501560 -9574893 11621901 26838958
5921 26838958 37795294 39902221 26883707 -404996 -36163684 -71177379 -89163606
5914 -89163606 -76455511 -41524039 -9650023 8561032 25692558 45721481 45667381 7758951
5906 7758951 -45946641 -73676752 -60963190 -28546548 96888 19102168 30446170
5899 30446170 33313501 28281614 21851527 23016166 37483550 60273423 71408970 51502255
5891 51502255 10533645 -13478934 -94878 21761492 7686432 -45309564 -97844163
5884 -97844163 -117902295 -107046571 -80303239 -48965803 -28671094 -36475017 -65682192
5877 -65682192 -83599403 -69100587 -36727502 -10000855 12420529 44970484 81280038
5870 81280038 94705208 71698348 28594816 -6286757 -16465233 -3639342 19026803
5863 19026803 38185004 51665283 68095920 89547089 99172416 77554976 31065235
5856 31065235 -7943959 -13456779 9494349 35327911 44429142 34405171 13968679
5849 13968679 -4551822 -10068442 339783 18132380 31962379 39209552 43997481 45650490
5841 45650490 37554868 18928758 -1219221 -16667844 -32766533 -55646460 -79401723
5834 -79401723 -93704495 -99508686 -105345495 -110240752 -104524968 -89568313 -81417701 -87033194
5826 -87033194 -89748069 -70546813 -35781228 -10309834 -6639944 -13466206 -14433703 -7014888
5818 -7014888 -157371 -1271366 -9143047 -15483775 -11970074 1370194 15415192 22243847
5810 22243847 23094244 21907097 15935683 777076 -18348422 -29819882 -29255827 -21045826
5802 -21045826 -7485099 12020639 28895515 25218147 -6374018 -49848076 -80663957
5795 -80663957 -89208539 -83032617 -70223778 -49602714 -17998926 19493609 50105534
5788 50105534 62287507 53101179 29977939 7870788 1503526 13334411 27122679
5781 27122679 20775202 -7338808 -29960334 -19355587 17631660 45336280 41040457
5774 41040457 16572104 -6143591 -23769398 -43719573 -62068907 -67214327 -58582033
5767 -58582033 -45336698 -30947065 -14100978 -566067 2296203 471477 6318481 17714409
5759 17714409 20908316 14749721 14819167 29592534 47309491 51635002 39192550 18917596
5751 18917596 4355955 6265158 20886263 27574791 12332259 -9441910 -11001898 8473415
5743 8473415 25960010 31218551 34949162 39697087 33806645 21541225 26135500 48366177
5735 48366177 54015500 23215069 -16776725 -32666083 -31852057 -38685953 -48464846 -41051810
5727 -41051810 -23365683 -19780977 -29128493 -28086708 -13295019 -4861859 -8215273 -5945630
5719 -5945630 9621071 27338895 44850773 73113475 105173792 112095581 84430168
5712 84430168 51297554 41531322 47914213 47570024 38539520 35519065 42390991 49746227
5704 49746227 53756218 60544574 72714429 82541703 79760547 61996138 38265875 22065633
5696 22065633 17625024 15904611 9872277 7215586 17044499 31272706 35423759 32410383
5688 32410383 35642608 42274131 37790775 27590125 35699522 64015577 79918229 59146424
5680 59146424 19394529 -4770713 -2554892 12625564 25817100 26724716 8698878 -20000832
5672 -20000832 -35483000 -25444287 -6853282 -1618383 -6331509 -3041358 10471320 20341128
5664 20341128 20452816 19237363 25161888 38026384 51856934 57887251 50381296 36157203
5656 36157203 29264173 30447594 25327587 9366507 -4322463 -12032269 -29690482 -57653144
5648 -57653144 -61612477 -18675663 37443139 54155386 31873473 19422701 41227420
5641 41227420 68776719 70063226 50820507 33868181 27743332 31473261 45459396 60546432
5633 60546432 56352421 27320254 -5329429 -21879945 -29091703 -42857872 -60949205
5626 -60949205 -69541626 -65451344 -55325445 -40969701 -21282850 -3538433 1480365 -6710867
5618 -6710867 -19683410 -32006337 -41934172 -43257626 -27669075 2865390 33017890 47098450
5610 47098450 43955577 37124130 37986576 39188941 21787813 -16830628 -52366846 -62632537
5602 -62632537 -58117987 -65270028 -84548608 -89217049 -67954474 -42864473 -35332491 -37808020
5594 -37808020 -34826169 -30876334 -36610340 -43459726 -36092988 -20480467 -15541492 -21876281
5586 -21876281 -22189672 -11555255 -4061053 -5687451 -1891683 18954287 45962811 60111492
5578 60111492 56856078 44936699 32502476 24896320 28410216 43391259 55995856 48443265
5570 48443265 19995686 -9447266 -20027605 -11960645 -1907717 -2553271 -10147015 -12113497
5562 -12113497 -3125997 9041324 12437582 2796385 -13997946 -28292062 -32491316 -21981939
5554 -21981939 3563653 34878593 52461907 41018334 8836042 -14881654 -10173435
5547 -10173435 11265688 23585524 21444224 21845828 32660143 39490267 30573382 14632147
5539 14632147 687764 -21058212 -57735375 -87436166 -80624782 -42481452 -8448224
5532 -8448224 2087411 3668238 13911751 29216100 39451096 46109416 54279118 61746048
5524 61746048 66497541 72759368 81090553 83642840 75900187 62311706 46320017 28012517
5516 28012517 14926765 18576952 34484500 42842241 36398472 30547377 37741077 49670242
5508 49670242 53593661 47912770 32869996 6832664 -18264106 -22724114 -14345434 -29964238
5500 -29964238 -81024563 -125686905 -123392115 -91616256 -73299988 -69706982 -49091794
5493 -49091794 -9463715 15604381 14233670 14321613 34553440 55544922 54379296 36200627
5485 36200627 15669301 -5083354 -22820917 -22601540 -752624 20823009 22198616 11298617
5477 11298617 5032175 835262 -12401255 -27518569 -27020305 -13625094 -11187707 -31588451
5469 -31588451 -56003267 -56665272 -29275215 4513902 24736482 33757997 43063200 47314194
5461 47314194 29335672 -5923542 -24352621 -6128725 20628916 13342722 -28561349
5454 -28561349 -67404131 -80430411 -77597240 -66542868 -35538584 15842605 57762437
5447 57762437 61215251 31345173 -4231691 -26232465 -32898580 -33297472 -40427613 -57606889
5439 -57606889 -67650370 -52713877 -25864759 -17743506 -27746622 -20410299 17854886
5432 17854886 52951191 54755244 42111877 48011171 68011330 77471015 77905377 87655281
5424 87655281 100475366 92338453 62900671 34614698 14070194 -11500298 -39644462
5417 -39644462 -48634106 -33283717 -15755758 -13170962 -18329094 -18542457 -11323939 3944607
5409 3944607 28267609 51071673 55847355 43232461 30732997 26953085 25462032 25503762
5401 25503762 35794465 53668209 63862978 63927883 67479546 75931968 73318300 59987905
5393 59987905 64271985 102503756 148876271 165452144 146715841 116117473 92434009
5386 92434009 78217376 70319082 63691879 52676172 42654400 50193208 76796402 94255241
5378 94255241 75226842 30958288 -257357 2410119 26619830 50981561 65129638
5371 65129638 65486942 50102290 24781838 3056792 -6382033 -6538370 -4735343 -4640900
5363 -4640900 -6512827 -8900757 -7903166 1505600 21755952 50197469 77395011 88202903
5355 88202903 72512950 39059040 10502708 -1735768 -10274884 -31469311 -59694219
5348 -59694219 -72717455 -58524993 -26572030 4537610 20508128 15379570 -5738708
5341 -5738708 -26226415 -29240223 -12888152 9860826 25913497 31860677 30717316 25710369
5333 25710369 18671703 10918810 4968101 5836307 16981201 32652837 39061504 26949130
5325 26949130 -786976 -35505635 -69490417 -93479657 -97991124 -83856706 -62022761
5318 -62022761 -36237255 1348292 46994386 73534319 61070639 28813090 12681808
5311 12681808 16444912 11220873 -16066475 -42006069 -43472743 -30250804 -25733637 -33993836
5303 -33993836 -43570780 -49830114 -54863211 -54916148 -46502566 -38903952 -43152016 -52816111
5295 -52816111 -52903661 -44771932 -43255625 -48940443 -44231756 -23575216 -8287719 -18152355
5287 -18152355 -41896925 -52230594 -42856292 -33960911 -43184935 -66658703 -90290552 -104831508
5279 -104831508 -103680502 -79447398 -35708955 3741314 11467082 -15106144 -49204872
5272 -49204872 -61512296 -47098908 -24557339 -13821594 -18676349 -28741161 -34349088
5265 -34349088 -36833690 -42733288 -49491971 -43595967 -18104201 12619393 24858063 12664631
5257 12664631 -4838839 -5661814 12034299 31977738 38727177 30499417 17632298 12344848
5249 12344848 17380506 23040902 18742873 7097242 -127964 -493627 -5510559 -22306084
5241 -22306084 -39989696 -41929065 -25216781 -788996 19819388 30609628 30623977 26519768
5233 26519768 30715055 47547518 65108563 69749635 64216754 60932185 61182891 53678236
5225 53678236 33094666 8006705 -11117725 -21721718 -25622960 -25625358 -27905438 -38474035
5217 -38474035 -53819644 -62265544 -57179775 -42684665 -25709664 -10199374 -137786
5210 -137786 699468 -4976602 -9252139 -9003376 -7697280 -5733408 2754540 20503667 41652883
5201 41652883 58122157 64879184 58434044 39697811 20578642 17002865 30436769 45675526
5193 45675526 51972257 55871463 65354619 71399049 57780981 25178681 -5907860 -16730502
5185 -16730502 -7361679 8767323 21415163 30968128 40874512 47421524 43297849 32536420
5177 32536420 32613021 52590962 75697687 77069454 56138751 36293680 32538506 36742107
5169 36742107 38260501 39898463 43990566 39881869 19458922 -6532912 -20995997 -20052059
5161 -20052059 -9257958 8103716 25671217 28926100 12810693 -4117700 -1315052
5154 -1315052 14247865 18820489 7071049 -4032314 -4476321 -2347891 -3485651 -1784668
5146 -1784668 3431693 732110 -11219837 -11816608 15281479 55013537 76940367 73176156
5138 73176156 64160675 67456795 77030457 79443948 77195217 82396920 92192213 86830853
5130 86830853 57348083 22144163 4941308 5165705 4492232 -4041889 -12581048 -20677796
5122 -20677796 -36104547 -49593173 -36904568 503152 23967905 8553789 -17831834
5115 -17831834 -14194260 14109028 29896344 24037623 19981973 23538544 13356854 -10689314
5107 -10689314 -13017101 23488001 63218097 64009082 32962300 9593059 11806853 25919948
5099 25919948 38180102 48921773 59230790 65276389 66881419 68552458 72678124 78952526
5091 78952526 84710125 80223530 55288929 19027345 -1215360 6594753 20807395 16733465
5083 16733465 1978510 1836182 20411761 38893660 47155783 54971283 71611737 91610341
5075 91610341 102601595 96012969 72140713 44353227 31672691 35476322 32339918 4110936
5067 4110936 -35062327 -58311013 -60732421 -53325368 -34755057 1557061 38309959 45328574
5059 45328574 22480198 2438896 5894275 22222549 39648108 61513092 79911229
5052 79911229 66926273 16092284 -32275007 -34743452 1931626 35804794 43949177
5045 43949177 34300413 13151749 -26062120 -76582057 -107170342 -92838331 -47035228
5038 -47035228 -12004977 -18531120 -58971408 -98890805 -112582981 -103943389 -90804689
5031 -90804689 -76552559 -50162086 -12769404 14070536 15443162 4941900 7354061
5024 7354061 27772040 48941211 53090600 36618955 8752258 -14962275 -22460017 -16975088
5016 -16975088 -15516750 -29690285 -53016491 -71492072 -78378490 -72940076 -55096228 -30285528
5008 -30285528 -10480690 -1035081 4698297 9328718 2374181 -20109971 -39056494 -33523871
5000 -33523871 -11526998 -1922206 -18668406 -48807351 -73330339 -84348806 -82512095
4993 -82512095 -72310862 -61294382 -52632409 -38896443 -13514523 14527690 29560856
4986 29560856 29781473 25337722 18419648 1295882 -24507131 -42136631 -37582084 -14327378
4978 -14327378 13003239 32091180 39457040 40217180 40148221 34015531 9848640 -27615897
4970 -27615897 -50728204 -41544561 -19104431 -13876737 -24732235 -26501950 -13954120 -8198282
4962 -8198282 -18746820 -29508326 -28560387 -23198316 -16398503 3113355 34063301 52748316
4954 52748316 46728517 34331167 32099258 26202943 -1183136 -37433993 -57104583 -57673021
4946 -57673021 -50333809 -28391519 23571950 93532925 144634400 156733479 143095043
4939 143095043 123870502 104541031 84756321 67869725 52689768 30375534 -1539187
4932 -1539187 -32314958 -52382857 -65958832 -81635921 -95756275 -93577385 -68670772
4925 -68670772 -37840965 -30396209 -56122773 -86964095 -82842937 -38607735 8021877
4918 8021877 21668599 7568680 -6458676 -10845382 -18185116 -35474029 -53918503 -64910500
4910 -64910500 -68056300 -61937382 -42421850 -13890941 9776482 19964942 21580344 24135190
4902 24135190 29871132 31418817 18405481 -10936134 -42664258 -57840930 -53358038 -44164831
4894 -44164831 -42789253 -48716908 -60128166 -77282399 -87127679 -67702127 -22799080 9621503
4886 9621503 2625390 -26491581 -47569375 -57377171 -62875246 -52788708 -21211295 5663977
4878 5663977 7508746 9106013 33299541 45933773 19022738 25510883 169020253 404250300
4870 404250300 533277156 436651218 226525314 99018855 100414600 126084770 102565409
4863 102565409 63563764 53824946 57698891 48565829 37336605 38138735 35441249 15708368
4855 15708368 -5453861 -12422407 -13609165 -15319273 -2766893 30203762 59946508 65334620
4847 65334620 59100465 65044915 83523420 100178471 110498848 114373423 102749767 72696825
4839 72696825 43997698 39418920 56677960 77142158 92185903 102723757 103010968 86857810
4831 86857810 64226605 49714895 36561967 4191552 -45225886 -78381327 -69076258
4824 -69076258 -31301855 -2011525 1878540 -3143978 4349043 20696492 22761699 -1405521
4816 -1405521 -37958531 -65744724 -79896305 -89290156 -97792868 -99839124 -91360445 -72447599
4808 -72447599 -40797795 2570243 39924176 46764482 22955746 -715757 1899548
4801 1899548 21146203 27358750 8550963 -20331413 -38911226 -38854530 -24340613 -8517938
4793 -8517938 -7636310 -25841708 -45206712 -42404143 -17388456 5216740 6964030 -2758276
4785 -2758276 -2917120 10203369 21812662 22730671 20364730 21201841 15095592 -10499169
4777 -10499169 -46521631 -68065098 -65112139 -52612353 -45054574 -36810754 -18663593 -98257
4769 -98257 1161254 -16014044 -36850954 -49010320 -45331464 -18478088 25592309 55925552
4761 55925552 44696754 5806080 -21171972 -25929460 -35377561 -61432193 -77149485
4754 -77149485 -62212168 -38810747 -35180356 -39289296 -20901825 17891880 47170774
4747 47170774 52980901 45232974 30500159 9846986 -818271 16692879 47401464
4740 47401464 53485376 27769789 6031908 13967744 31495716 28707966 12405717 11077147
4732 11077147 28561559 40068249 30302528 12558527 6293227 11574619 13201464 2299367
4724 2299367 -13672443 -21652340 -18859359 -12824540 -5220567 14766948 51105972 82059025
4716 82059025 78418148 42393021 10531346 9456766 23571922 19550171 -8100278 -32343985
4708 -32343985 -30355575 -9488234 5693736 2082457 -10359504 -10775848 10522960 38997840
4700 38997840 45663713 14863552 -36912420 -73802724 -73443950 -44591814 -11860674 12146519
4692 12146519 34441412 62529631 85598584 82803789 49895696 9351592 -10767817
4685 -10767817 -3456845 15802291 28731319 28915556 21030918 13777868 13005536 16446170
4677 16446170 16548844 11957858 11383107 20856082 33724357 40796064 42452884 40212604
4669 40212604 25884476 -4219014 -31452565 -33301452 -18406720 -19157913 -44686697 -65511486
4661 -65511486 -56072100 -30337109 -17713458 -20482599 -16739532 3253593 24404055 28415582
4653 28415582 12583098 -12696792 -33357663 -38671717 -28260969 -12736606 -2179298
4646 -2179298 3272399 6768381 4722894 -8556592 -29391639 -43965972 -36950813 -376448
4638 -376448 57137272 107297231 121437375 100878384 76111859 67046366 58223565 26030062
4630 26030062 -24339989 -66835814 -87424930 -88760986 -71892517 -37069064 1966916
4623 1966916 27908805 42572013 58248876 69059523 55751534 19792664 -13495591
4616 -13495591 -30149224 -39441609 -43980638 -28002217 9287333 36612206 30593753 12983732
4608 12983732 21631850 56768255 82453166 75354526 48131362 26310685 23206316 38447188
4600 38447188 62182789 77143061 72134165 58126108 59050436 83329237 114498248 130571213
4592 130571213 120745218 82828048 20957869 -46380646 -89276412 -89927163 -59572650
4585 -59572650 -25654026 -6249345 -1269096 -2173688 -2868423 -3761549 -10235162 -24980482
4577 -24980482 -39533866 -39157658 -21110821 -2117962 229704 -10480132 -15614177 -8232800
4569 -8232800 -2729683 -14819069 -41198580 -64559659 -71289873 -57456461 -24798044 18021862
4561 18021862 53798192 69588230 72230131 78929718 89915392 85326299 57091051 27851921
4553 27851921 21437977 25417815 6407308 -38764075 -71832945 -61899358 -25956207 -5951026
4545 -5951026 -18064989 -41293099 -49432501 -37660184 -18749815 -7523239 -12019965 -29733532
4537 -29733532 -47986233 -53570974 -44843729 -31231410 -21157172 -14860302 -9089558 -4700857
4529 -4700857 -8454638 -27515480 -58926648 -84231499 -83137491 -58190861 -36717762 -37932007
4521 -37932007 -46284644 -32815648 1777678 25539780 19748048 5051466 11940146 39709063
4513 39709063 60650170 58018352 43913504 39730035 51308596 67246751 74253171 69143175
4505 69143175 58236686 48570769 41203326 33524134 25608590 19623784 13655121 3563736
4497 3563736 -6241418 -1951318 22639798 53336208 68264243 61598237 46908949 37314839
4489 37314839 30553948 17018839 -3294904 -18270646 -18228811 -8647253 -4080138 -9566672
4481 -9566672 -14217274 -7984170 1692791 1028890 -5684509 324436 20621134 31082044
4473 31082044 17996008 4606978 19125836 47669992 48779150 14488951 -14231557
4466 -14231557 -4287248 24140516 28945754 3519999 -21991357 -25666950 -13132654 5127644
4458 5127644 28669825 52505031 59672490 42360989 17879512 9826620 19901636 30072660
4450 30072660 29013296 24839704 30215488 42936885 46607421 29656279 769875 -17669888
4442 -17669888 -13248303 2017134 4924861 -12878229 -37270640 -48708258 -40112697 -17978765
4434 -17978765 5965683 21629079 26284566 26684821 29652580 29444457 13077811 -19605551
4426 -19605551 -51880998 -70017860 -74478230 -65456947 -35115970 10524160 38175415
4419 38175415 21238804 -18703641 -31195373 20645 38085598 44189182 23367490
4412 23367490 5884333 4507153 10276935 15587608 17957756 8324637 -20956115 -56484633
4404 -56484633 -71280521 -55438545 -26176548 -6093072 -3856233 -15833101 -31414241
4397 -31414241 -34819677 -17966445 3397570 1751750 -27272801 -57005032 -64994995 -59928091
4389 -59928091 -60692716 -64326732 -54203939 -30681750 -12080386 -8048602 -11528033 -16984273
4381 -16984273 -27192554 -38880852 -40725255 -32345559 -27558574 -29090684 -17311658 20930842
4373 20930842 65557281 83637024 68800983 42216086 19876859 362534 -14530899
4366 -14530899 -10406203 17591920 49440204 61870278 57184418 57366141 73864323 95270244
4358 95270244 104115034 96282258 82737293 78325167 88601382 102077373 97174125 64505015
4350 64505015 22087266 175555 9179232 30113455 39119594 32855125 24740673 24727269
4342 24727269 31864866 41692014 50075144 51026186 41762279 32187027 38939012 63725581
4334 63725581 84878101 78597405 44774671 4387902 -25087967 -42267378 -51592419
4327 -51592419 -52484985 -43052437 -26467235 -9191177 496942 -9540935 -45812633 -89215218
4319 -89215218 -98883514 -54883652 8762852 34767725 7511188 -32310322 -42027560
4312 -42027560 -24220181 -8861247 -9718624 -18308323 -26751018 -33262583 -32488187 -23341851
4304 -23341851 -21881864 -41786338 -63161919 -48660553 3192590 48224494 52739887
4297 52739887 33525649 22880342 18427897 -2330174 -32929663 -40440232 -16468272
4290 -16468272 8477436 11474773 9212958 25595323 49063466 47368986 15434461 -16342675
4282 -16342675 -22486580 -11328545 -6321157 -12528099 -13838867 1460314 23642312 32655369
4274 32655369 20917883 813774 -9728280 -6124411 -650252 -9280346 -37008013 -74249366
4266 -74249366 -103831244 -111712413 -95935154 -68468450 -46052004 -35941856 -31131847
4259 -31131847 -21179082 -6031439 3756536 -17689 -12995391 -21768167 -15966369 3246156
4251 3246156 24209847 32846328 22291505 -1192123 -20731016 -20675423 128666 26942187
4243 26942187 43689391 48842517 53453638 63316756 69433391 61161499 44007772 35017867
4235 35017867 39787693 43334620 29497301 2984796 -16717475 -21089225 -21775142 -30732234
4227 -30732234 -40013334 -30162334 3895074 44016617 67304876 66774904 50880713 29036950
4219 29036950 4112013 -23022864 -47350956 -58830449 -46547611 -8201866 39780142
4212 39780142 67003736 54632947 16728728 -13141695 -18463410 -13035294 -14091138 -15120735
4204 -15120735 2325074 36901218 63719067 64347634 47994457 35797497 31780177 19628503
4196 19628503 -12038648 -50064406 -68997074 -60713614 -43572433 -38093896 -41130671 -34638239
4188 -34638239 -16657732 -7945197 -22479636 -45315080 -51153504 -35622754 -14881596
4181 -14881596 -885448 7241891 10271174 5033143 -3622546 -2857035 9047243 15592380
4173 15592380 2580344 -22994141 -42623735 -47432534 -41308916 -29652423 -15631730
4166 -15631730 -5004921 -4686602 -14717593 -26426462 -29126109 -16633158 9645261 39424816
4158 39424816 57484395 54323585 33264714 4791683 -24015207 -51524875 -76612347
4151 -76612347 -97300748 -113051929 -122973086 -121881814 -103629127 -70277189 -34488720
4144 -34488720 -10496175 -3842111 -9772835 -18498540 -20999762 -13653569 -1228335 5906970
4136 5906970 1643553 -8443901 -13198028 -9651341 -4837525 -1598189 8319826 28246891
4128 28246891 42125575 32502512 10305317 5683950 24597530 37775357 25284852
4121 25284852 7560561 9290664 14441020 -8300216 -48498149 -64678094 -50557375
4114 -50557375 -45305516 -68369823 -92050656 -101783926 -134260149 -211128521 -271502196
4107 -271502196 -231498971 -99608209 24820182 70590702 59117951 40417276 22632091
4100 22632091 -3159885 -15207764 11884225 54672921 63687594 32962848 5794375
4093 5794375 9054398 19484642 6875394 -21050123 -37041944 -35940936 -33943270 -36804931
4085 -36804931 -31527179 -8812571 22894344 48569094 60308475 57004137 40621742
4078 40621742 18724812 4473987 7339215 24947462 46758206 63617784 71570208
4071 71570208 69732073 59409154 45592474 36198548 37612464 49686488 63984946 68378293
4063 68378293 57066689 36456233 17561921 3241392 -10352184 -19147532 -9719898
4056 -9719898 19302504 44055889 37604833 1883555 -35616012 -55078394 -59632750 -57274672
4048 -57274672 -45445684 -21413555 5455495 21868628 22599671 7928348 -19781338
4041 -19781338 -48270115 -55734438 -31945141 7684814 39821707 57734192 67028330
4034 67028330 65752487 45413463 9391344 -24687349 -42589028 -43668071 -34201093 -20527001
4026 -20527001 -8446215 -133345 8733338 21984298 35063246 41100522 41587020 43143880
4018 43143880 46939668 48641764 44606079 31669073 8104538 -17691358 -30184383 -29030925
4010 -29030925 -34971316 -57617539 -72348101 -53519533 -19841359 -15912423 -50547333
4003 -50547333 -83988781 -81090723 -50243352 -22614550 -17578542 -36568920 -67173918
3996 -67173918 -83844257 -66323494 -25683398 8867950 32236166 63461405 98208250
3989 98208250 100551289 61297509 26291749 35651973 65535270 67010389 38397516 16743364
3981 16743364 13166196 2646962 -25104482 -46927455 -44785459 -29897225 -19506194
3974 -19506194 -15621796 -14982205 -18706044 -25332448 -31232903 -39567619 -51727493 -53095935
3966 -53095935 -29462754 5280553 23611669 25110385 33354229 50794202 50955607 24886980
3958 24886980 1310052 3464206 15708124 14425508 6031680 8551548 16416701 12873232
3950 12873232 3867143 10158828 32127140 48832593 50010521 45683721 43346544 37009148
3942 37009148 23470437 11929966 9884310 11019782 3978239 -13601619 -33159486 -41472401
3934 -41472401 -27995392 6092810 42833739 57806714 41390053 9170811 -11503607
3927 -11503607 -6855995 10656857 15726379 -2876255 -31335114 -48912004 -51103633 -47472458
3919 -47472458 -42941108 -35425775 -30046871 -37651248 -54752056 -62734661 -56148245 -54787960
3911 -54787960 -73539305 -94804887 -90270409 -61477035 -37553594 -34751210 -38437378 -28874137
3903 -28874137 -7533517 11009125 21745350 32369795 47661242 60023635 57687411
3896 57687411 38444427 11712111 -12650665 -32702266 -48398402 -53928645 -46224699
3889 -46224699 -37215850 -41843421 -51799117 -39363321 3463331 46380167 55794573 35313131
3881 35313131 14685523 10123407 16397801 29768430 52657419 75524868 79286055 63008121
3873 63008121 49248282 52647561 60055654 52414337 32093181 16987322 19263809 40890181
3865 40890181 77819103 114417947 124152509 94050308 44978527 11820763 4645073
3858 4645073 3788128 -7565524 -23129078 -30052195 -28891734 -26131423 -18688533 -895454
3850 -895454 17944482 18282733 -5226276 -34909047 -49974053 -47249049 -37272486 -27338096
3842 -27338096 -16902276 -6371820 -463548 127890 4541415 23529101 54994635 80532971
3834 80532971 79733092 49836372 9779026 -17397286 -23863301 -15918869 -120182 18274047
3826 18274047 26127795 10113111 -20094696 -34722381 -23562622 -15755107 -39171352
3819 -39171352 -73789644 -74596394 -35844655 270686 3600051 -7798323 -4853942 8714225
3811 8714225 11496475 859669 -10892341 -20884381 -30478554 -28220576 -6084462 14873612
3803 14873612 5405145 -25925825 -37368649 -11509482 17979240 10295581 -31395276
3796 -31395276 -68968166 -76747154 -63258113 -51542956 -52951140 -61838905 -66872440 -62385090
3788 -62385090 -50251507 -34792445 -20306476 -13607832 -21821881 -42700698 -62703387
3781 -62703387 -70608514 -67718023 -59129156 -43633157 -22102849 -7390325 -11472182 -26841484
3773 -26841484 -34436270 -27532811 -15277943 -6278004 -2658097 -6346061 -14754676 -13085818
3765 -13085818 10020784 39067059 43960755 19540152 -5542589 -4909798 17124393 38253499
3757 38253499 42644145 27827517 5163135 -515478 28868531 76205145 100355966
3750 100355966 85764683 60587525 53090335 53028026 36230472 7876742 -4543074 10050740
3742 10050740 38465434 65201331 79274450 67840506 30011806 -6035924 -7086921
3735 -7086921 21131371 38235545 22723089 -2212420 -5764091 9378338 18557828 12680041
3727 12680041 6020909 12720047 30080147 44294463 44099563 29703946 13452461 9268673
3719 9268673 17481592 23879973 17391768 2747810 -10222914 -22804017 -41577658 -58893416
3711 -58893416 -53619724 -17965900 26128630 48308932 44132276 37326391 47909754 70165263
3703 70165263 87274603 95991398 105274258 117222651 123496583 119640806 110506678 100346590
3695 100346590 88987053 79664672 78219076 79916626 69069212 39674101 7704449
3688 7704449 -5656121 2439665 16178454 19629620 10656529 589135 3162268 19387665
3680 19387665 33303216 30082073 17201048 16211273 33578614 54312889 65960528 70537231
3672 70537231 68094910 50963906 25897047 19321022 41494874 63300446 50972675
3665 50972675 10772217 -23445572 -35939482 -38159739 -40565122 -41048701 -37732339 -29786775
3657 -29786775 -8045610 32476210 72522185 83744700 63519905 33788898 8038874
3650 8038874 -16596992 -36935125 -42453070 -39668145 -49362814 -72193461 -83042521 -67710541
3642 -67710541 -40005680 -14657474 8834789 25019358 16148540 -15396802 -36027740
3635 -36027740 -23348537 4194189 20389966 28088791 38168281 38406062 16949785 -3754791
3627 -3754791 4715838 27133278 23596047 -7548463 -27023358 -17276212 -7722980 -25739235
3619 -25739235 -56349108 -67939828 -52253623 -21452954 13084046 41098784 50025403
3612 50025403 39289803 26022245 23310367 26081720 30207296 47232990 81235483 106558990
3604 106558990 93105371 46073262 -2455896 -36048439 -63051021 -84510898 -81826049
3597 -81826049 -47644913 -8126549 2134982 -22665475 -58490715 -78130897 -68941245
3590 -68941245 -34715241 6151690 30700362 32855710 30415829 39109248 47283374 33908387
3582 33908387 6884091 -550183 23563161 49411274 43504754 9255750 -25458526
3575 -25458526 -45586891 -54581381 -54586930 -44200839 -31614198 -28293831 -30266844 -25274678
3567 -25274678 -17568323 -23100038 -37918002 -37364122 -16518628 -6024725 -29023466 -61725354
3559 -61725354 -61406978 -23997654 10570947 8934754 -20184309 -44400684 -45869769 -33939033
3551 -33939033 -28010535 -34098606 -37328527 -18736452 18886892 47983582 45183732 17642000
3543 17642000 -7737049 -16299697 -16434831 -21151686 -30315906 -32730290 -18368171 12367706
3535 12367706 46268076 65666846 65127241 57428040 56186699 55906577 39000737 2024855
3527 2024855 -35069690 -48879471 -35753982 -12998363 -1113012 -5938267 -15727277 -15902436
3519 -15902436 -6889462 -2975556 -12363588 -26571040 -34252220 -35781579 -35539964 -29398361
3511 -29398361 -12853122 4880503 9349887 73193 -11854106 -21337366 -29442703 -29400782
3503 -29400782 -11289199 17395090 33895195 28951868 18677469 20944198 33104170
3496 33104170 41095437 39382110 33192966 29736941 34795286 50144589 67317569 71205536
3488 71205536 56767882 36269351 24813023 25282045 31959693 40504774 47533543 47505425
3480 47505425 38086752 24702277 14122275 6823687 -968590 -11742435 -24935167 -35671039
3472 -35671039 -35920428 -25430771 -20390612 -37570368 -66838217 -74965901 -45009141 1416090
3464 1416090 31139632 36291625 32017510 28776442 23101151 10382204 -8014101 -28772533
3456 -28772533 -47262594 -56470876 -53531834 -43272391 -28458776 -4674180 25498469
3449 25498469 43800685 37388123 20930763 18924553 29871185 28690050 5391176 -19891470
3441 -19891470 -26524018 -18839075 -11464331 -5036925 8542021 25844988 32592111 23032403
3433 23032403 8106669 3394414 14440087 33456622 46720603 46689926 39450248 37138067
3425 37138067 40290783 33023061 2218709 -41567235 -70986233 -71209636 -55327620 -45904168
3417 -45904168 -46251643 -38427886 -9945576 26950275 49342429 50901948 44638442 40299988
3409 40299988 32190013 14082098 -5436946 -12249929 -4692272 7131130 15075986 16551280
3401 16551280 8840895 -8463911 -26008948 -30153432 -17986312 -319548 10345285
3394 10345285 9043412 -1703163 -12533359 -10071028 10070478 32956476 37698864 22499879
3386 22499879 5970247 2045352 5414883 5137563 -160299 -7207085 -16216410 -24583346
3378 -24583346 -21935878 -2936308 20693172 31719470 27613340 20141114 18320495 21817005
3370 21817005 29053230 39954809 47868937 38212416 2039831 -51294582 -98279995 -117734124
3362 -117734124 -104093316 -68210747 -27194347 7682573 34550117 53849484 60628731
3355 60628731 47446096 16255086 -14555480 -19989942 8474530 48026694 59400140
3348 59400140 24142041 -34518932 -73914320 -72712438 -42857736 -6412668 24043242
3341 24043242 40374188 33016493 3386493 -27576967 -37006932 -22406222 2597243
3334 2597243 27797279 49587548 61043300 56015546 43423611 41600391 53996420 63564873
3326 63564873 56872599 41360983 30817604 25647793 19609952 17156284 27594757 43996123
3318 43996123 44898782 22944926 -741592 -1382768 16649973 23714813 923123 -38219320
3310 -38219320 -65101769 -65460839 -44924657 -13353015 23406853 56303998 70169495
3303 70169495 55644249 19720529 -20495758 -51900981 -71049934 -80908668 -86852247
3296 -86852247 -92729966 -96428079 -91485384 -76026672 -56772418 -41530635 -32643506 -31091479
3288 -31091479 -39439468 -53463847 -57829541 -41014112 -11466400 11010927 17188839 11701349
3280 11701349 -943758 -18393485 -29349196 -18869958 9007872 29902346 30226986
3273 30226986 26232264 39031264 61216593 64820853 38353106 596353 -23183803
3266 -23183803 -27330487 -25856850 -34123516 -52216891 -62719794 -47989524 -15170812 1997277
3258 1997277 -22679858 -74520038 -110551889 -105072784 -71404635 -38892089 -22643402
3251 -22643402 -19431375 -18705798 -9402479 12629039 34689987 35029489 11565360 -6403787
3243 -6403787 10496969 53696728 84670422 79254797 49526559 20838125 3154098
3236 3154098 -7805591 -14172381 -13106899 -4305845 11422791 38851002 81668428 126563585
3228 126563585 145187854 122262545 78637212 55214761 69497408 95493594 94527218
3221 94527218 61224019 27202785 19164244 28412593 30710752 23248054 23972676 38084982
3213 38084982 45698190 29736013 782412 -17919928 -20644032 -20037300 -22319818 -18061421
3205 -18061421 -1438057 14642534 13012730 -3782597 -14951502 -7537568 7612932
3198 7612932 10460463 -3495714 -20575232 -29128425 -33182774 -41856627 -51716996 -47606414
3190 -47606414 -20512205 20489853 54540337 64350245 46811489 13073918 -21152493
3183 -21152493 -47462830 -66132609 -75720406 -68872446 -45197676 -20900126 -12453275 -13127883
3175 -13127883 -925911 28213667 51007696 46912595 22707892 -2570635 -22963527
3168 -22963527 -41802336 -54323878 -52594239 -42262573 -36165176 -32874250 -19012222 5873020
3160 5873020 23707129 22378976 12227203 11198365 23235661 37075187 38844759 22322938
3152 22322938 -5756295 -28982651 -38474048 -46226691 -68607971 -96504126 -99928667 -68225110
3144 -68225110 -27146102 -5306240 -1447923 80648 -1460509 -16580454 -38953471 -49835260
3136 -49835260 -45633931 -39406485 -36106939 -27987886 -16513428 -17309593 -36911919 -62605449
3128 -62605449 -82209602 -96604148 -104824008 -95521261 -66261711 -35721269 -20856089
3121 -20856089 -13521133 3727738 27596440 37821544 26442524 6767646 -5008991
3114 -5008991 -2829476 12248999 32243346 39173100 18299834 -20480458 -47024233 -42794870
3106 -42794870 -19743649 -4145571 -10782780 -35495681 -62157894 -72988978 -63527417
3099 -63527417 -52764170 -66064662 -100431507 -119873798 -97266322 -50120920 -20329157
3092 -20329157 -26493476 -52389707 -75815815 -87825452 -83586877 -57060995 -14930138
3085 -14930138 19564145 29503934 22855932 18591272 21870136 23435975 18080490 11898477
3077 11898477 11821253 16447371 18220560 10068539 -8906948 -29890892 -38560547 -27825368
3069 -27825368 -5038911 16877111 32036661 40979668 42635900 34843333 20557455 6152982
3061 6152982 -4881680 -10293364 -4902962 12726773 32298507 41663451 43506634 49411528
3053 49411528 56904707 48234017 17665983 -15395011 -31198549 -35128862 -44407194 -57817044
3045 -57817044 -55311473 -26345976 14593320 42314981 42933280 23199654 5749891 11425728
3037 11425728 36301747 49975812 28803670 -12462550 -36946095 -31271096 -16135706
3030 -16135706 -10064918 -6228736 4238003 8714906 -6773912 -28915611 -32566991 -17795791
3022 -17795791 -8145110 -14019429 -20530292 -14339932 -1448239 8068009 14379016 18589226
3014 18589226 15720365 6489291 715721 -709682 -10440214 -29145422 -34433439 -13693719
3006 -13693719 10194722 11491831 4993441 23142051 57146721 62178856 28270428 4884723
2998 4884723 32886845 84746984 103010409 75175117 35420960 7175520 -15459855
2991 -15459855 -31827545 -22004980 16571166 50653572 49434424 22358020 1199984
2984 1199984 -515892 7558726 16122913 24272343 28642814 22266304 5466991 -12618114
2976 -12618114 -22851240 -19157102 2077435 34500853 57213523 51114785 21100288
2969 21100288 -8186924 -19714560 -17546479 -12556080 -7193436 -485367 1281765 -11128616
2961 -11128616 -36445905 -59411472 -61887179 -37542419 2097771 35913345 50288146
2954 50288146 48358371 40795484 31101513 16129340 -1773108 -13605407 -16830718 -20174129
2946 -20174129 -30526696 -42763420 -48083682 -45071713 -35736135 -18264808 6371385 26359274
2938 26359274 29987256 22245621 17418813 15153510 -966938 -35710485 -67208834 -70360555
2930 -70360555 -46210565 -17421020 -2497241 -6724673 -30616103 -69058535 -103573983
2923 -103573983 -114706758 -106806424 -103675487 -112752086 -111546522 -82325720 -43910117 -29244618
2915 -29244618 -40910173 -51039760 -42266599 -26331565 -19162486 -18551822 -15449142 -10765489
2907 -10765489 -8917180 -6184624 2150854 10600444 10583951 3773179 -1296446 -2409853
2899 -2409853 -5165454 -13577275 -25521068 -35505696 -37851632 -30698637 -20464544 -17549101
2891 -17549101 -24125823 -32008148 -35748063 -39799037 -48184713 -56533274 -60753404 -63374525
2883 -63374525 -62995742 -48821552 -17828159 12343512 22138397 14678379 7358878 6249967
2875 6249967 5666842 7147170 18446491 34530831 39012139 26664023 7307126 -14622364
2867 -14622364 -45776795 -84443890 -113385173 -120102252 -110195609 -94319375 -76236885
2860 -76236885 -59788088 -51752585 -49799124 -43179133 -33661320 -37964992 -57847896 -67049168
2852 -67049168 -46065550 -14380023 -6206133 -24705043 -43501565 -47078473 -44430573 -42921973
2844 -42921973 -33596349 -10454024 13794863 21560410 8856559 -17123785 -48717190
2837 -48717190 -78877945 -100015704 -109465785 -111244653 -107779845 -95675947 -74513077 -54190037
2829 -54190037 -46952073 -53956224 -63385021 -60328265 -37436206 -205050 34768911 50068845
2821 50068845 41183626 20705073 6714386 6197083 10769857 9345485 3520104 6362787
2813 6362787 23708130 42412532 46269721 41430235 51564787 81710297 101183086 77201422
2805 77201422 18237280 -32999817 -48427627 -40423343 -37068510 -48434568 -65108615
2798 -65108615 -75722913 -72876633 -50620374 -11746997 24469434 36135215 23447002
2791 23447002 8865604 8296917 12675685 6503645 -4831957 -1324982 20491476 39964954
2783 39964954 41267707 33695064 31199017 26305651 5041865 -19551253 -15131366 24401082
2775 24401082 64424045 71821206 52681875 33662799 23527837 14047649 7254723 16087004
2767 16087004 38867768 54712222 49079708 28848158 7845178 -9412565 -24577062
2760 -24577062 -37333327 -46731128 -53541812 -57049174 -54761478 -47067399 -36998363 -25358078
2752 -25358078 -11783315 399873 6422061 5225671 -2997781 -18860223 -35221904 -34780991
2744 -34780991 -10306827 18648172 26685956 17102944 15975762 32277338 46325084 42735008
2736 42735008 32078749 28979849 28490421 19390464 6541597 3793666 13043517 22824424
2728 22824424 21382345 3544964 -26085555 -50061398 -50466997 -32103764 -18853575 -17965823
2720 -17965823 -6879736 28693982 62639464 58886211 22718510 -4751219 651832
2713 651832 22921423 34753442 27223929 7764709 -11791295 -19598540 -11322483 1856545
2705 1856545 4026922 -5922818 -17505572 -28613357 -45090097 -60608898 -57108191 -30431891
2697 -30431891 2028582 25070492 39400893 44465229 27197320 -17761198 -70046965
2690 -70046965 -101290106 -104019773 -92293731 -80850294 -73803509 -67955624 -58058066 -42567296
2682 -42567296 -28596810 -23979679 -21419696 -2835081 33784926 65238588 70857351 56822701
2674 56822701 41376150 29665715 19009095 15930423 26276386 36150907 26607301 5522803
2666 5522803 1611619 24010422 49606394 56867491 51674555 48498299 43492951 23039690
2658 23039690 -9671312 -32452252 -28392558 -4853471 12022282 991114 -31850271
2651 -31850271 -55459083 -47057708 -21403384 -13636288 -32570469 -49701790 -40958623 -18058912
2643 -18058912 -4158185 1078230 9433638 13571865 -427318 -16532501 264822 50154326
2635 50154326 86801331 74820370 35355224 15625301 31540190 61956944 85531347
2628 85531347 97399654 95484044 76631098 49481569 31079104 25316757 20417951 11532426
2620 11532426 8150311 11778805 4695927 -24443139 -56606169 -61990340 -37979333 -10667202
2612 -10667202 -161590 -858160 1048509 6180148 6757338 2003073 -2275447 -4058247
2604 -4058247 -4937063 -2614789 6371174 17387761 21481628 19727276 23104392 33843898
2596 33843898 37707868 23185367 -261737 -13910417 -13000699 -5435127 6854576 27656399
2588 27656399 49129824 55962081 52343323 62958911 94379827 116065255 100962543
2581 100962543 70009996 68454640 103176738 132250420 120288261 78250421 39045431
2574 39045431 16788366 5444381 -288847 -2693425 -9538367 -25366176 -37832346 -29461314
2566 -29461314 -3932428 12431268 -186387 -31383228 -49580950 -32638056 10442460
2559 10442460 46990423 51640273 30089504 8361283 402266 -4468531 -21440641 -50654680
2551 -50654680 -83125936 -112726289 -132533992 -131491709 -108264873 -79448551 -59411883
2544 -59411883 -39422970 -3282385 41630898 68096688 63852094 45121339 32277374
2537 32277374 27569575 22365020 13067153 2406563 -5891369 -8157553 -4340698 -3824011
2529 -3824011 -18425050 -45910154 -70233494 -81900969 -86102788 -84114961 -60774020 -5396919
2521 -5396919 61949855 102764832 101243835 80769927 73608869 83216143 86084488 66507051
2513 66507051 35973909 13359454 -1937867 -23172520 -48062543 -57004923 -44216351
2506 -44216351 -31811204 -39802149 -56595807 -56969190 -39237679 -23919424 -21031479 -20893174
2498 -20893174 -16315429 -11607424 -7186304 2465966 10363595 -109765 -23973943 -29027033
2490 -29027033 2801131 47016169 68032925 64211261 60699945 68579814 74992759 69839358
2482 69839358 59419622 50850961 40844156 25767517 10466079 1139982 -2603890 -4196142
2474 -4196142 -3488096 3721415 20800815 42484476 51354633 31721790 -5886115 -24812873
2466 -24812873 -976197 44371660 66227567 47523718 12676212 -10439244 -22525218
2459 -22525218 -38607124 -56999442 -57365847 -26505928 22609837 58010037 54264367 15733716
2451 15733716 -24526101 -36015350 -23592833 -21288171 -49009290 -84464770 -87866959
2444 -87866959 -49863682 -3381071 13000620 -6343803 -36045143 -51574977 -49907889
2437 -49907889 -41798859 -35040712 -29483953 -20854761 -3500102 24448944 51512104 55523264
2429 55523264 27798578 -9491827 -25068022 -17056489 -12725256 -26780202 -40072543
2422 -40072543 -30297188 -5076578 12545187 16785814 15746697 5413836 -26584707 -71418540
2414 -71418540 -97292928 -84603313 -46630089 -9345433 14121646 22432157 15848668
2407 15848668 -527410 -13663774 -15771304 -15882122 -28080272 -50665717 -65726086 -59897903
2399 -59897903 -40059155 -26209705 -29828037 -40730439 -38232553 -16484524 6968613
2392 6968613 13554592 8969850 15794584 42836564 73540905 86762212 78685614 60282765
2384 60282765 41742642 25014936 6950389 -13881925 -31358051 -34362812 -20579816
2377 -20579816 -4928608 -5671958 -23399446 -42435226 -50654568 -47135478 -33258924 -11270249
2369 -11270249 8194220 13513345 9946461 13901570 25426347 24461456 1693514 -25313815
2361 -25313815 -37606749 -39392301 -44181223 -52597404 -59424860 -68008039 -80188959 -85508382
2353 -85508382 -80092100 -83282276 -111219133 -143071689 -141255487 -101972815 -57550521 -27566549
2345 -27566549 2254390 43844160 78455436 82694973 62685393 41606703 26414658
2338 26414658 7996292 -13218341 -23315623 -16406721 -2818221 7990663 19637611
2331 19637611 37754292 55732369 60083013 47958158 33701640 36185685 60270938
2324 60270938 91450385 109577744 107604939 95200476 84750278 78386091 71078839 61778371
2316 61778371 55221106 53146434 49721033 39071145 24550276 16026963 17584905 21824398
2308 21824398 18932783 8102998 -5133953 -20787880 -44526038 -72456694 -84839033
2301 -84839033 -64972818 -21543473 17549423 34026421 33555551 30389798 27978809 20740470
2293 20740470 7571022 -5251065 -12097109 -11751723 -4122892 10166079 25873020 33969443
2285 33969443 28877359 12984749 -6151535 -20932305 -27660397 -29837308 -36517978 -51308800
2277 -51308800 -63172142 -56511085 -32509712 -10141031 -498895 7317500 22992410 30544028
2269 30544028 8990963 -27328835 -35961294 276259 51966641 86498136 107387925
2262 107387925 130672924 146008187 132487027 99703890 78056612 71874534 56626657
2255 56626657 25678002 5602798 14536373 36137480 50035614 60128626 73513185
2248 73513185 76966896 59091107 36403852 31104603 36912651 32477164 17158195 6993195
2240 6993195 2957567 -10226616 -37106935 -66691907 -91640198 -110186596 -112561733 -89597795
2232 -89597795 -54258781 -31425185 -25521073 -20555739 -12298548 -14810752 -30692496 -40363176
2224 -40363176 -30069017 -9153293 9543084 25742414 38282022 37028120 22974893
2217 22974893 19267943 44929683 87685297 116904020 117069506 99039771 84101850 82779125
2209 82779125 84016316 65359853 22998863 -13263117 -12745574 12067746 19300388 -3616660
2201 -3616660 -25739906 -24726762 -17998531 -23588993 -24675416 -3741877 14701940 -6341505
2193 -6341505 -58941725 -99613887 -108835954 -106013421 -107183685 -102356386 -80752070 -50199712
2185 -50199712 -22345522 -137600 12607093 8685106 -7677549 -19946458 -20189610 -16988817
2177 -16988817 -17777459 -17527849 -10364920 -135240 5149914 -164446 -18303222 -41832716
2169 -41832716 -51434680 -36409329 -15941126 -20164708 -48377533 -67303482 -55922974
2162 -55922974 -30292685 -15136798 -12257983 -10547828 -8584873 -9771701 -8361432 1121706
2154 1121706 8248228 -2690750 -29566636 -52792814 -57598110 -47178560 -35171495 -31099252
2146 -31099252 -31460254 -22378005 5238124 42742301 72258149 86165712 86925110 70522701
2138 70522701 30368057 -17861869 -39026911 -20779364 6199518 8883960 -3642022
2131 -3642022 298667 23590509 37608553 27913572 13823596 16247390 29533777 36154664
2123 36154664 31390742 20491985 4841545 -14100230 -24985524 -16036726 6744134
2116 6744134 22191576 17303790 1444652 -5189974 7105602 30520125 50581978 58681154
2108 58681154 53189799 34525411 6527483 -18192796 -23456329 -5624305 19873753
2101 19873753 33058214 27378174 9866995 -10600435 -27628512 -34040029 -25279826 -8042663
2093 -8042663 2630840 -686168 -9322242 -10153455 -2893526 -1041824 -15307315 -39221681
2085 -39221681 -53603492 -45161657 -19290833 5317293 12218328 -2741868 -31101327
2078 -31101327 -56132829 -61101553 -41128462 -7551194 24234629 49484320 70425113
2071 70425113 81899185 73565191 48479402 26501154 21891261 26245892 21102729 839230
2063 839230 -23767915 -39050611 -39110545 -27531653 -13319195 -1299701 14460890 40027853
2055 40027853 64666903 68818963 53750256 46169796 61531288 78191039 65873569
2048 65873569 29498710 3682842 6484487 17670371 6377902 -31638678 -67814840
2041 -67814840 -66520518 -19640338 39734567 65417804 46325272 15856500 5289485
2034 5289485 5355593 -8824548 -33100522 -42960243 -36000315 -32338703 -34569015 -21421273
2026 -21421273 12407974 41441573 46291704 38686314 35914699 34381421 24595452 11504109
2018 11504109 2943461 -4013499 -9204620 -467415 23634885 39872963 28861449 1496818
2010 1496818 -23231985 -48977602 -84097197 -107562032 -86669792 -26621609 27249288
2003 27249288 41098809 24059158 5119255 365141 8822247 21451174 25997824 16830494
1995 16830494 5657054 10343692 30607008 48763105 56277470 62334583 71592250 72308689
1987 72308689 56254115 34378482 20449557 11535127 -3041951 -23997863 -45517410
1980 -45517410 -66115308 -82427610 -82070768 -60618226 -40156132 -50185045 -88136007
1973 -88136007 -117506621 -112104308 -86143379 -69384689 -66133602 -56817594 -34551333 -19188413
1965 -19188413 -29435215 -56542976 -76651163 -79638705 -73168518 -64050503 -50620781 -33679630
1957 -33679630 -21099669 -16815723 -15319957 -12417277 -12850650 -21105330 -31968327 -37396282
1949 -37396282 -37825263 -40401103 -49627279 -64251179 -79238353 -87118491 -82283863 -67268465
1941 -67268465 -49371663 -29352707 -2209017 27738548 44032710 37480816 18600747
1934 18600747 3389485 -3178837 -2318701 6238473 15226452 6306281 -28075413 -68011909
1926 -68011909 -86629607 -79059145 -56834673 -25682730 11168326 38796081 45428523
1919 45428523 45370221 59920836 78545220 69380707 30777432 174155 1137060 10762781
1911 10762781 -3437539 -37610867 -61978617 -59915818 -37815621 -9419220 11351793
1904 11351793 11766775 -7986013 -29100340 -32019699 -15769061 6567226 22318651 22941272
1896 22941272 6025993 -16954691 -26537037 -18414904 -9549314 -13396747 -23199173 -29007746
1888 -29007746 -34297599 -42252176 -41811945 -23793440 3002866 28044298 56633305 92404782
1880 92404782 116701561 108594344 76247758 46519490 30847492 21711984 14110330 8077613
1872 8077613 -2714151 -21526675 -33784078 -24786770 -5613831 3077619 5402522 19510927
1864 19510927 38592386 36808424 13682812 -4008248 -9764981 -27887769 -63075455
1857 -63075455 -77886796 -45114267 6695769 28324397 9655083 -22358588 -47331860
1850 -47331860 -63227366 -66092049 -49319761 -22135890 -4803961 -2970155 -3672892 2592839
1842 2592839 10961060 14106891 11692176 5646823 -4469987 -19399084 -38031091 -55105223
1834 -55105223 -58867326 -40083618 -9358368 6434782 -4248407 -20953157 -19490333
1827 -19490333 -4805216 2763222 3619780 16158009 40449551 51609637 36621140 16008314
1819 16008314 16397993 36153748 50691210 41539374 8827041 -36146506 -77802265 -100686764
1811 -100686764 -100045465 -88542106 -83735672 -87443790 -83978905 -60934102 -26897134 -5300561
1803 -5300561 -12451066 -43272737 -76967241 -94296571 -89741072 -69970949 -43869491 -15422593
1795 -15422593 14481894 41439995 55948735 51650655 35011379 22360396 24410669
1788 24410669 36779355 48651694 55961725 60195747 59213159 49902895 39511474 42846959
1780 42846959 63453754 85163516 87829327 67295163 36981699 14414567 8189985
1773 8189985 12659232 13056632 1087310 -13155558 -11377206 8744713 26881443 21596796
1765 21596796 -6463691 -36003382 -46462300 -38172640 -34744335 -60745859 -109474086
1758 -109474086 -140296611 -122171581 -73637497 -40073947 -35492123 -32940358 -13450508
1751 -13450508 8142449 17411638 27063944 47395608 58103429 38804723 7219533
1744 7219533 -4657952 1910533 226423 -17440657 -35376199 -46403981 -55190956 -54227109
1736 -54227109 -30728248 2845775 18554032 15091151 16514676 25698949 16921010 -14435638
1728 -14435638 -32873271 -13691306 18316050 25157380 6214163 -12019444 -16925720
1721 -16925720 -15320923 -12266251 -7549701 -4027330 -2176790 3342207 8343990 -3840437
1713 -3840437 -33722241 -52218759 -37567323 -9621220 -1808652 -11622554 -7986784 19052760
1705 19052760 45950050 52823544 45915140 37913847 28359352 12542808 -5126137 -14990108
1697 -14990108 -12050692 -512182 5833991 -6775630 -32612134 -44782058 -26417635
1690 -26417635 5190106 22112249 23847610 30221553 43838061 46937232 35112215 26528288
1682 26528288 32098592 40909738 42703927 41556678 37471009 17048961 -23160786 -61654229
1674 -61654229 -75193605 -64431801 -45450403 -29209980 -19768659 -18438252 -17909075 -5808961
1666 -5808961 14205343 18963676 -4071292 -37517697 -58423421 -66214436 -70028264 -65380581
1658 -65380581 -47040351 -32706774 -45605281 -77485275 -95477056 -86654291 -71289922
1651 -71289922 -67398970 -65386453 -48096492 -18736583 2957228 1969739 -21880417 -54879409
1643 -54879409 -74617914 -65205211 -34909322 -11040279 -12177518 -32360834 -54184553
1636 -54184553 -66371451 -65302350 -52438190 -37082436 -30702973 -32032526 -28654663 -18818136
1628 -18818136 -17581990 -32508610 -47942526 -46105512 -31072343 -17760777 -9760215 -4979910
1620 -4979910 -11109516 -33648732 -56345165 -56927309 -38107731 -19450287 -2306953 28403142
1612 28403142 65940772 78286983 55340753 30343369 34727485 55148532 58582350
1605 58582350 41165463 25319736 21457263 21383693 23384655 35216573 51455639 52611301
1597 52611301 31857737 4321039 -13600646 -18078682 -10580819 4691624 14284287 5887611
1589 5887611 -10901820 -13043641 3058359 17993069 23629647 35947248 61915524 78451958
1581 78451958 64236906 34136324 19847999 29224942 46535725 62547337 80448991
1574 80448991 96999345 101004691 91408030 79305709 71131403 64351288 58824534 57460231
1566 57460231 56346008 49397794 42621470 47868318 60701423 60324403 36816764 6804142
1558 6804142 -2926729 19879751 64057163 101195834 103699298 70929601 37004729 37403934
1550 37403934 66565502 84309770 66198353 29155803 1386159 -13740680 -31462051
1543 -31462051 -57831616 -83416077 -97816190 -98827971 -90640750 -79301427 -65735009
1536 -65735009 -41467771 -610106 41776330 57498834 38906648 11693346 4147438
1529 4147438 14974643 22142831 12200750 -11679957 -40035738 -60487533 -59409860 -36930927
1521 -36930927 -15171660 -15516324 -31036451 -37238821 -27720232 -21399847 -32258064 -48568494
1513 -48568494 -49536870 -31851059 -12198582 -9048552 -26252164 -50697048 -64343583 -61591584
1505 -61591584 -53477733 -51328826 -51849345 -46789385 -41827476 -51719594 -76246067 -94533437
1497 -94533437 -88144943 -60467135 -29225556 -8522194 -2312866 -6566776 -11472228 -7792905
1489 -7792905 2866498 8180464 -422569 -17327985 -29545527 -29295069 -17567197 -1094547
1481 -1094547 10982126 13482488 12163080 18288136 31807062 36896151 21279709 -5769704
1473 -5769704 -24071659 -28222794 -32006339 -45932722 -60516322 -58521867 -38600875 -18151885
1465 -18151885 -12015968 -15428721 -13466460 -3636578 227721 -10482901 -22521335 -15475627
1457 -15475627 10033339 30896303 31286468 22891127 27086061 44534830 55176951 47298348
1449 47298348 33223705 29881449 33274851 23623654 -6349966 -39407680 -53464017 -45433654
1441 -45433654 -30092997 -21230341 -21372468 -26524537 -32228974 -35450741 -38166589 -48808407
1433 -48808407 -71713903 -94736105 -97192148 -72501361 -33215920 8298356 50587733
1426 50587733 89292515 109750657 106990027 99128256 102308510 102668472 76501052 33576666
1418 33576666 13483729 34167769 68091051 79921035 67978574 54823534 53407605
1411 53407605 59027679 62790362 56166352 31288972 -5747724 -28332460 -14770447 21873731
1403 21873731 46857587 46780999 41564035 49379263 58067076 44246727 10316786 -13695165
1395 -13695165 -5801134 20755796 31800890 10878753 -22671698 -37557863 -27548657
1388 -27548657 -15018160 -17351873 -24214440 -18260113 -6273648 -10945676 -34986413 -53681662
1380 -53681662 -47945599 -27698317 -13251254 -7500350 280170 12057016 17502033 10586015
1372 10586015 -2049436 -10168366 -9471801 -818078 14669526 38017012 70958163 109638007
1364 109638007 139164475 141787596 116190091 82920934 63874302 61231278 63095339
1357 63095339 62668404 61275713 57932487 49219873 37827566 29120390 20268993 4699183
1349 4699183 -14009114 -25745433 -29842535 -32089716 -27233057 -4646427 25804872 36836693
1341 36836693 21751506 6724253 11717096 21805217 16233656 3897978 3560237 6356521
1333 6356521 -9457248 -36206613 -43611972 -25048742 -3421631 10567802 31374645
1326 31374645 62193924 79377758 68137616 45769367 32889801 26662327 19479910
1319 19479910 18901365 28453649 31844117 19457890 9621860 18474056 28446580 15214020
1311 15214020 -11052777 -23029844 -21741809 -30874550 -53508075 -68176025 -64410035 -50617984
1303 -50617984 -29628338 987094 25597468 22045248 -1148340 -12884287 -7926105
1296 -7926105 -11021914 -27059220 -27997892 -3170047 18235607 16416127 14950066 38080234
1288 38080234 67601099 74881725 67563265 68780062 73882595 66795695 60267707 76972075
1280 76972075 102250484 99856104 70965884 54635252 66678996 79002049 69107032
1273 69107032 52555968 50188764 54312995 47328459 30276354 13321059 -3127451 -18496530
1265 -18496530 -18953920 4829220 35622382 44179118 23569724 -3363362 -9862277 8956733
1257 8956733 34635218 44854022 34807346 18838177 9278817 971632 -14049927 -25207575
1249 -25207575 -14744115 12409750 30677777 27895700 17210099 10654040 2399180 -12959849
1241 -12959849 -26046352 -29174348 -29740784 -33823097 -32435488 -18756955 -4800123 -5684210
1233 -5684210 -19771602 -38485340 -61559663 -85620164 -91744123 -66093369 -24439133
1226 -24439133 4389353 13596742 18610546 28944379 39587773 45161865 42447638 22934011
1218 22934011 -16139943 -55715098 -71096595 -63361198 -54030940 -50159374 -38734965 -16909108
1210 -16909108 -939764 1984514 5500150 17124833 23266390 14648106 4715083 6516545
1202 6516545 11586901 10585072 15379128 36708379 55601112 45839338 16942765 5597021
1194 5597021 24858542 47685331 44138217 12330598 -31794896 -72684677 -95298702
1187 -95298702 -88669856 -62140655 -41875498 -39354569 -39092212 -30064400 -29923371 -56002938
1179 -56002938 -86504651 -80484244 -34516611 9374970 19188625 10812070 16742231 38792384
1171 38792384 53720789 52701304 49817786 55220180 64543688 77762017 104064818 136701398
1163 136701398 143768876 103921251 40675726 918235 2430636 19566943 19413965 -5012803
1155 -5012803 -38717908 -63691520 -67711955 -49718726 -25416448 -15342984 -19081452 -14538636
1147 -14538636 7229526 22744657 9263986 -16358534 -17766849 6405678 16770717
1140 16770717 -11879977 -55666197 -76217660 -70079936 -63005546 -67424149 -69993109 -59612445
1132 -59612445 -45565636 -40658139 -41478339 -36328077 -25069892 -20169858 -29117583 -43385133
1124 -43385133 -47559067 -36497260 -19957408 -9402929 -3482254 8255861 27450447
1117 27450447 40734988 36970683 24410311 20811434 28062732 27797350 6391105 -23863126
1109 -23863126 -36080444 -18557064 12849304 31778319 25873465 2702601 -24350257
1102 -24350257 -49884034 -74144588 -91761488 -90388800 -62862249 -16535060 31946027
1095 31946027 67867277 83293112 77280014 57231417 37076087 28528984 34172328 49452928
1087 49452928 66620339 76029086 72893136 66731282 72258831 83402753 71595778 24906101
1079 24906101 -25944194 -43737751 -36222817 -41294874 -64764375 -69612002 -35663290 6014421
1071 6014421 17413296 1843250 -16681137 -35151519 -60544967 -77271723 -63497426
1064 -63497426 -30951384 -12613467 -13583696 -7448369 18442066 46936636 63388205 71270035
1056 71270035 69403574 47519283 16059782 6919216 26709494 39658610 18917761
1049 18917761 -13187406 -22690683 -16274856 -22609153 -39653475 -38596954 -13060514 11449208
1041 11449208 17401240 13301615 8339329 -2530348 -21100259 -38474821 -53974769 -78963407
1033 -78963407 -111028260 -124848840 -103111424 -61842853 -31972503 -27270921 -40997672
1026 -40997672 -61650808 -79329767 -86217764 -83312377 -80372533 -80758429 -74874035 -56745930
1018 -56745930 -36050697 -23146052 -13872353 -2447248 2957071 -4049735 -6690098 16795815
1010 16795815 56564371 77471795 64942386 40756329 25907187 12628322 -11373090
1003 -11373090 -33013533 -32067975 -15752928 -8360861 -12580420 -9386761 2678466 -1984093
995 -1984093 -34807486 -67644053 -67871692 -41769998 -21511394 -20485011 -24136667 -18179210
987 -18179210 -2171820 22436778 53273522 73609907 62181968 24367928 -7736064
980 -7736064 -16969630 -23078538 -49564386 -87079089 -108046395 -104168766 -90059579 -78930033
972 -78930033 -72826559 -69327178 -60632363 -33870391 9468572 42649692 43440972 28201090
964 28201090 32268485 60054642 81221012 76781929 60290900 47182263 32140190 10169377
956 10169377 -5352028 -4448405 -1948367 -18269406 -51892512 -86272003 -110649361 -119062372
948 -119062372 -104103505 -71272136 -47727545 -55415136 -82207281 -98058552 -92986374
941 -92986374 -80740925 -71823153 -63581849 -53394593 -41734278 -24244343 303547 16668335
933 16668335 8466057 -13841339 -22303003 -11084654 -4277308 -18282553 -37971939 -39955311
925 -39955311 -21117222 6461741 31453594 41819427 24342995 -17351667 -55197300
918 -55197300 -63527635 -47209402 -30436262 -24904943 -22613897 -13835344 3103767 27497860
910 27497860 57524575 84540635 96142521 86886893 60898366 26849760 -2322295
903 -2322295 -9035778 17094176 63740045 99433269 97923894 59958535 12975039 -10757685
895 -10757685 -1554036 19108076 22788694 7767171 -2069068 4984189 9393604 -7210462
887 -7210462 -26857933 -17058802 18382443 38072336 17345121 -19981673 -35439984 -22763555
879 -22763555 -5705877 -2071606 -7370454 -8511318 1660196 22575558 47315970 65229850
871 65229850 71269941 72791483 80357476 92301715 95386610 81522963 57794427 38061290
863 38061290 28978157 26249558 21330710 9015929 -10428338 -33603404 -55743732 -69793348
855 -69793348 -67789836 -48422420 -22489122 -5063602 -928167 -2364613 -1532532 1682325
847 1682325 5240219 9262338 10165895 -887806 -26226010 -54640931 -73462970 -81175668
839 -81175668 -79834603 -63613773 -29552128 4516252 11431532 -11007327 -31667038 -21146749
831 -21146749 13531647 38375737 31126654 1865226 -22239242 -24174689 -7601111 14232874
823 14232874 34555156 55324187 74995148 81816325 66774833 39603785 21402889
816 21402889 20513498 25667502 25016591 19881361 13869716 1529313 -19472072 -33182130
808 -33182130 -18696111 21576944 59548232 69714219 50915350 19218074 -9910204
801 -9910204 -28055086 -32476281 -27108516 -21574222 -22953633 -29414700 -34650919 -35915248
793 -35915248 -34454416 -30562380 -22315381 -8777975 8000757 24324964 37800132 49875763
785 49875763 64584600 81872603 93135903 88827388 71803771 57064257 54651903 58219650
777 58219650 55559262 45558423 37936271 39588090 48686881 59645871 65250180 56175827
769 56175827 30432382 4562982 1566473 21062166 34350916 20213556 -5576654
762 -5576654 -12379891 1664048 9832373 543625 -3302415 20455783 57940293 76905224
754 76905224 68296481 50869568 40096570 32922565 24446035 20784814 27322339 36271858
746 36271858 35076713 21409350 4502922 -4270968 -641339 6927722 1435955 -23497787
738 -23497787 -48491557 -44950004 -10282279 26439984 39539196 32832694 21566314 4873732
730 4873732 -25473712 -58953737 -71992238 -60447463 -47495450 -52816464 -67339547 -67569732
722 -67569732 -47530185 -27048204 -28527378 -50270440 -66581169 -56347177 -28327765
715 -28327765 -10833761 -17445226 -34726014 -45913527 -49813005 -47237744 -28377474 6920700
707 6920700 31692249 21326324 -7179815 -13788306 9497294 32444078 37431335 42381635
699 42381635 61234930 74205454 59158521 27959125 6979358 438730 -1527046 4722708
691 4722708 25978913 45386107 38580479 13526497 3191615 16171938 24649793 9828645
683 9828645 -8718739 -4550643 17157089 33082162 38986757 50401660 71595021 85905836
675 85905836 81156670 68917617 68523040 79280312 80023586 57190518 23962287 3796564
667 3796564 -549259 -9521522 -36068224 -65068208 -72264268 -54234238 -27519764 -4933702
659 -4933702 12266943 21994153 18421275 4435561 -6972208 -8999688 -8492341 -13568005
$$ [...]
##END NTUPLES=NMR SPECTRUM
##END=
