##TITLE=31Pdec_DE-44EA3_D2O
 D2O, 64 sc
 12.7.2024
##JCAMPDX= 6.0         $$ Bruker NMR JCAMP-DX V2.0
##DATA TYPE= NMR SPECTRUM
##DATA CLASS= NTUPLES
##ORIGIN= UXNMR, Bruker Analytische Messtechnik GmbH
##OWNER= root
$$ XWIN-NMR		Version 3.5
$$ Fri Jul 12 14:29:32 2024 Russian Standard Time (UT+4h)  she@DPX200
##.OBSERVE FREQUENCY= 81.013821
##.OBSERVE NUCLEUS= ^31P
##.ACQUISITION MODE= SIMULTANEOUS
##.ACQUISITION SCHEME= undefined
##.AVERAGES= 64
##.DIGITISER RES= 17
##SPECTROMETER/DATA SYSTEM= spect
##.PULSE SEQUENCE= zgpg30
##.SOLVENT NAME= CDCl3
##.SHIFT REFERENCE= (INTERNAL, CDCl3, 0, 198.062)
##AUDIT TRAIL= $$ (NUMBER, WHEN, WHO, WHERE, WHAT)
$$ ##TITLE= Audit trail, XWIN-NMR		Version 3.5
$$ ##JCAMPDX= 5.01
$$ ##ORIGIN= Bruker BioSpin GmbH
$$ ##OWNER= she
$$ F:/spectra/data/she/nmr/P31/2/pdata/1/auditp.txt
$$ ##AUDIT TRAIL=  $$ (NUMBER, WHEN, WHO, WHERE, WHAT)
(   1,<2024-07-12 14:28:17.18 +0400>,<she>,<DPX200>,
      <created by zg, POWCHK disabled, PULCHK disabled
       configuration hash MD5:
       00 E9 B6 7A A2 85 ED C7 34 08 36 98 17 FE 4E 26
       data hash MD5: 32K
       8A 4C 39 53 B5 15 A6 CA 97 05 B3 54 5E 2E D4 12>)
(   2,<2024-07-12 14:28:19.92 +0400>,<she>,<DPX200>,
      <Start of raw data processing
       efp BC_mod = 2 LB = 1.5 FT_mod = 6 PKNL = 1 PHC0 = 2592.326 PHC1 = 208.287 SI = 64K 
       data hash MD5: 64K
       80 9F DA E3 41 42 F8 E7 1D 5A 28 90 EB 9C 96 CB>)
(   3,<2024-07-12 14:28:38.25 +0400>,<she>,<DPX200>,
      <pk PHC0 = -4.09628 PHC1 = 8.599999 
       data hash MD5: 64K
       D9 BC 93 E6 33 BE 9B 05 15 55 91 77 E7 53 70 CB>)
(   4,<2024-07-12 14:28:44.87 +0400>,<she>,<DPX200>,
      <abs ABSG = 5 
       data hash MD5: 64K
       0E BB 45 45 9A 99 F7 0D 5B 77 86 BC 73 CF A3 73>)
$$ ##END=
$$ 
$$ hash MD5
$$ A0 FA 96 79 FE D4 94 35 2E EA EA 8B D9 35 30 5A
##$RELAX= 
##$RELAX= 
##$RELAX= 
##$RELAX= 
##$RELAX= 
##$RELAX= 
##$RELAX= 
##$RELAX= 
$$ Bruker specific parameters
$$ --------------------------
##$DU= <F:/spectra>
##$EXPNO= 2
##$NAME= <P31>
##$PROCNO= 1
##$TYPE= <nmr>
##$USER= <she>
##$AMP= (0..31)
100 100 100 100 100 100 100 100 100 100 100 100 100 100 100 100 100 100 
100 100 100 100 100 100 100 100 100 100 100 100 100 100 
##$AQSEQ= 0
##$AQ_mod= 1
##$AUNM= <au_zg>
##$AUTOPOS= <>
##$BF1= 81.014009
##$BF2= 200.13
##$BF3= 200.13
##$BF4= 200.13
##$BF5= 200.13
##$BF6= 200.13
##$BF7= 200.13
##$BF8= 200.13
##$BYTORDA= 1
##$CFDGTYP= 0
##$CFRGTYP= 5
##$CHEMSTR= <none>
##$CNST= (0..31)
1 1 145 1 1 1 1 1 1 1 1 1 1 1 1 1 1 1 1 1 1 1 1 1 1 1 1 1 1 1 1 1 
##$CPDPRG= <waltz16>
##$CPDPRG1= <>
##$CPDPRG2= <waltz16>
##$CPDPRG3= <>
##$CPDPRG4= <mlev>
##$CPDPRG5= <mlev>
##$CPDPRG6= <mlev>
##$CPDPRG7= <mlev>
##$CPDPRG8= <mlev>
##$CPDPRGB= <>
##$CPDPRGT= <>
##$D= (0..31)
0 1 0 0 0 0 0 0 0 0.06 0 0.03 2e-05 3e-06 0 0 0.0002 0 0 0 0 0 0 0 0 0 
0 0 0 0 0 0 
##$DATE= 1720780096
##$DBL= (0..7)
120 120 120 11 120 120 24 19 
##$DBP= (0..7)
150 150 150 150 150 150 150 150 
##$DBP07= 0
##$DBPNAM0= <>
##$DBPNAM1= <>
$$ [...]
##$SUBNAM3= <"">
##$SUBNAM4= <"">
##$SUBNAM5= <"">
##$SUBNAM6= <"">
##$SUBNAM7= <"">
##$SUBNAM8= <"">
##$SUBNAM9= <"">
##$SW= 400.765351723535
##$SWIBOX= (0..15)
0 1 3 0 0 0 0 0 0 0 0 0 0 0 0 0 
##$SW_h= 32467.5324675325
##$TD= 32768
##$TD0= 1
##$TE= 0
##$TE2= 300
##$TE3= 300
##$TEG= 300
##$TL= (0..7)
0 120 53 12 22 120 120 120 
##$TP= (0..7)
150 150 150 150 150 150 150 150 
##$TP07= 0
##$TPNAME0= <>
##$TPNAME1= <>
##$TPNAME2= <>
##$TPNAME3= <>
##$TPNAME4= <>
##$TPNAME5= <>
##$TPNAME6= <>
##$TPNAME7= <>
##$TPOAL= (0..7)
0.5 0.5 0.5 0.5 0.5 0.5 0.5 0.5 
##$TPOFFS= (0..7)
0 0 0 0 0 0 0 0 
##$TUNHIN= 0
##$TUNHOUT= 0
##$TUNXOUT= 0
##$USERA1= <user>
##$USERA2= <user>
##$USERA3= <user>
##$USERA4= <user>
##$USERA5= <user>
##$V9= 5
##$VALIST= <valist>
##$VCLIST= <CCCCCCCCCCCCCCC>
##$VD= 0
##$VDLIST= <DDDDDDDDDDDDDDD>
##$VPLIST= <PPPPPPPPPPPPPPP>
##$VTLIST= <TTTTTTTTTTTTTTT>
##$WBST= 1024
##$WBSW= 4
##$XGAIN= (0..3)
0 0 0 0 
##$XL= 0
##$YL= 0
##$YMAX_a= 3734
##$YMIN_a= -5759
##$ZGOPTNS= <>
##$ZL1= 120
##$ZL2= 120
##$ZL3= 120
##$ZL4= 120
##$ABSF1= 198.0616
##$ABSF2= -202.7028
##$ABSG= 5
##$ABSL= 3
##$ALPHA= 0
##$AQORDER= 0
##$ASSFAC= 0
##$ASSFACI= 0
##$ASSFACX= 0
##$ASSWID= 0
##$AUNMP= <proc_1d>
##$AZFE= 0.1
##$AZFW= 0.5
##$BCFW= 0
##$BC_mod= 2
##$BYTORDP= 0
##$COROFFS= 0
##$CY= -3
##$DATMOD= 1
##$DC= 0
##$DFILT= <>
##$DTYPP= 0
##$F1P= 0
##$F2P= 0
##$FCOR= 1
##$FTSIZE= 65536
##$FT_mod= 6
##$GAMMA= 0
##$GB= 0
##$INTBC= 1
##$INTSCL= 9.790993e-09
##$ISEN= 30
##$LB= 1.5
##$LEV0= 0
##$LPBIN= 0
##$MAXI= 10000
##$MC2= 0
##$MEAN= 0
##$ME_mod= 0
##$MI= 50
##$NCOEF= 0
##$NC_proc= -11
##$NLEV= 6
##$NOISF1= 182.463
##$NOISF2= 159.3651
##$NSP= 0
##$NTH_PI= 0
##$NZP= 0
##$OFFSET= 198.0616
##$PC= 4
##$PHC0= 2588.23
##$PHC1= 216.887
##$PH_mod= 1
##$PKNL= yes
##$PPARMOD= 0
##$PSCAL= 0
##$PSIGN= 0
##$REVERSE= no
##$SF= 81.0140089999434
##$SI= 65536
##$SIGF1= 159.3651
##$SIGF2= -187.1042
##$SINO= 113.3802
##$SIOLD= 16384
##$SREGLST= <1H.CDCl3>
##$SSB= 0
##$STSI= 65536
##$STSR= 0
##$SW_p= 32467.5324675325
##$SYMM= 0
##$S_DEV= 0
##$TDeff= 32768
##$TDoff= 0
##$TI= <>
##$TILT= no
##$TM1= 0
##$TM2= 0
##$TOPLEV= 0
##$USERP1= <user>
##$USERP2= <user>
##$USERP3= <user>
##$USERP4= <user>
##$USERP5= <user>
##$WDW= 1
##$XDIM= 65536
##$YMAX_p= 431251735
##$YMIN_p= -428359341
$$ End of Bruker specific parameters
$$ ---------------------------------
##NTUPLES= NMR SPECTRUM
##VAR_NAME=  FREQUENCY,     SPECTRUM/REAL,   SPECTRUM/IMAG
##SYMBOL=    X,             R,               I
##VAR_TYPE=  INDEPENDENT,   DEPENDENT,       DEPENDENT
##VAR_FORM=  AFFN,          ASDF,            ASDF
##VAR_DIM=   65536,         65536,           65536
##UNITS=     HZ,            ARBITRARY UNITS, ARBITRARY UNITS
##FACTOR=    0.49542278885378, 1,            1
##FIRST=     16045.7642231865, 0,            0
##LAST=      -16421.768244346, 0,            0
##MIN=       -16421.768244346, -428359341,   0
##MAX=       16045.7642231865, 431251735,    0
$$ Real data points
##PAGE= N=1
##DATA TABLE= (X++(R..R)), XYDATA
$$ [...]
42390c2529491P956585K1614229J6718611k0813518n5448222m3531240L944798
42383a02088248L3565872K0011818p235897j1744238L476349J1127455K185778
42376e0701111o567108k672991K163694r391928k9887571l0312011J006965L6432560
42368h9929501M1308883J9844353P013230J6809515K5145170J1082417j1695209
42361A9578858j9626089j2919570n738357j676178O56910n340841j9590209k3637022
42353f8292498p896688M774386r050271l1397478k6075184M813200K4534890J9756607
42345h8833036J5800775K8078819L7058978K6636326J3395116J5913844K1868803
42338F9919625J0877429r399346j5927938o717843o33396p665852j9605259k6301033
$$ y = [-32529491, -24572906, -2958677, 13759934, -7053584, -62501806, -106033046, -102088248, -68522376, -48510558, -55746455, -67490693, -64014344, -52886889, -50701111, -57268219, -59941210, -57777516, -67169444, -97057015, -127369026, -126362061, -89929501, -48620618, -28776265, -21763035, -4953520, 20191650, 31274067, 19578858, -47231, -12966801, -18705158, -20381336, -19724426, -25065267, -44655476, -68292498, -76189186, -71414800, -80465071, -111862549, -137937733, -133124533, -108589643, -88833036, -73032261, -44953442, -7894464, 18741862, 32136978, 48050822, 69919625, 80797054, 71397708, 55469770, 48751927, 48118531, 40452679, 20847420, -5453613]
42330e453613k4312297j2250058P673500K4880923K9209126K3134475J5897131
42323E8779187Q902093k590676j6078667k1599598j5265321m039392M335312R358150
42315B1801088J3791489J6218826J0504131o823588k7954752l5294716j7894680
42308b5652202J2970760L1722896K4863131L666756j1812262j4554508j2406185
42301H798386j4136287j9385337k0644259j2604860L62231Q429230R726751J2679374
42293b6774771J9082096J5010488q347966l3649497l5864962j6766069j61320
42286h7472001L778837N177095P220179J745955m917472N038460K3233529J6977983
42278b9217435j4925741k7302833L819576L6644379K4447455j1642794j8558170
$$ y = [-5453613, -29765910, -42015968, -34342468, -9461545, 19747581, 42882056, 58779187, 67681280, 65090604, 49011937, 27412339, 12147018, 8107626, 12442938, 21801088, 35592577, 51811403, 62315534, 55491946, 27537194, -7757522, -25652202, -12681442, 19041454, 43904585, 47571341, 35759079, 21204571, 8798386, -5337901, -24723238, -45367497, -57972357, -57610126, -49180896, -39454145, -26774771, -7692675, 7317813, -1030153, -34679650, -70544612, -87310681, -87472001, -83693164, -78516069, -71295890, -69549935, -74467407, -69428947, -46195418, -29217435, -44143176, -71446009, -67626433, -30982054, -6534599, -18177393, -36735563]
42271c6735563M178546J2026466m674796r418669R607913J7757809j236299j4315317
42263b2809910J50186R684015j7171270n1843724m5731979l386114K8633152L0013208
42255g2462436K0703571J5469884P751875k29665Q374099L0420150L5539072R571693
42247E5138243k0017515k0514711K820765J9229713J5166349L961318r26154j588797
42239E3269211k366922K339255J7133204L0636273K3599532o408140l6207259
42232H1995154l9340554j5613550P573949N187906j8158084l3974868k1208166
42225c3538213J0882597L1548175K0324732j0266945k6848142j2016515J5920485
42218c993826K5627374R819117j0236975j3890799j317273J5742806K8066123
$$ y = [-36735563, -32557017, -20530551, -25205347, -34624016, -25016103, -7258294, -8494593, -22809910, -22659724, -12975709, -30146979, -81990703, -127722682, -131108796, -102475644, -72462436, -51758865, -36288981, -28537106, -28766771, -20392672, 10027478, 45566550, 55138243, 35120728, 14606017, 17426782, 36656495, 51822844, 55784162, 54858008, 53269211, 50902289, 53241544, 70374748, 101011021, 124610553, 118202413, 81995154, 42654600, 27041050, 34614999, 39802905, 21644821, -12330047, -33538213, -22655616, 8892559, 29217291, 18950346, -7897796, -19914311, -3993826, 21633548, 31452665, 21215690, 7324891, 6007618, 21750424, 49816547]
42211D9816547K8764460J3831217q118975j8619495j1604542k209493m126750
42204D7732969j1002966j2432833j3880107k2484257k5545435p379781J9092829
42197b5899581K4730013P700607l405848M336368P620775j3400112l9774557l9784881
42189g7877216j3519038J2294370K3727072K9612656L6126545L5004763K0382942
42182F5752094j19821j5706596k1294779j5017001o74573O632786n981217k6393766
42174a2802873k5796566L127609L3636014M0089113K7509706J2288484p079843
42167G0971644l6997207o0340659n0732044j2509955K0844230L0555813K9313035
42160h895143K9531672K2868276M026428j0265909n399161O538631O488524k297602
$$ y = [49816547, 78581007, 92412224, 84293249, 65673754, 54069212, 51859719, 47732969, 36730003, 24297170, 10417063, -12067194, -37612629, -44992410, -25899581, -1169568, 6531039, 3125191, 7461559, 15082334, 1682222, -38092335, -77877216, -91396254, -79101884, -55374812, -25762156, 10364389, 45369152, 65752094, 65632273, 49925677, 28630898, 13613897, 12939324, 19572110, 13590893, -12802873, -38599439, -35471830, -1835816, 38253297, 65763003, 78051487, 70971644, 33974437, -26366222, -77098266, -89608221, -68763991, -38208178, -8895143, 20636529, 43504805, 47531233, 37265324, 31866163, 38404794, 44893318, 42595716]
42152D2595716n245699l058771m613056m925779M459520J1987955R44343j7614543
42144B4529686j7140826L65440N360468r698991j6411780J238627J7656124O106204
42136A2004952j8610245k4613554j0362183J085795K012805M604990J1586825
42129b2290615J0108422m425209k0409965k7691427k5358511j2564134R082371
42122i3549068K3503077J2459410j4173414k1159134P329605M2007558M3484210
42115i7756J2825046j1641557o290356Q189549j192126l0896486m3512760k0079757
42107i2696203J1354225J4411510l998408o400606J6888537L4562048K6183153
42100C04256J3569019K0372692K9388724J1600050k0846513k7615859Q0239K7643887
$$ y = [42595716, 37350017, 34291246, 29678190, 24752411, 29211931, 41199886, 42144229, 24529686, 7388860, 7754300, 13114768, 3415777, -12996003, -11757376, 5898748, 12004952, -6605293, -31218847, -41581030, -40495235, -38482430, -33877440, -22290615, -12182193, -16607402, -37017367, -64708794, -90067305, -102631439, -93549068, -70045991, -57586581, -71759995, -92919129, -85589524, -43581966, -97756, 12727290, 1085733, -5204623, 2984926, 1792800, -29103686, -72616446, -92696203, -81341978, -66930468, -70928876, -77329482, -60440945, -25878897, 304256, 13873275, 34245967, 63634691, 75234741, 54388228, 26772369, 26852608, 54496495]
42092E4496495K7364168J0118712p46100j532628k484799q266587j5299005j7118503
42084D6531753p265034J2241911K5144162J7848525O65573n408934j291079o723220
42076H1743657k3322673k7173390p139834J3584633Q500789j7241383l6615526
42069g663727l2539171r831582J3144746J8350742M927912o545466j038818M712111
42061a6483253j2308968l4627419k0905184K5409628M8762623K1569899j3095722
42054a678396r755720J0303279J710053k6446841k8765428j317129J5188790M652198
42046c6109194n342086K036295Q134368M12801m049270N964041J2405607j12940
42038a6660378j7549938k0785873j2962184m939054N033516J9602929K8767098
$$ y = [54496495, 81860663, 91979375, 91233275, 89700647, 87215848, 78949261, 63650256, 46531753, 39266719, 51508630, 76652792, 94501317, 95166890, 89757956, 88466877, 81743657, 58420984, 31247594, 24107760, 37692393, 46193182, 28951799, -7663727, -40202898, -50034480, -36889734, -18538992, -13611080, -20156546, -21195364, -16483253, -28792221, -63419640, -84324824, -58915196, -10152573, 11417326, -1678396, -11434116, -1130837, 579216, -25867625, -54633053, -55950182, -40761392, -36109194, -41451280, -39414985, -31280617, -30867816, -34917086, -28953045, -16547438, -16660378, -34210316, -54996189, -67958373, -72897427, -67863911, -48260982, -19493884]
42031a9493884K4868211J6235222J2239587Q892730M51567r240013j6057509k0178795
42023b282884j4629369R718764L8722683L9573252N826106k6192765k4586796
42016B6148991k610341R110438P824687Q823109J0228147K38250j3240045j3245913
42008C3277323o020383j0123311j8929571q533881J7785746K8751989J3932906
42001E0140818j216432P38428M268341l767605o003862J3571090L5069280K9721031
41993A22521089M651012r733800o685106o730603j8621946k6963555k1348970
41986C7088121j0850756l315760M911665R871062l942499l3206555m4453870j5578154
41978e9476746K7284433L9869111J7218082o073732r015309p663483j9674455
$$ y = [-19493884, 5374327, 21609549, 33849136, 42741866, 43193433, 33953420, 17895911, -2282884, -16912253, -7193489, 31529194, 71102446, 76928552, 50735787, 26148991, 23538650, 32649088, 40473775, 49296884, 59525031, 59763281, 46523236, 33277323, 27256940, 17133629, -1795942, -10329823, 7455923, 36207912, 50140818, 48924386, 49662814, 53931155, 50163550, 44159688, 57730778, 92800058, 122521089, 127172101, 117438301, 110753195, 104022592, 85400646, 58437091, 37088121, 26237365, 22921605, 27833270, 37704332, 33761833, 555278, -43898592, -59476746, -32192313, 7676798, 24894880, 18821148, 9805839, 2142356, -17532099]
41971a7532099l3273656k7488106m790473J4774766K1520227K1653316K0821736
41964d314289J6752258P058676n178523j3634819j3236927o339817m691318j5549996
41956c9134755k5279454j2684329J6921365L1586505J7163168j088846J341886
41949a1174460J0842733M999502l206517J2269792L8613715L8659879J2977167
41942A03981811N99503J2395511J2202104j8541214m3742423k9366641J390090
41935C8918741O616186r926009j4261133j601074M035222j148842K797721J4672838
41927D0103650P230129k2913387l9024032j7298729J3777155J2980466j4230195
41920a9374943k5404420l153220K1676626J5459496j2173402k5263367j3030827
$$ y = [-17532099, -50805755, -78293861, -83084334, -68309568, -46789341, -25136025, -4314289, 12437969, 19496645, 14318122, 683303, -12553624, -18893441, -23584759, -39134755, -64414209, -77098538, -60177173, -28590668, -11427500, -12516346, -11174460, -331727, 4667775, 1461258, 13731050, 52344765, 91004644, 103981811, 104581314, 116976825, 129178929, 110637715, 66895292, 37528651, 38918741, 45534927, 35608918, 21347785, 19746711, 23781933, 22633091, 25430812, 40103650, 47333779, 24420392, -14603640, -31902369, -18125214, -5144748, -19374943, -44779363, -47932583, -26255957, -10796461, -22969863, -48233230, -61264057]
41913f1264057m98396n283301q942062J0782114L7610356L5954152O067409j3414225
41905A011990k843526J1776616L531335j5015224j8416702r186496m258154j311887
41897c4712048R819838J7126870K089920k2562131k4459808R68022K4867336K6899667
41889C7666J4745143J070539j0654437j4451246l475663J1873632J3087324M446797
41881A6679755P495194K0544562J5358345j5773959m1668244l7074145j6658986
41874e1097478m372957L373179J8200261K7212125J2476908j1024735j0937626
41867a6170323J2826249K4851766M990953k2947744k4294975J406395K2367022
41860C029343J4756667j1090432k5813350j5299380O169100J5963589Q462516
$$ y = [-61264057, -61762453, -67045754, -75987816, -65205702, -27595346, 8358806, 14426215, 1011990, -1831536, 9945080, 13476415, -1538809, -19955511, -29142007, -33400161, -34712048, -24892210, -7765340, -5675420, -28237551, -52697359, -51729337, -26862001, 37666, 14782809, 15853348, 5198911, -9252335, -12727998, -854366, 12232958, 16679755, 24174949, 44719511, 60077856, 44303897, 2635653, -34438492, -51097478, -55470435, -52097256, -33896995, -6684870, 5792038, -5232697, -16170323, -3344074, 21507692, 26498645, 3550901, -20744074, -19337679, 3029343, 17786010, 6695578, -19117772, -34417152, -28248052, -12284463, -3821947]
41853c821947m024240q205060M72492J8449980L3713250L0773921Q490184j3046634
41845F2801946j7068827j2989029j6897816k0648765p459906J0294525M970682
41838C002810j5692250j3452446J6565341L1556907R836817j0730319N341375
41831B6428235L0621687J9055668j8861236l4550531j7127547J37671J499652
41824G203599O257396K1413365K3386165M4255k5974195l1443735k0835087p160681
41816b7108918P934927K0717998J7898335k01605j0245840K876669K2508251K3929445
41808E8309262O745935j1188909j8538998j4982221l818183N633831Q6936j8702247
41800C545406k7845591j1684305J3158816J7989603Q19941j2970378o756512P773838
$$ y = [-3821947, -7846187, -16051247, -15578755, 2871225, 36584475, 67358396, 75848580, 62801946, 45733119, 32744090, 15846274, -4802491, -12262397, -1967872, 3002810, -12689440, -26141886, -9576545, 21980362, 31817179, 21086860, 26428235, 57049922, 76105590, 57244354, 22693823, 5566276, 5703947, 7203599, 13460995, 34874360, 58260525, 58304780, 32330585, 886850, -19948237, -27108918, -19173991, 1544007, 19442342, 19240737, 8994897, 11871566, 34379817, 58309262, 65055197, 53866288, 35327290, 20345069, 16526886, 22160717, 22247653, 3545406, -24300185, -35984490, -22825674, -4836071, -4016130, -16986508, -23743020, -15969182]
41792a5969182J0843279J187559n732099m45298Q136878N698762n804382p556206
41784i640689J0373576L0707834K8779834P344131n125053N873898K0256149J2303513
41776A00873193j3837833l1474062k5057478k431886K0248563L1230824K4528542
41769A04079863L804740j4886386j7312405r453198r632658k0789262k4961333
41762A0849361j1018385O927089J0554775N298184J0390470K6304267L1721688
41755I1027449J5428583p092702j7192458j7280895j8836137j9775129j1632866
41748A4645845m66419K21767o549220o322142j319655q347988k4137895k0896153
41740e3171860R620350L3348714J7686420k0644436l7690798k0646594K840093
$$ y = [-15969182, -5125903, -3938344, -9670443, -10115741, -1978863, 3719899, -2084483, -9640689, 732887, 31440721, 60220555, 67564686, 62439633, 68313531, 88569680, 100873193, 87035360, 55561298, 30503820, 28071934, 48320497, 79551321, 104079863, 107884603, 92998217, 75685812, 66232614, 56599956, 35810694, 10849361, -169024, 6758065, 17312840, 22611024, 33001494, 59305761, 91027449, 106456032, 99363330, 82170872, 64889977, 46053840, 26278711, 14645845, 14179426, 14401193, 7851973, 1529831, 210176, -8137812, -32275707, -53171860, -43551510, -10202796, 7483624, -13160812, -50851610, -71498204, -68658111]
41733f8658111Q092454n63497p974654q954645n033025K884461J2356876J9821189
41725d8028952K4534622K4858802J6043365J573991l341500N498401P614695j1552106
41717A7201318k8940542j2809364K4131002L6776861J3372334r577284o958216
41710C3196109j27160j3515551l1900950k8968749j1622108m265729p135282j782189
41702f6121609J2946501J9751165J2523099K599791j704790j627017K551524J0381577
41694h699759J3812155Q049471M360710J3968607K5229273J7787942m025466j4301150
41686E6181783k481661J4140453J8294644J3300611R456375P270018L415328M81712
41678A20059263J283821J863299k719250j1866234k2796679l3367503l8016974
$$ y = [-68658111, -60565657, -61129154, -69103808, -78058453, -83091478, -80207017, -67850141, -48028952, -23494330, 1364472, 17407837, 18981828, 15640328, 21138729, 28753424, 17201318, -11739224, -24548588, -417586, 36359275, 49731609, 40154325, 33196109, 33068949, 19553398, -12347552, -41316301, -52938409, -57204138, -64339420, -66121609, -53175108, -33423943, -20900844, -18301053, -20005843, -21632860, -19081336, -8699759, 5112396, 13161867, 17522577, 31491184, 56720457, 74508399, 70482933, 56181783, 53700122, 67840575, 86135219, 99435830, 108892205, 116162223, 119577551, 120059263, 121343084, 123206383, 120487133, 108620899, 85824220, 52456717, 14439743]
41671A4439743k8725373n449204J9510322L2021195K7868034J2382373o598344
41664F5448746k2128109k8289429k1837279n149547J2852262K0723158J3134539
41657C4754341l525114j6932805j9989101j2819846K755619K1440236K9298704
41650C4982034J5096117j0215287k1513583j3609087r271740k1999408l1187687
41643e7718641j4505757J2335205J6187334l020890j4146605n233156J652909
41636f4449601o765601j0204581R174599L2254918K9811309P263326n123374J388858
41628f650147N925153l316885r995056N39342J4998071J3795411L866600O723090
41620B5885579K0058914J7468075r348437l3282810l0516678j5220925j3576334
$$ y = [14439743, -14285630, -19734834, -224512, 31796683, 59664717, 72047090, 65448746, 43320637, 15031208, -6806071, -11955618, 896644, 21619802, 34754341, 31229227, 14296422, -5692679, -18512525, -15756906, 5683330, 34982034, 50078151, 39862864, 18349281, 4740194, -4531546, -26530954, -57718641, -72224398, -59889193, -43701859, -46722749, -60869354, -66102510, -64449601, -71215202, -81419783, -72245184, -39990266, -10178957, -2915631, -8039005, -6650147, -724994, -4041879, -14036935, -13497593, 1500478, 15295889, 19162489, 25885579, 45944493, 63412568, 54064131, 20781321, -9735357, -24956282, -38532616]
41613c8532616j8886150l136356L1471631M6477965K1237407j5703183k5699672
41606b770974q789220O280073M897553k500756l977152m38685J694177j118465
41598f723449p084588q083101K734149J6935301J5560117m668046k3616101k5623849
41590d0569567j8803153j4389127o509542Q987246J5141725j041833j9043156
41583g6227407r631254K0190742L6952011K9879012J9852109K0549593K0778077
41576F2342883R754495n561847j4289617j2869617n28135J7220197K2187145K757009
41568H1012513k2696886k6004035j0130971k324866q697007q462977M495753J0195163
41560A7386687Q26087m775443K350854L863349j0891229k4248431k2497177j7712541
$$ y = [-38532616, -57418766, -60555122, -29083491, 17394474, 38631881, 22928698, -2770974, -11560194, -5280121, -382568, -2883324, -6860476, -7299161, -5604984, -6723449, -13808037, -21891138, -19156989, -2221688, 13338429, 8670383, -14945718, -40569567, -59372720, -73761847, -80271389, -71284143, -56142418, -57184251, -76227407, -85858661, -65667919, -28715908, 1163104, 21015213, 41564806, 62342883, 72097378, 66535531, 52245914, 39376297, 38848162, 56068359, 78255504, 81012513, 58315627, 32311592, 22180621, 19855755, 11158748, 2695771, 7191524, 17386687, 18212774, 13437331, 15788185, 19651534, 8760305, -15488126, -37985303, -55697844]
41552e5697844j7302122l875401K8412551M7070201K3525053j9442907l5877849
41545c3188318j7257070O066992J2236972O490093k89354m057843j519316P488112
41537b4029732J4917832J6772557K1559821L2331535L4310665J7728096k846511
41530A10744263j1787360j7410429l0305606l5519099j5949005J1999933J9048040
41523C0820737P577352J478117J567047j1080195l2555427l6573546j8585443
41516e7351358k097746K538835Q708184J7512380J0236734j1995531j9264156
41509e1712658n08565J5130320N783501p079473L407773K3449501K1915653k74393
41501A0111659j6584744j8007621j8229913k1689921j5826506L506853K1668205
$$ y = [-55697844, -72999966, -76875367, -48462816, -1392615, 22132438, 2689531, -33188318, -50445388, -44378396, -32141424, -25651331, -25940685, -29998528, -31517844, -24029732, -9111900, 7660657, 29220478, 61552013, 95862678, 113590774, 110744263, 98956903, 81546474, 51240868, 15721769, -227236, 11772697, 30820737, 38398089, 39876206, 41443253, 30363058, -2192369, -38765915, -57351358, -59449104, -56910269, -48202085, -30689705, -20452971, -32448502, -51712658, -52221223, -37090903, -31307402, -38386875, -34979102, -11529601, 10386052, 10111659, -6473085, -24480706, -42710619, -64400540, -80227046, -76720193, -55051988]
41494e5051988K4631657J3758199o15388q647101n114639M778298O373947o380202
41486b6267217j8093486j0577918R544351J8058698P044873o042053o506778k232931
41478c5072461o644269j6066183j7302026r479323l862319m424371k057553R713894
41470h5194611K4153040L1192996K9196985K0746497N214188j4647054k5333212
41463a4671171j5996832K254134N864449r154632j9855871q093543J4750005K5597895
41455a9305566J9440080P252706m828141j6476449k0478228r169134Q192039J3349811
41447b2022882N510581K304068J1561767J9829019J4955407L897128q68554M18943
41439C5585477P603l949645q600548j3401446j8026649j9855213j9655672k2478015
$$ y = [-55051988, -30420331, -16662132, -17277520, -25924621, -31039260, -26260962, -19887015, -26267217, -44360703, -54938621, -45394270, -27335572, -20290699, -26332752, -32839530, -35072461, -41716730, -57782913, -75084939, -84564262, -88426581, -92850952, -94908505, -85194611, -61041571, -29848575, -651590, 20094907, 25309095, 10662041, -14671171, -30668003, -28413869, -22549420, -31704052, -51559923, -59653466, -44903461, -19305566, 134514, 7387220, 2559079, -13917370, -34395598, -43564732, -35372693, -22022882, -16512301, -14208233, -2646466, 17182553, 32137960, 36035088, 35166534, 35585477, 35593080, 31643435, 23042887, 9641441, -8385208, -28240421, -47896093, -70374108]
41431g0374108k7258638k4157369r179516P291715J4872200J7520592K3357902
41424f7927222K8324072K3797759J5582183J8224537K8805713K3673816q702984
41417F1777874m3847171m6285466j4903847J3894074J2307787o527894j3923908
41410c7508551p556226n730103q005826P620682M2474302O2641559M4484113J0501865
41402A08921815l960971j47337k941884j3527551j0807991N164187Q532727r086573
41394H2146422k4179634j9598934p113640o9572O811809J4662331O635407k1218035
41386C8076154m0177195k6212423K344811J2330816M843964N636450J7489289
41379A4331866J7444115L91931q604294N971837K5564856K6286659J1502334k63804
$$ y = [-70374108, -97632746, -121790115, -130969631, -123677916, -108805716, -91285124, -67927222, -39603150, -15805391, -223208, 18001329, 46807042, 70480858, 61777874, 17930703, -28354763, -43258610, -29364536, -17056749, -23584643, -37508551, -45064777, -50794880, -58800706, -51180024, -8705722, 53935837, 98419950, 108921815, 104960844, 104813507, 101871623, 88344072, 77536081, 82700268, 91232995, 82146422, 57966788, 38367854, 31254214, 31184642, 37996451, 52658782, 59294189, 38076154, -2101041, -28313464, -25968653, -13637837, -8793873, -3157423, 14331866, 31775981, 32167912, 23563618, 29535455, 55100311, 81386970, 92889304, 92625500]
41371I2625500n285973j4303021k8802444l4623587k1082452L950717K2751356
41364A5230096K6570160K0589046J1611605j645016k0278368l2758473k3779795
41357d460745J806228J7588203P833139r555784o533442J5393946K6866227J1716318
41349F0654090j1916907j7836584m198504J0636478J3489710M656771j1802331
41342D3682723l0517422l9245033k6601935K32404J7886946J3691743L59651l561433
41334b4072356K502179P369261P929986P674440L215096q741400j5684321l420312
41326b3227427J4625537Q919850j9579622l3077568j0349926K1918009L1011435
41319i759712K3778542K2793729K1786995J529533k6104214l0602555j2097754
$$ y = [92625500, 87339527, 73036506, 44234062, 9610475, -11471977, -7521260, 15230096, 41800256, 62389302, 74000907, 72355891, 52077523, 19319050, -4460745, -2654517, 14933686, 22766825, 13211041, 6677599, 22071545, 48937772, 60654090, 48737183, 30900599, 26702095, 37338573, 50828283, 55485054, 43682723, 13165301, -26079732, -52681667, -52449263, -34562317, -20870574, -20510923, -24072356, -21570177, -14200916, -6270930, 1403510, 4618606, -4122794, -19807115, -23227427, -8601890, 317960, -19261662, -52339230, -62689156, -40771147, -9759712, 14018830, 36812559, 58599554, 60129087, 34024873, 3422318, -8675436]
41312h675436J200046J820389Q987251K4150280K2670636o60321j7310325j0927679
41304B1254841j827375q175691j6214317r855532M22955J066437O23799P798236
41296d906647R488469m205913j5839391p558024P999474R757074K273455R53408
41288b038095Q48081j0794559k4715793k1488265l587805J0220751J3782023J3337351
41280b4436311Q319411l673067j1590931m013804J0109071J4692776J1322824
41273G29969J0713746J0789763M855340k36152L483519O770512j2569n791144
41265C1302984Q92937O094524o650944k3063843j9978112o627864p916576j7206561
41257d3153455o131325K2592138L2900053R403240k1510631l0352654j4836932
$$ y = [-8675436, -7475390, -5655001, 3332250, 27482530, 50153166, 49492845, 32182520, 21254841, 19427466, 11251775, -4962542, -14818074, -14395119, -13328682, -12704883, -4906647, 4581822, 375909, -15463482, -23021506, -15022032, -5264958, -2991503, -2038095, -1190014, -11984573, -36700366, -58188631, -61776436, -51555685, -37773662, -24436311, -16116900, -19789967, -31380898, -35394702, -25285631, -10592855, 729969, 11443715, 22233478, 27088818, 26852666, 30336185, 37106697, 37094128, 31302984, 32195921, 38290445, 31639501, 8575658, -11402454, -18030318, -25946894, -43153455, -49284780, -26692642, 6207411, 15610651, -5899980, -36252634, -51089566]
41250e1089566J1822595L4768414L7377574J4441701j2776834j8936217q942743
41243F664924m446564m898203M934738J6918283R063892j0046429r175965J1176111
41235B0190787J5829604o676792k5110674j6151805M656897J4404034R897239
41228A7039290n710102k7489382l4030965q380145K1019161P104919l9248129
41221f9695353n2476462q738762L6774257L4972894J0323082P617389K1485637
41214a9737318K2518076J2640618R031494N935484m917122o160246J2611391K5015062
41206E6937439J1414226m03867J6860514L4177129J1068844l0475732l5204168
41199F4374385q43588K2506284J0590570j1300051j9598093j8130049j2323471
$$ y = [-51089566, -39266971, -4498557, 32879017, 47320718, 34543884, 15607667, 6664924, 2218360, -2679843, 2254895, 19173178, 28237070, 18190641, 9014676, 20190787, 36020391, 29343599, 4232925, -11918880, -7261983, 7142051, 17039290, 11329188, -16160194, -50191159, -58571304, -37552143, -30447224, -69695353, -122171815, -130910577, -94136320, -59163426, -48840344, -41222955, -19737318, 2780758, 15421376, 24452870, 30388354, 25471232, 19310986, 31922377, 56937439, 68351665, 67947798, 84808312, 118985441, 130054285, 99578553, 64374385, 63530797, 86037081, 96627651, 85327600, 65729507, 47599458, 35275987]
41192C5275987j330416L629812q618279k2081227j5523317k877338j0219488k2713270
41184d4457536m087675L5747278M6571542J5151015j6103685j7684936r378402
41177E757601j2484144j3656254R73702J5783591J4316243N858592K363309j971127
41169A6941513r761480q221673L889745N585369j1044562k1911823p428166J6591497
41161a5359580K4562994J5578460L297182p513911j5503434j3371911k589193
41154a0899393R2723j1965927k0354070q811616J0708924J5950076M432539r530559
41146c0377303j5484622j1669462j147334O593387K440869o674483l726241J1069716
41138d8975473J7442935O796053l684958K071383J8031343L0845990L4405674
$$ y = [35275987, 33945571, 37575383, 28957104, 6875877, -8647440, -11524778, -21744266, -44457536, -48545211, -12797933, 33773609, 48924624, 32820939, 15136003, 5757601, -6726543, -20382797, -19409095, -3625504, 10690739, 16549331, 18912640, 16941513, 7180033, -1041640, 2848105, 8433474, -2611088, -24522911, -31951077, -15359580, 9203414, 24781874, 28079056, 20565145, 5061711, -8310200, -10899393, -10806670, -22772597, -43126667, -51938283, -41229359, -25279283, -20846744, -30377303, -45861925, -57531387, -58678721, -52085334, -49644465, -56318948, -60045189, -48975473, -31532538, -24736485, -28421443, -26350060, -8318717, 22527273, 56932947]
41131E6932947K1590602j2717353m8543300m8931846r253731K7088284K2820495
41124H986098p140514k5992749k6929393k6230396k4490368q800332J5516437
41117i5081217K6158537J5168934l607104j6430724k0505206j5837038l152171
41110a13285989J1422168K1485479K6882609K7719385K0935311J0664199Q813247
41103A4636409J5102866J1762894r232338k9881077l1946827k2299413j5560740
41096f7418226q903925N372688J8293110J8547292J4888936J9957052K3612310
41089B4349237Q384626j7373462k8203707j7990910l270425N331426J1010610
41082a7762605J3422141P197709k533780l760575L257730P593867N855602K512965
$$ y = [56932947, 78523549, 65806196, 17262896, -31668950, -40922681, -13834397, 8986098, 1845584, -24147165, -51076558, -77306954, -101797322, -110597654, -95081217, -68922680, -53753746, -57360850, -73791574, -94296780, -110133818, -113285989, -101863821, -80378342, -53495733, -25776348, -4841037, 5823162, 14636409, 29739275, 41502169, 32269831, 2388754, -29558073, -51857486, -67418226, -76322151, -70949463, -52656353, -34109061, -19220125, 736927, 24349237, 32733863, 15360401, -12843306, -30834216, -34104641, -28773215, -17762605, -4340464, 2857245, 323465, -3437110, -179380, 7414487, 13270089, 15783054]
41074A5783054k688044j0257996j0828703J390206J2767464Q931148Q99115Q331339
41066B4327583K3892197K1442432l958614l0650575m1757883l5946292j2501706
41059e5152858K3224737M3343074K2801502j6825323k6834403j063150J4379727
41052C873306n944227k6955575j1131262K1424292K6688469M389573p736946N922931
41044A0530561K2181249K0215173Q311765M491010J2070010K1339411K2763470
41037A21902649J4465469L737699M88545M438417M302316n267137j5368366j8567765
41029A10131827k0818068k7229415k9102788j9690545j0763347j5410933k3962385
41022c6845654j7373506K252150J6326822K0413344K6078209L2806368K4513935
$$ y = [15783054, 13095010, 2837014, -7991689, -6601483, 6165981, 15097129, 15996244, 24327583, 48219780, 69662212, 65703598, 35053023, -6704860, -42651152, -55152858, -31928121, 11414953, 34216455, 17391132, -9443271, -10506421, 3873306, -2070921, -29026496, -40157758, -18733466, 7955003, 12344576, 4607630, 10530561, 32711810, 52926983, 61238748, 65729758, 77799768, 99139179, 121902649, 136368118, 140105817, 140594362, 145032779, 149335095, 144067958, 128699592, 110131827, 89313759, 62084344, 32981556, 13291011, 2527664, -12883269, -36845654, -54219160, -51967010, -35640188, -15226844, 10851365, 43657733, 68171668]
41015F8171668M66269j4957213n778183J1958220J4457633J830408j0098283j5470865
41007E0579654j8166371j7120917j1090872r743960j9958960k7689201j5633914
41000f8824541N638528R964672j728786o48599K1922331L7734443K7174495J0366531
40992D1599074R383614Q648362j3582206l7491908k7986951M268029J5237984
40985G5998j646523o775834J5123681K6600560J827202k6500687j8578944J0428985
40977E54438K0289476J0894248J2360539K5967897K2142021n716862k7787717
40970E8704040k3935167q864557k223929j856031K135212Q435821J0240031M900902
40962D7536322p438439k1716191k4648604r326176Q980738R945259j640396l913842
$$ y = [68171668, 68637937, 53680724, 47902541, 59860761, 74318394, 76148802, 66050519, 50579654, 32413283, 15292366, 4201494, -5542466, -25501426, -53190627, -68824541, -63186013, -53221341, -54950127, -55598726, -33676395, 4058048, 31232543, 41599074, 50982688, 59631050, 46048844, 8556936, -19430015, -15161986, 75998, -1570525, -8346359, 6777322, 33377882, 35205084, 8704397, -9874547, 554438, 20843914, 31738162, 44098701, 70066598, 92208619, 86491757, 58704040, 34768873, 25904316, 23680387, 21824356, 23959568, 32395389, 42635420, 47536322, 40097883, 18381692, -6266912, -15593088, -6612350, 3332909, 1692513, -2221329]
40954b221329O303764J0478268J613963n692381k614429J897323K493441O071244
40946A8329864J2011359Q664653k031919j648285J3095046K1517450J3647819
40939H3585987O860378J2539131J3450721m694948k3652189k0192410m025264
40932F3871406p88865j1228133j5171082p159271r32785k273416k060321L091691
40924B7349224L920847m076495j1265768o442782R398240K3200999K0173065j488469
40916F0768861k2860430k0445217M529849K4253319J8612007j878159j5561030
40909D7419200j5941184p051163R163896K3733410J6355547j6864181m4192336
40902A2623189l2532301O489807L0189080K0588602Q32942m073802K816417N822804
$$ y = [-2221329, 4082435, 14560703, 16174666, 10482285, 7867856, 9765179, 12258620, 18329864, 30341223, 39005876, 36973957, 35325672, 48420718, 69938168, 83585987, 90446365, 102985496, 116436217, 111741269, 88089080, 67896670, 63871406, 63082541, 51854408, 36683326, 29524055, 28591270, 26317854, 24257533, 27349224, 31270071, 27193576, 15927808, 9485026, 18883266, 42084265, 62257330, 60768861, 37908431, 17463214, 21993063, 46246382, 64858389, 62980230, 47419200, 31478016, 24426853, 33590749, 57324159, 73679706, 56815525, 12623189, -19909112, -13419305, 16769775, 37358377, 38191319, 34117517, 36933934, 42756738]
40894D2756738L54410q857563j8001217k2595198j5945334K060934K0522272K7471756
40886B7766798K0750011P079497n634863j3323618j4908265p801976J1009360
40879B4936944L2729812L2395776m332116m9050155n1015465k562829M0654015
40872B3755982K7320949k1881200m4125428j8706640J3951831J5357023m391979
40865h719462j3212471l237111P082277L515074o554977n281975J2101094K6496077
40857A2188526J4386635j8948239l9083181k5259641J974819J1576659L732605
40850c9431817j350589n64913m757529r613980k285815R336771P822111K531030
40842c8314731J7607189M3510879M0961832J195039l6126037l7818490j4898080
$$ y = [42756738, 43111148, 34253585, 16252368, -6342830, -22288164, -20227230, 295042, 27766798, 48516809, 55596306, 49961443, 36637825, 21729560, 13927584, 24936944, 57666756, 90062532, 85730416, 36680261, -14335204, -16898033, 23755982, 51076931, 29195731, -14929697, -33636337, -19684506, -4327483, -8719462, -21931933, -25169044, -18086767, -14571693, -21126670, -26408645, -14307551, 12188526, 26575161, 7626922, -31456259, -56715900, -54741081, -43164422, -39431817, -40782406, -41347319, -46104848, -55718828, -58004643, -48667872, -40845761, -38314731, -20707542, 22803337, 63765169, 64960208, 28834171, -8984319, -23882399]
40835b3882399P839508K4071460L1358564K0298919j060742n583845Q924289R273852
40827G1239606j5744387k7381000L65671K9394534J3700965k5359900l2809844
40820A3405645n898558J1610952P314907J0213183K4576716J7357475j5569668
40813F3010652k9732109l708134K0463800K694323l0495246k8014061P848335
40806B067560K9991281J7981061j458853k602950O800580P773836j400785r605517
40798D9546213j0303791n855405k820797p045118j7695216k5691253k3039070
40791d2904437j1705069J528842J4246526K5877357L1666597K7781420J7974199
40784F4465435O941817p316730k4633763l2471709j8469855R249368K8188674
$$ y = [-23882399, -16042891, 8028569, 39387133, 59686052, 58625310, 53041465, 61965754, 71239606, 55495219, 28114219, 28479890, 57874424, 71575389, 46215489, 13405645, 7507087, 19118039, 26432946, 36646129, 61222845, 78580320, 63010652, 33278543, 29570409, 50034209, 52728532, 22233286, -5780775, 2067560, 32058841, 50039902, 48581049, 45978099, 52778679, 60552515, 59151730, 49546213, 39242422, 33387017, 30566220, 23521102, 5825886, -19865367, -42904437, -54609506, -53080664, -38834138, -12956781, 18709816, 46491236, 64465435, 71407252, 64090522, 39456759, 6985050, -11484805, -2235437, 25953237]
40777B5953237K7769461J6502089L115737j3354136l0246154l4551541k0510551
40770b5321858k675358J676247l293257J172403J9396503L1969011J9472715j1820106
40762C0576300l3661299k4622641O486855K7650113J6952563j1949309k3944489
40755a2511907l650403K6275580L3730518J4847269p592147j6396909j5328310
40748A9373691j3480611j0503399k936559O136060J0798520Q807228K89888j3038948
40740E445870k4500558k6311697j9384361j0630117J41906J7563750L3056403
40733b4618804K8442114N459182q202401L173670J8655715J4162387K017127Q177958
40725D7266948K3472370J4814899j7617111l4846690k0112964o626447k3160369
$$ y = [25953237, 53722698, 70224787, 73340524, 59986388, 29740234, -4811307, -25321858, -27997216, -26320969, -29614226, -28441823, -9045320, 22923691, 42396406, 30576300, -3084999, -27707640, -21220785, 6429328, 23381891, 11432582, -12511907, -16162310, 10113270, 43843788, 58691057, 51098910, 34702001, 19373691, 5893080, -4610319, -7546878, -1410818, 9387702, 18194930, 18484818, 5445870, -19054688, -45366385, -64750746, -75380863, -75238957, -57675207, -24618804, 3823310, 9282492, 1080091, 4253761, 22909476, 37071863, 39088990, 47266948, 70739318, 85554217, 67937106, 33090416, 12977452, 6351005, -16809364]
40718a6809364m4646144k8839176J8207443M8548160L6465534M592956j3845407
40711C674002j1368156L81440J0323996J1067423q83165j6962149j9736237l830111
40703b7332957J4554589J7167942N750090l376222o67331R806913K1081030L0225650
40695F7209704L3588602K4543757K070582k2883563l6693692l7858368l5624064
40688e647042l3104735k1338481L440079K5663024K6666914J1618474M777000
40681A2075233J5860141K6824749J9371469J319380o800349j444970K748041k949223
40673F7004471j0864937j1536447p711955r762223k2157710l6479718l6998516
40666f8507035j6846386R523526J8027648M798503n694884O606752K6070173K0586880
$$ y = [-16809364, -61455508, -90294684, -72087241, -23539081, 12926453, 17519409, 3674002, -7694154, -7312714, 3011282, 14078705, 13195540, -3766609, -23502846, -27332957, -12778368, 4389574, 10139664, 6763442, 6096111, 15903024, 36984054, 67209704, 100798306, 125342063, 127412645, 104529082, 67835390, 29977022, -5647042, -38751777, -60090258, -56650179, -30987155, -4320241, 7298233, 12075233, 27935374, 54760123, 74131592, 75450972, 68650623, 67205653, 69953694, 67004471, 56139534, 44603087, 36891132, 27128909, 4971199, -31508519, -68507035, -85353421, -75829895, -57802247, -53003744, -58698628, -52091876, -26021703, -5434823]
40658e434823j1793947l6501261k6956850L636564K4945662K7832587K4515352
40651B43284K0968297R485408j1098259k5346274j9770460j925138Q418108K867304
40643a6157730r223322j5935510j5240728j0982802n246181M73126L335934M580634
40635f4396579J0789186K2195653K6173717J3188655o117692j3908939j1533742
40628b3609741j4545910k1586212j2075862J6373265L2828660J4414407j6044377
40621b4245770j9359752M333392J8322069M833769j2317214p433595J1105567
40614b4761534J9077930J1287042K84278p242208j3682264j6214377p887508O969514
40606c2169127J4042496R391552N339953R523957J0176541n616068k6711811k7957934
$$ y = [-5434823, -17228770, -53730031, -80686881, -77050317, -52104655, -24272068, 243284, 21211581, 30696989, 19598730, -5747544, -25518004, -27443142, -19025034, -16157730, -25381052, -41316562, -56557290, -67540092, -72786273, -72313147, -68977213, -64396579, -53607393, -31411740, -5238023, 7950632, 1832940, -12075999, -23609741, -38155651, -59741863, -71817725, -55444460, -22615800, -8201393, -24245770, -43605522, -39272130, -20950061, -16116292, -28433506, -35867101, -24761534, -5683604, 5603438, 5887716, -1354492, -15036756, -31251133, -39138641, -32169127, -18126631, -8735079, -3395126, 6128831, 16305372, 10689304, -16022507, -43980441]
40598d3980441n573134J5339449J5949331R091016J4701945K4988806J7977627
40591D8494599j932599o776826R085687J6436498l508895k9055896l1953988j7060806
40583a6272226m271203P604882K8058346M1431057K3303634j3834986k7474244
40576C8545260k957635K6100000K4919279o34407k1520134k3535085j3639007
40569B7278271l241732J976609M106590J0498614K0591068J7102176j3303303
40562F5008293n1780857o1915982l6219806n198052N802811M104075N149340P217542
40554f7832636N681941Q078439J6324984J5391874l60582j0078645K011260J7363139
40546a3420226J1331998o138054p434247P361359J3603543M346943j515318P123582
$$ y = [-43980441, -49553575, -34214126, -18264795, -9173779, 5528166, 30516972, 48494599, 46562000, 39785174, 48870861, 65307359, 61798464, 32742568, 788580, -16272226, -20543429, -12938547, 15119799, 56550856, 79854490, 66019504, 38545260, 35587625, 61687625, 86606904, 85972497, 64452363, 40917278, 27278271, 24036539, 26013148, 30119738, 40618352, 61209420, 78311596, 65008293, 13227436, -48688546, -84908352, -90106404, -84303593, -80199518, -75050178, -67832636, -62150695, -54072256, -37747272, -22355398, -22715980, -32794625, -30783365, -13420226, -2088228, -8226282, -15660529, -8299170, 5304373, 9651316, 8135998, 15259580]
40538A5259580J9038255K1730633J4045119k847656k4734417l5202046k1430764
40531a4141296J98199J12299k0195437k7837985q888854J0603988O918789o268793
40523e9499090m960983O456070Q651723L123497O686502J8089384J7589941P91706
40515c071250j0277910K155240K5345732L1286915J1201259j4808117k2354912
40508A9476957j0968447k367787j0168095j9555034p348634K1509136L4456090
40501B5034186J4042238j6029960k1262315j477685J2937265N386861p209040
40494A1421550l516676J1510111J7136776P055878n827229j0683143r936735p891869
40486I268663k518338M540687K144328j3694986k5526031j3457234J3954231K6035775
$$ y = [15259580, 34297835, 56028468, 70073587, 67225931, 42491514, 7289468, -14141296, -13943097, -13830798, -34026235, -61864220, -70753074, -60149086, -53230297, -59499090, -64460073, -58004003, -49352280, -46228783, -39542281, -21452897, -3862956, -3071250, -13349160, -11193920, 14151812, 45438727, 56639986, 41831869, 19476957, 8508510, 6140723, -4027372, -23582406, -30931040, -9421904, 25034186, 39076424, 23046464, 1784149, 306464, 13243729, 18630590, 11421550, 7904874, 19414985, 36551761, 43607639, 37780410, 27097267, 17160532, 9268663, 6750325, 11291012, 13435340, -259646, -25785677, -39242911, -25288680, 747095]
40478G47095J0166984j2767989k0149265j5343513j0783749k997604J4132236
40471c6995805K5885069J3808306j0521807j7108830j661806J0093781M773112
40464a1727980j675836K546389M615167m890051j0801544p94054R029149P5865
40456a3622895j5959317j6548189n345214j212544j916472R536014K7915231K7696094
40448A0542708L440106k0857166k7379250k3193884j8025515r712217n7198K91254
40440h4951162o126085l20381K1767147L7337629L0313281J4349320O243417j27019
40432A8486147j2744850j7455043j966412J4830761Q374176j0386118j2174821
40425a3036160K009459N342767o358652r364766K014997L821878j2022429j8389064
$$ y = [747095, 10914079, -1853910, -22003175, -37346688, -48130437, -51128041, -36995805, -11110736, 2697570, -7824237, -24933067, -26594873, -16501092, -11727980, -13403816, -10857427, -6242260, -11132311, -21933855, -22727909, -13698760, -13622895, -29582212, -46130401, -51475615, -52688159, -54604631, -45068617, -17153386, 10542708, 13982814, -6874352, -34253602, -57447486, -75473001, -85185218, -85242416, -84951162, -91077247, -91397628, -69630481, -32292852, -1979571, 12369749, 18613166, 18486147, 5741297, -11713746, -13680158, 1150603, 9524779, -861339, -13036160, -11026701, -5683934, -12042586, -21407352, -19392355, -15570477, -27592906, -45981970]
40417d5981970J219558K0310995R086980j8978688k9360145j6333467m18769R928982
40409g0526524K1758699L0327390K1512737K227700j505201J6129506K8123893
40402D8048200J2175447j8069376l1675759j7423581Q891343K5061002K0938865
40395D7946141K529331j4543148j8420658j1491124n155689m590844m022905K979956
40387d768940J4361706K1656804J8362537Q043080M556372J5958328K6137569
40380A04307456Q548543l2081964n2282029k5371759J4048979J3650576j9926511
40373A0893291k9324669P901213M6899333M3372249J1783452j0172745j8892403
40366F2459721l0340362l4804881j0464382K8617986M0594541J4004330j6392719
$$ y = [-45981970, -44762412, -24451417, -15364437, -34343125, -63703270, -80036737, -80455506, -70526524, -48767825, -18440435, 3072302, 5300002, 3794801, 19924307, 48048200, 60223647, 42154271, 10478512, -6945069, 1946274, 27007276, 47946141, 50475472, 35932324, 17511666, 6020542, 864853, -3725991, -7748896, -4768940, 9592766, 31249570, 49612107, 57655187, 62211559, 78169887, 104307456, 112855999, 80774035, 28492006, 3120247, 17169226, 30819802, 10893291, -18431378, -10530165, 36369168, 79741417, 91524869, 81352124, 62459721, 32119359, -2685522, -13149904, 15468082, 56062623, 70066953, 53674234]
40359E3674234j8923479j745879R975357R748388P689164Q464839P150094Q44072
40351G6876790o371992q615272l733973N280767J3139850J6821869J5644078Q030121
40343A17072238n081829j4059788r284634K080773L309244l898299L82921J6769429
40335A07290055J6092499j3271134l4997200j4806146K0254843J5550850k8495727
40328F7618040n5739249l7971723r657747m827398p044174R129804K5932201J1980999
40320e79247j9336456k4375503M958833K8210052J4105041j7939416k6556479
40313d1513175j230595K7857056K7035173l589578l1839295k9519118j828155
40306e4627687K2976608K7721839J9475821J0892401L911384l154468o052434
$$ y = [53674234, 34750755, 33004876, 42980233, 52728621, 60417785, 68882624, 76032718, 76876790, 70504798, 61889526, 58155553, 63436320, 76576170, 93398039, 109042117, 117072238, 111990409, 97930621, 88645987, 90726760, 94036004, 90137705, 90520626, 107290055, 123382554, 110111420, 75114220, 60308074, 80562917, 96113767, 67618040, 11878791, -26092932, -35750679, -40578077, -47622251, -38492447, -12560246, -579247, -19915703, -44291206, -39332373, -11122321, 2982720, -14956696, -41513175, -42743770, -14886714, 12148459, 8558881, -23280414, -52799532, -54627687, -31651079, -3929240, 15546581, 26438982, 30350366, 27195898, 21143464]
40299B1143464j141719P030040J1932890J2425944R860876N080023O11872k419256
40291F4524134r751354k5543218l9597529l7409146k2152069r184018L20976J7254600
40283f1537624L4503345K8255512q81612j7967428j978848K3053568K5902287
40276B9349200J1417796R06688o441794k1122735l1127382j7443199R203077K0779653
40268d478696J4319797J0097370J2968265Q515178l875056p015291J695575L310943
40260C5538085j1780544l1279089m3211176m6498343l7217598j0728433J8995298
40253a26181800K9298231K2659926K2573468L0717684K0434115j6498274m9302821
40246f6299471n1238578l3790339j8303208j897828K3340421M1778477L5259804
$$ y = [21143464, 20001745, 27031785, 38964675, 51390619, 61251495, 66331518, 66943390, 64524134, 54772780, 29229562, -10367967, -47777113, -69929182, -79113200, -78792224, -61537624, -27034279, 1221233, 339621, -17627807, -19606655, 3446913, 29349200, 40766996, 41673684, 35231890, 14109155, -17018227, -34461426, -25258349, -4478696, 9841101, 19938471, 32906736, 41421914, 37546858, 30531567, 32227142, 35538085, 23757541, -7521548, -50732724, -97231067, -134448665, -145177098, -126181800, -96883569, -74223643, -51650175, -20932491, -498376, -16996650, -66299471, -117538049, -151328388, -169631596, -171529424, -148189003, -106410526, -71150722]
40239g1150722J6602202J2337697K2165861K3236762Q509194n240036n680178
40232G80780J275469O395760P652582N010552p58357m525402l982200o691132
40224E158052j7336904k3695126j1255289J2045410K3005676J4109778P44370
40217B775967l523273l003783p305162j5728190k0018780j4667897r10372J3878019
40209d8503471J9845639J2852379j129460j2451767j4712202l807850J9302722
40202b8604010L9245225L4319932O364934j1984284K246047K7815168K8205268
40195I7608280M273380j1186689o522723n320809k3104205m2115253m1288983
40188b7657002k4731494o459527R681515K0693264J8195311P151489P666279K0950087
$$ y = [-71150722, -54548520, -42210823, -20044962, 3191800, 11700994, 6460958, 780780, 2056249, 8452009, 16104591, 21115143, 20356786, 15831384, 11849184, 5158052, -12178852, -35873978, -47129267, -35083857, -12078181, 2031597, 2775967, -747306, -3751089, -11056251, -26784441, -46803221, -61471118, -62381490, -48503471, -28657832, -15805453, -16934913, -29386680, -44098882, -47906732, -28604010, 10641215, 44961147, 51326081, 39341797, 41587844, 69403012, 97608280, 101881660, 90694971, 84172248, 78851439, 55747234, 13631981, -27657002, -52388496, -58848023, -49166508, -28473244, -10277933, -3126444, 4539835, 25489922]
40180B5489922J8938799j0061986l2499298j7231747J2030576J1588631j2301632
40173d046735j5409330R719981K2653364M625987j1858332j521440J1899366J536122
40165A7598983j3625602l196730J9537033J9007908l361594j3526426r21168R643707
40157C1156111K468402q199847p830127k495699j561954k820265j841638L292067
40149A2167050J8546103M3428175N4735329K9232133j4469609k9184633l306107
40142A11148441K1881356J3532979q710340j2023066n61848M367742P054556K3295715
40134A59985535M1682422L7133956J3582196j134676L326920J4283394K4469359
40127B93329106L4547938L4865070J8524761N453166J6005244K7374375J152075
$$ y = [25489922, 44428721, 34366735, 1867437, -15364310, -3333734, 8254897, -4046735, -19456065, -9736084, 12917280, 17543267, 5684935, 4163495, 16062861, 17598983, 3973381, 776651, 20313684, 39321592, 35959998, 22433572, 21512404, 31156111, 33624513, 25424666, 17594539, 15098840, 13536886, 10716621, 8874983, 12167050, 30713153, 74141328, 128876657, 158108790, 143639181, 114454548, 111148441, 133029797, 146562776, 137852436, 125829370, 125267522, 129635264, 136689820, 159985535, 201667957, 238801913, 252384109, 251249433, 254576353, 268859747, 293329106, 327877044, 362742114, 381266875, 386720041, 402725285, 430099660, 431251735]
40120D31251735m7564559o1700517l1867230j6769039m9687528q0952490n5265663
40113H7444709k21719J6535094j1964614l3136090k1362253l901260m92207P456371
40105D0358031L2627666N0570169L5446765j711000l0648879l7346705k6405611
40098F2890436o483895J1396252J5306990N666127l204561l221275k812445j0061873
40090F9475756j8331733j7131732p014222L129133N134981m207112j7087453j4362823
40082c95205J1588432L4788458K0539779k3520267m9559676l3731671p853458
40075d8143608p889994k1479421j6647078K624069Q232017o50812l90980J0425872
40067g3919935J1409206P177987K6134903O2024104O5225921J6585336l3059096
$$ y = [431251735, 383687176, 321986659, 290119429, 273350390, 223662862, 142710372, 87444709, 87222990, 103758084, 91793470, 58657380, 37295127, 33393867, 32901660, 40358031, 72985697, 123555866, 159002631, 157291631, 126642752, 89296047, 62890436, 56406541, 67802793, 83109783, 88775910, 85571349, 82350074, 79537629, 69475756, 51144023, 34012291, 26998069, 30127202, 35262183, 31055071, 13967618, -395205, 11193227, 45981685, 66521464, 43001197, -6558479, -40290150, -48143608, -56033602, -77513023, -94160101, -91536032, -83304015, -83954827, -84345807, -73919935, -62510729, -55332742, -29197839, 32826265, 98052186, 114637522, 81578426]
40060H1578426l2225140k796495p42189k7803665l5073360n910045J9239454R970566
40052F237552r014999j645809K4978028L6405517J9839389o761195k1328861j5062549
40044C3647073N766404K1195110J2437326j3086932k5889146j4225829l68594
40037A9475412k770211o045711P694753K0532372N571808k2901398k5163943K928666
40029f78252K3421486J3676257n866648r647872L63040J1876614K1803309K3991665
40021G8939599N631233k6653409m2247009k6778915m043811R97310k616764M215903
40013a2555863J4669399J1144429k120848j0225311j5573916k4416884j9942138
40006e9021132J5379798N8144499O2638765K2868853j7273428k1154795K946558
$$ y = [81578426, 49353286, 46556791, 45814602, 18010937, -17062423, -22972468, -3733014, 6237552, -2777447, -4423256, 20554772, 56960289, 76799678, 70038483, 48709622, 33647073, 39413477, 60608587, 73045913, 59958981, 34069835, 19844006, 19475412, 16705201, 10659490, 18354243, 38886615, 44458423, 21557025, -3606918, -678252, 22743234, 36419491, 30552843, 20904971, 21268011, 33144625, 54947934, 78939599, 84570832, 57917423, 15670414, -11108501, -15152312, -14155002, -16771766, -12555863, 2113536, 13257965, 11137117, 911806, -14662110, -39078994, -59021132, -43641334, 14503165, 77141930, 100010783, 82737355, 61582560, 64529118]
39999F4529118K7370422L8120571L1717600P029452k3903139l8225343l0372284
39992G6266397j9954007k0084748j9117545q462167m582313j9519526k8652155
39985d4106064K46321N3037330P6753806M5858856n270054k7546392j4809900
39978H4163903N56046l210642j4754412j6149151j1272792j5000227k4731734
39971c99009k0717199M099100K9794258L2908320J4154011o481082j4481396j0302515
39963B8574488q22225O086994K050476j4100644l0069875l1681618j8738880l19781
39955e9021065J9700327L8859516M4217711K4124360q636713k5845203j9586682
39948A3812251r997859j2488005j7551569j1958206l70248O926610J1164777J5676539
$$ y = [64529118, 91899540, 130020111, 161737711, 168767163, 144864024, 106638681, 76266397, 56312390, 36227642, 17110097, 8647930, 4065617, -15453909, -44106064, -43859743, 9177587, 85931393, 131790249, 126520195, 98973803, 84163903, 84719949, 81509307, 66754895, 50605744, 39332952, 24332725, -399009, -21116208, -17017108, 12777150, 45685470, 59839481, 53358399, 38877003, 28574488, 27752263, 33839257, 35889733, 21789089, -8280786, -39962404, -58701284, -59021065, -39320738, -461222, 43756489, 67880849, 59244136, 33398933, 13812251, 3814392, -8673613, -26225182, -38183388, -38553636, -31627026, -20462249, -4785710]
39940d785710J3997758L180090l517252N474188J8878031J6582559k054737j9883158
39932B7871769k5570853j9790842m773803J3980690K0677485M852148j6993089
39925B53505j6910428M353474J4582743m226578k8047100k3936136M104647K2292045
39917b7533828J3085151o840456j5740716j4457476j5091273j5756966l379221
39910h5714785K1462515L8938104L4569323J7417235M712458j944191j1218503
39903A8222156j8659515q193605J8762426L3958483J5703826j9060663l2971745
39896G761363j5272049O580755O044335p793826p160719J1934722K2887156O711653
39888C1693390k0383132l0171255k0964615j3294873j2601882k684329J8026659
$$ y = [-4785710, 9212048, 12392138, 8874886, 14349074, 33227105, 49809664, 47754927, 27871769, 2300916, -17489926, -22263729, -8283039, 12394446, 17246594, 253505, -16656923, -12303449, 2279294, -1947284, -29994384, -53930520, -49825873, -27533828, -14448677, -21289133, -37029849, -51487325, -66578598, -82335564, -85714785, -64252270, -25314166, 9255157, 26672392, 31384850, 29440659, 18222156, -437359, -8630964, 10131462, 44089945, 59793771, 40733108, 7761363, -7510686, -929931, 5114404, -2679422, -9840141, 2094581, 24981737, 31693390, 11310258, -18860997, -39825612, -53120485, -65722367, -68406696, -50380037]
39881e0380037K2446664l697344k9847473j9027546J6585051L2476052J7115234
39874a4329399K466555P350323J1237046j295354q403027J0741896L5189512L1818502
39866G4776054N655417j2614166j5724210k1336638l0986483k4106298K670181
39859b1666143K1987795J3769905o030650q653605J0857670L2789774L7857491
39852H0912237K2833372j101464j7170743j5745578m475922j308579j3614000
39845E0329323k9250888l1603267j8195967m85466J0557128J3797128J3923554
39838I071545J1732435J695424j8426225l8163128m2015723k8227585j1589351
39831a15922608l381006K218497J4476469K8136087L0467345K0652601R964990
$$ y = [-50380037, -27933373, -31630717, -61478190, -80505736, -63920685, -31444633, -14329399, -11862844, -4512521, 6724525, 5429171, -2973856, 7768040, 42957552, 74776054, 80431471, 67817305, 52093095, 30756457, -230026, -24336324, -21666143, 321652, 14091557, 8060907, -592698, 10264972, 43054746, 80912237, 103745609, 102644145, 85473402, 69727824, 65251902, 63943323, 50329323, 21078435, -10524832, -28720799, -29206265, -18649137, -4852009, 9071545, 20803980, 22499404, 4073179, -34089949, -76105672, -104333257, -115922608, -119303614, -117085117, -102608648, -74472561, -44005216, -23352615, -13387625]
39824a3387625M939039J487043m313825r022912p453010J28621Q031663J0500992
39816i090014P808702O054149O759529O36419j7210899k9169406j1490505K7691827
39808a8010198M9106017L1766393l3170j3796927j0164988o577804k196844J1614474
39800D1706953K2019544R514341j5892770k4851627j0914304O048962J3946148
39793D1577247J6571373J2564691j850040j2976733o714211j456897k3721373
39786B3994057n2383811l6881212J9327007M7414342J0037175m0479547l8471812
39779f7443801K144598J9528282k19137j3785165L457246K4408250J8968853l880246
39771a6821120j5886322n741639J6040672L2002598L0735494J6605618P679807
$$ y = [-13387625, -8448586, -6961543, -11275368, -20298280, -27751290, -27622669, -19591006, -9090014, -1281312, 4772837, 11532366, 12168785, -5042114, -34211520, -45702025, -18010198, 31095819, 62862212, 62829042, 49032115, 38867127, 32289323, 30092479, 41706953, 63726497, 73240838, 57348068, 32496441, 21582137, 27631099, 41577247, 58148620, 70713311, 68863271, 55886538, 49172327, 47715430, 23994057, -28389754, -65270966, -45943959, 1470383, 11507558, -28971989, -67443801, -65299203, -45770921, -45990058, -59775223, -56317977, -31909727, -12940874, -16821120, -32707442, -38449081, -22408409, 9594189, 40329683, 56935301, 64615108]
39764F4615108J3529684J9134338M379971k5285631m3702059l6536884j3457842
39757a7323315R628668K4497894K7529829J7958354J538677j3703245k4988347
39750B5138515l1494083k9447133j9172281r228911l618631N437800K0942148
39743d1442576L0174465K4809665J7322159J8367415J3641106j1085820l5870479
39736A5915935l0311616l309370P758221l949700o891930J0505534J5899178j2236193
39728f619941m2124184l1882218Q691929L3263914K3187286M172607K270335J2507402
39720C467130J6999865J2172085O465801L390037q33214o352097o025153M148829
39712C3433283J5370994J3775456p64106j1296965n102589R360168J6174322J4469086
$$ y = [64615108, 78144792, 97279130, 101659101, 76373470, 32671411, -3865473, -17323315, -7694647, 16803247, 44333076, 62291430, 63830107, 50126862, 25138515, -6355568, -35802701, -54974982, -64203893, -67822524, -62384724, -41442576, -11268111, 13541554, 30863713, 49231128, 62872234, 51786414, 15915935, -14395681, -17705051, -9946830, -13896530, -20788460, -10282926, 5616252, -6619941, -48744125, -80626343, -71934414, -38670500, -15483214, -11310607, -9040272, 3467130, 20466995, 32639080, 39104881, 42494918, 41661704, 35309607, 29284454, 33433283, 48804277, 62579733, 61815627, 50518662, 45416073, 54776241, 70950563, 85419649]
39704H5419649J2937905R026500o047878k3772050k3608096n817248M526219n405551
39696D7259450j8177943j6642289q843113o038886P72933J9342345L0933510J5248395
39688F3854402j2563790k0270897o301761J719108p480581j7068074j7539890
39681a5651483k0774539l0074065k7179883l983848J8996050K3129667J7844386
39674c7693715J7769131J5878959K295980r374314j716001J4310110J5188935
39667A6659085K694840l538950l302412j2329516k4526918j4622508J6130582
39660b2835797L3473947K1685875O638187R316929J1177855o969044k2879382
39653B9608570p217483K1464243J9085629j6058699m0318391k9546433o776452
$$ y = [85419649, 98357554, 107384054, 101336176, 77564126, 53956030, 48138782, 52665001, 47259450, 29081507, 12439218, 3596105, -2442781, -1669848, 17672497, 48606007, 63854402, 51290612, 31019715, 24717954, 26437062, 18956481, 1888407, -15651483, -36426022, -66500087, -93679970, -97663818, -78667768, -55538101, -37693715, -19924584, -4045625, -1749645, -11123959, -12839960, 1470150, 16659085, 19353925, 15814975, 12512563, 183047, -24343871, -38966379, -22835797, 10638150, 32324025, 38962212, 48279141, 59456996, 52487952, 29608570, 22391087, 43855330, 62940959, 46882260, 6563869, -22982564, -29759016]
39646b9759016K476379N434761J6970058K9476989K8208198J6029408M541966
39639G3378743l876439j0392237j0986348o985440r706475k1125056k4337598
39632a4030850p804716J3842844J8161873L613352j2826274j6379414k259342
39625a7682527K3990620M2265834K9318923j0433735l9517198k9527503L679513
39618B093927K3437330J8021257M425449j970845j111043P50169l461673j7731055
39610B4453516l1652061k6162276m266158L587479j5368502k8969467p085416
39603h5462885K6527283K8600542O249791M729839L0658402L9023797N601974
39596E5928743l4824233m1725736k2109917p236022n975791o211986j475252N912467
$$ y = [-29759016, -27282637, -21847876, -4877818, 24599171, 52807369, 68836777, 73378743, 69502304, 59110067, 48123719, 41138279, 31431804, 10306748, -14030850, -21835566, -7992722, 10169151, 13782503, 956229, -15423185, -17682527, 6308093, 48573927, 77892850, 67459115, 27941917, -1585586, 2093927, 25531257, 43552514, 47977963, 46007118, 44896075, 45646244, 42184571, 24453516, -7198545, -33360821, -37626979, -34039500, -49408002, -78377469, -85462885, -58935602, -30335060, -24085269, -19355430, 11302972, 50326769, 55928743, 21104510, -20621226, -42731143, -49967165, -55942956, -62154942, -63630194, -57717727]
39588e7717727J3485159J4894286J867323j8685270k5101463q245660J6810741
39581f2692611L2157789L2542274J7563001p742048k2001323o805579J7815639
39574H37142J1787287k1756640l1936691L075330L7320381K4784696j2335979
39567A1775526k1859376J402328J9855533J4628962P74430p573762j0504802q643610
39559a44771n653339j3243927k7552611j9331715K1296678N3275549L7509078
39552D6154942n58846r085238Q358369O903899j4528312r651529K8483144M5608044
39544A01684473J2890610k5547860k4196356k972703k863688j8084281j7924159
39537B2986036m148983O9826l863248K18468L886317j1186358k9818713j9533597
$$ y = [-57717727, -44232568, -29338282, -27470959, -46156229, -71257692, -79503352, -62692611, -30534822, 2007452, 19570453, 11828405, -10172918, -16978497, 837142, 12624429, -9132211, -41068902, -37993572, -673191, 24111505, 11775526, -10083850, -8681522, 11174011, 25802973, 26577403, 19003641, 8498839, -144771, -5798110, -19042037, -46594648, -65926363, -44629685, 8645864, 46154942, 45596096, 36510858, 44869227, 51773126, 37244814, 27593285, 56076429, 101684473, 114575083, 89027223, 64830867, 61858164, 58994476, 40910195, 22986036, 18837053, 18906879, 15043631, 15262099, 19148416, 7962058, -21856655, -41390252]
39529d1390252J2420748K2120375m047977k5036916m477177L6131122M7192616
39522D2912539J6808496j7306598j8052683O986446J8601951l439269l4017626
39515A2493256l4491041m257537J7841190P683373j0998341m489549J8952631
39508B733982K2975669K09980j7080855o969823J1852529J3324006L290640M545499
39500C4881627J7195915J7749180n492904l5435658m7643392l5995990j3139340
39493f7880562M748236Q621790n36953j2779181j6133151p340574N378941J2273881
39485g3647573J1820906P886723J601285p602313j4834950j1924955Q86239J1905368
39477g3909270J1082088K033727l594766q55612M514120N826730M410945O935578
$$ y = [-41390252, -28969504, -6849129, -10897106, -35934022, -40411199, -4280077, 42912539, 59721035, 42414437, 24361754, 31348200, 49950151, 46510882, 12493256, -21997785, -26255322, -8414132, -730759, -11729100, -16218649, 2733982, 25709651, 25919631, 8838776, 1868953, 13721482, 27045488, 30336128, 34881627, 52077542, 69826722, 64333818, 28898160, -18745232, -54741222, -67880562, -63132326, -54510536, -55047489, -67826670, -83959821, -91300395, -85921454, -73647573, -61826667, -53939944, -52338659, -59940972, -74775922, -86700877, -85814638, -73909270, -62827182, -60793455, -64388221, -65243833, -60729713, -54902983, -50492038, -43556460]
39469d3556460J4932999J9331661R541222r989811j8825539m706144J6064509
39462a7207563J6314705m435454j7633400n963500J3348367J7108366R196063
39455A0727584O456939P002690k765244j8225696k0450100q052017K41891l351600
39447b8415553o231655j474084O92950m215806l136417J1106733K3426620J7838539
39439I591327N88883j1723693j4928077j5244208j4898764j2082391p352050q85186
39431f6934159Q496765J5491692J1158872l8104p28144J3019515K1876624J1487788
39423A3830849n482420r725725k308700M923090J0969792J8722158J9777295P389017
39415E8095356o388275p951411n466608j1213495j2372298R988236L9334366L6876999
$$ y = [-43556460, -28623461, -9291800, 249422, -9740389, -28565928, -33272072, -17207563, -892858, -5328312, -22961712, -28925212, -15576845, 1531521, 10727584, 17184523, 24187213, 21421969, 3196273, -17253827, -25305844, -25063953, -28415553, -34647208, -36121292, -35428342, -39644148, -42780565, -31673832, -8247212, 9591327, 10180210, -1543483, -16471560, -31715768, -46614532, -58696923, -66048973, -66934159, -58437394, -42945702, -31786830, -31824934, -32553078, -19533563, 2343061, 13830849, 8348429, -1377296, -3685996, 1237094, 12206886, 30929044, 50706339, 58095356, 51707081, 43755670, 38289062, 27075567, 14703269, 24691505, 64025871, 100902870]
39407A00902870m51324l0191974k3959510n063024p790170k5781804k7269138
39400a9604074n321103J5471983J6950532P341875J524648Q43606n48433k344219
39392A4314815n51711K627278j23085j0617590k0768965k0950678j0905670k33628
39384d7209234J479744o261122j4079357r322264J2213392L5783906L5193431
39377G798496L365734k8192446j9971993K2390994M9051216L1409677Q73829l84675
39369F6340832J6303998P130620l1390292n3970500l4014152J154009J6343389
39362a2102096J4334425J4478176J5115073M967660q580351j1124562p192103
39355I896222p870878m865475J3745098L0426381J4423138k8545012n5249299
$$ y = [100902870, 100451546, 70259572, 46300062, 41237038, 33446868, 7665064, -19604074, -24925177, -9453194, 7497338, 14839213, 16363861, 17207467, 16659034, 14314815, 13763104, 16390382, 16267297, 5649707, -15119258, -36069936, -46975606, -47209234, -45729490, -51990612, -66069969, -75392233, -63178841, -27394935, 7798496, 11164230, -17028216, -37000209, -14609215, 34442001, 65851678, 66725507, 66340832, 82644830, 89775450, 58385158, 4414658, -29599494, -28445485, -12102096, 2232329, 16710505, 31825578, 36793238, 28212887, 17088325, 9896222, 2025344, -2840131, 10904967, 41331348, 55754486, 27209474, -28039825]
39348b8039825m1712105j2295782J048696J988044J1187160K4554837J8338740
39341b4930235j0918336l7171096l7675199j6219485R696458K8028001L3193179
39334e5996713K4003471R595871M321612P105487k97202k1671276k8836210J995664
39326e9779296M7098187N8526286K9548971L399261P335901J3254651j2101133
39319H7282828m7446262m5011147l439634K8247643J8851271r774458k3330318
39312E379923j8096584q504068J693423J5584128K7108201K7275979J6793548
39305F7234550J153557j6187499k7667365k2770608m188256J2427513K2946981
39298C2948873L9207440N8063291N1446547Q546386l4848287l8235564j1543356
$$ y = [-28039825, -69751930, -82047712, -80999016, -79010972, -67823812, -43268975, -24930235, -35848571, -73019667, -110694866, -126914351, -117217893, -89189892, -55996713, -31993242, -22397371, -18075759, -10970272, -11267474, -32938750, -61774960, -59779296, -12681109, 45845177, 75394148, 78793409, 86129310, 99383961, 87282828, 39836566, -5174581, -8614215, 19633428, 38484699, 28710241, 5379923, -12716661, -21220729, -19527306, -3943178, 23165023, 50441002, 67234550, 68388107, 52200608, 24533243, 1762635, -2425621, 10001892, 32948873, 72156313, 130219604, 181666151, 190212537, 155364250, 117128686, 105585330]
39291A05585330L767282k597082k696503J6892380L3627882K8646015J5254270
39284A98479574J3133641J9058829J9529989J3529324P241628J219193l508208
39277B68683970P0815J1844619J8793766J4482795J1348313J9942809K8296487
39270C73463574J8522611m659625j9453551j7093296j0785658j4770986k6679206
39263B98543863l3080304k5795665j1305753n777035j7530539l3991062l4286527
39256A36776978j7033208l721908q780187k0215673k0553225j3291377j2573428
39249D0607972j6557357j0473682P451310K1004441J7490739Q48520j6526303
39242D3845640k3339600j2816482J0144700K6157446J9119744k884087j6573081
$$ y = [105585330, 109352612, 106755530, 104059027, 120951407, 154579289, 183225304, 198479574, 211613215, 230672044, 250202033, 263731357, 270972985, 272192178, 268683970, 268754785, 280599404, 299393170, 313875965, 325224278, 345167087, 373463574, 391986185, 387326560, 367873009, 350779713, 339994055, 325223069, 298543863, 265463559, 239667894, 228362141, 222585106, 205054567, 171063505, 136776978, 119743770, 116021862, 107241675, 87026002, 66472777, 53181400, 40607972, 24050615, 13576933, 21028243, 42032684, 59523423, 60371943, 43845640, 20506040, 7689558, 17834258, 43991704, 63111448, 60227361, 43654280]
39235D3654280j2463616j605667N403928R816891J2976901R648097o81618q499070
39227E8250126o561266J784040R614184J2453764P430614j741526j259225J4767131
39219I4737842K5477859O090426k8595927l3274026M034408L7848365K6206212
39212A32525159j1073463k4492424m897870J4180587J3228558P479589J0655100
39205A37605236J3031895M903493n473065r376476j2056408j8242859k0802302
39198H9589514j4846237q252311q173188j0410265j0614635j2042349j3550328
39191A1700201n227132J2479972J9754405K717271k2374241k6230976k676442
39184i856942K5802064L5817689K5179358Q348438j235246k846137n626301j3774261
$$ y = [43654280, 31190664, 29584997, 34988925, 44805816, 57782717, 67430814, 66749196, 58250126, 51688860, 53472900, 63087084, 75540848, 82971462, 81229936, 79970711, 94737842, 120215701, 126306127, 97710200, 64436174, 68470582, 106318947, 132525159, 121451696, 96959272, 92061402, 106241989, 119470547, 126950136, 137605236, 150637131, 155540624, 150067559, 140691083, 128634675, 110391816, 89589514, 74743277, 66490966, 58317778, 47907513, 37292878, 25250529, 11700201, 6473069, 18953041, 38707446, 41424717, 19050476, -7180500, -9856942, 15945122, 51762811, 76942169, 85290607, 84055361, 81209224, 75582923, 61808662]
39176F1808662j7102299l789234J9141487L0578544K2389118P586019k328263
39169A18284034j1184457k1446506k2242140q254852M816898Q80320j2205232
39162D8648065j6200228r732691l630462N72909O011396K759988k0032552m7264017
39154c8867592m8871629k0119174J2120888K7136134L1009049L2715128K4590415
39147A9713219J841502j7838004j4583356L648804J0574772j953753j3090321
39140a1687137j772802K3739208L2544133P252640l1163993m2343879j3299624
39133c6731454K3518297K8930471M820432j3446685o766160Q404342J2297112
39126B1026355Q338746O810503M333124l214979m580867R015241K1496625J0513813
$$ y = [61808662, 44706363, 40917129, 60058616, 90637160, 113026278, 120612297, 118284034, 107099577, 85653071, 63410931, 55156079, 59972977, 60853297, 48648065, 32447837, 22715146, 19084684, 19657593, 25668989, 28428977, 8396425, -38867592, -87739221, -107858395, -95737507, -68601373, -37592324, -4877196, 19713219, 21554721, 3716717, -10866639, -7217835, 3356937, 1403184, -11687137, -13459939, 10279269, 42823402, 50076042, 18912049, -23431830, -36731454, -13213157, 15717314, 20537746, 7091061, 324901, 8729243, 21026355, 29365101, 36175604, 40508728, 37293749, 32712882, 41728123, 63224748, 73738561]
39118G3738561j6895783l0216135j7410179O32146L348777j265500N781289K1767743
39110C9480919K4323030L898732k0323670k2962706l664260J3013404Q765307
39103D2530756o139996q513368M876224J2467537j187959k2048648k4814524p529203
39095a0359181O639181K230823q755761p220958M395831O923080o867406k3153426
39087c6167817k7928333k2625547j3009984L010483K4378923L6284824K9022232
39080g035219J9394959L0141140N0864123M7104480J2784055j6725178j6954709
39073A19573651r009525j9303648l3093439k1417533O091294J4745962J59031
39066E7745793j0531487q316479j1239062k1613598j7347979L983583J3540522
$$ y = [73738561, 56842778, 26626643, 9216464, 9848610, 13197387, 11931887, 17713176, 39480919, 63803949, 67702681, 47379011, 24416305, 20752045, 33765449, 42530756, 36390760, 27877392, 32753616, 45221153, 44033194, 21984546, -2829978, -10359181, -3720000, -1489177, -10244938, -17465896, -13070065, -6146985, -13014391, -36167817, -64096150, -86721697, -99731681, -96721198, -72342275, -36057451, -7035219, 12359740, 42500880, 93365003, 140469483, 153253538, 136528360, 119573651, 110564126, 91260478, 58167039, 36749506, 42840800, 57586762, 57745793, 47214306, 38897827, 27658765, 6045167, -11302812, -7319229, 6221293]
39059F221293J5147q169553R405708L0583537K9199996J5826042J0699079N820899
39051I9602148j1469511k2538808m874742K1935967J8767078j3788366l7229258
39044E0404508l1459023j2852622K365560J6599907K8377620K3876767P10443
39037G8023160k3567765l4075608l0880897j7076772M477798K1535065K1372272
39030A9807253J0590755N249275L039280j0400199k9405433l1601133j5163823
39023d7884025k194259J18093R251149K8742544L3376248R911459j6550888j7793940
39015c023619q28622R249642M353395q023111k1928003k9240299j7724961P141734
39007f0023844J7008918j571091k3105551k0141189m371505k157481p337449N183434
$$ y = [6221293, 6236440, -1933113, 7472595, 38056132, 67256128, 83082170, 93781249, 99602148, 88132637, 65593829, 60719087, 82655054, 101422132, 87633766, 50404508, 18945485, 6092863, 8458423, 25058330, 53435950, 77312717, 78023160, 54455395, 20379787, -10501110, -27577882, -23100084, -1565019, 19807253, 30398008, 35647283, 38686563, 28286364, -1119069, -32720202, -47884025, -50078284, -49960191, -40709042, -11966498, 21409750, 31321209, 14770321, -3023619, -3852241, 5397401, 9750796, 1727685, -20200318, -49440617, -67165578, -60023844, -43014926, -44586017, -67691568, -87832757, -92204262, -94361743, -101699192, -96515758]
38999i6515758K9441246L2560239Q980650q063276K177975J9551001K0321445
38992H453522J2507569J2844965J2698200n376033l0315972l0801197M30524L3839463
38984A4281041L9885901K1325408P21224j0267849j6180615k0346834j8649776
38977A0768500j1762621r183431j3655138j2340181M886689K5013560K4420063
38970A8147441R08105k1105306k0811039m174772Q605053Q073631L34122n232140
38962a5254905m913402j508779j273222o527364j0226813m626442M850291N656032
38954c3824604l85665L087461J9157747K6166761P049637k2691725l2396996j3663289
38946d7500673J4786454L3194600L5950911K5062105N321747j3491266k2558043
$$ y = [-96515758, -67074512, -34514273, -25533623, -33596899, -31418924, -11867923, 8453522, 20961091, 33806056, 46504256, 41128223, 10812251, -19988946, -19558422, 14281041, 54166942, 75492350, 76213574, 65945725, 49765110, 29418276, 10768500, -994121, -10177552, -23832690, -36172871, -31286182, -6272622, 18147441, 19055546, -2049760, -22860799, -27035571, -18430518, -10356887, -10022765, -15254905, -20168307, -21677086, -22950308, -29477672, -39704485, -44330927, -39480636, -33824604, -34210269, -31122808, -11965061, 14201700, 21251337, -1440388, -33837384, -47500673, -32714219, 480381, 36431292, 61493397, 66815144, 53323878, 30765835]
38939C0765835k3259025k1402386j5527951l015261N945131k582005k1641651
38932e0717313k4985874q53440K9093925L5291709J6213699l165475m933524K889481
38924a166812M148535j12728M291989J8492518K3952435R605030p558555m923405
38916D6729007J0465203J0563833j0486114k6312847j8281232p34344P369043
38909A9312549J1809384K2564398K4945677J245518l1088581l6138044j1328827
38902A322074R080735N209819m112735K589890J6378625J6454896J588062j4020805
38894C4490561k2176904k2341395j2714179N177540J9901962K0764889J0441933
38887C3544407j647106j2002396k0359032k1774186j2297913K039681J1630001
$$ y = [30765835, 7506810, -13895576, -29423527, -32438788, -26493657, -29075662, -50717313, -75703187, -76556627, -47462702, -12170993, 4042706, 877231, -4056293, -1166812, 2981723, 2868995, 7160984, 25653502, 49605937, 59210967, 51652412, 46729007, 57194210, 67758043, 57271929, 30959082, 12677850, 11943506, 19312549, 31121933, 53686331, 78632008, 79877526, 48788945, 12650901, 1322074, 10402809, 15612628, 11499893, 14089783, 30468408, 46923304, 48511366, 34490561, 12313657, -10027738, -22741917, -17564377, 2337585, 23102474, 33544407, 31897301, 19894905, -464127, -22238313, -34536226, -32496545, -20866544]
38880b0866544J5218452J7298514J7930442J4207929Q183962L356195m322602
38873E1006348k0527091l7066446l4560759p284990K2645216K6265059J939605
38866B416942k0747496j5328497J0493498K6590360J9156081M264691j08211J37109
38858B6874477r503046k1965659j4592323J4464249L5694017K3478699j0942056
38851D3508358l3186045k4711901K971743K7525809L5847677K5172202j792213
38844G5335630l4159532n2440345m3307936j6889739K28786m233746j1981431
38837h7448313O64742K6698806L4767850J3741885q732577m093348J7000743K1542167
38829A4141955J921367j5684468j0100644P989378J3877149n78349k0871790k5439452
$$ y = [-20866544, -5648092, 11650422, 29580864, 43788793, 51972755, 55328950, 51006348, 30479257, -6587189, -41147948, -48432938, -25787722, 477337, 2416942, -18330554, -33659051, -23165553, 3424807, 22580888, 26845579, 26737368, 26874477, 17371431, -4594228, -19186551, -4722302, 30971715, 54450414, 43508358, 10322313, -14389588, -11417845, 16107964, 51955641, 77127843, 75335630, 41176098, -11264247, -54572183, -71461922, -71233136, -75466882, -87448313, -86783571, -60084765, -25316915, -11575030, -20307607, -24400955, -7400212, 14141955, 16063322, 378854, -9721790, -1732412, 12144737, 11566388, -9305402, -34744854]
38821c4744854m122973L0345626M8425776L1980083k305852j9524461q375012
38814D1678333P534902M578485j0439982j5253290n274207L227065j742828j3546165
38806A0762313j8893416j4200068n357989L217088J2041432J8607964J3730338
38799A9907662o098760k6214164k6397204q396362L186090n465117j7617109j1653435
38791g8748399Q057594K2843040K9588281L7394707M3317891L5787826J8033072
38784A16274012M222374n274446k0474047l5369184l1477765r134450J0876569
38777B9643063J8476179J9522558R680147k2108047n7861798n7338247j6248320
38770g6234465J8986642J5600085j593312L395381K1633747K3400643J0041933
$$ y = [-34744854, -38867827, -8522201, 39903575, 71883658, 69577806, 50053345, 41678333, 49213235, 53791720, 43351738, 28098448, 22824241, 26051306, 24308478, 10762313, -8131103, -22331171, -27689160, -24472072, -12430640, 6177324, 19907662, 13808902, -12405262, -38802466, -47198828, -44012738, -49477855, -67094964, -78748399, -70690805, -47847765, -18259484, 19135223, 62453114, 98240940, 116274012, 120496386, 115221940, 94747893, 59378709, 27900944, 18766494, 29643063, 48119242, 67641800, 77321947, 55213900, -2647898, -59986145, -76234465, -57247823, -41647738, -43241050, -39845669, -18211922, 5188721, 15230654]
38763A5230654L120626K588985n018363j2214246l425056R429378K943815j4805339
38755b149546j6003353j474579K691453o180735l889894J3129660J8794243M263200
38747I180449n895642K096512P231896q306405k8375218k9494331j2198363J1599999
38739e4161103L6948216N3689477M2240786L630674k8606453k9266309j4015444
38732A0459844q556376p155916R087471L0364423K9397538O456853j0691228j0550751
38724D8811858r902502j8060781j9654005m918434Q170964K09951j8157608k1332814
38716c4833371o105219O387477L648762k762888L55042O887217M677518k008465
38708b3753927m81949N311243j038072j6722678j5898354R950685L0226268J6851852
$$ y = [15230654, 18351280, 20940265, 15921902, 3707656, 282600, 9711978, 12655793, -2149546, -18152899, -19627478, -16936025, -23116760, -27006654, -13876994, 4917249, 9180449, 3284807, 5381319, 12613215, 4306810, -24068408, -53562739, -65761102, -54161103, -17212887, 36476590, 78717376, 82348050, 53741597, 24475288, 10459844, 1903468, -5252448, 3835023, 34199446, 63596984, 70053837, 59362609, 48811858, 38909356, 20848575, 1194570, -3723864, 4447100, 4657051, -13500557, -34833371, -40938590, -34551113, -30902351, -33665239, -33310197, -26422980, -21745462, -23753927, -24235876, -18924633, -19962705, -36685383, -52583737, -42633052, -12406784, 4445068]
38700D445068q946866l714911L0486692M2659419N520728m2133050m5605777k992006
38692b0280703L9726901M6485143K0538181j3444565l2817511k6691161l457894
38685A0058391J1307654J016685j8291505j6215177J0588196L2971238K8708347
38678F0143829R766764J291307P242777J0287028r86446j8178224k6140166k0422632
38670B3004237q974241j811715k024434m558932j968911P397766J6540666J7064428
38662D4668864Q997438m34183p845660j6336639k3902787j9427709m03339J4481211
38654b02804P403358r113273p231696J1469467J4246417j0589795l0030362j5295123
38646c9343811J3303488K0026431R148018Q699048J5213191J194617k6911559
$$ y = [4445068, -4501798, -8216709, 22269983, 64929402, 70450130, 28317080, -17288697, -20280703, 19446198, 65931341, 86469522, 73024957, 40207446, 13516285, 10058391, 21366045, 22382730, 4091225, -12123952, -1535756, 31435482, 60143829, 69910593, 71201900, 78444677, 88731705, 87745259, 69567035, 43426869, 23004237, 14029996, 12218281, 10193847, 5634915, 3666004, 11063770, 27604436, 44668864, 53666302, 53232119, 45386459, 29049820, 5147033, -14280676, -14684015, -202804, 7200554, -1912719, -9144415, 2325052, 16571469, 5981674, -24048688, -39343811, -26040323, -6013892, 3134126, 11833174, 27046365, 28240982, 1329423]
38639A329423k8357435N161906K9234779J2764240j6381288j8078963K008789
38632a2318549J2888432J0112786J1797818J9294906J5754093l426138k5202863
38625B8900485l8395434l8158452j9577218J2643067L6303117L3456097J3240095
38618B8411757l214863j0463095j4809402j5796046j1163516p994650r291640
38611d4321455l094575J4662101K3531303R780069m008694Q157857K9379574K3517600
38603E7603780o502503k4808810k0215666j3923305j0925600Q919400M3016082
38596C3163378N5030093K8975734m608986j6285551j6468288k4751264l3207624
38589B1847492k6676280j3353820q212123o566549J359054Q139664M661980O16235
$$ y = [1329423, -27028012, -21866106, 7368673, 20132913, 3751625, -14327338, -12318549, 569883, 10682669, 22480487, 41775393, 57529486, 54103348, 28900485, -9494949, -47653401, -67230619, -54587552, -18284435, 15171662, 28411757, 25196894, 14733799, -75603, -15871649, -27035165, -35029815, -44321455, -47416030, -32753929, -9222626, 557443, -3451251, 4706606, 34086180, 57603780, 51101277, 26292467, 6076801, -7846504, -18772104, -9852704, 33163378, 88193471, 117169205, 112560219, 96274668, 79806380, 55055116, 21847492, -4828788, -18182608, -26394731, -32961280, -31602226, -23462562, -18800582, -18184347]
38581a8184347O789654J2818736M713568j0200005j6849814j6040470j4350156
38574e1302834p393488M498692K277547k2723240m1873524k3800082J4579666
38567a25737263K6012442j654153l1320390l0156650o289007J5791878K9162465
38560a24190678L9480860M4561044L5847477J4486771m168054l802971J4014725
38553A6229174K5644439J0131712j9339883k5711529J301217K6289309J7459754
38546E2004193p783425j3917990m114405q829565k9113886l3996370j4082735
38539e9834183L900801L610442J530204J0383886J6041967Q186262J825200P999989
38531f355432J1633915L03145j1213344q188640k517778o503636m542621J8475268
$$ y = [-18184347, -11394693, 1424043, 6137611, -4062394, -20912208, -36952678, -51302834, -58696322, -54197630, -51920083, -74643323, -116516847, -140316929, -125737263, -99724821, -101378974, -132699364, -162856014, -169145021, -153353143, -124190678, -84709818, -40148774, -4301297, 10185474, 6017420, 2214449, 16229174, 41873613, 52005325, 32665442, 6953913, 8255130, 34544439, 52004193, 44220768, 30302778, 26188373, 17358808, -11755078, -45751448, -59834183, -55933382, -52322940, -50792736, -40408850, -24366883, -16180621, -14355421, -6355432, 5278483, 5581628, -5631716, -13820356, -16338134, -22841770, -27384391, -8909123]
38523h909123M1079508L2187024j61403k2138022k5485237k8333204l1118027
38516d2878484j3314011K1561367L7251092J5493539j5655457k1814299n822550
38509b5178803P455898R344545R033372J0839618J0842420R454942J0719746J2594003
38501E5105741R453488L57001j2836956k7949916l5263753j9894136J4725956
38494a6302575L6653034J9053048k0266721l5299516j0628346J8352803J4627398
38487F189125j0575517j7201332N080601K3926482J2773757j2260502j9143295
38480a1210681o585255l96071r578066j3350128K278353K0335888K0816238J2447425
38472A4757703J3816898J7005352m55470l1559182l9699146j0298832K4446631
$$ y = [-8909123, 32170385, 64357409, 64196006, 42057984, 16572747, -11760457, -42878484, -56192495, -34631128, 2619964, 18113503, 2458046, -19356253, -25178803, -17722905, -8378360, 655012, 11494630, 22337050, 31791992, 42511738, 55105741, 64559229, 64916230, 52079274, 24129358, -11134395, -31028531, -16302575, 20350459, 39403507, 19136786, -16162730, -26791076, -8438273, 6189125, -4386392, -21587724, -16507123, 7419359, 20193116, 7932614, -11210681, -17795936, -18192007, -27770073, -41120201, -38841848, -18505960, 2310278, 14757703, 28574601, 45579953, 45124483, 13565301, -26133845, -36432677, -11986046]
38465a1986046K7213397J521222k1195516k4557365j7488824j1706746r007399
38458f7207277o979803j685980J2089224L0191231L4172184J2361996j8223381
38451e281806k8101403j2739658K461298l806858k4390608l6346360k5574741
38444a33780136L840090L3634202M2897790K6525074L043326o271951l350447
38437c3462052m384348r809689n228240P927481R950250j565561k692017J5074559
38429b4189617K3180110J196030k1802989o658134L0642212L5578257m245914
38422C3699955l7023003j8286206K9689878N1962599L0806856l614735j8772757
38415F8462587j1183982K840331P014054n388019k6915715l8489165k7507825
$$ y = [-11986046, 15227351, 16748573, -4446943, -29004308, -46493132, -58199878, -67207277, -74187080, -75873060, -63783836, -33592605, 579579, 12941575, -5281806, -33383209, -46122867, -43661569, -47468427, -71859035, -108205395, -133780136, -129940046, -96305844, -53408054, -26882980, -23839654, -30111605, -33462052, -37846400, -47656089, -52884329, -44956848, -35006598, -36572159, -39264176, -24189617, -1009507, 186523, -21616466, -28274600, 2367612, 37945869, 33699955, -3323048, -21609254, 8080624, 60043223, 90850079, 87235344, 68462587, 57278605, 60118936, 67132990, 61744971, 34829256, -3659909, -31167734]
38408c1167734n359869L051525r721327k2642385j2665711J4152295K8156055
38401c6197151J3120881j2190178j7250300J540603J9230391K0168027J9236013
38394G658286L2983655M5542573K7480981j6126123m3932210l1344132j549178
38387B0713852R666644K28663n568149L833249J7528130K4296058K3345114J5210205
38379A09253766N33370j2136684j3969382j1453730j7495458k6407916j7932478
38372A0391488Q493262K4860194J2610139q514150q356648Q924181J1303514j2392832
38364D7319148l3461529k1367999J5135121L8614773K7877123r13383j7566275
38357E5636979j1011642N563809J4594169J0098409l588526j8493878k4932953
$$ y = [-31167734, -36527603, -33476078, -43197405, -65839790, -78505501, -64353206, -36197151, -23076270, -35266448, -52516748, -50976145, -31745754, -11577727, 7658286, 40641941, 86184514, 113665495, 97539372, 53607162, 22263030, 20713852, 30380496, 30609159, 25041010, 28874259, 46402389, 70698447, 94043561, 109253766, 109787136, 97650452, 83681070, 72227340, 54731882, 28323966, 10391488, 18884750, 43744944, 56355083, 47840933, 39484285, 48408466, 59711980, 47319148, 13857619, -7510380, 7624741, 46239514, 74116637, 73203254, 55636979, 44625337, 50189146, 64783315, 74881724, 71293198, 52799320, 27866367]
38350B7866367j5295978O241940K2001844J7443750j185352j3035537o564289
38343C7472745R483234J9228733J6060341L975681r582015j7902783j7880477
38336D0855459j3449274j2295467j6023758j7863140j2542951k950529N730437
38329b8539223J1712839J2809915N487586n732529o510524R556810K7515713K7053271
38321E3353858Q414973r339071j3545160q769740l546921o72513k688291j2148541
38313A1058594k1003907j3970560Q763935K4756518J6740510l254781j0587558
38306A2502751r52412Q842787Q272016L741136J663835j887464r567061j5461615
38298G153973j7192203k2619019l3832598l5029445j1322568K5016591M3203622
$$ y = [27866367, 12570389, 18812329, 40814173, 58257923, 57072571, 44037034, 37472745, 46955979, 66184712, 82245053, 86220734, 76638719, 58735936, 40855459, 27406185, 15110718, -913040, -18776180, -31319131, -34269660, -28539223, -16826384, -4016469, 1471117, -4261412, -10771936, -1215126, 26300587, 53353858, 61768831, 52429760, 38884600, 30114860, 26567939, 25895426, 23207135, 11058594, -9945313, -23915873, -15151938, 9604580, 26345090, 23090309, 12502751, 11550339, 20393126, 28665142, 32406278, 34070113, 32182649, 22615588, 7153973, -10038230, -32657249, -66489847, -101519292, -112841860, -87825269, -44621647]
38291d4621647L0868337Q899264L200637J2559521J5563637L452248q719015o266966
38283A4936016K963957Q39152j3854191k4048768j9426176q658045k167226L423551
38275d5991730J3356415J9037290J0340742l010327j804944J1504662J2912975
38268A6345083n856897k0735374r554145J3692192J8485844J805163j0296562
38261C885304l145026P426356K720994j1131742j5892133r332013m911133p713211
38253c8092604n626823J2039933L6123379M4270121K4738233r014309k8169185
38246C6268745j4597794K0481338M4614188L4601501K86726k5196610k1181319
38239G5276775j643906L682075j2927293k9207783k5398907j1194931q000974
$$ y = [-44621647, -13753310, -4854046, -1653409, 10906112, 26469749, 29921997, 21202982, 14936016, 17899973, 18739125, 4884934, -19163834, -38590010, -47248055, -49415281, -45991730, -32635315, -13598025, -3257283, -6267610, -8072554, 3432108, 16345083, 10488186, -10247188, -19801333, -6109141, 12376703, 14181866, 3885304, 740278, 8166634, 10887628, -244114, -16136247, -25468260, -30379393, -38092604, -43719427, -31679494, 4443885, 48714006, 73452239, 64437930, 36268745, 21670951, 42152289, 86766477, 121367978, 121654704, 96458094, 75276775, 73632869, 77314944, 64387651, 35179868, 9780961, -1413970, -9414944]
38232i414944j3961649o932560J7816258L4850139K3353564k896767j5851267
38225B6962774j1366528q357641j5843650k0823178j0690196Q230209K0415541
38218a1472669J9556475J1775521N873094L712651j308595j4533844k7850181
38211a4247548k5252613n795576J0259273Q898392L723653J2921189K5677595
38204A6184365J5687731j6137651l9156429l5405265j8656485n035408Q950960
38197g3568182K6946694L5369598K3314958K847257p628753p315104o310842p981719
38189a4326093j0951146j5066941j3569016M065785K8085077K7492814p679826
38182a949346m2404609l8455566l115173K9392665M6788641N6330347M9374128
$$ y = [-9414944, -23376593, -30309153, -12492895, 22357244, 45710808, 42814041, 26962774, 15596246, 7238605, -8605045, -29428223, -40118419, -31888210, -11472669, 8083806, 19859327, 25732421, 29445072, 28136477, 13602633, -14247548, -39500161, -45295737, -35036464, -26138072, -22414419, -9493230, 16184365, 31872096, 15734445, -23421984, -58827249, -77483734, -82519142, -73568182, -46621488, -11251890, 12063068, 14910325, 7281572, -33532, -6344374, -14326093, -25277239, -40344180, -53913196, -49847411, -21762334, 5730480, -1949346, -44353955, -82809521, -85924694, -56532029, -9743388, 46586959, 95961087]
38175I5961087J1340450l6017674m6075506j0265038K6607713K6409098R93999
38168F8954129j8631781k5145765k7078366k4271294j4252529m673637N38260
38161d4560983J1087480K9161316L6931446K4722101J2759376K0965968L3601528
38154A24668232K2174969p981689k4763968j7569187p550371q901120j0213877
38147F9862989k369766J873065r088405k2700128k0109246n463803R7812j0783070
38139A319448k1824291j5410400N277956K1326251K0903729J0968575M971018
38132B7532286M499249O21247q126796j0578958m96182J1608120J3093155O369463
38124D4521584K37749o881526j9552662k7800977j6855254O468763J7724242R338926
$$ y = [95961087, 107301537, 71283863, 25208357, 14943319, 41551032, 67960130, 68954129, 50322348, 25176583, -1901783, -26173077, -40425606, -45099243, -44560983, -33473503, -4312187, 32619259, 57341360, 70100736, 91066704, 124668232, 146843201, 138861512, 114097544, 96528357, 88977986, 80076866, 69862989, 67493223, 69366288, 60277883, 37577755, 17468509, 12004706, 12102518, 1319448, -20504843, -35915243, -30637287, -9311036, 11592693, 22561268, 27532286, 32031535, 32652782, 24525986, 13947028, 13450846, 25058966, 38152121, 44521584, 44759333, 37877807, 18325145, -9475832, -26331086, -19862323, -2138081, 7200845]
38116G200845J413299R819475K2391097K0013876N291649o902278j4645112k3637361
38108B0945490k4879662l562584K8440508L4902049K355829l4104687l0745923
38101f648980Q835836L7623987K3688336j3608953l1938044j6407334J0263498
38094A1808346K1161461J4436666O525864O608171P338450m03181j2639269j8224015
38086C6612493j5837136j5949531k3537716k7723489j6618928L215070J3670139
38079d6169098R992633N648964R555179J2613342N288993m069173k031262P467473
38071a702949J0179035O984856J3321943L0695857L6940645J4576330k3011639
38064H7984078m4863770l5460555n770655K2754546L5388741K8596484Q115143
$$ y = [7200845, 8614144, 18433619, 40824716, 60838592, 66130241, 59227963, 44582851, 20945490, -3934172, -7496756, 20943752, 55845801, 58201630, 24096943, -6648980, 2186856, 39810843, 63499179, 49890226, 17952182, 1544848, 11808346, 32969807, 47406473, 53932337, 60540508, 67878958, 67475777, 54836508, 36612493, 20775357, 4825826, -18711890, -46435379, -63054307, -59839237, -46169098, -36176465, -30527501, -20972322, -8358980, -3069987, -7139160, -9170422, -1702949, 8476086, 15460942, 28782885, 59478742, 96419387, 110995717, 87984078, 43120308, 7659753, 1889098, 24643644, 60032385, 88628869, 96744012]
38057I6744012j4476535k8308786k9734876k2624158j3145028m573467M444840
38050a1673998J6490666K8335008K9410236J2740469j2917274k8473260k4076671
38043I835176q175069M452242Q152463P945010J0954455J8659264K4035097J6885408
38035I2744046k727041j9050316j8220626r505033j4973341l5745932m5267139
38028e2745382k5041531P785355K2132232J1429250n242415j2817255j2909791
38021f7409537r132054J317018J6154442K2540313J2935393j081562r73513J4593027
38013a1056473K6304176J7687974m068929j7801283j6450053j4314213k2026756
38006d1725557k6999357j1858953J6076329L1959862K7421702J7772696J3799271
$$ y = [96744012, 82267477, 53958691, 24223815, 1599657, -11545371, -16118838, -11673998, 4816668, 33151676, 62561912, 75302381, 62385107, 33911847, 9835176, 1660107, 6112349, 14264812, 22209822, 33164277, 51823541, 75858638, 92744046, 90017005, 70966689, 52746063, 43241030, 28267689, -7478243, -52745382, -77786913, -70001558, -47869326, -36440076, -41682491, -54499746, -67409537, -76541591, -75224573, -59070131, -36529818, -23594425, -24675987, -25649500, -11056473, 15247703, 32935677, 28866748, 11065465, -5384588, -19698801, -41725557, -68724914, -80583867, -64507538, -32547676, -5125974, 12646722, 26445993]
37999B6445993P555435p107391k0315963k3274769k1654198k0011262j0685961
37992f9048116P535129J7394960P661190n598122j793116J3213441J9212355J2769786
37984A347507M774133k139450j0518211j1828749J982363J7652542J6220882L714167
37976B1205184R95787Q406318P619369n063079j5604063j9863443k4644297k2966406
37968d9914630j502165K5667811K6248760j063675k1941017j9299677j2768370
37961e4572963j2806828K235878L9958670O4445148M5684632P211195j0640382
37954H1515350q242196r669662j2367781J242294J7061163K972434l3699868m8124056
37946i312322k3742245L825103R36489k0046899k7538201j3987402P080862K6828627
$$ y = [26445993, 34001428, 26894037, 6578074, -16696695, -38350893, -58362155, -69048116, -61512987, -44118027, -36456837, -42054959, -43848075, -30634634, -11422279, 1347507, 6121640, 3982190, -6536021, -18364770, -16382407, 1270135, 17491017, 21205184, 22200971, 30607289, 38226658, 33163579, 17559516, -2303927, -26948224, -49914630, -51416795, -25748984, 499776, -563899, -22504916, -41804593, -54572963, -67379791, -65143913, -25185243, 39259905, 84944537, 92155732, 81515350, 73273154, 63603492, 51235711, 52478005, 69539168, 72511602, 38811734, -9312322, -33054567, -29229464, -28292975, -48339874, -75878075, -89865477, -82784615, -55955988]
37938e5955988M3222316M9447111L8360092J4347348r190613k0679816j5423681
37931D4126769K098277J7576242J7694684N226375n299838q097401j0222753j3210287
37923D9892068o668572J1720818K4095055J3209077j3004404l0130694k6103815
37916B3009533j0874345l4962J390137j330592j754629J143253K871531j90661
37908A4229265l989651m77185R263845J1506415l046302k1909001k1505343J947522
37900a3980435K2890990J6932649o263491j5058563M42590J5112305O918994j0099113
37892A6895926q856894P707308J1918744m008898j6281901p872249P033588Q807644
37884A5343268Q82665k921906j500279J17364M813833J2791859J1305887m929916
$$ y = [-55955988, -12733672, 36713439, 75073531, 89420879, 80230266, 59550450, 44126769, 46225046, 63801288, 81495972, 86722347, 81422509, 73325108, 63102355, 49892068, 43223496, 54944314, 79039369, 92248446, 79244042, 49113348, 23009533, 12135188, 12100226, 13490363, 12159771, 10405142, 11548395, 14419926, 14229265, 10239614, 9762429, 19026274, 30532689, 27486387, 5577386, -15927957, -13980435, 8910555, 25843204, 19579713, 4521150, 4963740, 20076045, 26995039, 16895926, 8039032, 15746340, 27665084, 23656186, 7374285, -497964, 6535624, 15343268, 16225933, 13304027, 11803748, 11921112, 16734945, 29526804, 40832691, 35902775]
37876C5902775j5655024Q5100K9917240M1491688K3576277p166134l3481736m8814023
$$ y = [35902775, 20247751, 20332851, 50250091, 91741779, 115318056, 108151922, 74670186, 25856163]
$$ [...]
##END NTUPLES=NMR SPECTRUM
##END=
