##TITLE=31Pdec_DE-43_EA_W
 D2O
 24 sc
 4.4.2024
##JCAMPDX= 6.0         $$ Bruker NMR JCAMP-DX V2.0
##DATA TYPE= NMR SPECTRUM
##DATA CLASS= NTUPLES
##ORIGIN= UXNMR, Bruker Analytische Messtechnik GmbH
##OWNER= root
$$ XWIN-NMR		Version 3.5
$$ Thu Apr  4 13:55:53 2024 Russian Standard Time (UT+4h)  she@DPX200
##.OBSERVE FREQUENCY= 81.013821
##.OBSERVE NUCLEUS= ^31P
##.ACQUISITION MODE= SIMULTANEOUS
##.ACQUISITION SCHEME= undefined
##.AVERAGES= 24
##.DIGITISER RES= 16
##SPECTROMETER/DATA SYSTEM= spect
##.PULSE SEQUENCE= zgpg30
##.SOLVENT NAME= CDCl3
##.SHIFT REFERENCE= (INTERNAL, CDCl3, 0, 248.564)
##AUDIT TRAIL= $$ (NUMBER, WHEN, WHO, WHERE, WHAT)
$$ ##TITLE= Audit trail, XWIN-NMR		Version 3.5
$$ ##JCAMPDX= 5.01
$$ ##ORIGIN= Bruker BioSpin GmbH
$$ ##OWNER= she
$$ F:/spectra/data/she/nmr/P31/1/pdata/1/auditp.txt
$$ ##AUDIT TRAIL=  $$ (NUMBER, WHEN, WHO, WHERE, WHAT)
(   1,<2024-04-04 13:55:03.26 +0400>,<she>,<DPX200>,
      <created by zg, POWCHK disabled, PULCHK disabled
       configuration hash MD5:
       00 E9 B6 7A A2 85 ED C7 34 08 36 98 17 FE 4E 26
       data hash MD5: 32K
       84 76 37 C9 3D A9 A6 F8 C8 03 7B 97 5C D9 F5 C1>)
(   2,<2024-04-04 13:55:08.40 +0400>,<she>,<DPX200>,
      <Start of raw data processing
       efp BC_mod = 2 LB = 10 FT_mod = 6 PKNL = 1 PHC0 = -13218.86 PHC1 = 65.08333 SI = 64K 
       data hash MD5: 64K
       B4 6F E6 2B 35 5B 0B 0E 8F A7 71 15 23 7D E3 C7>)
(   3,<2024-04-04 13:55:21.87 +0400>,<she>,<DPX200>,
      <pk PHC0 = -13.23288 PHC1 = 0 
       data hash MD5: 64K
       18 23 26 4E 2C 27 44 EF EE B7 CD D7 47 8F 92 EB>)
(   4,<2024-04-04 13:55:26.60 +0400>,<she>,<DPX200>,
      <abs ABSG = 5 
       data hash MD5: 64K
       86 F5 7F B9 E2 48 6F 5E 3B 9B 34 45 FF A5 DA 71>)
$$ ##END=
$$ 
$$ hash MD5
$$ B0 07 35 58 9B 17 AD C3 E5 92 B4 8B CB 08 B3 CB
##$RELAX= 
##$RELAX= 
##$RELAX= 
##$RELAX= 
##$RELAX= 
##$RELAX= 
##$RELAX= 
##$RELAX= 
##$RELAX= 
$$ Bruker specific parameters
$$ --------------------------
##$DU= <F:/spectra>
##$EXPNO= 1
##$NAME= <P31>
##$PROCNO= 1
##$TYPE= <nmr>
##$USER= <she>
##$AMP= (0..31)
100 100 100 100 100 100 100 100 100 100 100 100 100 100 100 100 100 100 
100 100 100 100 100 100 100 100 100 100 100 100 100 100 
##$AQSEQ= 0
##$AQ_mod= 1
##$AUNM= <au_zg>
##$AUTOPOS= <>
##$BF1= 81.014009
##$BF2= 200.13
##$BF3= 200.13
##$BF4= 200.13
##$BF5= 200.13
##$BF6= 200.13
##$BF7= 200.13
##$BF8= 200.13
##$BYTORDA= 1
##$CFDGTYP= 0
##$CFRGTYP= 5
##$CHEMSTR= <none>
##$CNST= (0..31)
1 1 145 1 1 1 1 1 1 1 1 1 1 1 1 1 1 1 1 1 1 1 1 1 1 1 1 1 1 1 1 1 
##$CPDPRG= <waltz16>
##$CPDPRG1= <>
##$CPDPRG2= <waltz16>
##$CPDPRG3= <>
##$CPDPRG4= <mlev>
##$CPDPRG5= <mlev>
##$CPDPRG6= <mlev>
##$CPDPRG7= <mlev>
##$CPDPRG8= <mlev>
##$CPDPRGB= <>
##$CPDPRGT= <>
##$D= (0..31)
0 1 0 0 0 0 0 0 0 0 0 0.03 2e-05 3e-06 0 0 0 0 0 0 0 0 0 0 0 0 0 0 0 0 
0 0 
##$DATE= 1712224502
##$DBL= (0..7)
120 120 120 11 120 120 24 19 
##$DBP= (0..7)
150 150 150 150 150 150 150 150 
##$DBP07= 0
##$DBPNAM0= <>
##$DBPNAM1= <>
$$ [...]
##$SUBNAM3= <"">
##$SUBNAM4= <"">
##$SUBNAM5= <"">
##$SUBNAM6= <"">
##$SUBNAM7= <"">
##$SUBNAM8= <"">
##$SUBNAM9= <"">
##$SW= 501.771253377433
##$SWIBOX= (0..15)
0 1 3 0 0 0 0 0 0 0 0 0 0 0 0 0 
##$SW_h= 40650.406504065
##$TD= 32768
##$TD0= 1
##$TE= 0
##$TE2= 300
##$TE3= 300
##$TEG= 300
##$TL= (0..7)
0 120 53 12 22 120 120 120 
##$TP= (0..7)
150 150 150 150 150 150 150 150 
##$TP07= 0
##$TPNAME0= <>
##$TPNAME1= <>
##$TPNAME2= <>
##$TPNAME3= <>
##$TPNAME4= <>
##$TPNAME5= <>
##$TPNAME6= <>
##$TPNAME7= <>
##$TPOAL= (0..7)
0.5 0.5 0.5 0.5 0.5 0.5 0.5 0.5 
##$TPOFFS= (0..7)
0 0 0 0 0 0 0 0 
##$TUNHIN= 0
##$TUNHOUT= 0
##$TUNXOUT= 0
##$USERA1= <user>
##$USERA2= <user>
##$USERA3= <user>
##$USERA4= <user>
##$USERA5= <user>
##$V9= 5
##$VALIST= <valist>
##$VCLIST= <CCCCCCCCCCCCCCC>
##$VD= 0
##$VDLIST= <DDDDDDDDDDDDDDD>
##$VPLIST= <PPPPPPPPPPPPPPP>
##$VTLIST= <TTTTTTTTTTTTTTT>
##$WBST= 1024
##$WBSW= 4
##$XGAIN= (0..3)
0 0 0 0 
##$XL= 0
##$YL= 0
##$YMAX_a= 1666
##$YMIN_a= -1334
##$ZGOPTNS= <>
##$ZL1= 120
##$ZL2= 120
##$ZL3= 120
##$ZL4= 120
##$ABSF1= 248.5645
##$ABSF2= -253.2056
##$ABSG= 5
##$ABSL= 3
##$ALPHA= 0
##$AQORDER= 0
##$ASSFAC= 0
##$ASSFACI= 0
##$ASSFACX= 0
##$ASSWID= 0
##$AUNMP= <proc_1d>
##$AZFE= 0.1
##$AZFW= 0.5
##$BCFW= 0
##$BC_mod= 2
##$BYTORDP= 0
##$COROFFS= 0
##$CY= -3
##$DATMOD= 1
##$DC= 0
##$DFILT= <>
##$DTYPP= 0
##$F1P= 0
##$F2P= 0
##$FCOR= 1
##$FTSIZE= 65536
##$FT_mod= 6
##$GAMMA= 0
##$GB= 0
##$INTBC= 1
##$INTSCL= 6.047779e-11
##$ISEN= 30
##$LB= 10
##$LEV0= 0
##$LPBIN= 0
##$MAXI= 10000
##$MC2= 0
##$MEAN= 0
##$ME_mod= 0
##$MI= 50
##$NCOEF= 0
##$NC_proc= -10
##$NLEV= 6
##$NOISF1= 182.463
##$NOISF2= 159.3651
##$NSP= 0
##$NTH_PI= 0
##$NZP= 0
##$OFFSET= 248.5645
##$PC= 4
##$PHC0= -13232.09
##$PHC1= 65.08333
##$PH_mod= 1
##$PKNL= yes
##$PPARMOD= 0
##$PSCAL= 0
##$PSIGN= 0
##$REVERSE= no
##$SF= 81.0140089999694
##$SI= 65536
##$SIGF1= 159.3651
##$SIGF2= -187.1042
##$SINO= 113.3802
##$SIOLD= 16384
##$SREGLST= <1H.CDCl3>
##$SSB= 0
##$STSI= 65536
##$STSR= 0
##$SW_p= 40650.406504065
##$SYMM= 0
##$S_DEV= 0
##$TDeff= 32768
##$TDoff= 0
##$TI= <>
##$TILT= no
##$TM1= 0
##$TM2= 0
##$TOPLEV= 0
##$USERP1= <user>
##$USERP2= <user>
##$USERP3= <user>
##$USERP4= <user>
##$USERP5= <user>
##$WDW= 1
##$XDIM= 65536
##$YMAX_p= 298933000
##$YMIN_p= -86209253
$$ End of Bruker specific parameters
$$ ---------------------------------
##NTUPLES= NMR SPECTRUM
##VAR_NAME=  FREQUENCY,     SPECTRUM/REAL,   SPECTRUM/IMAG
##SYMBOL=    X,             R,               I
##VAR_TYPE=  INDEPENDENT,   DEPENDENT,       DEPENDENT
##VAR_FORM=  AFFN,          ASDF,            ASDF
##VAR_DIM=   65536,         65536,           65536
##UNITS=     HZ,            ARBITRARY UNITS, ARBITRARY UNITS
##FACTOR=    0.620285442955139, 1,           1
##FIRST=     20137.2065510682, 0,            0
##LAST=      -20513.1999529968, 0,           0
##MIN=       -20513.1999529968, -86209253,   0
##MAX=       20137.2065510682, 298933000,    0
$$ Real data points
##PAGE= N=1
##DATA TABLE= (X++(R..R)), XYDATA
$$ [...]
43673 3645003 4877272 6104005 7298930 8436588 9493302 10447357 11278869 11971462 12517109
43664 12517109 12922474 13212659 13428687 13618487 13824999 14076213 14379571 14719645 15057811
43655 15057811 15336121 15489497 15466020 15247552 14859971 14367406 13853164 13395477 13047170
43646 13047170 12826102 12718684 12692753 12712026 12745203 12767392 12756350 12688552 12539930 12292630
43636 12292630 11943842 11509990 11022773 10520016 10037015 9600970 9227134 8915522 8649951
43627 8649951 8402296 8142452 7851422 7533128 7220183 6969780 6848678 6910797 7174964 7611601
43617 7611601 8144401 8667153 9069604 9262949 9197007 8865641 8300495 7554960 6682367 5716053
43607 5716053 4660554 3498398 2207837 780629 -768640 -2402933 -4069028 -5706176
43599 -5706176 -7255073 -8664655 -9893959 -10909515 -11683548 -12198644 -12458233 -12495068 -12368850
43590 -12368850 -12150875 -11902068 -11654996 -11408400 -11136522 -10808074 -10404396 -9926895 -9391269
43581 -9391269 -8815820 -8214640 -7599810 -6986912 -6395293 -5841218 -5329911 -4853439 -4395708
43572 -4395708 -3939982 -3473136 -2983989 -2458159 -1875481 -1214914 -465764 361940 1235140
43563 1235140 2105203 2921180 3642887 4249523 4742392 5143221 5490281 5832090 6216392
43554 6216392 6674943 7210959 7797729 8389629 8937385 9397620 9733801 9913217 9905897 9687174
43544 9687174 9241700 8566589 7674043 6595132 5383591 4114252 2871158 1727093 723665
43535 723665 -138389 -894816 -1602143 -2316707 -3075427 -3885103 -4723799 -5552185 -6327826 -7015611
43525 -7015611 -7591652 -8042453 -8362884 -8555221 -8629121 -8601069 -8492343 -8325660 -8120566 -7887713
43515 -7887713 -7623945 -7312076 -6927767 -6451006 -5876498 -5218932 -4513113 -3810539 -3172908
43506 -3172908 -2662263 -2328626 -2197394 -2259696 -2469220 -2748771 -3007499 -3164856 -3172701 -3026221
43496 -3026221 -2759528 -2429320 -2094495 -1798449 -1557364 -1356687 -1158059 -916256 -599972
43487 -599972 -206865 233716 670647 1048491 1324852 1480110 1516733 1452771 1317787 1154216
43477 1154216 1018448 973672 1073569 1344590 1776601 2326732 2933659 3534145 4074026 4512182
43467 4512182 4822812 5000938 5068523 5072934 5073510 5121844 5246358 5447303 5700388 5964062 6188415
43456 6188415 6327025 6351252 6261216 6085350 5866076 5638580 5414523 5178764 4898916 4541459
43446 4541459 4086491 3534902 2905704 2226436 1523149 815532 117567 -560541 -1213530
43437 -1213530 -1844942 -2468457 -3101956 -3755968 -4424616 -5086171 -5712452 -6279335 -6771406
43428 -6771406 -7180267 -7501236 -7733137 -7882405 -7968639 -8026562 -8100257 -8229979 -8436872 -8713258
43418 -8713258 -9023866 -9318276 -9549065 -9686812 -9724937 -9674038 -9552354 -9380195 -9181213 -8986552
43408 -8986552 -8834479 -8760637 -8781503 -8880878 -9009576 -9100049 -9088013 -8931126 -8619966 -8180721
43398 -8180721 -7668696 -7152431 -6693668 -6332762 -6085462 -5948412 -5906395 -5937244 -6014982 -6113440
43388 -6113440 -6211825 -6301912 -6393574 -6513050 -6691063 -6945422 -7267926 -7622426 -7952882 -8195530
43378 -8195530 -8290863 -8194413 -7886231 -7377531 -6712215 -5961739 -5213549 -4555039 -4056309 -3755497
43368 -3755497 -3650631 -3701714 -3844528 -4012152 -4154510 -4246167 -4279742 -4250800 -4143584 -3924724
43358 -3924724 -3548284 -2971278 -2173191 -1168692 -5492 1250279 2529556 3766396 4894563
43349 4894563 5843509 6542550 6934629 6993603 6736007 6220233 5531430 4756740 3960423 3169183
43339 3169183 2373230 1540672 636668 -361391 -1456546 -2631670 -3852615 -5072338 -6234500
43330 -6234500 -7277401 -8141583 -8782611 -9183886 -9359980 -9345882 -9178373 -8880807 -8457953
43321 -8457953 -7900207 -7194040 -6335778 -5344367 -4267271 -3176451 -2156873 -1292441 -652677
43312 -652677 -281982 -193483 -368811 -762682 -1310053 -1934688 -2558435 -3109516 -3528524 -3773751
43302 -3773751 -3828340 -3707437 -3458596 -3150432 -2852337 -2614641 -2458172 -2376521 -2347724 -2348035
43292 -2348035 -2360924 -2379428 -2405358 -2448938 -2527650 -2660285 -2856100 -3105002 -3375346 -3620773
43282 -3620773 -3792700 -3853941 -3789308 -3609160 -3344061 -3033557 -2715022 -2416129 -2150619 -1916760
43272 -1916760 -1700187 -1482025 -1248644 -997245 -734618 -471236 -214703 34148 280806
43263 280806 533072 797384 1079437 1388439 1739729 2151436 2636394 3194592 3811067 4461542
43253 4461542 5124358 5792507 6476663 7194456 7951634 8727954 9477212 10140215 10661905
43244 10661905 11004524 11154017 11121417 10941373 10668030 10366775 10101706 9922368 9855200 9902887
43234 9902887 10049998 10270542 10533589 10805692 11051490 11235766 11329552 11319006 11211143 11030208
43224 11030208 10803923 10546084 10245559 9869297 9379848 8759378 8027174 7240484 6478384
43215 6478384 5817808 5313101 4985210 4820838 4779797 4809018 4860202 4905220 4942964 4995557
43205 4995557 5097572 5284170 5581691 6000651 6530431 7136825 7764521 8345017 8808454
43196 8808454 9097460 9181211 9065883 8795223 8436700 8056408 7694450 7353914 7008809 6624775
43186 6624775 6179557 5672150 5118341 4539495 3954868 3383370 2852055 2402994 2091403
43177 2091403 1974414 2095879 2474269 3098095 3928927 4908694 5967286 7029068 8020336
43168 8020336 8879635 9568552 10076795 10417778 10618046 10707889 10716983 10672556 10596138 10499002
43158 10499002 10379773 10226284 10020555 9744749 9386479 8942137 8417274 7824939 7183916
43149 7183916 6516995 5847253 5192757 4564527 3971483 3428172 2955711 2572119 2279250
43140 2279250 2057258 1870343 1678538 1448536 1160571 811589 414989 -3271 -411728
43131 -411728 -781919 -1095623 -1346951 -1535635 -1651968 -1661096 -1498940 -1087602 -365632 682894
43121 682894 2016461 3545440 5153762 6721136 8140729 9333186 10256936 10911331 11330344
43112 11330344 11569327 11689629 11744349 11767567 11770496 11747033 11685923 11581763 11438071 11261518
43102 11261518 11051596 10791670 10446908 9972703 9332517 8517668 7558575 6521285 5491526
43093 5491526 4554341 3777032 3199688 2834547 2673028 2696245 2883070 3212457 3662287 4209519
43083 4209519 4833199 5517305 6250079 7019977 7810631 8596894 9343683 10009753 10557168
43074 10557168 10963110 11227794 11373834 11437027 11452474 11442501 11413266 11363273 11298945 11245901 11246814
43063 11246814 11346403 11572408 11922025 12358377 12816622 13216370 13475770 13523079 13304006 12785864
43053 12785864 11960315 10845369 9485967 7951860 6331337 4720334 3208520 1865733
43045 1865733 731954 -187372 -919483 -1515172 -2033664 -2525661 -3019768 -3515827 -3986425
43036 -3986425 -4386524 -4669009 -4800600 -4771537 -4596633 -4310947 -3964261 -3614592 -3318667 -3120355
43026 -3120355 -3041883 -3081533 -3216541 -3407415 -3601822 -3739086 -3757087 -3602366 -3242331 -2675502
43016 -2675502 -1933822 -1074180 -163609 732994 1557678 2259125 2792203 3119103 3211196 3051873
43006 3051873 2641122 1999740 1168425 200049 -850461 -1931927 -2995610 -3989827 -4855821
42997 -4855821 -5529117 -5947977 -6067396 -5873589 -5392313 -4686692 -3845709 -2968832 -2151807
42988 -2151807 -1474836 -991684 -719870 -635985 -681109 -776854 -845974 -828724 -689811 -417862
42978 -417862 -23256 461805 983079 1469849 1849449 2066690 2098183 1953075 1660016 1248970
42968 1248970 739043 138440 -545266 -1292013 -2061579 -2796801 -3436932 -3933646 -4259629
42959 -4259629 -4405396 -4370353 -4158877 -3785870 -3285261 -2711055 -2126750 -1588164 -1128534 -752682
42949 -752682 -442013 -166760 102000 387493 710892 1098279 1583645 2203940 2987440 3940402
42939 3940402 5038174 6225062 7423424 8548919 9527386 10308933 10875107 11236298 11420055
42930 11420055 11455461 11360727 11139414 10786627 10302049 9703184 9031374 8346614 7713185 7182414
42920 7182414 6779392 6498055 6305720 6154707 5995968 5789849 5512201 5156775 4734880
42911 4734880 4271238 3794976 3327676 2873750 2418475 1935272 1399230 801633 160486
42902 160486 -477371 -1045749 -1479264 -1736542 -1814678 -1747059 -1586806 -1386507 -1185582 -1009765
42892 -1009765 -878661 -812743 -833709 -959095 -1196713 -1542592 -1981782 -2490696 -3042092 -3613168
42882 -3613168 -4192534 -4780246 -5380398 -5992044 -6603988 -7194191 -7731854 -8180796 -8503555
42873 -8503555 -8665554 -8639948 -8414598 -7999736 -7430512 -6759566 -6041994 -5320912 -4620105 -3944313
42863 -3944313 -3284090 -2622441 -1941527 -1228244 -477967 303854 1102898 1900585 2681266
42854 2681266 3439234 4182562 4931900 5713557 6548158 7439187 8367660 9296524 10182555
42845 10182555 10989441 11696359 12299623 12807779 13232636 13580745 13850251 14034685 14130270
42836 14130270 14140990 14078159 13955570 13783299 13562338 13280999 12914605 12430579 11799317 11007074
42826 11007074 10064308 9005181 7879859 6745398 5659306 4674593 3833000 3156691 2643370
42817 2643370 2269396 1999742 1798699 1635738 1485344 1323773 1126882 871689 541003
42808 541003 127504 -366161 -930624 -1551897 -2209042 -2869275 -3485873 -4002695 -4364798 -4531595
42798 -4531595 -4487747 -4246950 -3845693 -3329128 -2736728 -2096240 -1428641 -758524 -120398 445149
42788 445149 903181 1235716 1445297 1550512 1579052 1563237 1537395 1533322 1572812 1661348 1787428
42777 1787428 1927084 2048581 2113789 2078794 1899658 1545336 1012162 331103 -436224 -1209286
42767 -1209286 -1901886 -2434315 -2745392 -2803714 -2613367 -2209527 -1645893 -982058 -277591 408078
42757 408078 1017012 1500442 1830577 2008896 2065086 2047701 2012913 2016864 2111177 2337157 2716713
42746 2716713 3244813 3891355 4614817 5380088 6168051 6970094 7772110 8539945 9216077
42737 9216077 9728862 10008950 10006436 9704502 9126340 8332606 7409490 6452442 5552075 4784652
42727 4784652 4204374 3835022 3663783 3643457 3706456 3787446 3846320 3882148 3932077 4055895
42717 4055895 4313473 4744834 5359333 6134998 7025440 7970710 8908640 9783553 10550314
42708 10550314 11173398 11622919 11871799 11899052 11700960 11305011 10776238 10208153 9699862
42699 9699862 9329944 9139218 9128444 9267976 9510205 9796169 10054607 10199958 10137875 9780924
42689 9780924 9068742 7983552 6554779 4851729 2967438 999646 -964419 -2855175
42681 -2855175 -4620283 -6220504 -7625489 -8811560 -9762428 -10472300 -10948406 -11209415 -11279710
42672 -11279710 -11184055 -10947618 -10601842 -10191799 -9778602 -9431852 -9211892 -9148516 -9227078 -9389520
42662 -9389520 -9549292 -9613832 -9508858 -9199263 -8698906 -8062296 -7360735 -6656074 -5985524 -5360906
42652 -5360906 -4777049 -4223033 -3692222 -3187555 -2719867 -2301146 -1938024 -1629194 -1366497
42643 -1366497 -1137901 -931436 -739565 -563166 -414070 -314487 -291158 -364267 -536251 -787766
42633 -787766 -1082750 -1377057 -1624226 -1778347 -1798764 -1659142 -1357895 -924611 -419070 77695
42623 77695 478734 709566 724462 514925 107531 -446316 -1081970 -1728906 -2313857 -2763444
42613 -2763444 -3008974 -2993179 -2678463 -2056770 -1158612 -54678 1155444 2365496 3486486
42604 3486486 4461933 5268503 5903002 6363565 6636655 6697765 6523444 6104761 5454360 4607409
42594 4607409 3620712 2570889 1548322 644683 -62887 -524716 -724020 -674894 -416527
42585 -416527 -7114 482447 977986 1416264 1759801 2003472 2166105 2269918 2320213 2298635
42575 2298635 2173939 1922776 1548267 1087724 606847 182365 -120731 -267350 -256185 -107741
42565 -107741 154191 514011 961372 1477840 2024368 2539621 2951579 3196658 3236886 3068026
42555 3068026 2717355 2234629 1681027 1119389 607112 191935 -90116 -216493 -181939 -4849
42545 -4849 267030 556961 768472 801291 568640 12192 -886416 -2098886 -3551421 -5136074
42535 -5136074 -6730298 -8218956 -9512462 -10556583 -11331815 -11843142 -12104724 -12126547 -11908665
42526 -11908665 -11443877 -10725829 -9758875 -8567207 -7200578 -5733270 -4254848 -2855629
42518 -2855629 -1612514 -578992 220261 790515 1162789 1384503 1508336 1583353 1648927
42509 1648927 1729250 1828234 1927986 1993131 1978800 1838171 1528243 1016257 289160 -635398
42499 -635398 -1702315 -2823094 -3892728 -4814050 -5519821 -5984911 -6226460 -6293953 -6252935
42490 -6252935 -6168170 -6092887 -6067178 -6121722 -6279967 -6555798 -6949489 -7445976 -8016865 -8625381
42480 -8625381 -9232980 -9805754 -10317824 -10749755 -11082939 -11293690 -11351379 -11222814 -10881135 -10314441
42470 -10314441 -9530262 -8556057 -7438130 -6239094 -5031042 -3883258 -2848142 -1950928
42462 -1950928 -1186104 -520644 96060 715994 1373517 2070909 2775795 3432940 3985719
42453 3985719 4396453 4654329 4767015 4744092 4586995 4294033 3875056 3361424 2801599 2245205
42443 2245205 1727014 1259856 836769 436839 30578 -414453 -925363 -1513822 -2168842
42434 -2168842 -2856882 -3529599 -4135395 -4630232 -4985066 -5189674 -5253242 -5201452 -5069088 -4888628
42424 -4888628 -4678370 -4436255 -4143967 -3780489 -3338448 -2834976 -2312386 -1829867 -1451166
42415 -1451166 -1233107 -1216947 -1421993 -1840673 -2435940 -3143483 -3880508 -4559716 -5103726 -5454777
42405 -5454777 -5577994 -5460294 -5107899 -4543237 -3800845 -2923680 -1962881 -981728 -59148
42396 -59148 714419 1252091 1492163 1416709 1058302 491996 -183415 -867244 -1475618 -1954703
42386 -1954703 -2287716 -2493033 -2610340 -2677616 -2710559 -2697667 -2614124 -2444242 -2197858 -1913406
42376 -1913406 -1650034 -1474527 -1446772 -1605836 -1959452 -2480094 -3109099 -3767845 -4373247 -4853928
42366 -4853928 -5163065 -5284986 -5234673 -5051054 -4786262 -4494157 -4221844 -4005651 -3869648 -3824186
42356 -3824186 -3865193 -3977361 -4141544 -4341642 -4565821 -4802867 -5039982 -5267089 -5485760 -5715468
42346 -5715468 -5990999 -6350709 -6820669 -7401105 -8059924 -8735963 -9352290 -9836232 -10138490
42337 -10138490 -10242828 -10162808 -9929523 -9578062 -9138355 -8631950 -8073717 -7476457 -6855287
42328 -6855287 -6228364 -5613172 -5021573 -4458443 -3926015 -3431243 -2990709 -2628381 -2365386
42319 -2365386 -2205839 -2126309 -2076169 -1991025 -1813933 -1514082 -1094340 -586639 -41435 481515
42309 481515 918845 1208566 1296995 1146694 742388 93323 -767411 -1786126 -2894840
42300 -2894840 -4020729 -5096830 -6070910 -6910153 -7600867 -8144072 -8549452 -8831200 -9008320
42291 -9008320 -9108413 -9170180 -9239426 -9357516 -9547102 -9803020 -10093818 -10373131 -10594519 -10722623
42281 -10722623 -10737531 -10634123 -10419932 -10113087 -9739715 -9329625 -8909926 -8497283 -8090816
42272 -8090816 -7669424 -7197195 -6636739 -5964859 -5183143 -4319463 -3421729 -2547709 -1754046
42263 -1754046 -1085755 -566676 -191988 74361 293485 535688 859911 1297340 1845020
42254 1845020 2468682 3111097 3704653 4187989 4522521 4700545 4739980 4669929 4516916 4298333
42244 4298333 4022156 3688464 3291097 2821825 2279121 1678608 1057856 469911 -32420
42235 -32420 -412545 -657709 -776471 -790480 -725904 -607080 -452979 -276899 -89332 97801
42225 97801 268885 407126 501627 555053 585964 622082 686556 784359 896073 981898 993558
42214 993558 888869 643549 256854 -248499 -828832 -1422449 -1955434 -2354095 -2562793 -2559023
42204 -2559023 -2357241 -2000003 -1542722 -1039632 -534420 -55063 388015 799657 1192427
42195 1192427 1574818 1939481 2257396 2482022 2562761 2462041 2168493 1701377 1107186 453687
42185 453687 -174448 -680080 -963948 -943852 -577053 125690 1103285 2264021 3512825
42176 3512825 4774780 6007847 7203827 8380828 9570521 10801774 12082294 13383420
42168 13383420 14635700 15739631 16588189 17092014 17198811 16902682 16242323 15288832 14126876
42159 14126876 12836236 11480153 10102210 8729221 7377477 6060821 4797818 3613855
42151 3613855 2536805 1590700 793349 158139 -305489 -596648 -728910 -729912 -631672 -457120
42141 -457120 -212172 111255 523821 1027014 1608306 2244365 2907993 3574215 4224608 4851555
42131 4851555 5463419 6089015 6777951 7593189 8594932 9821078 11274767 12926977 14731053
42122 14731053 16636719 18593290 20543092 22414810 24125521 25592911 26752502 27572124
42114 27572124 28057276 28245861 28195941 27972156 27634273 27228803 26784529 26313544 25817851
42105 25817851 25298303 24760999 24217724 23680370 23152539 22623446 22068655 21458413 20769129
42096 20769129 19990822 19125853 18181019 17160542 16066911 14909709 13715843 12534273
42088 12534273 11433532 10494589 9800825 9424329 9408736 9752928 10402320 11252568 12165922
42079 12165922 12995897 13612933 13923714 13880459 13481459 12766142 11805899 10690204 9509317
42070 9509317 8338117 7225812 6193060 5235455 4332352 3459849 2604033 1767962 968626
42061 968626 227876 -433500 -993270 -1421108 -1677521 -1723105 -1533268 -1108867 -477490 312588
42051 312588 1200397 2118758 2998997 3774622 4384618 4777414 4917305 4793552 4428242 3875665
42041 3875665 3208433 2494203 1775646 1066754 368246 -309217 -931494 -1447235 -1808903
42032 -1808903 -1992867 -2005511 -1874922 -1638821 -1339538 -1027309 -764150 -620380 -662878 -940437
42022 -940437 -1471855 -2239562 -3190152 -4243384 -5309297 -6308744 -7189396 -7930781 -8537260
42013 -8537260 -9023542 -9400854 -9671079 -9830613 -9878375 -9819581 -9661908 -9408573 -9055740 -8597249
42003 -8597249 -8033385 -7378058 -6660767 -5922938 -5210471 -4565027 -4016781 -3580971 -3259614
41994 -3259614 -3046977 -2934507 -2911510 -2963304 -3072877 -3228674 -3432403 -3697593 -4037232 -4448599
41984 -4448599 -4904765 -5355722 -5736771 -5981925 -6041104 -5897420 -5577776 -5150755 -4710596 -4351800
41974 -4351800 -4143398 -4113057 -4247742 -4509454 -4856861 -5261709 -5713762 -6215049 -6768520 -7366390
41964 -7366390 -7981745 -8565673 -9051202 -9363805 -9435748 -9220038 -8699894 -7891147 -6837012
41955 -6837012 -5597722 -4240773 -2837174 -1463688 -204466 854712 1639708 2102106
41947 2102106 2227100 2032960 1564680 885991 73066 -789198 -1610816 -2304052 -2795500
41938 -2795500 -3038395 -3018377 -2749581 -2264426 -1603621 -810065 74635 1013895 1979702 2952288
41928 2952288 3913420 4836022 5676374 6373838 6859404 7071308 6973809 6572660 5920333 5107864
41918 5107864 4246232 3443722 2785310 2319082 2053761 1967992 2025927 2190252 2427637 2708883
41908 2708883 3008895 3308259 3593966 3856687 4085131 4260538 4354586 4332063 4157004 3799482
41898 3799482 3241769 2485007 1556749 515427 -554312 -1556586 -2403155 -3027796 -3393055
41889 -3393055 -3491556 -3343751 -2991180 -2484843 -1872497 -1190872 -465649 283858 1041712 1798294
41879 1798294 2556987 3337000 4165849 5063008 6024306 7017472 7991895 8896638 9696241
41870 9696241 10375678 10932528 11362852 11652012 11778097 11725560 11498938 11127660 10660319 10152202
41860 10152202 9650984 9185169 8760370 8366525 7992789 7640802 7327554 7076452 6902565
41851 6902565 6800280 6739320 6671635 6548071 6339399 6052836 5735621 5462784 5313602 5346636
41841 5346636 5583944 6010843 6589878 7280373 8052418 8888133 9770709 10668870 11527460
41832 11527460 12271895 12825520 13129556 13153284 12890665 12351087 11555556 10541937 9372364
41823 9372364 8132319 6916715 5807863 4856346 4074238 3442040 2922414 2471894 2047076
41814 2047076 1608191 1124698 583795 -1968 -593635 -1134640 -1567531 -1852088 -1977546
41805 -1977546 -1964796 -1858766 -1714389 -1581993 -1498575 -1488111 -1567526 -1750970 -2048180 -2459166
41795 -2459166 -2970207 -3553659 -4171219 -4779936 -5340016 -5821517 -6205769 -6480019 -6629051
41786 -6629051 -6630718 -6460481 -6104142 -5571541 -4901885 -4155733 -3396756 -2671926 -1998858 -1365114
41776 -1365114 -739659 -91820 590644 1292291 1971682 2569938 3021342 3265230 3260228 2998662
41766 2998662 2515144 1884567 1209486 600345 152636 -73808 -66590 141494 486748 892237
41756 892237 1280783 1582471 1741203 1722442 1518350 1145126 632564 11597 -693575 -1465731
41746 -1465731 -2288179 -3135132 -3963771 -4713152 -5313194 -5702984 -5852877 -5781363 -5557335 -5283160
41736 -5283160 -5063093 -4970011 -5024956 -5197049 -5421251 -5624921 -5752799 -5782321 -5725145 -5616680
41726 -5616680 -5500660 -5416593 -5393060 -5444306 -5567573 -5742584 -5936282 -6112014 -6238040 -6291897
41716 -6291897 -6262305 -6152006 -5980571 -5782392 -5597591 -5460016 -5389062 -5388476 -5449931 -5557482
41706 -5557482 -5690529 -5824897 -5932866 -5984325 -5951893 -5820953 -5600865 -5330406 -5072336 -4898481
41696 -4898481 -4871922 -5032618 -5388030 -5907005 -6517332 -7111678 -7566605 -7772236 -7661377 -7224649
41686 -7224649 -6505247 -5577746 -4521879 -3401642 -2255086 -1095520 78323 1268097
41678 1268097 2463893 3639581 4756160 5769793 6640575 7340496 7860527 8215383 8442570
41669 8442570 8593556 8718939 8852727 9001037 9138474 9213039 9158318 8909624 8419584 7668691
41659 7668691 6667740 5451799 4068915 2569411 1000481 -593659 -2169464 -3682253
41651 -3682253 -5085195 -6329222 -7366571 -8160161 -8696086 -8991645 -9092756 -9061382 -8959360
41642 -8959360 -8834936 -8714318 -8598025 -8462930 -8272482 -7995001 -7623549 -7186767 -6743719
41633 -6743719 -6364983 -6109737 -6009133 -6061590 -6240033 -6506799 -6829332 -7189777 -7584805 -8017319
41623 -8017319 -8486064 -8980103 -9481483 -9972988 -10443093 -10882652 -11276271 -11598259 -11820667
41614 -11820667 -11930547 -11944200 -11906195 -11870759 -11876017 -11927622 -12002427 -12068428 -12105917 -12115735 -12111326
41603 -12111326 -12101793 -12076546 -11999880 -11819436 -11486240 -10976937 -10306106 -9522869 -8696888 -7904088
41593 -7904088 -7217377 -6699354 -6392318 -6306918 -6416507 -6662708 -6970756 -7267747 -7496616 -7621960
41583 -7621960 -7628037 -7512871 -7283473 -6954320 -6546944 -6087623 -5603509 -5119843 -4658588 -4236238
41573 -4236238 -3860392 -3528513 -3231602 -2960642 -2711402 -2486157 -2293835 -2149076 -2068868 -2066897
41563 -2066897 -2148581 -2310069 -2541852 -2834935 -3185885 -3596775 -4068504 -4590881 -5136249 -5661694
41553 -5661694 -6120020 -6475934 -6721732 -6884952 -7020720 -7187855 -7418710 -7699536 -7974147
41544 -7974147 -8170043 -8232374 -8146695 -7939756 -7662345 -7367300 -7093606 -6859020 -6659205 -6472494
41534 -6472494 -6270202 -6029106 -5739741 -5406413 -5040708 -4654203 -4255304 -3851243 -3452651
41525 -3452651 -3077104 -2750018 -2503593 -2374281 -2397274 -2596755 -2974659 -3504431 -4135502 -4808995
41515 -4808995 -5478520 -6125104 -6755937 -7385329 -8009038 -8589243 -9060344 -9351119 -9409419 -9217003
41505 -9217003 -8790043 -8168537 -7402184 -6540423 -5629783 -4715284 -3839594 -3036511 -2321269
41496 -2321269 -1684467 -1096235 -522185 55688 625598 1149115 1578614 1877133 2029384
41487 2029384 2041389 1934133 1737798 1489472 1232510 1013552 875023 845607 934084 1129614
41477 1129614 1406492 1730022 2063009 2374360 2648234 2888751 3116515 3358553 3636469
41468 3636469 3956602 4304061 4642386 4920508 5086025 5100395 4950545 4653606 4254297 3816506
41458 3816506 3411760 3107775 2959684 3004840 3260797 3725767 4380433 5189225 6099637 7040934
41448 7040934 7926577 8663891 9169820 9386869 9292853 8902012 8259830 7436030 6518350 5605932
41438 5605932 4799110 4184946 3822326 3732123 3894908 4254973 4729156 5220302 5633993 5893720
41428 5893720 5948926 5774673 5366595 4735854 3906429 2914334 1806547 636661 -544085
41419 -544085 -1697347 -2803369 -3857690 -4861002 -5808416 -6683161 -7455774 -8087803 -8538763
41410 -8538763 -8774780 -8776828 -8546571 -8108617 -7508151 -6803115 -6051884 -5300657 -4576691 -3891146
41400 -3891146 -3249210 -2660003 -2138816 -1700208 -1347120 -1063179 -812326 -545805 -214655
41391 -214655 215019 748475 1356218 1979020 2542344 2973787 3216993 3239320 3034240 2620008
41381 2620008 2034389 1325092 538203 -290411 -1136992 -1985638 -2821859 -3627856 -4381604
41372 -4381604 -5060065 -5644654 -6124895 -6496733 -6756385 -6895030 -6899049 -6755769 -6460885 -6023871
41362 -6023871 -5469590 -4835613 -4165623 -3500538 -2869892 -2286001 -1743053 -1222379 -702816
41353 -702816 -171872 367669 898673 1397432 1845354 2240150 2600939 2962728 3361301 3816267
41343 3816267 4321527 4846957 5347877 5775896 6086833 6245434 6229747 6038333 5699871 5279001
41333 5279001 4870116 4576526 4482324 4629526 5009137 5566299 6214191 6850903 7375372 7700651
41323 7700651 7764755 7539845 7038153 6310059 5431481 4484341 3538916 2645108 1833343 1121801
41313 1121801 526207 68304 -221523 -309965 -172086 198652 786628 1556611 2459434 3438129
41303 3438129 4433219 5386354 6242062 6949355 7466056 7766927 7852543 7753284 7524254 7231442
41293 7231442 6933649 6666845 6437510 6228846 6017999 5795281 5573590 5382370 5251852
41284 5251852 5199919 5229863 5336650 5512778 5747626 6022269 6306578 6563293 6758009 6870752
41274 6870752 6905361 6894289 6895791 6980704 7210452 7614706 8179447 8851258 9555387 10219346
41264 10219346 10792192 11251911 11599488 11846240 12004199 12083735 12093656 12037504 11907257 11682559
41254 11682559 11340164 10868166 10274076 9581042 8816246 8000013 7140420 6232418 5259181
41245 5259181 4196449 3022038 1729454 339586 -1096042 -2502470 -3795336 -4895976
41237 -4895976 -5743589 -6303396 -6570975 -6572099 -6356913 -5989383 -5536227 -5059360 -4611354 -4230502
41227 -4230502 -3935440 -3724694 -3585196 -3505717 -3485446 -3531491 -3647289 -3819197 -4008995 -4157254
41217 -4157254 -4197179 -4071575 -3743328 -3196468 -2434098 -1480209 -384068 780643 1926317
41208 1926317 2967574 3835472 4485140 4896765 5072245 5030375 4803006 4433159 3974313
41199 3974313 3489345 3047741 2719607 2565916 2627006 2913674 3404313 4047963 4771249 5488506
41189 5488506 6115770 6587753 6873670 6985781 6975432 6915236 6872587 6886179 6957443 7059779
41179 7059779 7156359 7213524 7204681 7110005 6919313 6638704 6295105 5932881 5600743 5331644
41169 5331644 5122644 4926008 4661633 4249817 3648158 2871218 1983278 1072672 224850
41160 224850 -494624 -1046483 -1417388 -1615388 -1662812 -1589877 -1431894 -1228670 -1021177 -843155
41150 -843155 -711884 -625402 -569078 -527366 -493202 -470107 -467268 -492514 -549404 -640879 -774792
41139 -774792 -963023 -1211701 -1510546 -1831852 -2139990 -2401697 -2588894 -2676707 -2644861 -2484413
41129 -2484413 -2203135 -1822754 -1368587 -857763 -292088 341975 1067065 1905369 2868350
41120 2868350 3946378 5099440 6254252 7314639 8184817 8794216 9110653 9138977 8912939
41111 8912939 8488008 7935566 7335087 6763092 6280458 5920663 5683312 5538512 5443487 5363557
41101 5363557 5284776 5211439 5153111 5111920 5077907 5033128 4959770 4846202 4688066 4486962 4251727
41090 4251727 4003463 3778721 3624059 3581677 3673624 3893393 4208508 4571453 4933269 5254443
41080 5254443 5510249 5691039 5800113 5851151 5865143 5866293 5877610 5917498 5997277 6118545 6270567
41069 6270567 6430038 6565410 6645223 6647184 6564391 6406664 6197044 5964981 5737927 5532411
41059 5532411 5345931 5153271 4912415 4581762 4141894 3609151 3031713 2470406 1975997
41050 1975997 1574900 1267418 1034635 847450 673421 480443 237972 -82822 -508063
41041 -508063 -1056826 -1732498 -2512877 -3345460 -4153465 -4852402 -5370972 -5668074 -5740486 -5620179
41031 -5620179 -5363712 -5037482 -4702560 -4402028 -4153172 -3946158 -3749939 -3524605 -3237544
41022 -3237544 -2878562 -2467142 -2046575 -1666613 -1365042 -1160294 -1057847 -1060730 -1171608 -1384167
41012 -1384167 -1673866 -1999990 -2321017 -2613718 -2883388 -3158815 -3475156 -3854054 -4290858
41003 -4290858 -4754522 -5199212 -5580857 -5870217 -6057029 -6145586 -6146377 -6069184 -5920800 -5707335
40993 -5707335 -5438863 -5133925 -4822355 -4545286 -4349687 -4274913 -4333940 -4499396 -4705329 -4865879
40983 -4865879 -4900144 -4750369 -4388813 -3816764 -3059900 -2161249 -1172482 -146272 867960
40974 867960 1825468 2687816 3427182 4032839 4515569 4903812 5228545 5502070 5702659 5775562
40964 5775562 5651447 5273834 4623949 3734486 2689222 1609731 632737 -117591 -557091
40955 -557091 -661607 -472068 -81765 388831 818567 1104103 1168768 966779 487867 -238309
40945 -238309 -1143414 -2131147 -3094679 -3933948 -4568910 -4950316 -5070015 -4967527 -4726116 -4455030
40935 -4455030 -4262231 -4227619 -4387224 -4734419 -5235817 -5851244 -6545304 -7285985 -8036560 -8750946
40925 -8750946 -9377180 -9866552 -10183956 -10316784 -10279970 -10113778 -9872458 -9606898 -9348412 -9099866
40915 -9099866 -8836298 -8513835 -8083818 -7507424 -6764918 -5855936 -4792663 -3592305 -2274689
40906 -2274689 -865730 597712 2067652 3492043 4825336 6034415 7094450 7977591
40898 7977591 8643841 9041333 9115571 8822430 8141196 7086459 5716645 4134403 2474674
40889 2474674 881245 -521715 -1653583 -2488290 -3049925 -3397557 -3607757 -3761213 -3935110
40880 -3935110 -4199799 -4617086 -5236541 -6086608 -7161771 -8413196 -9751703 -11065632 -12247238
40871 -12247238 -13216840 -13936140 -14407441 -14660964 -14736585 -14668432 -14478837 -14182510 -13795963 -13345313
40861 -13345313 -12868623 -12413223 -12030230 -11767518 -11661826 -11732083 -11977426 -12381481 -12919941
40852 -12919941 -13565670 -14287770 -15046122 -15786501 -16440680 -16932937 -17191925 -17165598 -16835096
40843 -16835096 -16221545 -15380608 -14385344 -13305039 -12190012 -11067715 -9948453 -8835474
40835 -8835474 -7735083 -6664404 -5654651 -4747454 -3983251 -3385127 -2945919 -2626847 -2370279
40826 -2370279 -2120649 -1842980 -1531359 -1206646 -907151 -676203 -549314 -544263 -657591 -868421
40816 -868421 -1145766 -1453811 -1753064 -2000796 -2155496 -2185856 -2079838 -1849025 -1526606 -1159606
40806 -1159606 -796036 -469396 -187059 69784 333003 628496 961514 1312188 1640761
40797 1640761 1899076 2044517 2053026 1928309 1705271 1446265 1229367 1130404 1204083 1470692
40787 1470692 1912357 2479588 3106487 3730158 4306217 4812302 5238690 5574247 5798645
40778 5798645 5885893 5815942 5586665 5219225 4754059 4240164 3723799 3241378 2816829 2461524
40768 2461524 2176394 1956692 1797248 1693761 1638849 1617397 1607026 1583948 1528736 1426471
40758 1426471 1261014 1007989 632422 94452 -638323 -1577844 -2708968 -3992387 -5374522
40749 -5374522 -6798406 -8210303 -9560095 -10797826 -11872228 -12736718 -13362905 -13754804 -13954807
40740 -13954807 -14036742 -14088084 -14187986 -14389065 -14709293 -15135998 -15638574 -16183188 -16743425 -17303237
40730 -17303237 -17851209 -18369053 -18822061 -19160230 -19332314 -19305379 -19078200 -18681422 -18165745
40721 -18165745 -17585348 -16984518 -16392172 -15823324 -15282804 -14767467 -14267207 -13767084 -13251184
40712 -13251184 -12706983 -12129467 -11524695 -10910753 -10312739 -9751513 -9231437 -8734646 -8225889
40703 -8225889 -7665913 -7027238 -6305631 -5523188 -4723261 -3960596 -3290312 -2757569 -2389192
40694 -2389192 -2189613 -2143452 -2224145 -2404614 -2665819 -3001505 -3418719 -3932896 -4557046 -5288726
40684 -5288726 -6102053 -6949313 -7769693 -8498791 -9075751 -9449911 -9589328 -9489877 -9181006 -8724483
40674 -8724483 -8203711 -7703672 -7286655 -6974241 -6745102 -6549381 -6330556 -6043443 -5662645
40665 -5662645 -5183020 -4616390 -3986284 -3319133 -2630965 -1914281 -1134433 -241467 807415
40656 807415 2027746 3399965 4873951 6380012 7842798 9197935 10408580 11473927
40648 11473927 12423234 13298624 14137854 14965433 15790263 16602900 17370780 18037738 18534220
40639 18534220 18796721 18787474 18504664 17978907 17259592 16400564 15453724 14470347 13501261 12588516
40629 12588516 11751621 10978531 10227993 9441698 8561127 7544212 6376523 5072144 3664813
40620 3664813 2196646 711788 -744695 -2127610 -3395445 -4515672 -5467942 -6242811
40612 -6242811 -6837118 -7250545 -7488100 -7567694 -7524695 -7404831 -7245466 -7055429 -6805879 -6438675
40602 -6438675 -5889612 -5116757 -4120996 -2949230 -1679632 -398313 819942 1919093 2858561
40593 2858561 3606338 4135550 4427252 4477943 4308291 3968791 3537936 3110269 2776757 2605105
40583 2605105 2627853 2841400 3213695 3695971 4233581 4772184 5258424 5638283 5858015 5870325
40573 5870325 5644862 5179767 4509710 3705900 2865953 2096209 1492418 1124164 1025882 1195664
40563 1195664 1601365 2190949 2902627 3672414 4439909 5153778 5777033 6291485 6700643
40554 6700643 7028977 7314034 7590466 7871233 8135464 8330409 8387986 8249167 7885592 7309137
40544 7309137 6566687 5724888 4852470 4005028 3213964 2482093 1789859 1112696 442348
40535 442348 -199665 -764202 -1190897 -1430804 -1466904 -1326957 -1085108 -849811 -738631 -846103
40525 -846103 -1215928 -1828603 -2609564 -3454130 -4259323 -4951291 -5499873 -5916707 -6239564 -6511940
40515 -6511940 -6768925 -7034325 -7323440 -7641448 -7974567 -8282338 -8501386 -8561586 -8405730 -8003042
40505 -8003042 -7353465 -6485092 -5447952 -4305735 -3125611 -1966077 -865009 166370
40497 166370 1137820 2063267 2941791 3747101 4429877 4929807 5191688 5181433 4898821 4383451
40487 4383451 3711548 2984465 2312533 1798326 1522231 1532455 1841171 2426914 3240438 4209934
40477 4209934 5244369 6238890 7087679 7704249 8041246 8099406 7921030 7571907 7120802
40468 7120802 6625185 6127762 5662733 5265193 4975038 4830699 4856108 5050276 5387187 5825749
40458 5825749 6321885 6833828 7317922 7720552 7975740 8014223 7780920 7250875 6434850 5373765
40448 5373765 4128279 2770058 1376466 26697 -1202448 -2241762 -3035529 -3546922
40440 -3546922 -3760439 -3680020 -3325012 -2727526 -1931335 -988460 49131 1139527 2255900
40431 2255900 3382626 4504540 5595772 6614740 7508315 8223143 8718480 8975314 8999473
40422 8999473 8819014 8477219 8022928 7500523 6941858 6361591 5756503 5108783 4392234
40413 4392234 3579550 2649195 1591582 414443 -853715 -2163477 -3448287 -4631949
40405 -4631949 -5639079 -6406707 -6893687 -7085136 -6991705 -6646008 -6098731 -5415359 -4672762
40396 -4672762 -3953392 -3335114 -2877436 -2609048 -2522520 -2578636 -2718107 -2876315 -2996481 -3036992
40386 -3036992 -2970880 -2780738 -2456222 -1998494 -1428072 -787983 -137424 461636 958524 1323278
40376 1323278 1549470 1651307 1657221 1601861 1517026 1422087 1316954 1182860 993675 733138
40366 733138 407708 46789 -308883 -621452 -862732 -1010885 -1043211 -934657 -666607 -241677
40356 -241677 304698 902693 1457200 1863950 2028111 1880901 1390196 563229 -556979
40347 -556979 -1898678 -3371228 -4878261 -6332115 -7664669 -8831591 -9812033 -10607171 -11237801
40338 -11237801 -11739020 -12152605 -12520483 -12880857 -13264341 -13687138 -14143079 -14600947 -15012580
40329 -15012580 -15330876 -15529497 -15613404 -15613929 -15571220 -15513759 -15444667 -15339571 -15155718 -14848831
40319 -14848831 -14391523 -13785770 -13064411 -12282771 -11506276 -10799223 -10215742 -9792034 -9540704
40310 -9540704 -9449906 -9488754 -9617278 -9796876 -9997069 -10195475 -10370897 -10494637 -10528992 -10438447
40300 -10438447 -10208647 -9859874 -9444900 -9032877 -8689640 -8463399 -8377878 -8430643 -8594571 -8821834
40290 -8821834 -9050671 -9215612 -9260666 -9151507 -8880694 -8463551 -7929140 -7313055 -6654042 -5991227
40280 -5991227 -5359427 -4784592 -4282797 -3862986 -3530501 -3289051 -3141123 -3087594 -3126382 -3249837
40270 -3249837 -3441814 -3676328 -3919024 -4131325 -4276281 -4325136 -4263245 -4093161 -3832654 -3507575
40260 -3507575 -3142667 -2754675 -2350315 -1928933 -1488387 -1032099 -573754 -135074 264461
40251 264461 620062 946583 1271215 1618560 1997167 2393038 2770035 3075898 3253344 3254117
40241 3254117 3050569 2639831 2040562 1286495 420472 -510576 -1460715 -2390109 -3268712
40232 -3268712 -4076656 -4800432 -5426176 -5933826 -6296455 -6486012 -6482438 -6281173 -5895688 -5354695
40222 -5354695 -4695986 -3959987 -3186187 -2414131 -1687445 -1056358 -574560 -290326 -236807 -427001
40212 -427001 -854116 -1492570 -2295128 -3187932 -4071063 -4831061 -5363859 -5598487 -5510145 -5117142
40202 -5117142 -4465697 -3613067 -2618550 -1544702 -462942 545355 1397863 2028126 2401281
40193 2401281 2519050 2411628 2123298 1700840 1187436 617846 11951 -629556 -1321174
40184 -1321174 -2079655 -2908844 -3790572 -4686046 -5546600 -6328206 -7002011 -7555453 -7984813
40175 -7984813 -8285352 -8445225 -8445356 -8264378 -7886891 -7312545 -6562117 -5677380 -4714629 -3734897
40165 -3734897 -2794177 -1935854 -1186661 -556678 -42248 370768 704723 987140 1243997
40156 1243997 1489383 1716219 1894161 1977226 1918023 1681904 1255195 645996 -119866 -1003855
40146 -1003855 -1959212 -2936178 -3888978 -4782351 -5593462 -6307582 -6910820 -7385348 -7710272
40137 -7710272 -7867812 -7852913 -7683556 -7406856 -7094891 -6828072 -6672150 -6660554 -6790836 -7035221
40127 -7035221 -7357864 -7730116 -8137856 -8578773 -9051806 -9545306 -10032037 -10475028 -10841210
40118 -10841210 -11115458 -11308591 -11456284 -11608667 -11813595 -12100638 -12474149 -12918902 -13413697
40109 -13413697 -13944071 -14507950 -15113203 -15768968 -16473618 -17203735 -17910066 -18525000 -18980816
40100 -18980816 -19231552 -19268248 -19119883 -18839993 -18487078 -18109817 -17743440 -17415101 -17150409
40091 -17150409 -16973662 -16899605 -16920887 -16999503 -17069548 -17052379 -16877262 -16497107 -15893092 -15070479
40081 -15070479 -14053173 -12881812 -11612705 -10310795 -9034506 -7819564 -6672935 -5581685
40073 -5581685 -4530722 -3518400 -2563145 -1701303 -979086 -440329 -111996 7589 -48750
40064 -48750 -226476 -466082 -718408 -952069 -1153081 -1321169 -1466536 -1606925 -1762836 -1950968
40054 -1950968 -2179480 -2448837 -2758190 -3112768 -3527171 -4022352 -4617551 -5319978 -6115443
40045 -6115443 -6963318 -7798969 -8544464 -9124939 -9485496 -9603140 -9489510 -9182505 -8729211
40036 -8729211 -8167727 -7517541 -6783482 -5969315 -5091165 -4182832 -3292059 -2471871 -1771120
40027 -1771120 -1225926 -852783 -644929 -573727 -594792 -656104 -704298 -686446 -547524 -227400
40017 -227400 336667 1198171 2383086 3874474 5609259 7489943 9406573 11260889 12985108
40008 12985108 14549577 15956766 17224637 18367445 19382241 20244815 20914090 21342038
40000 21342038 21486121 21321002 20846745 20092082 19112238 17980734 16775895 15566251 14401190
39991 14401190 13310382 12309674 11407932 10610357 9917019 9318073 8789292 8292364 7782173
39982 7782173 7218895 6579432 5863478 5092994 4307321 3557262 2899591 2389987 2071687
39973 2071687 1961246 2038654 2249305 2518577 2771973 2951977 3026440 2988099 2847703 2624482
39963 2624482 2337390 1998979 1612339 1171281 663824 77592 -595472 -1356749 -2200611
39954 -2200611 -3115238 -4083642 -5083151 -6081578 -7031751 -7870614 -8527879 -8941801 -9073522
39945 -9073522 -8913255 -8478183 -7805988 -6946872 -5955025 -4880617 -3764192 -2634518 -1508920
39936 -1508920 -394100 712999 1822355 2943793 4076780 5201967 6279488 7254730
39928 7254730 8068621 8669311 9023261 9122694 8985440 8646730 8148742 7535664 6856120 6167224
39918 6167224 5532584 5011332 4641245 4422953 4313822 4239011 4120452 3912957 3628188 3331141
39908 3331141 3110406 3040426 3157567 3459759 3923056 4520883 5235712 6060718 6993449 8024371
39898 8024371 9124250 10236187 11277794 12154700 12781207 13101140 13102160 12818255 12317994
39889 12317994 11681751 10977516 10246156 9500593 8734636 7934026 7085639 6184577 5239308
39880 5239308 4273802 3326109 2443650 1675262 1060659 621023 356216 250152 278843 414020
39870 414020 621320 858929 1082611 1257089 1368193 1428854 1474436 1547416 1676739 1860653
39860 1860653 2060819 2210370 2232903 2065466 1677348 1078095 312798 -551506 -1441407 -2289431
39850 -2289431 -3041819 -3662864 -4136877 -4468188 -4679701 -4810519 -4912332 -5043061 -5256581
39841 -5256581 -5589625 -6049874 -6610682 -7216250 -7796544 -8286469 -8641808 -8846696 -8911840 -8866093
39831 -8866093 -8744776 -8577580 -8378611 -8141434 -7841688 -7448231 -6940362 -6324294 -5639312
39822 -5639312 -4947234 -4308573 -3758948 -3300338 -2911164 -2565643 -2248344 -1957123 -1697730
39813 -1697730 -1476847 -1296738 -1151154 -1023122 -887117 -716742 -494982 -222236 81117
39804 81117 378487 627181 793839 871224 889263 913509 1029134 1315451 1821154 2550174
39794 2550174 3461960 4482341 5518364 6474227 7269293 7856701 8235104 8445092 8549371
39785 8549371 8605468 8643454 8657639 8613697 8465180 8169402 7695222 7023691 6149135 5086135
39775 5086135 3878623 2601034 1345055 196265 -786683 -1579016 -2181175 -2602755 -2849676
39766 -2849676 -2920282 -2809411 -2516374 -2052460 -1444054 -729621 47016 842195 1614793 2328277
39756 2328277 2954814 3478283 3890547 4180323 4321157 4267257 3962608 3362510 2459450 1299979
39746 1299979 -18586 -1371439 -2637366 -3722979 -4572261 -5161641 -5485458 -5539733 -5313373
39737 -5313373 -4791841 -3970492 -2870324 -1550292 -111849 1310233 2574729 3571306 4249740
39728 4249740 4624773 4756739 4723063 4596655 4437115 4290755 4192381 4164732 4216256 4340522
39718 4340522 4518818 4723800 4921916 5076341 5154204 5137519 5031323 4862960 4673725 4509532
39708 4509532 4415202 4431000 4587156 4895087 5338959 5873624 6432693 6944795 7350917 7614766
39698 7614766 7722756 7676817 7487047 7169380 6747596 6254288 5726070 5194274 4677494 4181172
39688 4181172 3703064 3239220 2787292 2348543 1930376 1547706 1219973 963513 782337
39679 782337 660809 560968 427986 206157 -138521 -600452 -1132188 -1659410 -2105000 -2411579
39669 -2411579 -2555086 -2545839 -2417613 -2211200 -1962465 -1700576 -1452341 -1243571 -1093409 -1006225
39659 -1006225 -968750 -955324 -937653 -892831 -806161 -670348 -484998 -257661 -3139 262335
39649 262335 530679 809811 1125439 1515832 2020492 2665043 3448255 4339453 5289829 6251337
39639 6251337 7191437 8096427 8965371 9801867 10609471 11391830 12154606 12905335 13649373
39630 13649373 14383422 15090118 15736797 16279983 16675321 16890468 16916106 16769845 16490416
39621 16490416 16124107 15709330 15266301 14795907 14286127 13720356 13083205 12363520 11556050
39612 11556050 10661313 9682745 8623333 7486094 6279773 5025888 3761729 2536319
39604 2536319 1399257 385253 -498914 -1276492 -1988563 -2674094 -3353509 -4022146 -4652149
39595 -4652149 -5199045 -5611893 -5846914 -5881669 -5724120 -5412300 -5005015 -4568317 -4163797 -3842235
39585 -3842235 -3641842 -3587771 -3690681 -3944245 -4322585 -4778906 -5248289 -5658454 -5948362 -6087287
39575 -6087287 -6083613 -5977927 -5824585 -5671658 -5548121 -5461988 -5407612 -5376037 -5361446 -5360952 -5371634
39564 -5371634 -5390726 -5419850 -5467905 -5547850 -5669346 -5833851 -6035434 -6263837 -6504150 -6732198
39554 -6732198 -6910410 -6989845 -6919800 -6661462 -6199957 -5550473 -4757104 -3885414 -3010798 -2204830
39544 -2204830 -1522523 -993846 -621492 -383830 -240247 -138091 -23016 146657 385940
39535 385940 677033 975704 1228427 1393536 1458023 1443288 1397473 1378381 1435497 1598770
39525 1598770 1876379 2258402 2721281 3229337 3733689 4173831 4487640 4628566 4579894 4355615
39515 4355615 3988053 3512481 2958357 2348497 1702613 1043314 404086 -164454 -596740
39506 -596740 -826303 -807161 -532659 -43107 580473 1233461 1810033 2225302 2432136 2427961
39496 2427961 2248714 1951980 1596206 1224026 854711 486505 106149 -299577 -736068
39487 -736068 -1199420 -1678544 -2155803 -2604376 -2986038 -3254546 -3366144 -3292741 -3030328 -2598153
39477 -2598153 -2031371 -1375041 -684861 -31671 499093 819549 861362 598396 58771 -680332
39467 -680332 -1512822 -2328542 -3031850 -3549550 -3831347 -3848195 -3591937 -3077057 -2342825 -1451172
39457 -1451172 -475860 515257 1475615 2384016 3237037 4037056 4783074 5466576 6071729
39448 6071729 6578924 6970177 7233722 7365765 7369651 7254193 7032544 6722345 6347328 5939056
39438 5939056 5536094 5178996 4902749 4729658 4663278 4682101 4734274 4739049 4600036 4228579
39428 4228579 3568514 2612180 1401056 10454 -1475251 -2984653 -4467628 -5888647
39420 -5888647 -7214148 -8404600 -9414723 -10199144 -10720351 -10957181 -10910932 -10605287 -10079236
39411 -10079236 -9376218 -8533545 -7574748 -6507732 -5332013 -4054757 -2708281 -1358074
39403 -1358074 -94353 990613 1828846 2393793 2700520 2791499 2718638 2531910 2277149
39394 2277149 1998246 1738512 1540427 1445983 1497764 1736805 2193020 2869764 3731097 4701227
39384 4701227 5678897 6560359 7260443 7723693 7924031 7857809 7537326 6988047 6246699 5356070
39374 5356070 4357619 3286922 2173208 1038497 -106626 -1266202 -2454720 -3686329
39366 -3686329 -4964774 -6279374 -7606338 -8912571 -10160860 -11315710 -12347492 -13233193
39358 -13233193 -13955014 -14499800 -14860838 -15041513 -15059097 -14946259 -14747560 -14509799 -14268349
39349 -14268349 -14034857 -13792762 -13505045 -13132795 -12655532 -12080988 -11437988 -10757899 -10057783
39340 -10057783 -9335318 -8575766 -7763621 -6891340 -5962277 -4989735 -3995537 -3009687 -2069504
39331 -2069504 -1214828 -477583 131133 629487 1063021 1492308 1974936 2547055 3208130
39322 3208130 3913065 4576984 5094623 5368107 5331282 4961620 4278769 3334726 2200944
39313 2200944 955798 -325363 -1576055 -2740142 -3770618 -4628414 -5283622 -5719165 -5933984
39304 -5933984 -5941965 -5765895 -5430071 -4956822 -4369145 -3696727 -2979405 -2263283 -1589942 -984673
39294 -984673 -450885 26603 472281 909356 1351029 1796261 2233267 2651593 3056941 3478108
39284 3478108 3959198 4540366 5237489 6030225 6862155 7652360 8315633 8786065 9036102
39275 9036102 9083751 8985643 8819338 8661270 8567434 8563481 8647662 8803130 9010360 9252424
39265 9252424 9514253 9782617 10050242 10320129 10604010 10914093 11253762 11613816 11976058
39256 11976058 12320263 12628824 12886561 13078089 13186764 13196993 13098555 12890942 12586601 12212122
39246 12212122 11806100 11413611 11079724 10845195 10744852 10805528 11040307 11440390 11971075
39237 11971075 12578033 13202969 13799796 14341692 14816889 15219365 15542523 15779137 15924631
39228 15924631 15978130 15937924 15793152 15517798 15072632 14415756 13517043 12370554 11001191
39219 11001191 9464723 7842002 6228907 4723322 3410375 2348401 1559992 1031536
39211 1031536 720556 567258 508107 491292 491229 514722 592812 761156 1039803 1423334 1885066
39200 1885066 2390798 2913067 3437916 3961870 4483292 4994687 5479940 5916484 6280583
39191 6280583 6553911 6729836 6818250 6848421 6869083 6944064 7142230 7523220 8123101 8944799
39181 8944799 9956926 11102267 12313048 13526206 14691875 15773199 16740828 17566473
39173 17566473 18217993 18657577 18844772 18744699 18338978 17635577 16674672 15528307 14291680
39164 14291680 13065745 11935540 10952506 10128137 9441123 8854534 8336337 7875389 7486120
39155 7486120 7199395 7044166 7029898 7139101 7332598 7563432 7792649 8001104 8193021 8389878
39145 8389878 8618260 8899414 9246200 9666096 10164609 10746323 11415971 12181950 13060195
39136 13060195 14073480 15243195 16575339 18046430 19597043 21139212 22577619 23836346
39128 23836346 24879143 25715110 26389870 26968264 27515645 28082623 28695564 29353283 30028961
39119 30028961 30674777 31226354 31606341 31730205 31518284 30913719 29898974 28501728 26786744
39110 26786744 24839273 22749763 20606125 18492489 16488578 14665216 13076731 11754778
39102 11754778 10707161 9921749 9373412 9031805 8867473 8853540 8962491 9161897 9414153
39093 9414153 9680956 9928157 10127669 10258559 10311653 10296999 10247403 10211572 10237770 10356439
39083 10356439 10571322 10862708 11198696 11546865 11881300 12184636 12446813 12661173 12818319
39074 12818319 12900829 12883783 12743100 12467351 12065213 11563331 10996090 10394172 9779315 9167959
39064 9167959 8580107 8046613 7610671 7324249 7242332 7416046 7884132 8663423 9741474
39055 9741474 11075393 12599546 14241651 15942227 17668892 19419201 21213514 23085732
39047 23085732 25077565 27234411 29597816 32194552 35029156 38086946 41348188 44807155
39039 44807155 48486948 52442650 56750546 61487853 66712182 72449944 78698378 85439766
39031 85439766 92661300 100371277 108603348 117406277 126824729 136881029 147565117 158832643
39023 158832643 170606609 182779443 195216755 207765238 220263885 232553513 244478797
39016 244478797 255879581 266572245 276325703 284840021 291738226 296583570 298933000 298428147
39008 298428147 294904900 288480959 279577443 268857024 257102261 245083108 233455759
39001 233455759 222709229 213154503 204943301 198103199 192576853 188256051 185006724 182684897
38993 182684897 181143997 180233853 179793844 179644782 179583143 179378946 178778123 177512345 175320703
38984 175320703 171985172 167374575 161482877 154443893 146511951 138014397 129295148 120668480
38976 120668480 112390843 104647302 97546691 91123346 85346439 80137772 75396797 71028764
38968 71028764 66968162 63188056 59690621 56484477 53562279 50890210 48412019 46062855
38960 46062855 43787318 41557400 39384797 37320509 35438823 33812052 32488254 31480685
38952 31480685 30768348 30301506 30007952 29801091 29592485 29308155 28903672 28371567 27737258
38943 27737258 27044544 26336664 25641239 24965368 24301146 23635941 22960019 22267839 21555349
38934 21555349 20818946 20059788 19291521 18545225 17866921 17308644 16918147 16730819 16763599
38925 16763599 17010160 17439153 17997723 18618860 19228333 19749331 20107690 20241352 20113689
38916 20113689 19726170 19124627 18394687 17644947 16981475 16482668 16184375 16079743 16130573
38907 16130573 16283014 16481707 16679682 16843865 16957210 17018460 17039533 17039665 17036376 17035671 17025454
38896 17025454 16975343 16843719 16590452 16191828 15652560 15009507 14324324 13667501 13100616
38887 13100616 12664086 12373494 12222550 12188408 12236930 12328430 12425173 12499475 12538684 12544359 12527031
38876 12527031 12500744 12479624 12475210 12493154 12531661 12585556 12654940 12750229 12885053 13057687 13232880
38865 13232880 13338780 13284851 12993085 12426491 11601441 10580789 9454667 8319022 7258145
38856 7258145 6331935 5566868 4952018 4443969 3982491 3512350 3001619 2448593 1877216
38847 1877216 1327534 847506 487246 292771 297204 511344 918512 1477422 2132092 2822816
38837 2822816 3492171 4085558 4551641 4847990 4951344 4866541 4628267 4294230 3932902 3610929
38827 3610929 3384330 3294344 3365602 3604312 3997297 4515163 5120700 5778845 6462671 7153423
38817 7153423 7837652 8505528 9150794 9769127 10352684 10883344 11330381 11656345 11829374
38808 11829374 11835550 11683911 11400274 11013102 10541654 9996633 9393626 8767638 8175465 7683557
38798 7683557 7350388 7212918 7279114 7524073 7889975 8293456 8641931 8854549 8879674 8702395
38788 8702395 8341035 7837361 7246594 6629744 6045988 5542787 5145953 4855184 4648380
38779 4648380 4492677 4356758 4219492 4072656 3918391 3764331 3619835 3494727 3399110 3341152
38769 3341152 3321703 3328633 3336592 3315729 3245997 3128122 2983532 2843200 2732646 2662172 2627578
38758 2627578 2620019 2637873 2691924 2800314 2977736 3227134 3538359 3892129 4265012 4632551
38748 4632551 4970152 5253839 5464236 5594605 5657785 5684702 5713367 5776078 5893667 6077997
38738 6077997 6337074 6676640 7095818 7578153 8083467 8547905 8895437 9055299 8975632 8629029
38728 8629029 8013048 7149235 6079919 4861287 3554979 2221986 919285 -303728
38720 -303728 -1410920 -2385828 -3235257 -3986835 -4679598 -5350127 -6019369 -6684850 -7320606
38711 -7320606 -7884957 -8333927 -8634567 -8770811 -8739164 -8539691 -8170861 -7630898 -6920861 -6044251
38701 -6044251 -5003897 -3801605 -2444309 -954224 624211 2226923 3781993 5223697
38693 5223697 6501026 7578535 8432954 9049904 9422928 9555510 9465726 9190220 8781614
38684 8781614 8295778 7772872 7222323 6620672 5923357 5083272 4066634 2860455 1471979
38675 1471979 -75787 -1747872 -3497804 -5265197 -6974251 -8537828 -9868517 -10892906
38667 -10892906 -11563444 -11864663 -11813500 -11454237 -10849348 -10069381 -9185509 -8265299 -7369292
38658 -7369292 -6546951 -5833235 -5247020 -4790999 -4453622 -4215689 -4061879 -3990998 -4016730 -4157695
38648 -4157695 -4424756 -4815054 -5315288 -5909341 -6584028 -7330327 -8141290 -9008593 -9918102
38639 -9918102 -10843853 -11741781 -12547762 -13184874 -13579831 -13681986 -13475902 -12982802 -12253024
38630 -12253024 -11355004 -10364517 -9354543 -8385738 -7499927 -6719757 -6054507 -5507688 -5081692
38621 -5081692 -4778364 -4597512 -4535025 -4580358 -4713404 -4902693 -5107296 -5282186 -5384003 -5374376
38611 -5374376 -5221321 -4902003 -4409396 -3761665 -3009241 -2233226 -1531021 -991133 -666832
38602 -666832 -561582 -633123 -811146 -1016175 -1171115 -1206662 -1066731 -716745 -151372 604084
38592 604084 1501614 2485065 3503971 4519348 5500050 6415282 7230709 7910993 8426053
38583 8426053 8756677 8897294 8856398 8656016 8330347 7922054 7475072 7025809 6596911 6195605
38573 6195605 5814963 5436100 5032644 4579953 4067793 3511000 2952767 2458325 2099795
38564 2099795 1935836 1993150 2257988 2681955 3199395 3748638 4288365 4802955 5296163 5778909
38554 5778909 6259380 6739254 7213291 7667877 8078375 8409208 8619672 8673878 8549616 8241282
38544 8241282 7756517 7111358 6329822 5448629 4521156 3613471 2791001 2101581 1563568
38535 1563568 1165189 874985 657033 482326 331938 194827 66565 -48020 -131268 -153108
38525 -153108 -77271 129631 491051 1018497 1713735 2571448 3578672 4709981 5921050
38516 5921050 7145596 8300047 9296238 10057136 10528986 10686794 10534630 10103307 9446086
38507 9446086 8632232 7739466 6846311 6023838 5326339 4783430 4397374 4146227 3989241
38498 3989241 3871523 3729285 3499055 3131105 2603195 1929995 1165770 399276 -259920
38489 -259920 -702986 -846368 -651141 -130320 657237 1622874 2669130 3710733 4690025
38480 4690025 5582087 6389181 7129403 7825419 8495259 9144297 9759160 10307060 10742989
38471 10742989 11022855 11117712 11024578 10771075 10412472 10021833 9676744 9447235 9387177 9528373
38461 9528373 9876496 10410623 11088489 11855545 12651945 13414068 14074890 14571796 14864474
38452 14864474 14954040 14888881 14749152 14615116 14534352 14502920 14467602 14346572 14059379 13555644
38442 13555644 12833244 11939736 10955822 9966977 9035711 8186744 7409969 6676375 5956922
38433 5956922 5235766 4514089 3805230 3123945 2473539 1835474 1166963 410854 -482575
38424 -482575 -1529422 -2693939 -3889387 -5000227 -5916178 -6561675 -6908056 -6967710 -6779488
38415 -6779488 -6395196 -5870920 -5262318 -4622916 -4004876 -3459913 -3037138 -2776781 -2701896 -2811083
38405 -2811083 -3074752 -3437569 -3828991 -4180112 -4440577 -4588191 -4627554 -4579524 -4467395 -4306472
38395 -4306472 -4100933 -3846821 -3536935 -3164954 -2729710 -2241390 -1728107 -1237650 -829667
38386 -829667 -558316 -452134 -501708 -662800 -873705 -1077193 -1236243 -1338860 -1394288 -1425552
38376 -1425552 -1461974 -1533149 -1664277 -1872018 -2160234 -2515905 -2906544 -3280830 -3574077 -3718550
38366 -3718550 -3655508 -3343547 -2759868 -1896689 -758991 632710 2236931 3989442 5809573
38357 5809573 7613901 9332159 10918774 12355288 13642857 14788890 15794823 16651010
38349 16651010 17339878 17843364 18149264 18254151 18164288 17896520 17478891 16948982 16349130
38340 16349130 15720361 15098293 14512677 13988805 13546560 13194388 12920343 12686417 12431524
38331 12431524 12083438 11575774 10865004 9943447 8844519 7637417 6411469 5255075 4237145
38322 4237145 3397250 2745048 2264649 1919327 1656648 1417847 1153480 841055 496022
38313 496022 169330 -68603 -150907 -34458 290386 801710 1454395 2188602 2936657 3631166
38303 3631166 4216303 4659516 4957780 5134292 5226606 5271644 5293630 5297342 5265196 5157259
38293 5157259 4917680 4491755 3850440 3009898 2033111 1011142 34185 -833068 -1562116
38284 -1562116 -2156461 -2638515 -3035469 -3369718 -3655164 -3897888 -4099050 -4257932 -4373098
38275 -4373098 -4440427 -4449025 -4377763 -4195705 -3868783 -3372689 -2707319 -1903819 -1017079 -105810
38265 -105810 787793 1646215 2469532 3260843 4015049 4716654 5345140 5882951 6321842 6665476
38255 6665476 6927667 7126800 7278499 7389558 7454843 7456415 7363742 7136559 6733593 6127228
38245 6127228 5318300 4343144 3268934 2179633 1158318 272032 -436182 -946454 -1255552
38236 -1255552 -1370690 -1307342 -1089165 -745583 -306008 205759 773368 1385964 2034579 2708299
38226 2708299 3391513 4064960 4712018 5326230 5912419 6478518 7024404 7537034 7994607
38217 7994607 8374635 8660334 8844400 8931536 8939410 8896756 8839474 8807137 8840770 8979991 9257351
38206 9257351 9690059 10271791 10968187 11718463 12443225 13056265 13477345 13643414 13516439
38197 13516439 13086646 12371247 11409942 10258347 8979503 7633984 6271012 4923646
38189 4923646 3609368 2335315 1107305 -58465 -1124760 -2030047 -2697327 -3053234 -3049231
38180 -3049231 -2675677 -1963825 -977112 202935 1490866 2808611 4093137 5300032 6403526
38171 6403526 7394918 8281364 9083916 9831308 10548811 11247606 11921676 12553690 13124328
38162 13124328 13618755 14028759 14353474 14601628 14795308 14972364 15183454 15481546 15906327
38153 15906327 16470842 17157771 17927276 18731070 19524526 20271429 20941507 21504950 21929090
38144 21929090 22180698 22233811 22079063 21728577 21212374 20567179 19822948 18993256 18073050
38135 18073050 17043934 15884920 14585354 13156032 11634914 10085791 8590328 7234806
38127 7234806 6093138 5209389 4585487 4180076 3920262 3721770 3509365 3230580 2859701
38118 2859701 2393017 1839474 1212589 528099 -193213 -923237 -1630052 -2286167 -2874826
38109 -2874826 -3389341 -3827076 -4183938 -4452844 -4624990 -4691653 -4646503 -4489781 -4233648 -3905058
38099 -3905058 -3542298 -3184859 -2860940 -2578893 -2326235 -2074680 -1786938 -1423285 -949242
38090 -949242 -344731 389621 1234454 2161259 3141500 4147906 5149335 6107876 6983928
38081 6983928 7746119 8377993 8877293 9250915 9511231 9676084 9769908 9822146 9861641 9908962
38071 9908962 9969950 10033039 10071438 10050069 9936090 9710480 9377194 8966558 8531128 8134442
38061 8134442 7835340 7672358 7653154 7752540 7919720 8091892 8209024 8224530 8109669 7853819
38051 7853819 7464364 6966805 6401458 5813667 5239847 4695573 4169985 3626425 3008322
38042 3008322 2251134 1300372 130962 -1240199 -2753941 -4319709 -5832155 -7187817
38034 -7187817 -8298688 -9101552 -9562767 -9678497 -9470977 -8982573 -8270145 -7400951 -6448647
38025 -6448647 -5486752 -4579320 -3772175 -3088626 -2530549 -2082863 -1719932 -1414228 -1147093
38016 -1147093 -918479 -751152 -686859 -775430 -1059560 -1558837 -2257807 -3103423 -4014329 -4898844
38006 -4898844 -5674843 -6285326 -6706122 -6943938 -7024924 -6977923 -6820276 -6553046 -6166737 -5652896
37996 -5652896 -5015518 -4278207 -3485454 -2697745 -1981392 -1395359 -978950 -744651 -678508 -746362
37986 -746362 -900980 -1086182 -1238565 -1291093 -1181924 -867149 -331878 406344 1303416 2299414
37976 2299414 3326695 4311678 5174492 5834656 6226490 6318705 6127301 5714231 5172444
37967 5172444 4604191 4100042 3722953 3498971 3415834 3430594 3485240 3525278 3513984 3436432
37957 3436432 3292421 3083378 2802492 2436099 1976484 1436625 854251 280194 -242012
37948 -242012 -691753 -1072667 -1400209 -1684355 -1917530 -2072943 -2112301 -1999056 -1713119 -1262503
37938 -1262503 -686437 -46866 588450 1163144 1642989 2018403 2300190 2510742 2673747
37929 2673747 2806485 2916979 3005227 3067290 3102532 3122814 3157709 3249744 3441453 3763545
37919 3763545 4230932 4844215 5590204 6440309 7351784 8274950 9163042 9978538 10693707
37910 10693707 11288306 11748587 12069139 12255673 12325531 12304056 12218291 12092511 11949199 11814345
37900 11814345 11720975 11705086 11794405 11997053 12297920 12664588 13057598 13438213 13770791 14022033
37890 14022033 14161080 14162683 14013003 13715595 13294062 12788384 12244650 11702117 11183816 10695282
37880 10695282 10231587 9788902 9374466 9008837 8718020 8520248 8417865 8401881 8466049 8618563
37870 8618563 8881225 9276150 9808824 10457738 11176349 11906423 12595644 13209453 13730751
37861 13730751 14149559 14451529 14613643 14609225 14417715 14032012 13457972 12706275 11783092 10687722
37851 10687722 9419910 7991484 6433510 4794205 3129641 1493051 -72158 -1533793
37843 -1533793 -2868428 -4059103 -5096122 -5979656 -6719502 -7329139 -7817071 -8182168 -8417051
37834 -8417051 -8517220 -8489969 -8358637 -8161171 -7943858 -7751298 -7614629 -7541738 -7513777 -7490353
37824 -7490353 -7422124 -7266417 -7000166 -6625893 -6169568 -5672474 -5180720 -4735691 -4367594 -4092923
37814 -4092923 -3914913 -3824729 -3801603 -3812827 -3816805 -3771421 -3646409 -3434533 -3155546 -2849420
37804 -2849420 -2560468 -2319029 -2129749 -1972691 -1816625 -1636842 -1427512 -1202582 -986191
37795 -986191 -798711 -644962 -508826 -356376 -147765 145476 525784 966458 1422560 1848698
37785 1848698 2212742 2499863 2709295 2848654 2927479 2949931 2909813 2793468 2591530 2311824
37775 2311824 1983012 1645885 1339370 1091021 915596 818063 796001 840377 937185 1071559
37765 1071559 1232618 1415820 1621574 1852229 2110143 2397506 2716567 3069149 3455948
37756 3455948 3876154 4326927 4801567 5286676 5760499 6195267 6563934 6847631 7037741
37747 7037741 7129647 7112551 6964551 6658802 6177309 5522685 4720346 3811246 2840874 1850238
37737 1850238 871076 -75751 -980270 -1842301 -2668749 -3468912 -4247989 -4999476 -5698055
37728 -5698055 -6296596 -6731690 -6939070 -6874220 -6529185 -5938160 -5170324 -4313934 -3457871 -2675694
37718 -2675694 -2015096 -1494153 -1105080 -824925 -629452 -503661 -443482 -448936 -514491 -622583
37708 -622583 -742553 -834612 -858737 -787599 -618445 -375768 -100790 166317 399596 588630
37698 588630 731311 827281 877966 891902 889457 901316 958426 1076737 1245454 1427946 1576937
37687 1576937 1655428 1650924 1576275 1459850 1332789 1219731 1134704 1080298 1048021 1019976 973362
37676 973362 887246 747985 550013 293033 -19894 -380269 -769348 -1154777 -1492547 -1735536
37666 -1735536 -1846747 -1812510 -1650293 -1407333 -1149055 -939805 -822752 -808553 -878736 -1000442
37656 -1000442 -1142113 -1281986 -1409230 -1521766 -1622356 -1712208 -1784254 -1822416 -1811083 -1750514
37646 -1750514 -1667026 -1609103 -1630457 -1769984 -2039139 -2420525 -2874737 -3350675 -3796376 -4168652
37636 -4168652 -4439448 -4597017 -4641756 -4578928 -4412310 -4143165 -3776506 -3331450 -2847875 -2382390
37626 -2382390 -1993320 -1722388 -1584239 -1571087 -1670293 -1883261 -2232137 -2748775 -3452825 -4332437
37616 -4332437 -5338191 -6392320 -7407656 -8307222 -9036870 -9568712 -9898516 -10041218 -10025113
37607 -10025113 -9882814 -9639647 -9304653 -8870286 -8322837 -7659672 -6904925 -6114386 -5364580
37598 -5364580 -4729495 -4255738 -3947795 -3769474 -3660468 -3561287 -3435924 -3281008 -3116236 -2962185
37588 -2962185 -2820166 -2666589 -2463093 -2173333 -1775736 -1267768 -664329 4862 696838
37579 696838 1357799 1929101 2356537 2598862 2631442 2444925 2042674 1440021 664166 -248637
37569 -248637 -1259595 -2334338 -3446008 -4572885 -5692391 -6775174 -7782497 -8668186
37561 -8668186 -9383997 -9886073 -10141662 -10136956 -9885790 -9435084 -8861188 -8255113 -7701263 -7258389
37551 -7258389 -6949929 -6765641 -6671011 -6618633 -6557374 -6439013 -6224410 -5889923 -5431970 -4866696
37541 -4866696 -4223879 -3536999 -2832865 -2124487 -1410463 -682410 61904 805885 1509135
37532 1509135 2114001 2561507 2809527 2845014 2685217 2368258 1937678 1427254 852002 209628
37522 209628 -506937 -1291720 -2113703 -2919634 -3650089 -4257059 -4712354 -5006956 -5149533 -5168408
37512 -5168408 -5111383 -5035306 -4985977 -4979089 -4993855 -4983160 -4895006 -4695465 -4383980 -3995858 -3592526
37501 -3592526 -3244526 -3013116 -2934420 -3008841 -3199299 -3441643 -3666022 -3820515 -3884831 -3867659
37491 -3867659 -3792910 -3687336 -3577781 -3495054 -3474704 -3549033 -3733905 -4018888 -4366766 -4722569
37481 -4722569 -5027694 -5233126 -5307091 -5235933 -5021050 -4676097 -4226525 -3710281 -3176794 -2682076
37471 -2682076 -2280207 -2014288 -1911615 -1985903 -2243974 -2690125 -3323068 -4127157 -5064626 -6073999
37461 -6073999 -7074826 -7976672 -8692100 -9153870 -9332235 -9243387 -8941782 -8497850 -7971685
37452 -7971685 -7395149 -6769209 -6074898 -5290398 -4405732 -3429685 -2388415 -1318892 -261149
37443 -261149 747873 1677854 2506357 3218911 3809177 4279814 4643380 4921562 5141201
37434 5141201 5327769 5499307 5664144 5823182 5974797 6119987 6266476 6430834 6637391
37425 6637391 6913630 7283919 7763866 8356012 9046247 9801590 10571203 11291802 11896673
37416 11896673 12326769 12542531 12534051 12325541 11970015 11533293 11071824 10613491 10150902 9650667
37406 9650667 9072944 8390558 7599935 6722501 5798041 4871279 3974951 3117253 2282034
37397 2282034 1442401 578670 -310995 -1212797 -2108810 -2988994 -3855487 -4716424 -5573875
37388 -5573875 -6414563 -7209505 -7921592 -8514984 -8961389 -9243209 -9356062 -9311221 -9135517 -8867029
37378 -8867029 -8548679 -8223342 -7930876 -7703716 -7558996 -7490596 -7467310 -7439750 -7352778 -7158594
37368 -7158594 -6828295 -6361824 -5794984 -5199681 -4673418 -4317499 -4209165 -4378011 -4797601
37359 -4797601 -5396435 -6081893 -6764146 -7369628 -7842622 -8140888 -8232642 -8098478 -7737018 -7169622
37349 -7169622 -6438921 -5599003 -4700213 -3775370 -2833749 -1865595 -855129 203530 1295116
37340 1295116 2382613 3417887 4357254 5173228 5857356 6415386 6859695 7203562 7459550
37331 7459550 7641896 7770488 7872776 7981391 8128424 8339560 8630248 9004185 9453270
37322 9453270 9958105 10487877 10999296 11436965 11739627 11854163 11752951 11446041 10981895
37313 10981895 10436120 9892041 9418407 9050531 8781533 8567471 8343934 8046287 7625444
37304 7625444 7055314 6333193 5477026 4522879 3522657 2538739 1632651 850143 210178
37295 210178 -295615 -693417 -1014081 -1282951 -1515005 -1714310 -1876546 -1993645 -2058756 -2069005
37285 -2069005 -2024878 -1928023 -1780796 -1588986 -1365729 -1133613 -924393 -777937 -740568 -859893
37275 -859893 -1174061 -1698738 -2419051 -3291163 -4251806 -5230175 -6157799 -6975243 -7636812 -8114890
37265 -8114890 -8404152 -8523200 -8509856 -8409052 -8257429 -8071710 -7845969 -7558253 -7183418 -6707180
37255 -6707180 -6136255 -5500692 -4847632 -4228949 -3687176 -3244262 -2896375 -2615659 -2357516
37246 -2357516 -2071073 -1711079 -1249469 -683691 -38375 641071 1300831 1892889 2386930
37237 2386930 2776907 3080336 3330024 3560588 3795172 4038705 4281019 4506696 4703673
37228 4703673 4864570 4982329 5047427 5051579 4995381 4892889 4768700 4648821 4550103 4472862
37218 4472862 4399418 4298872 4135859 3879549 3510222 3023670 2435337 1784033 1131487 553588
37208 553588 123886 -104513 -111731 84174 429514 843087 1229880 1498496 1577780 1428102
37198 1428102 1045114 455856 -291919 -1143942 -2051406 -2976236 -3890147 -4771389 -5601540
37189 -5601540 -6362148 -7031907 -7587329 -8008494 -8287016 -8431251 -8466233 -8429190 -8362501 -8305945
37179 -8305945 -8290712 -8337226 -8455591 -8644351 -8885235 -9138192 -9344638 -9441948 -9382179 -9143570
37169 -9143570 -8729308 -8158163 -7455931 -6652647 -5784428 -4896244 -4042344 -3282059 -2670952
37160 -2670952 -2250896 -2044311 -2054258 -2266793 -2651814 -3163943 -3747998 -4350133 -4929536 -5464429
37150 -5464429 -5950375 -6393379 -6801183 -7175076 -7504115 -7764231 -7924183 -7957483 -7855860 -7638324
37140 -7638324 -7351628 -7061261 -6834581 -6719822 -6727799 -6825455 -6946812 -7017475 -6980200 -6809182
37130 -6809182 -6508874 -6101978 -5614676 -5065691 -4462223 -3802905 -3085769 -2317627 -1520229
37121 -1520229 -728824 18007 692714 1288655 1818508 2301156 2744260 3132748 3430499
37112 3430499 3595005 3596972 3434246 3134449 2748031 2335986 1953830 1632403 1360831 1081762
37102 1081762 705726 140193 -680678 -1779369 -3135098 -4693564 -6376221 -8085564 -9711644
37093 -9711644 -11146706 -12307382 -13154296 -13696778 -13978240 -14050169 -13950250 -13696671 -13298256
37084 -13298256 -12769080 -12135891 -11435876 -10710245 -9998901 -9336818 -8751154 -8259635 -7870510
37075 -7870510 -7582079 -7379925 -7233823 -7098768 -6922643 -6659131 -6282008 -5795677 -5236100
37066 -5236100 -4658918 -4118578 -3648559 -3252191 -2906487 -2575262 -2225826 -1843461 -1437294
37057 -1437294 -1033027 -655047 -308533 26937 388663 813231 1320248 1904330 2536881
37048 2536881 3175131 3774049 4296649 4719906 5036282 5252859 5390035 5480355 5566391 5695340
37038 5695340 5908384 6226144 6636336 7091602 7521378 7853947 8039381 8064259 7953459 7758965
37028 7758965 7538709 7331590 7138653 6921847 6625144 6208858 5677045 5081558 4502509
37019 4502509 4019080 3685670 3520101 3503834 3591855 3727897 3858260 3938888 3936342 3827305
37009 3827305 3599206 3250109 2785667 2214066 1542414 777223 -70642 -978689 -1907181
37000 -1907181 -2799696 -3592177 -4228455 -4676285 -4936675 -5041851 -5043080 -4995153 -4945334 -4930129
36990 -4930129 -4976918 -5104664 -5320000 -5609810 -5935562 -6235295 -6435366 -6468342 -6290325 -5892221
36980 -5892221 -5302433 -4579937 -3798342 -3025618 -2308252 -1666828 -1102136 -604179 -157551
36971 -157551 256731 658740 1064437 1480012 1898940 2302808 2665498 2960752 3172194 3301759
36961 3301759 3371148 3414779 3468915 3563646 3720335 3952232 4264787 4654718 5109655 5610674
36951 5610674 6137963 6676274 7215097 7741631 8230975 8641669 8921379 9020426 8906081 8570713
36941 8570713 8030607 7316625 6461869 5493138 4430953 3298189 2132368 994301 -33108
36932 -33108 -857569 -1397638 -1603107 -1469094 -1040887 -409359 302460 960841 1448029 1687524
36922 1687524 1658359 1390995 946534 391270 -219364 -842133 -1439202 -1973590 -2411721 -2729885
36912 -2729885 -2918277 -2978658 -2916750 -2734818 -2429910 -1998623 -1443655 -776578 -15748 816978
36902 816978 1696680 2592747 3467055 4277448 4986946 5572994 6028935 6355215 6546680 6585731
36892 6585731 6446249 6105482 5557239 4820698 3942145 2989889 2044653 1187932 489666
36883 489666 -3418 -275392 -340258 -231490 13649 367632 818677 1368221 2022356 2780841
36873 2780841 3627020 4521705 5404319 6203369 6853683 7312439 7565366 7620780 7497243 7213661
36863 7213661 6787419 6240310 5607389 4941545 4308311 3771423 3376558 3142158 3060637 3105663
36853 3105663 3239033 3415201 3586950 3715575 3782785 3796289 3783596 3777635 3804294 3879153 4012109
36842 4012109 4213258 4494717 4867239 5332870 5875889 6455787 7006687 7445713 7688912
36833 7688912 7670222 7357981 6764021 5942109 4975220 3954241 2953669 2012332 1127563
36824 1127563 266636 -610185 -1528451 -2491980 -3489632 -4506101 -5525605 -6526140 -7471104
36815 -7471104 -8307068 -8971615 -9408827 -9586065 -9505012 -9202411 -8741161 -8197474 -7650663 -7177531
36805 -7177531 -6847894 -6717123 -6816220 -7144460 -7668919 -8330874 -9055902 -9764879 -10384250 -10853844
36795 -10853844 -11130906 -11191595 -11033350 -10679213 -10180078 -9609309 -9048807 -8571118 -8223446
36786 -8223446 -8017622 -7929122 -7907015 -7892152 -7835258 -7706612 -7495709 -7205722 -6847741 -6436305
36776 -6436305 -5985894 -5508699 -5014104 -4509567 -4002102 -3499723 -3011852 -2547868 -2114280
36767 -2114280 -1712205 -1336071 -973517 -607890 -225614 172506 563011 902859 1145537
36758 1145537 1262625 1259037 1173529 1063976 984610 965668 1002788 1057081 1063591 946733 641369
36747 641369 113498 -629313 -1542882 -2561278 -3611168 -4620885 -5528127 -6290417 -6895211
36738 -6895211 -7361781 -7731092 -8048278 -8346192 -8635811 -8904355 -9119552 -9238133 -9216605 -9021513
36728 -9021513 -8636061 -8061138 -7310870 -6405367 -5364896 -4209616 -2966100 -1677212 -407779
36719 -407779 761014 1749054 2497809 2981221 3200378 3167355 2890914 2373058 1615920 632198
36709 632198 -547054 -1870226 -3269174 -4668387 -5996003 -7192834 -8217691 -9050097
36701 -9050097 -9691488 -10163874 -10504182 -10754762 -10953562 -11127570 -11290321 -11441232 -11565378
36692 -11565378 -11636100 -11624181 -11512242 -11305666 -11031135 -10723179 -10408771 -10099755 -9794346 -9482159
36682 -9482159 -9147565 -8770039 -8322637 -7771266 -7078740 -6215927 -5176135 -3984113 -2694028
36673 -2694028 -1378909 -118810 1007980 1931185 2594213 2959583 3013721 2770857 2274954
36664 2274954 1597137 826401 53952 -645805 -1232921 -1712473 -2132757 -2569390 -3099773
36655 -3099773 -3777177 -4613761 -5577671 -6603590 -7611373 -8524979 -9284782 -9850312 -10195299
36646 -10195299 -10300794 -10152975 -9749107 -9108130 -8276633 -7322771 -6320223 -5332632 -4407336
36637 -4407336 -3577538 -2864773 -2275439 -1793397 -1376698 -965460 -500512 55615 706020
36628 706020 1419982 2143615 2814347 3375286 3787178 4034667 4124116 4075283 3913249 3664709
36618 3664709 3357049 3017020 2668833 2333329 2028056 1766272 1554030 1386693 1246770
36609 1246770 1104571 922745 664690 304867 -161680 -712766 -1298104 -1847861 -2292343
36600 -2292343 -2586806 -2728528 -2755341 -2725435 -2689379 -2668755 -2650685 -2598269 -2469471 -2234703
36590 -2234703 -1886519 -1439996 -926477 -384641 148397 645684 1099199 1526082 1965846
36581 1965846 2464839 3053825 3731626 4463265 5189855 5842180 6353965 6675354 6784639
36572 6784639 6692158 6432920 6052541 5595183 5098326 4592813 4103999 3651593 3248016 2896377
36562 2896377 2589850 2314512 2056073 1807323 1570568 1351623 1148729 945109 712223
36553 712223 422820 65629 -347353 -785098 -1210640 -1595600 -1927987 -2210037 -2449927 -2654568
36543 -2654568 -2826891 -2965418 -3063373 -3108707 -3087934 -2992561 -2822472 -2582200 -2272193 -1881501
36533 -1881501 -1387469 -764120 3335 903674 1892247 2897317 3840943 4667515 5367594
36524 5367594 5984829 6600222 7298287 8129175 9084501 10098550 11073153 11911665 12544412
36515 12544412 12936025 13077332 12971854 12626659 12051693 11264965 10297096 9190927 7998108
36506 7998108 6777920 5598948 4536962 3663132 3026202 2639744 2481782 2504092 2643491
36497 2643491 2831018 3000233 3096480 3086001 2961562 2741798 2464191 2174133 1913743 1713216
36487 1713216 1586301 1530986 1535417 1586150 1673509 1790550 1927711 2069226 2195704 2291785
36477 2291785 2353621 2390933 2421930 2463747 2523095 2591008 2643941 2652658 2598679 2492748 2384206
36466 2384206 2351597 2475490 2806046 3340236 4016783 4728274 5345079 5743486 5829832 5554856
36456 5554856 4917906 3964463 2778917 1471210 156974 -1063846 -2122019 -2983473 -3645403
36447 -3645403 -4128602 -4468498 -4705572 -4877095 -5013007 -5136167 -5263270 -5402545 -5549025
36438 -5549025 -5682842 -5776063 -5808017 -5781968 -5732225 -5714687 -5784165 -5971357 -6272396 -6654438
36428 -6654438 -7070696 -7476282 -7840367 -8153000 -8424277 -8674503 -8919916 -9163563 -9397534
36419 -9397534 -9612531 -9804359 -9971605 -10108791 -10203185 -10237724 -10195469 -10061349 -9822354 -9469236
36409 -9469236 -8998909 -8414078 -7720088 -6923582 -6036174 -5080369 -4092353 -3120008 -2218785
36400 -2218785 -1447490 -862485 -508007 -403838 -535677 -854024 -1283525 -1739505 -2145241
36391 -2145241 -2444294 -2605331 -2619930 -2496044 -2251391 -1910944 -1509500 -1095395 -729515 -477194
36381 -477194 -396293 -527201 -888189 -1475402 -2264389 -3211176 -4253757 -5316791 -6320799
36372 -6320799 -7193918 -7882376 -8357193 -8616611 -8684272 -8602832 -8424049 -8198367 -7967044 -7757344
36362 -7757344 -7579616 -7426217 -7274346 -7094245 -6860557 -6561251 -6199133 -5785187 -5328068
36353 -5328068 -4826914 -4274253 -3671130 -3048104 -2477599 -2064216 -1913024 -2092079 -2609762
36344 -2609762 -3415992 -4421384 -5522394 -6623080 -7648134 -8545089 -9278508 -9823296 -10162577
36335 -10162577 -10289316 -10207802 -9933978 -9496046 -8934669 -8299679 -7642347 -7006452 -6422379
36326 -6422379 -5906345 -5464934 -5103268 -4833044 -4675833 -4659820 -4811755 -5146610 -5657095 -6306542
36316 -6306542 -7029747 -7742917 -8358220 -8797202 -9001327 -8940895 -8621539 -8084481 -7397194 -6635387
36306 -6635387 -5862084 -5113033 -4396428 -3707283 -3046561 -2432278 -1897173 -1477876 -1203587
36297 -1203587 -1088383 -1127248 -1295507 -1552258 -1847797 -2133698 -2372738 -2544902 -2646493 -2683070
36287 -2683070 -2660899 -2581980 -2444464 -2246985 -1994330 -1701641 -1394169 -1101396 -847889 -645495
36277 -645495 -489744 -360144 -223197 -38259 233580 619858 1130652 1758919 2485558 3284200
36267 3284200 4121951 4957177 5739049 6412745 6929936 7260935 7404402 7391413 7281588 7150432
36257 7150432 7070438 7091978 7231196 7469557 7764806 8067899 8337995 8549575 8691462 8762317
36247 8762317 8767052 8714414 8613129 8465951 8265319 7995566 7642145 7202145 6688347 6123731
36237 6123731 5530621 4922052 4299985 3659587 2995617 2307749 1603598 899196 216650
36228 216650 -420875 -995724 -1501308 -1943387 -2334874 -2685935 -2995416 -3250227 -3434130 -3540317
36218 -3540317 -3579540 -3579186 -3574483 -3596178 -3659222 -3756111 -3857584 -3921008 -3903175 -3771907 -3512044
36207 -3512044 -3125398 -2627875 -2047536 -1424443 -809537 -259203 174264 451595 549866 459509
36197 459509 179080 -287828 -932382 -1738179 -2677462 -3706191 -4760502 -5759835 -6619730
36188 -6619730 -7269618 -7664798 -7785312 -7625921 -7189575 -6492309 -5574594 -4506181 -3376060
36179 -3376060 -2270454 -1249069 -329729 512269 1328527 2170588 3063231 3990834 4902403
36170 4902403 5729991 6409121 6892287 7154270 7193956 7037301 6740384 6386077 6068896 5870388
36160 5870388 5835438 5960798 6200815 6487046 6753383 6957232 7089250 7168707 7227737 7293025
36150 7293025 7374378 7465229 7552629 7628977 7698150 7773955 7873843 8011710 8191451 8401661 8612736
36139 8612736 8778679 8845146 8762756 8501477 8059739 7463164 6753577 5975513 5168493 4367464
36129 4367464 3606499 2919197 2333660 1865235 1512166 1257357 1075748 943436 844257 772418
36119 772418 733230 743929 833033 1034412 1375016 1861136 2471588 3163277 3886939 4604114
36109 4604114 5295662 5958241 6592731 7192265 7735773 8189140 8512621 8670110 8634206 8383983
36099 8383983 7900048 7166571 6185482 4996246 3686874 2385659 1234952 358098 -167070
36090 -167070 -319488 -129500 338021 1004458 1795824 2655398 3549752 4468878 5422485 6434071
36080 6434071 7532143 8736795 10042932 11406707 12743387 13940863 14885966 15495256
36072 15495256 15738951 15648017 15301350 14800258 14243765 13714605 13275655 12969666 12816277
36063 12816277 12806614 12900304 13029858 13114178 13078835 12876979 12502696 11989888 11395306 10772217
36053 10772217 10146670 9506904 8809549 7998714 7030239 5892680 4617602 3275110 1956884
36044 1956884 754304 -261071 -1052235 -1626479 -2037053 -2371084 -2722691 -3159951 -3700647
36035 -3700647 -4308276 -4908807 -5418242 -5767878 -5919496 -5870228 -5649914 -5311522 -4913924 -4500476
36025 -4500476 -4082476 -3636625 -3118217 -2483196 -1708530 -802777 195628 1229392 2237290
36016 2237290 3168586 3994180 4711807 5342828 5921818 6485267 7065903 7692537 8389135
36007 8389135 9168257 10021197 10911745 11778425 12544823 13134241 13484076 13556101 13340378 12852469
35997 12852469 12125382 11199227 10113078 8903412 7609835 6282960 4986496 3789076
35989 3789076 2748362 1895217 1225858 705733 282812 -95947 -470922 -861669 -1264769
35980 -1264769 -1658340 -2012976 -2305132 -2526219 -2683763 -2797189 -2892772 -2998334 -3135128 -3307674
35970 -3307674 -3497696 -3668293 -3777836 -3796459 -3716927 -3555526 -3344207 -3119232 -2912446 -2748076
35960 -2748076 -2643004 -2606095 -2634163 -2706045 -2778485 -2787587 -2658325 -2321773 -1734579 -891380
35950 -891380 176794 1416405 2768133 4177102 5594064 6971726 8261635 9414704
35942 9414704 10385758 11141026 11666218 11971842 12092486 12078619 11982349 11841962 11672062 11464416
35932 11464416 11198514 10854724 10422047 9898125 9285499 8589714 7821048 6997318 6144182
35923 6144182 5291837 4470148 3705124 3017680 2422668 1926039 1521237 1189628 908954
35914 908954 667583 475562 362768 362167 487132 717585 1004516 1289999 1529705 1705423
35904 1705423 1824543 1912360 2003942 2137322 2346208 2652361 3061306 3564162 4143624 4779012
35894 4779012 5448030 6127688 6797757 7446192 8072220 8684181 9293610 9909308 10533322
35885 10533322 11157970 11763065 12314965 12770527 13087147 13236006 13213156 13044127 12780962
35876 12780962 12492748 12251419 12115251 12113957 12239549 12445172 12652257 12766364 12701239 12405511
35866 12405511 11880560 11179156 10385109 9585668 8850734 8225375 7732446 7378174 7155955
35857 7155955 7048941 7035014 7095669 7224697 7429624 7723309 8111363 8584756 9122248 9699342
35847 9699342 10296693 10903309 11514570 12128026 12739821 13342097 13919454 14443113 14865128
35838 14865128 15118482 15128099 14831999 14204471 13269390 12094838 10769755 9373993 7957823
35829 7957823 6541131 5130319 3740703 2410737 1201028 180144 -595197 -1097361
35821 -1097361 -1336563 -1358259 -1229987 -1023253 -799003 -602885 -469406 -428426 -507830 -730489
35811 -730489 -1107242 -1629082 -2262563 -2952274 -3631029 -4233996 -4711600 -5038465 -5217889 -5280746
35801 -5280746 -5277084 -5261126 -5274335 -5332625 -5422018 -5503844 -5527526 -5446592 -5233063 -4886829 -4438228
35790 -4438228 -3942709 -3468327 -3081006 -2835207 -2773755 -2932210 -3338433 -4002241 -4899365 -5960035
35780 -5960035 -7070971 -8092175 -8882880 -9328752 -9364782 -8990073 -8269750 -7319325 -6273398
35771 -6273398 -5250043 -4325340 -3525486 -2834142 -2208269 -1596541 -955278 -256994 510631
35762 510631 1351924 2269538 3264598 4331077 5449961 6589348 7711824 8783660 9778012
35753 9778012 10669586 11426039 12004219 12355066 12434928 12217834 11703598 10918956 9912588
35744 9912588 8747816 7496317 6232898 5029479 3948032 3034352 2314219 1792081 1452562
35735 1452562 1265886 1197012 1215744 1304274 1460048 1693378 2020341 2453807 2997742 3648266
35725 3648266 4398631 5240500 6156847 7110840 8040960 8869113 9518514 9931170 10076440
35716 10076440 9949799 9567050 8959375 8170457 7253466 6265674 5261199 4285037 3371486
35707 3371486 2547107 1834900 1255679 825486 551080 426458 431732 534156 690803 852965
35697 852965 972623 1011100 948616 791283 571357 338646 145197 28747 1243 47294
35687 47294 133604 224765 296760 341778 365869 386514 434142 553693 799403 1221651 1852136
35676 1852136 2694628 3723152 4884701 6104022 7291336 8355186 9219637 9840368 10211952
35667 10211952 10361790 10333431 10168165 9893393 9520048 9045039 8454085 7724016 6826542
35658 6826542 5734396 4428516 2904500 1177957 -711545 -2699761 -4702905 -6629204
35650 -6629204 -8393597 -9930348 -11199864 -12189388 -12909217 -13385747 -13651979 -13737450 -13661798
35641 -13661798 -13435353 -13065814 -12565854 -11956356 -11263595 -10511897 -9715045 -8870521 -7961093
35632 -7961093 -6965794 -5876983 -4715193 -3533511 -2408527 -1421744 -639691 -100372 190748
35623 190748 257086 143837 -89545 -376735 -652474 -861499 -967857 -961833 -859714 -692744
35613 -692744 -488029 -251722 34343 400216 868894 1444071 2110494 2842201 3610106 4385565
35603 4385565 5142897 5863500 6538365 7163361 7727390 8201699 8540159 8692797 8625335 8333916
35593 8333916 7848070 7222173 6520831 5804306 5117708 4485501 3912886 3395087 2931517
35584 2931517 2536108 2235442 2054689 2000902 2054546 2173163 2303830 2398725 2428125 2384989
35574 2384989 2277593 2113946 1888886 1583647 1178104 666685 68012 -576119 -1211042
35565 -1211042 -1784692 -2263234 -2641635 -2945631 -3224924 -3540551 -3950284 -4495341 -5191082
35556 -5191082 -6023961 -6955843 -7934659 -8908190 -9836729 -10701026 -11503136 -12259179 -12985193
35547 -12985193 -13681190 -14322088 -14862260 -15251742 -15453343 -15450094 -15242050 -14840351 -14265579 -13549401
35537 -13549401 -12733434 -11862613 -10977108 -10108991 -9285262 -8532627 -7877583 -7339317 -6919080
35528 -6919080 -6592934 -6313161 -6018940 -5652540 -5175080 -4576271 -3875375 -3114666 -2349200
35519 -2349200 -1636057 -1023705 -541805 -194139 40995 201395 327221 451245 598570
35510 598570 793117 1062252 1432546 1917848 2507306 3160396 3810475 4374772 4768735 4922712
35500 4922712 4796588 4386628 3722106 2855075 1849152 771047 -314703 -1348331 -2275241
35491 -2275241 -3045917 -3618260 -3964129 -4077394 -3977432 -3703462 -3301562 -2812037 -2264673 -1683353
35481 -1683353 -1094788 -534107 -43328 336396 574761 659848 599627 416442 137321 -213700
35471 -213700 -615159 -1038873 -1438837 -1749432 -1899318 -1835701 -1544768 -1055952 -429343 263461
35461 263461 953843 1582861 2104880 2492613 2741870 2869801 2903080 2859916 2735530 2500126
35451 2500126 2111433 1535130 761757 -187934 -1268839 -2421913 -3583693 -4694834 -5709891
35442 -5709891 -6607255 -7393686 -8098261 -8756539 -9392767 -10010032 -10593035 -11119318 -11570352
35433 -11570352 -11937549 -12224292 -12445730 -12624479 -12780972 -12923520 -13046138 -13135671 -13180900 -13175916
35423 -13175916 -13117282 -12999475 -12812053 -12539541 -12164387 -11672046 -11054876 -10311969 -9446602
35414 -9446602 -8465583 -7382097 -6219481 -5013255 -3810959 -2669617 -1649308 -802250
35406 -802250 -160323 273483 525025 639544 666687 646858 604167 545970 465058 341936
35396 341936 148508 -144464 -556747 -1088827 -1717786 -2401547 -3090003 -3737372 -4309924 -4787643
35386 -4787643 -5162505 -5434939 -5607188 -5674142 -5618054 -5414195 -5046440 -4522907 -3881459 -3182623
35376 -3182623 -2494504 -1876317 -1366017 -976231 -700191 -524727 -443275 -462296 -599392 -876024
35366 -876024 -1308225 -1896991 -2620762 -3434932 -4282035 -5108614 -5878340 -6573750 -7188861 -7721119
35356 -7721119 -8168364 -8530349 -8812110 -9027331 -9199665 -9359163 -9533113 -9735439 -9961282
35347 -9961282 -10190645 -10399214 -10570447 -10703052 -10811165 -10918110 -11046165 -11205318 -11385145
35338 -11385145 -11554617 -11671366 -11695397 -11598887 -11367786 -10998019 -10491867 -9857645 -9112717 -8287974
35328 -8287974 -7429953 -6596060 -5842667 -5212872 -4732074 -4412126 -4256522 -4259307 -4398182 -4628414
35318 -4628414 -4883643 -5085359 -5159119 -5052983 -4751655 -4279824 -3692682 -3058808 -2444899 -1908580
35308 -1908580 -1496892 -1242681 -1155151 -1210439 -1352520 -1508723 -1613737 -1630560 -1559219 -1430163
35298 -1430163 -1285752 -1158612 -1057548 -967521 -861802 -718368 -532338 -319852 -112909 51665
35288 51665 143322 143861 47217 -144548 -425631 -788365 -1220309 -1696946 -2175508 -2598018 -2906000
35277 -2906000 -3059350 -3047661 -2888361 -2615835 -2270106 -1890612 -1514639 -1176665 -905699 -721225
35267 -721225 -630385 -627606 -695072 -802650 -908798 -964940 -923064 -744097 -405695 90572 714806
35256 714806 1411980 2114944 2762546 3314354 3756385 4097965 4363462 4582824 4783095 4980799
35246 4980799 5174838 5343097 5448945 5459875 5369986 5211576 5046940 4944805 4954497 5089410
35236 5089410 5324703 5608353 5880819 6095765 6233641 6303106 6330667 6343847 6355719 6357907
35226 6357907 6325322 6230342 6059596 5825425 5566471 5336825 5188635 5156345 5249280 5454112
35216 5454112 5743535 6085867 6451416 6813413 7143329 7403562 7543943 7508233 7250605 6753455
35206 6753455 6035157 5143583 4142639 3103122 2101474 1219291 534647 105078 -48880
35197 -48880 49447 338142 730790 1134762 1469072 1677084 1730757 1627285 1383004 1029339
35187 1029339 611575 187009 -181519 -437293 -542720 -487676 -289450 15013 380982 768899
35177 768899 1156755 1549338 1979673 2499143 3158701 3989462 4990536 6125847 7326870
35168 7326870 8499210 9534940 10332671 10822185 10984562 10858272 10527747 10099694 9677610
35159 9677610 9343407 9148851 9114497 9233083 9475066 9793379 10124480 10387334 10487986 10336714
35149 10336714 9874977 9099723 8072398 6908238 5749785 4733015 3956537 3464278 3246823
35140 3246823 3257261 3431379 3703932 4018416 4330779 4607648 4821365 4947269 4967923 4882448
35130 4882448 4712994 4501698 4299234 4152082 4094261 4143170 4296282 4528669 4795750 5044261
35120 5044261 5227310 5314659 5293071 5160047 4918508 4576426 4149333 3661729 3145680 2637094
35110 2637094 2170219 1770827 1449693 1199244 995731 807190 604958 374360 119589
35101 119589 -140256 -382725 -595682 -786189 -979871 -1210449 -1503932 -1864661 -2269222 -2669198
35091 -2669198 -2999384 -3188046 -3169220 -2898247 -2367683 -1616017 -722798 208800 1074443 1788828
35081 1788828 2300641 2601013 2722209 2723442 2666902 2594467 2515832 2411051 2242559 1970025
35071 1970025 1564395 1019407 358117 -368503 -1091571 -1739961 -2256341 -2608453 -2793228
35062 -2793228 -2834983 -2780141 -2688527 -2618996 -2610168 -2664170 -2744152 -2789328 -2739771 -2557860 -2238008
35051 -2238008 -1804901 -1304952 -794938 -329745 49142 321962 493568 590212 651582 720754
35041 720754 834986 1019864 1288252 1643573 2084667 2608302 3206794 3861600 4537233 5180313
35031 5180313 5725527 6105563 6260288 6143266 5727327 5010601 4020739 2813721 1466670
35022 1466670 67217 -1298816 -2560500 -3671907 -4613153 -5380281 -5970597 -6372793 -6565682
35013 -6565682 -6523369 -6224627 -5665450 -4870514 -3895560 -2816437 -1710025 -637506 362923
35004 362923 1273699 2089371 2805886 3411192 3880341 4177260 4263765 4113935 3728538 3142071
34994 3142071 2417669 1631309 851487 120732 -555869 -1210218 -1895778 -2661280 -3525819
34985 -3525819 -4468574 -5436933 -6364580 -7187046 -7848858 -8306188 -8530926 -8515817 -8274836 -7836549
34975 -7836549 -7236535 -6516126 -5726023 -4925434 -4170486 -3496534 -2905101 -2362448 -1809622
34966 -1809622 -1179978 -419867 492800 1538988 2662859 3788124 4837363 5744251 6455636
34957 6455636 6928882 7131875 7047577 6679579 6055211 5225509 4261431 3244061 2248637
34948 2248637 1328028 503976 -229847 -895919 -1518833 -2115278 -2691564 -3248476 -3789588
34939 -3789588 -4327689 -4885851 -5492873 -6174856 -6945842 -7801041 -8715200 -9645847 -10539531
34930 -10539531 -11339796 -11996004 -12469941 -12736599 -12780345 -12593327 -12180856 -11569853 -10811389
34921 -10811389 -9973038 -9124332 -8321013 -7591975 -6932697 -6310123 -5680084 -5009729 -4292351
34912 -4292351 -3546949 -2805668 -2099250 -1449209 -868769 -368400 40219 345809 544072
34903 544072 644806 674248 670096 671249 707500 794184 933181 1117401 1334027 1563304 1773540
34892 1773540 1916999 1933359 1764692 1378656 788933 60659 -704286 -1396758 -1932454 -2274274
34882 -2274274 -2437344 -2476351 -2462354 -2459852 -2512058 -2635390 -2819959 -3034485 -3237062 -3391806
34872 -3391806 -3485931 -3538341 -3593798 -3704275 -3906238 -4205081 -4574834 -4973731 -5367801 -5749517
34862 -5749517 -6140388 -6574882 -7074435 -7626845 -8182897 -8670667 -9017638 -9168998 -9096135 -8795473
34852 -8795473 -8280322 -7569696 -6680281 -5628206 -4441686 -3175920 -1916359 -762667 199853
34843 199853 924262 1407608 1678860 1782111 1767501 1691261 1616038 1602317 1690726 1885342
34833 1885342 2151594 2434595 2689243 2903202 3097775 3307410 3553256 3828419 4102767
34824 4102767 4341876 4526759 4661857 4767492 4863678 4956967 5037791 5087403 5088847 5036945 4944314
34813 4944314 4841484 4770554 4774324 4884816 5114930 5455583 5878481 6342129 6797346 7190616
34803 7190616 7467562 7579862 7495043 7204428 6725550 6099733 5387703 4663854 4007692 3492888
34793 3492888 3177528 3098969 3272803 3692962 4331571 5139938 6052360 6992855 7884563 8662214
34783 8662214 9285988 9751096 10086331 10340257 10561006 10778516 10995199 11186266 11307617
34774 11307617 11307431 11138000 10766458 10184726 9417289 8522656 7584849 6695940 5935137 5351407
34764 5351407 4955560 4724818 4617672 4591075 4611580 4657820 4717838 4785212 4855041 4920390 4971772
34753 4971772 5001594 5011137 5014958 5039877 5119907 5289791 5578083 5999744 6549751 7201263 7911082
34742 7911082 8630885 9318162 9940369 10471182 10884481 11153732 11259445 11199794 10995763 10685771
34732 10685771 10312677 9911995 9508860 9123704 8779197 8500227 8304450 8188035 8114959
34723 8114959 8017144 7807990 7405480 6756320 5852313 4733957 3480591 2189586 949920
34714 949920 -180868 -1186576 -2084630 -2905813 -3672980 -4388742 -5035001 -5580977 -5994624
34705 -5994624 -6253638 -6352995 -6306224 -6139553 -5882188 -5558681 -5187406 -4784028 -4365877 -3954678
34695 -3954678 -3578104 -3270579 -3071018 -3014469 -3119046 -3375688 -3749599 -4195209 -4676188 -5177678
34685 -5177678 -5704079 -6266796 -6872058 -7514948 -8178545 -8834658 -9445787 -9970114 -10368767
34676 -10368767 -10611073 -10674729 -10543049 -10204539 -9657016 -8912734 -7999006 -6953102 -5816269
34667 -5816269 -4632931 -3455327 -2346712 -1375218 -597888 -43637 294066 451368 481325
34658 481325 443739 401347 418469 555780 859560 1350522 2019677 2834527 3752062 4731079
34648 4731079 5737766 6743142 7715607 8614498 9390398 9994225 10391201 10571816 10553371
34639 10553371 10371333 10064714 9661094 9166247 8562210 7815588 6893961 5784390 4506980
34630 4506980 3118511 1704133 358206 -840642 -1850822 -2675006 -3348855 -3917323 -4412205
34621 -4412205 -4842495 -5199182 -5467003 -5634158 -5696199 -5655581 -5520098 -5302163 -5019174 -4693930
34611 -4693930 -4353662 -4027059 -3739660 -3508195 -3334948 -3205089 -3090882 -2962501 -2798282
34602 -2798282 -2586550 -2319801 -1990764 -1597462 -1153077 -689890 -251709 121263 407206
34593 407206 611944 770234 937362 1170904 1507662 1945886 2442539 2927871 3329696 3595085
34583 3595085 3701103 3654925 3489348 3258467 3032862 2890253 2899417 3101305 3496901 4050490
34573 4050490 4707903 5418683 6149220 6882773 7612386 8333632 9037955 9704720 10294767
34564 10294767 10752637 11020535 11057192 10849935 10413472 9779174 8984707 8071220 7087238
34555 7087238 6091504 5147414 4309162 3607978 3048010 2613257 2277570 2008430 1763812
34546 1763812 1490333 1130847 640744 4132 -759279 -1599724 -2451960 -3252545 -3953223
34537 -3953223 -4526528 -4963986 -5270864 -5461006 -5551794 -5557700 -5483756 -5323902 -5067559 -4711683
34527 -4711683 -4271466 -3784984 -3311734 -2926233 -2705451 -2708979 -2956489 -3413647 -3997298 -4601359
34517 -4601359 -5132381 -5537418 -5811355 -5983653 -6096206 -6186611 -6283152 -6406740 -6570695 -6774248
34507 -6774248 -6994831 -7188517 -7303058 -7297903 -7159121 -6900531 -6552810 -6150362 -5724433 -5303695
34497 -5303695 -4917526 -4596786 -4369892 -4255434 -4254863 -4349157 -4501091 -4661752 -4779052 -4807019
34487 -4807019 -4714737 -4492528 -4153217 -3728796 -3263983 -2806803 -2395952 -2048549 -1755646 -1490442
34477 -1490442 -1226263 -955328 -699468 -508335 -445491 -567440 -903985 -1447840 -2156936 -2967024
34467 -2967024 -3808591 -4621430 -5361892 -6002066 -6524886 -6920795 -7188278 -7336159 -7384969 -7367288
34457 -7367288 -7327781 -7320955 -7402651 -7614855 -7970383 -8447457 -8999101 -9572128 -10123583 -10625019
34447 -10625019 -11054670 -11386340 -11584888 -11612020 -11438564 -11055799 -10479899 -9748141 -8910295
34438 -8910295 -8020841 -7135207 -6307781 -5586577 -5003062 -4562267 -4240000 -3988661 -3747452
34429 -3747452 -3453416 -3053723 -2519210 -1853916 -1093495 -291610 498477 1238287 1910606
34420 1910606 2518667 3079870 3616778 4150061 4697495 5277976 5913922 6626330 7423871
34411 7423871 8294190 9204917 10114281 10983775 11785025 12499555 13116176 13630131 14043126
34402 14043126 14361194 14590437 14734504 14796727 14785418 14717620 14617710 14510943 14415380 14335898
34392 14335898 14261705 14166714 14012969 13759294 13375607 12857580 12233146 11556673 10894596 10309739
34382 10309739 9848824 9534831 9365713 9320561 9370330 9486779 9645077 9821337 9989825 10122807
34372 10122807 10192220 10170910 10033127 9756587 9328465 8753737 8059970 7293091 6505844 5747496
34362 5747496 5061987 4492108 4080012 3857511 3830402 3968513 4210451 4482091 4719192 4882869
34352 4882869 4962170 4965674 4909334 4808006 4674527 4524825 4383503 4283498 4257255 4323004
34342 4323004 4473716 4674846 4871679 5002709 5013951 4869684 4556448 4079684 3455890 2705480
34332 2705480 1850855 920972 -40218 -967434 -1776456 -2378329 -2700955 -2707738 -2403737 -1826854
34322 -1826854 -1029474 -59551 1050891 2285818 3635430 5083160 6596783 8126705
34314 8126705 9609420 10973196 12145743 13064075 13683595 13981720 13955443 13617909 12998330
34305 12998330 12142975 11111516 9968200 8773937 7583981 6447847 5405043 4476871
$$ [...]
##END NTUPLES=NMR SPECTRUM
##END=
