##TITLE=31Pdec_DE-43_EA_TFA3
 CDCl3
 24 sc
 3.4.2024
##JCAMPDX= 6.0         $$ Bruker NMR JCAMP-DX V2.0
##DATA TYPE= NMR SPECTRUM
##DATA CLASS= NTUPLES
##ORIGIN= UXNMR, Bruker Analytische Messtechnik GmbH
##OWNER= root
$$ XWIN-NMR		Version 3.5
$$ Wed Apr  3 16:28:14 2024 Russian Standard Time (UT+4h)  she@DPX200
##.OBSERVE FREQUENCY= 81.013821
##.OBSERVE NUCLEUS= ^31P
##.ACQUISITION MODE= SIMULTANEOUS
##.ACQUISITION SCHEME= undefined
##.AVERAGES= 24
##.DIGITISER RES= 16
##SPECTROMETER/DATA SYSTEM= spect
##.PULSE SEQUENCE= zgpg30
##.SOLVENT NAME= CDCl3
##.SHIFT REFERENCE= (INTERNAL, CDCl3, 0, 248.564)
##AUDIT TRAIL= $$ (NUMBER, WHEN, WHO, WHERE, WHAT)
$$ ##TITLE= Audit trail, XWIN-NMR		Version 3.5
$$ ##JCAMPDX= 5.01
$$ ##ORIGIN= Bruker BioSpin GmbH
$$ ##OWNER= she
$$ F:/spectra/data/she/nmr/P31/1/pdata/1/auditp.txt
$$ ##AUDIT TRAIL=  $$ (NUMBER, WHEN, WHO, WHERE, WHAT)
(   1,<2024-04-03 16:27:30.04 +0400>,<she>,<DPX200>,
      <created by zg, POWCHK disabled, PULCHK disabled
       configuration hash MD5:
       00 E9 B6 7A A2 85 ED C7 34 08 36 98 17 FE 4E 26
       data hash MD5: 32K
       01 16 22 DD 43 C6 D7 4B 32 D5 45 1E 86 B1 CD 15>)
(   2,<2024-04-03 16:27:32.46 +0400>,<she>,<DPX200>,
      <Start of raw data processing
       efp BC_mod = 2 LB = 10 FT_mod = 6 PKNL = 1 PHC0 = -13218.86 PHC1 = 65.08333 SI = 64K 
       data hash MD5: 64K
       28 D5 5C 22 48 82 C8 82 5D 70 DC B6 B9 C7 8B B3>)
(   3,<2024-04-03 16:27:41.60 +0400>,<she>,<DPX200>,
      <abs ABSG = 5 
       data hash MD5: 64K
       2B E4 85 13 B6 B1 B7 AF A7 B7 8A 40 F0 88 61 3B>)
$$ ##END=
$$ 
$$ hash MD5
$$ B6 9C 42 6E 03 DB 34 4D C9 E2 3B 50 D6 55 F8 53
##$RELAX= 
##$RELAX= 
##$RELAX= 
##$RELAX= 
##$RELAX= 
##$RELAX= 
##$RELAX= 
##$RELAX= 
##$RELAX= 
$$ Bruker specific parameters
$$ --------------------------
##$DU= <F:/spectra>
##$EXPNO= 1
##$NAME= <P31>
##$PROCNO= 1
##$TYPE= <nmr>
##$USER= <she>
##$AMP= (0..31)
100 100 100 100 100 100 100 100 100 100 100 100 100 100 100 100 100 100 
100 100 100 100 100 100 100 100 100 100 100 100 100 100 
##$AQSEQ= 0
##$AQ_mod= 1
##$AUNM= <au_zg>
##$AUTOPOS= <>
##$BF1= 81.014009
##$BF2= 200.13
##$BF3= 200.13
##$BF4= 200.13
##$BF5= 200.13
##$BF6= 200.13
##$BF7= 200.13
##$BF8= 200.13
##$BYTORDA= 1
##$CFDGTYP= 0
##$CFRGTYP= 5
##$CHEMSTR= <none>
##$CNST= (0..31)
1 1 145 1 1 1 1 1 1 1 1 1 1 1 1 1 1 1 1 1 1 1 1 1 1 1 1 1 1 1 1 1 
##$CPDPRG= <waltz16>
##$CPDPRG1= <>
##$CPDPRG2= <waltz16>
##$CPDPRG3= <>
##$CPDPRG4= <mlev>
##$CPDPRG5= <mlev>
##$CPDPRG6= <mlev>
##$CPDPRG7= <mlev>
##$CPDPRG8= <mlev>
##$CPDPRGB= <>
##$CPDPRGT= <>
##$D= (0..31)
0 1 0 0 0 0 0 0 0 0 0 0.03 2e-05 3e-06 0 0 0 0 0 0 0 0 0 0 0 0 0 0 0 0 
0 0 
##$DATE= 1712147249
##$DBL= (0..7)
120 120 120 11 120 120 24 19 
##$DBP= (0..7)
150 150 150 150 150 150 150 150 
##$DBP07= 0
##$DBPNAM0= <>
##$DBPNAM1= <>
##$DBPNAM2= <>
##$DBPNAM3= <>
##$DBPNAM4= <>
##$DBPNAM5= <>
##$DBPNAM6= <>
##$DBPNAM7= <>
##$DBPOAL= (0..7)
0.5 0.5 0.5 0.5 0.5 0.5 0.5 0.5 
##$DBPOFFS= (0..7)
0 0 0 0 0 0 0 0 
$$ [...]
##$SUBNAM3= <"">
##$SUBNAM4= <"">
##$SUBNAM5= <"">
##$SUBNAM6= <"">
##$SUBNAM7= <"">
##$SUBNAM8= <"">
##$SUBNAM9= <"">
##$SW= 501.771253377433
##$SWIBOX= (0..15)
0 1 3 0 0 0 0 0 0 0 0 0 0 0 0 0 
##$SW_h= 40650.406504065
##$TD= 32768
##$TD0= 1
##$TE= 0
##$TE2= 300
##$TE3= 300
##$TEG= 300
##$TL= (0..7)
0 120 53 12 22 120 120 120 
##$TP= (0..7)
150 150 150 150 150 150 150 150 
##$TP07= 0
##$TPNAME0= <>
##$TPNAME1= <>
##$TPNAME2= <>
##$TPNAME3= <>
##$TPNAME4= <>
##$TPNAME5= <>
##$TPNAME6= <>
##$TPNAME7= <>
##$TPOAL= (0..7)
0.5 0.5 0.5 0.5 0.5 0.5 0.5 0.5 
##$TPOFFS= (0..7)
0 0 0 0 0 0 0 0 
##$TUNHIN= 0
##$TUNHOUT= 0
##$TUNXOUT= 0
##$USERA1= <user>
##$USERA2= <user>
##$USERA3= <user>
##$USERA4= <user>
##$USERA5= <user>
##$V9= 5
##$VALIST= <valist>
##$VCLIST= <CCCCCCCCCCCCCCC>
##$VD= 0
##$VDLIST= <DDDDDDDDDDDDDDD>
##$VPLIST= <PPPPPPPPPPPPPPP>
##$VTLIST= <TTTTTTTTTTTTTTT>
##$WBST= 1024
##$WBSW= 4
##$XGAIN= (0..3)
0 0 0 0 
##$XL= 0
##$YL= 0
##$YMAX_a= 1607
##$YMIN_a= -1697
##$ZGOPTNS= <>
##$ZL1= 120
##$ZL2= 120
##$ZL3= 120
##$ZL4= 120
##$ABSF1= 248.5645
##$ABSF2= -253.2056
##$ABSG= 5
##$ABSL= 3
##$ALPHA= 0
##$AQORDER= 0
##$ASSFAC= 0
##$ASSFACI= 0
##$ASSFACX= 0
##$ASSWID= 0
##$AUNMP= <proc_1d>
##$AZFE= 0.1
##$AZFW= 0.5
##$BCFW= 0
##$BC_mod= 2
##$BYTORDP= 0
##$COROFFS= 0
##$CY= -3
##$DATMOD= 1
##$DC= 0
##$DFILT= <>
##$DTYPP= 0
##$F1P= 0
##$F2P= 0
##$FCOR= 1
##$FTSIZE= 65536
##$FT_mod= 6
##$GAMMA= 0
##$GB= 0
##$INTBC= 1
##$INTSCL= 6.047779e-11
##$ISEN= 30
##$LB= 10
##$LEV0= 0
##$LPBIN= 0
##$MAXI= 10000
##$MC2= 0
##$MEAN= 0
##$ME_mod= 0
##$MI= 50
##$NCOEF= 0
##$NC_proc= -10
##$NLEV= 6
##$NOISF1= 182.463
##$NOISF2= 159.3651
##$NSP= 0
##$NTH_PI= 0
##$NZP= 0
##$OFFSET= 248.5645
##$PC= 4
##$PHC0= -13218.86
##$PHC1= 65.08333
##$PH_mod= 1
##$PKNL= yes
##$PPARMOD= 0
##$PSCAL= 0
##$PSIGN= 0
##$REVERSE= no
##$SF= 81.0140089999694
##$SI= 65536
##$SIGF1= 159.3651
##$SIGF2= -187.1042
##$SINO= 113.3802
##$SIOLD= 16384
##$SREGLST= <1H.CDCl3>
##$SSB= 0
##$STSI= 65536
##$STSR= 0
##$SW_p= 40650.406504065
##$SYMM= 0
##$S_DEV= 0
##$TDeff= 32768
##$TDoff= 0
##$TI= <>
##$TILT= no
##$TM1= 0
##$TM2= 0
##$TOPLEV= 0
##$USERP1= <user>
##$USERP2= <user>
##$USERP3= <user>
##$USERP4= <user>
##$USERP5= <user>
##$WDW= 1
##$XDIM= 65536
##$YMAX_p= 297791646
##$YMIN_p= -75381935
$$ End of Bruker specific parameters
$$ ---------------------------------
##NTUPLES= NMR SPECTRUM
##VAR_NAME=  FREQUENCY,     SPECTRUM/REAL,   SPECTRUM/IMAG
##SYMBOL=    X,             R,               I
##VAR_TYPE=  INDEPENDENT,   DEPENDENT,       DEPENDENT
##VAR_FORM=  AFFN,          ASDF,            ASDF
##VAR_DIM=   65536,         65536,           65536
##UNITS=     HZ,            ARBITRARY UNITS, ARBITRARY UNITS
##FACTOR=    0.620285442955139, 1,           1
##FIRST=     20137.2065510682, 0,            0
##LAST=      -20513.1999529968, 0,           0
##MIN=       -20513.1999529968, -75381935,   0
##MAX=       20137.2065510682, 297791646,    0
$$ Real data points
##PAGE= N=1
##DATA TABLE= (X++(R..R)), XYDATA
$$ [...]
43323H462183j62501j38958p7337J7821J39918K78983M20366N46580O42495P00319
43313A0829869P20043P04511O52860N58055M11551K12537k5575k77829n18985
43304A3267037p34745r23718j089178j229029j333243j390093j394624j352200
43296C820207j275289j176517j062210r29734p70296n76469l50590j08580J23554
43287b305924L18139M53806N19949N18696M65741L87933L14560K64580K38039
43278A175519K18278J82647J13424L173j44880l18711n00896o73327q21012r32374
43268a698159r96590j001430r34487p88420n68912l01538l1366J89187L20583
43259e811132L52696L06599K20832J31993O1599J4672j3121k7927l6156m8376
$$ y = [8462183, 8299682, 8160724, 8083387, 8101208, 8241126, 8520109, 8940475, 9487055, 10129550, 10829869, 11549912, 12254423, 12907283, 13465338, 13876889, 14089426, 14063851, 13786022, 13267037, 12532292, 11608574, 10519396, 9290367, 7957124, 6567031, 5172407, 3820207, 2544918, 1368401, 306191, -623543, -1393839, -1970308, -2320898, -2429478, -2305924, -1987785, -1533979, -1014030, -495334, -29593, 358340, 672900, 937480, 1175519, 1393797, 1576444, 1689868, 1693041, 1548161, 1229450, 728554, 55227, -765785, -1698159, -2694749, -3696179, -4630666, -5419086, -5987998, -6289536, -6320902, -6131715, -5811132, -5458436, -5151837, -4931005, -4799012, -4737413, -4722741, -4735862, -4763789, -4799945, -4848321]
43249d848321q1473j52550k66270m05328n32944o07052n97592m97406l22792j05532
43239h417260J19101L23595M94808O33845P50353Q55111R54963J051378J140921
43230b093185J216064J266940J285615J271522J233767J186750J140949J095230
43222G603652J036424R46884Q15133O42937M44556K39416M3483j35157k94898
43213A1342430m35847n55361o46280o98445p02822o56214n63878m38485k96428
43204F348670j54068k5240Q0825J61763K22947K74433L24176L71775M07685M18766
43194H431732L95894L37893K49967J39986J7357j04753k08088k72958k85686k44676
43184H456668j62097o2888J7647M0536k3461j79416m03610o53467q84702j064715
$$ y = [-4848321, -4929794, -5082344, -5348614, -5753942, -6286886, -6893938, -7491530, -7988936, -8311728, -8417260, -8298159, -7974564, -7479756, -6845911, -6095558, -5240447, -4285484, -3234106, -2093185, -877121, 389819, 1675434, 2946956, 4180723, 5367473, 6508422, 7603652, 8640076, 9586960, 10402093, 11045030, 11489586, 11729002, 11772485, 11637328, 11342430, 10906583, 10351222, 9704942, 9006497, 8303675, 7647461, 7083583, 6645098, 6348670, 6194602, 6169362, 6250187, 6411950, 6634897, 6909330, 7233506, 7605281, 8012966, 8431732, 8827626, 9165519, 9415486, 9555472, 9572829, 9468076, 9259988, 8987030, 8701344, 8456668, 8294571, 8231683, 8249330, 8289866, 8266405, 8086989, 7683379, 7029912, 6145210, 5080495]
43174E080495j178115j226740j225441j192725j139301j062820r53842q08119
43166c706608o34655m54168k91268j66868r4268p8156j14714j92177k92736l96502
43156f422120m86318n50364n80282n66440m95114l51759j30054J58444M80722
43147h943285P88530J032158J174960J202038J121302R59280P54439N48749L78034
43138i83795K63724K09832K06416K36692K83406L32152L72496L99134M13741M25750
43128B159548M49384M96673N70336O61820P56186Q39471R02692R40975R51250
43119H728335R31751Q82714Q06215P04987N81677M38809K78862J04944p6765k54186
43109A3127343m09822n26106n92385o08523n83658n32603m73092m24627m07659
$$ y = [5080495, 3902380, 2675640, 1450199, 257474, -881827, -1944647, -2898489, -3706608, -4341263, -4795431, -5086699, -5253567, -5347835, -5425991, -5540705, -5732882, -6025618, -6422120, -6908438, -7458802, -8039084, -8605524, -9100638, -9452397, -9582451, -9424007, -8943285, -8154755, -7122597, -5947637, -4745599, -3624297, -2665017, -1910578, -1361829, -983795, -720071, -510239, -303823, -67131, 216275, 548427, 920923, 1320057, 1733798, 2159548, 2608932, 3105605, 3675941, 4337761, 5093947, 5933418, 6836110, 7777085, 8728335, 9660086, 10542800, 11349015, 12054002, 12635679, 13074488, 13353350, 13458294, 13381529, 13127343, 12717521, 12191415, 11599030, 10990507, 10406849, 9874246, 9401154, 8976527, 8568868]
43100H568868m41578n40759p09037r34273j185849j417913j579001j625180j531460
43091a396182j297600r48059n27891r4551K95671O04426Q23268R72038J082769
43082d86111J178652J261308J313392J312924J248623J126575R65747P87727O08727
43073I317564M38133K81414J42078K0550q6817j84174k69314l30423l51576l23649
43063H653786k51845j54635n6698J8311N2355L6081k8282j24935k25847k97502
43053G620789l12351k60279j53536k1585J01349J89235K31869K35168K15466J90712
43043H036837J71832J57121J31902P4701l1767j90185l85287n89551p73862r17121
43033E684620j011406j061689j080038j076397j051482r97022r02747p64371n87588
$$ y = [8568868, 8127290, 7586531, 6877494, 5943221, 4757372, 3339459, 1760458, 135278, -1396182, -2693782, -3641841, -4169732, -4264283, -3968612, -3364186, -2540918, -1568880, -486111, 692541, 1953849, 3267241, 4580165, 5828788, 6955363, 7921110, 8708837, 9317564, 9755697, 10037111, 10179189, 10199739, 10112922, 9928748, 9659434, 9329011, 8977435, 8653786, 8401941, 8247306, 8190608, 8208919, 8261274, 8297355, 8269073, 8144138, 7918291, 7620789, 7308438, 7048159, 6894623, 6873038, 6974387, 7163622, 7395491, 7630659, 7846125, 8036837, 8208669, 8365790, 8497692, 8572393, 8540626, 8350441, 7965154, 7375603, 6601741, 5684620, 4673214, 3611525, 2531487, 1455090, 403608, -593414, -1496161, -2260532, -2848120]
43024b848120l87364j84435l88J47762K52583L19762L68425M25340N12064O30576
43014g63795P57455Q52495Q77293Q12684O66885M72739K76708J23578M2020L6934
43004D154996R1345J75228K55387L02309K94034K18895P7871j15013l35982n58449
42994D560621p60466r28442j055046j134224j159200j126549j042701r26273q03059
42985d375339o96920o21577n76555n48301n16662m64453l85510k87476j89085
42976h661878j13416p8021q4627j14919j37853j25375o5747L3665J52558K65265
42966h930348L44880L65597L07914J68326l1641k46268m20813n14030n14054m38634
42956i909071l22046j97700q4734J6702J20107K40614L83591N39651O87000P99437
$$ y = [-2848120, -3235484, -3419919, -3420307, -3272545, -3019962, -2700200, -2331775, -1906435, -1394371, -763795, -6340, 846155, 1723448, 2536132, 3203017, 3675756, 3952464, 4076042, 4118062, 4154996, 4246341, 4421569, 4676956, 4979265, 5273299, 5492194, 5570065, 5455052, 5119070, 4560621, 3800155, 2871713, 1816667, 682443, -476757, -1603306, -2646007, -3572280, -4375339, -5072259, -5693836, -6270391, -6818692, -7335354, -7799807, -8185317, -8472793, -8661878, -8775294, -8853315, -8937942, -9052861, -9190714, -9316089, -9381836, -9348171, -9195613, -8930348, -8585468, -8219871, -7911957, -7743631, -7775272, -8021540, -8442353, -8956383, -9470437, -9909071, -10231117, -10428817, -10513551, -10496849, -10376742, -10136128, -9752537, -9212886, -8525886, -7726449]
42946g726449Q58718Q67215Q51879Q52468Q99001R93907J111013J209742J252865
42937A170359J217843J099717R08980O67746M05092J51113o9626k43138l67600
42928D940486m51245n07686n50259n87389o21007o48207o63859o61715o34490
42919c85371n75257m80899l55523k11237o5534O3663J63276K28423K62220K72610
42909a083629K68784K59941K56886K73905L26840M25825N66444P26149Q69223
42900B890368R57079R58472Q57233O57356L83405P4063k28867m89586o81913p90104
42890D587506q10769p55427o49816n28084m23629l59892l44164l66848m06725
42881e7848m39631m45851m13429l38606k26500r2553L8918J42693K04661K29162
$$ y = [-7726449, -6867731, -6000516, -5148637, -4296169, -3397168, -2403261, -1292248, -82506, 1170359, 2388202, 3487919, 4396899, 5064645, 5469737, 5620850, 5551224, 5308086, 4940486, 4489241, 3981555, 3431296, 2843907, 2222900, 1574693, 910834, 249119, -385371, -960628, -1441527, -1797050, -2008287, -2073821, -2010158, -1846882, -1618459, -1356239, -1083629, -814845, -554904, -298018, -24113, 302727, 728552, 1294996, 2021145, 2890368, 3847447, 4805919, 5663152, 6320508, 6703913, 6777976, 6549109, 6059523, 5377610, 4587506, 3776737, 3021310, 2371494, 1843410, 1419781, 1059889, 715725, 348877, -57848, -497479, -943330, -1356759, -1695365, -1921865, -2014418, -1975500, -1832807, -1628146, -1398984]
42871a398984K34867K42254K62857K97230L39575L82916M21813M53642M79357
42862A715527N02895N28557N57080N81816N87079N50983M53391K85815N7433k06549
42852E614027m73034p10784q97133j019558j073252j057648r74913q31562o41932
42843b065789m30362k28802o8892K8602O1536M6751J2690j1763o205L8730J24299
42832b499205K47049L98567N62941P16880Q34751Q95574Q87952Q11801O77057
42823C533367M99101K92017O4394j78440m28195o69902q83830j050021j151908
42814B6583j178972j129208j010455q39625o40885m43190k74725j53276p8156
42805e721909l1744Q361N5303J06784J49097J66654J51693J10668O4738M2496
$$ y = [-1398984, -1164117, -921863, -659006, -361776, -22201, 360715, 782528, 1236170, 1715527, 2218422, 2746979, 3304059, 3885875, 4472954, 5023937, 5477328, 5763143, 5820576, 5614027, 5140993, 4430209, 3533076, 2513518, 1440266, 382618, -592295, -1423857, -2065789, -2496151, -2724953, -2793845, -2765243, -2703707, -2656956, -2644266, -2656029, -2662234, -2623504, -2499205, -2252156, -1853589, -1290648, -573768, 260983, 1156557, 2044509, 2856310, 3533367, 4032468, 4324485, 4388879, 4210439, 3782244, 3112342, 2228512, 1178491, 26583, -1152389, -2281597, -3292052, -4131677, -4772562, -5215752, -5490477, -5643753, -5721909, -5753653, -5745292, -5689989, -5583205, -5434108, -5267454, -5115761, -5005093, -4940355, -4897859]
42795d897859O7074J44376K60026L87664N03728N99533O83026P69700Q69223R76671
42785C63162J073225J134659J142014J088870R82719Q41178O85462N33548L94849
42776H239686K68097J44013J2311j30309k75637m05197m96257n29911m98301m08012
42766E920483k77914j32597M870J17467J95353K34919K37538K09276J61365J09133
42756F779893O7111M2238L1060K4452J6131P758P957K7976P6871J56221K55291
42745G492959L50628M13281M20983L67981K66542J39922J1969r9991j85825k39674
42735H938775k58923k46870k15568j84861j77485k12423k97897m25735n71322
42726F347691p02350p93103q35342q38939q22866q02634p80797p44970o74534
$$ y = [-4897859, -4830785, -4686409, -4426383, -4038719, -3534991, -2935458, -2252432, -1482732, -613509, 363162, 1436387, 2571046, 3713060, 4801930, 5784649, 6625827, 7311289, 7844837, 8239686, 8507783, 8651796, 8664107, 8533798, 8258161, 7852964, 7356707, 6826796, 6328495, 5920483, 5642569, 5509972, 5514842, 5632309, 5827662, 6062581, 6300119, 6509395, 6670760, 6779893, 6847004, 6889242, 6920302, 6944754, 6960885, 6968643, 6976600, 7004576, 7081447, 7237668, 7492959, 7843587, 8256868, 8677851, 9045832, 9312374, 9452296, 9464265, 9364274, 9178449, 8938775, 8679852, 8432982, 8217414, 8032553, 7855068, 7642645, 7344748, 6919013, 6347691, 5645341, 4852238, 4016896, 3177957, 2355091, 1552457, 771660, 26690, -647844]
42717f47844n53161l80645j77636J9640J72721K56531K69601K33160J79609J37612
42707d90412J22498J35682J70296K17302K67819L11497L34518L21431K61522J55525
42697A807678J7500j29284k59379l51764l94919l89908l49754k94077k40765j98792
42687g83464j65195j27378p0442J2721J14285K13501K88011L26539L33795L25700
42677D68073L20156L28744L51381L75183L79596L46700K70509J59394L2577q3854
42667B948459j59443j64524q1319Q3266K92792M90646O20086O43825N52873L63150
42657E589811J06663j75845m40748o49890p80805q32169q19496p64429o85298
42648E47794n92775m89441l71808k35343q1573P6969K17869L15345L48052L05143
$$ y = [-647844, -1201005, -1581650, -1759286, -1739646, -1566925, -1310394, -1040793, -807633, -628024, -490412, -367914, -232232, -61936, 155366, 423185, 734682, 1069200, 1390631, 1652153, 1807678, 1825178, 1695894, 1436515, 1084751, 689832, 299924, -49830, -343907, -584672, -783464, -948659, -1076037, -1146479, -1133758, -1019473, -805972, -517961, -191422, 142373, 468073, 788229, 1116973, 1468354, 1843537, 2223133, 2569833, 2840342, 2999736, 3032313, 2948459, 2789016, 2624492, 2543173, 2626439, 2919231, 3409877, 4029963, 4673788, 5226661, 5589811, 5696474, 5520629, 5079881, 4429991, 3649186, 2817017, 1997521, 1233092, 547794, -44981, -534422, -906230, -1141573, -1223146, -1146177, -928308, -612963, -264911, 40232]
42638D0232J90192K2893j63029l27394m35367m68676m30731l43078k35670j36464
42628b287092o4897l0434l4129p0705j29596j95102k47040k63911k29836j43205
42618c695947k1549J02866J96210K37028K21165J55519M8525r2415k55056m16485
42608c520139n46109o16497o13197n36796l99210k19835k3280J64191L20511M32328
42598e558033M95118N11232M90750M54775M34408M60330N47453O86175Q47486
42589f30306R97511J109987J169306J166795J097394R60288P61530N15287K42524
42580G390316l2985k90708n18602p13306q74416r97867j074196j092108j043317
42571G52811r26420p50416n36783l16129j18480L6731J43526K04801K26978K19339
$$ y = [40232, 230424, 253317, 90288, -237106, -672473, -1141149, -1571880, -1914958, -2150628, -2287092, -2351989, -2382423, -2416552, -2487257, -2616853, -2811955, -3058995, -3322906, -3552742, -3695947, -3717496, -3614630, -3418420, -3181392, -2960227, -2804708, -2756183, -2848598, -3103654, -3520139, -4066248, -4682745, -5295942, -5832738, -6231948, -6451783, -6475063, -6310872, -5990361, -5558033, -5062915, -4551683, -4060933, -3606158, -3171750, -2711420, -2163967, -1477792, -630306, 367205, 1477192, 2646498, 3813293, 4910687, 5870975, 6632505, 7147792, 7390316, 7357331, 7066623, 6548021, 5834715, 4960299, 3962432, 2888236, 1796128, 752811, -173609, -924025, -1460808, -1776937, -1895417, -1858686, -1715160, -1510359, -1283381, -1064042]
42561a064042J96289J76757J77745K05361K50402K93279L15905L12095K88811
42552A152602K58013K26369J90651J41207O9651k5132j36140k51454l57518m39930
42542H28319m83409m74604m08388k93232j50519p026J14790K03022K56588K81116
42532a33343K83818K69815K40712J95642J34322O0282j8894r5489j66499k34328
42522E36038l02287l69262m28306m69536m84612m70680m32792l83318l37458l07200
42512c449413k97894l08703l34270l65487l90594l98352l81624l38430k70272
42503f535039j80280p2514M8412J77637L08854M31379N28781N82884N82771N32815
42493c594300M52681L67132K91509K23282J46381M5497p9484k07485l00802l17581
$$ y = [-1064042, -867753, -690996, -513251, -307890, -57488, 235791, 551696, 863791, 1152602, 1410615, 1636984, 1827635, 1968842, 2038493, 2013361, 1877221, 1625767, 1268249, 828319, 344910, -129694, -538082, -831314, -981833, -988859, -874069, -671047, -414459, -133343, 150475, 420290, 661002, 856644, 990966, 1051248, 1032354, 936865, 770366, 536038, 233751, -135511, -563817, -1033353, -1517965, -1988645, -2421437, -2804755, -3142213, -3449413, -3747307, -4056010, -4390280, -4755767, -5146361, -5544713, -5926337, -6264767, -6535039, -6715319, -6787833, -6739421, -6561784, -6252930, -5821551, -5292770, -4709886, -4127115, -3594300, -3141619, -2774487, -2482978, -2259696, -2113315, -2067818, -2147302, -2354787, -2655589, -2973170]
42483b973170k28183l0040K46084N43448P98335R61869J014359R66383Q47725
42474B146810O91834N25577L68896K39503J53466J18446J25807J49850J55664
42465D675853J10836m025j88173m18762o56000q54815r77939j004429r31840p75080
42455a024374n64710l43057j54426l0306K2280K0365p967l9791o5989q9013j14706
42444b391694j45234j76993k03230k18193k18983k03700j68777j10086k8882O1836
42434c803936J36612J65151J25171J3686j50030l32072m97533o21601o92088p04608
42424f361248o56590n45586l72546j46789J11627L74485O11816P98762R20017
42415e266052R71830R62484R10648Q39662P68683P05647O47303N85789N15588
$$ y = [-2973170, -3201353, -3231393, -2985309, -2441861, -1643526, -681657, 332702, 1299085, 2146810, 2838644, 3364221, 3733117, 3972620, 4126086, 4244532, 4370339, 4520189, 4675853, 4786689, 4782664, 4594491, 4175729, 3519729, 2664914, 1686975, 682546, -249294, -1024374, -1589084, -1932141, -2086567, -2116873, -2094593, -2074228, -2082195, -2121986, -2187975, -2276988, -2391694, -2536928, -2713921, -2917151, -3135344, -3354327, -3558027, -3726804, -3836890, -3865772, -3803936, -3667324, -3502173, -3377002, -3363316, -3513346, -3845418, -4342951, -4964552, -5656640, -6361248, -7017838, -7563424, -7935970, -8082759, -7971132, -7596647, -6984831, -6186069, -5266052, -4294222, -3331738, -2421090, -1581428, -812745, -107098, 540205, 1125994, 1641582]
42406A641582M35229L44168K40472J23264k209j22872k22245k87459l12965k99273
42396A537692k50166j71651p1836M0687J59594K82110M08012N37810O70891Q03287
42386C946430R26550J030690J110054J165442J198261J202842J167288J083961
42378A2831518R58873Q10072O57377N13843L85200K74870J88742J35996J24950
42369A6881441J55573K13370K70082K92870K58095J63288L1814r2702j61631j40713
42359A7871487k4781J59505L63937N36504O37857O49493N72356M20253K13225
42350B1399836k7515k83826n42462p91510j013228j181188j267846j258785j163096
42341A3870380j012372q49181p11584o20770n76669n62377n53641n28337m73476
$$ y = [1641582, 2076811, 2420979, 2661451, 2784715, 2782506, 2659634, 2437389, 2149930, 1836965, 1537692, 1287526, 1115875, 1044039, 1084726, 1244320, 1526430, 1934442, 2472252, 3143143, 3946430, 4872980, 5903670, 7013724, 8179166, 9377427, 10580269, 11747557, 12831518, 13790391, 14600463, 15257840, 15771683, 16156883, 16431753, 16620495, 16756491, 16881441, 17037014, 17250384, 17520466, 17813336, 18071431, 18234719, 18266533, 18173831, 18012200, 17871487, 17846706, 18006211, 18370148, 18906652, 19544509, 20194002, 20766358, 21186611, 21399836, 21372321, 21088495, 20546033, 19754523, 18741295, 17560107, 16292261, 15033476, 13870380, 12858008, 12008827, 11297243, 10676473, 10099804, 9537427, 8983786, 8455449, 7981973]
42332G981973l89987k94135k12181j67790j68597k01453k40204k60134k48473
42323E799019k04974j35546m6929N2929J51439K30494K70241K55145J79822N3816
42313F605456r6598k33485l19878l33496k72583j51549P358J79548L40394M68144
42303F193311N48685N78808N64824N17579M48131L66790K84309K11542J55771
42294I869750J16135Q2896M2350j5943r4724j88811k86663l71702m24501m27213
42284H301574l68911k49021p8101J22649L22535M84729N73435N63997M52287K58438
42274A0383611K1561k13065m07435n37529n91846n66827m64849k95817p9455J54797
42264G403146L71977N39438O35291O52807N98581M86785L33669J54621l5852k21522
$$ y = [7981973, 7591986, 7297851, 7085670, 6917880, 6749283, 6547830, 6307626, 6047492, 5799019, 5594045, 5458499, 5411570, 5464499, 5615938, 5846432, 6116673, 6371818, 6551640, 6605456, 6508858, 6275373, 5955495, 5621999, 5349416, 5197867, 5205225, 5384773, 5725167, 6193311, 6741996, 7320804, 7885628, 8403207, 8851338, 9218128, 9502437, 9713979, 9869750, 9985885, 10068781, 10111131, 10095188, 10000464, 9811653, 9524990, 9153288, 8728787, 8301574, 7932663, 7683642, 7605541, 7728190, 8050725, 8535454, 9108889, 9672886, 10125173, 10383611, 10405172, 10192107, 9784672, 9247143, 8655297, 8088470, 7623621, 7327804, 7248349, 7403146, 7775123, 8314561, 8949852, 9602659, 10201240, 10688025, 11021694, 11176315, 11140463, 10918941]
42254A0918941l81456m91262n30753m93206l88214k36384o2287J08226K47715
42245H691320L29398L34013K57796J16118o0660k38171l89992n02818n72504n97131
42235G367369n75144n09626m12254l01600j97330j15514o7681o1648j01012j82817
42225D842743k96422m26795n61109o92988q19872r36398j031241j091020j106984
42216b120086j078374j011301r16489q07700o99319o01666n16279m35243l46326
42207h532783k40899j19008J1798J42187K65895L80189M82880N69736O34755O73236
42197e732014O85946O82046O78159O92276P34445P99253Q64998R01096Q80518
42188A186723P90993O39237M46632K40052M3067j29692k75018m00239n17606o34444
$$ y = [10918941, 10537485, 10046223, 9515470, 9022264, 8634050, 8397666, 8335379, 8443605, 8691320, 9020718, 9354731, 9612527, 9728645, 9667985, 9429814, 9039822, 8537004, 7964500, 7367369, 6792225, 6282599, 5870345, 5568745, 5371415, 5255901, 5188220, 5126572, 5025560, 4842743, 4546321, 4119526, 3558417, 2865429, 2045557, 1109159, 77918, -1013102, -2120086, -3198460, -4209761, -5126250, -5933950, -6633269, -7234935, -7751214, -8186457, -8532783, -8773682, -8892690, -8880892, -8738705, -8472810, -8092621, -7609741, -7040005, -6405250, -5732014, -5046068, -4364022, -3685863, -2993587, -2259142, -1459889, -594891, 306205, 1186723, 1977716, 2616953, 3063585, 3303637, 3346704, 3217012, 2941994, 2541755, 2024149, 1389705]
42178A389705p43919q23213q42033p77476o26924m11740j70302N5040K29959L34312
42168b386591L62372L20262K23673R6666l0143j24671j62491j36742o2619K8018
42158a872266J00184J30069J12523N9146r727p3513j16493j29464j10189o3928
42148a973658k911N6861J00689J19260J10280P8644L6057j294j8392q331K3726
42137a479069O1692Q3430O7465J091j11743k47407l68780m39184m36948l63008
42127c232461k38621r5195L8712J47309K30063K96785L59711M27663N04249N88307
42117i73478O74138P51061Q04422Q20486P94617P37376O71936O21748N95693N80812
42107F078811N47077M60485K97682N7189k35756n33288p78505r24247r49208q64710
$$ y = [1389705, 645786, -177427, -1019460, -1796936, -2423860, -2835600, -3005902, -2950862, -2720903, -2386591, -2024219, -1703957, -1480284, -1383618, -1413761, -1538432, -1700923, -1837665, -1900284, -1872266, -1772082, -1642013, -1529490, -1470344, -1480071, -1553584, -1670077, -1799541, -1909730, -1973658, -1976569, -1919708, -1819019, -1699759, -1589479, -1510835, -1474778, -1476072, -1494464, -1502795, -1479069, -1417377, -1333947, -1266482, -1265391, -1377134, -1624541, -1993321, -2432505, -2869453, -3232461, -3471082, -3566277, -3527565, -3380256, -3150193, -2853408, -2493697, -2066034, -1561785, -973478, -299340, 451721, 1256143, 2076629, 2871246, 3608622, 4280558, 4902306, 5497999, 6078811, 6625888, 7086373, 7384055, 7441244, 7205488, 6672200, 5893695, 4969448, 4020240, 3155530]
42097C155530p09720n35855l87649k86848k29122j94615j63675j26235q0486k6364
42087D14961L7947J13618J96061K72171L22942L30996K89068K04210R5312j3942
42077B263344j02445j56908j73986j58485j18311o0271Q975P8879J35517J70076
42067A886385J88544K12127K66459L67592N13350O82258Q38431R42191R65290
42058F862627R04274P82546O37599N00942L83792K77120J64169L5822j01536k30003
42048A0217352l32098m01912m48221m88711n40386o12305p03317q03436q96522
42039D990444r63464r86685r55764q71874p48169o05427m65292l44637k53245
42030a204113j94966j70932j82220k29160l06663l99512m83797n36745n48867
$$ y = [3155530, 2445810, 1909955, 1522306, 1235458, 1006336, 811721, 648046, 521811, 441325, 414961, 452908, 566526, 762587, 1034758, 1357700, 1688696, 1977764, 2181974, 2277286, 2263344, 2160899, 2003991, 1830005, 1671520, 1553209, 1492938, 1501913, 1580792, 1716309, 1886385, 2074929, 2287056, 2553515, 2921107, 3434457, 4116715, 4955146, 5897337, 6862627, 7766901, 8549447, 9187046, 9687988, 10071780, 10348900, 10513069, 10548891, 10447355, 10217352, 9885254, 9483342, 9035121, 8546410, 8006024, 7393719, 6690402, 5886966, 4990444, 4026980, 3040295, 2084531, 1212657, 464488, -140939, -606231, -950868, -1204113, -1399079, -1570011, -1752231, -1981391, -2288054, -2687566, -3171363, -3708108, -4256975]
42021d256975n28775m96813m73373m70951m92480n31469n70624n82553n37958
42012h941971m19956k35469j5772J93830L49273M22135M08972L31674K27115J30903
42002g549266O5116L6540M2551P6597J28785J84142K23856K31696K02672J47316
41992f209995Q6701M0292J5995J0631J8963M0935P9425J31747J84771K19514K21885
41981e159136J90703J36506P2306M384o8833j49346k31509l01317l43148l47217
41971f196607l11942k41590j43553k8256Q9204J89203K52031K65739K33272J74909
41961e717590J24767J22146J98977L66278O05546Q71596J107480J264080J314144
41952B57424J255758J107715R02453O79309M77023L24457K32273J90934J77241
$$ y = [-4256975, -4785750, -5282563, -5755936, -6226887, -6719367, -7250836, -7821460, -8404013, -8941971, -9361927, -9597396, -9613168, -9419338, -9070065, -8647930, -8238958, -7907284, -7680169, -7549266, -7484150, -7447610, -7405059, -7328462, -7199677, -7015535, -6791679, -6559983, -6357311, -6209995, -6123294, -6083002, -6067007, -6056376, -6037413, -5996478, -5917053, -5785306, -5600535, -5381021, -5159136, -4968433, -4831927, -4759621, -4755237, -4824070, -4973416, -5204925, -5506242, -5849390, -6196607, -6508549, -6750139, -6893692, -6921948, -6832744, -6643541, -6391510, -6125771, -5892499, -5717590, -5592823, -5470677, -5271700, -4905422, -4299876, -3428280, -2320800, -1056720, 257424, 1513182, 2620897, 3523350, 4202659, 4679682, 5004139, 5236412, 5427346, 5604587]
41943E604587J65794J38811R0501K6377m0106r1632j10548q1734L968J45127L25924
41932F177069N17083O83110P93363Q31935Q02026P22631O19139N13170M17228
41923A2076754L35368K66577K07954J57642J16971Q9086P3561O2368M3176Q194
41913A3437651m0095r1625j36012j67271j84177j89820j92262k03221k31748k75943
41903A1725477l20760l46544l43074l17650k90175k79683k93260l24142l57012
41894H853177l74943l65513l26505k70185k22594k15946k76803m15692o22401
41885E762595q68010j112445j315300j446410j491818j452653j339075j164855
41877d427971r46407p04380m62812k43940o2285P7195J76436K40618K76356K91290
$$ y = [5604587, 5770381, 5909192, 5999693, 6026070, 5985964, 5894332, 5783784, 5702050, 5706018, 5851145, 6177069, 6694152, 7377262, 8170625, 9002560, 9804586, 10527217, 11146356, 11659526, 12076754, 12412122, 12678699, 12886653, 13044295, 13161266, 13250352, 13323913, 13386281, 13429457, 13437651, 13397556, 13305931, 13169919, 13002648, 12818471, 12628651, 12436389, 12233168, 12001420, 11725477, 11404717, 11058173, 10715099, 10397449, 10107274, 9827591, 9534331, 9210189, 8853177, 8478234, 8112721, 7786216, 7516031, 7293437, 7077491, 6800688, 6384996, 5762595, 4894585, 3782140, 2466840, 1020430, -471388, -1924041, -3263116, -4427971, -5374378, -6078758, -6541570, -6785510, -6847795, -6770600, -6594164, -6353546, -6077190, -5785900]
41867e785900K93743K92355K95755L10698L37861L68753L89104L89190L73445
41858b734996L60285L70635M13238M76966N35088N58664N31707M60095L69758
41849A341440K95333K65515K92061L66083M61105N40437N66755N12168L66670
41840E007567J41877j31743m13112o60535q40393r33514r38589q70919p55908
41831c95269o20454m87016l71418k81432k14421j56427q5748J9562J73269L74119
41821b045235O03122Q28068J015187J141463J199107J191016J124169J007495
41813F064392Q53091O75287M86249K92570R7460r2922k65355m02881m93930n39728
41803F674233n53234n50310n40706n25892n04177m77287m52271m36974m33034
$$ y = [-5785900, -5492157, -5199802, -4904047, -4593349, -4255488, -3886735, -3497631, -3108441, -2734996, -2374711, -2004076, -1590838, -1113872, -578784, -20120, 511587, 971682, 1341440, 1636773, 1902288, 2194349, 2560432, 3021537, 3561974, 4128729, 4640897, 5007567, 5149444, 5017701, 4604589, 3944054, 3103661, 2170147, 1231558, 360639, -395269, -1015723, -1502739, -1874157, -2155589, -2370010, -2526437, -2612185, -2592623, -2419354, -2045235, -1442113, -614045, 401142, 1542605, 2741712, 3932728, 5056897, 6064392, 6917483, 7592770, 8079019, 8371589, 8469049, 8376127, 8110772, 7707891, 7213961, 6674233, 6120999, 5570689, 5029983, 4504091, 3999914, 3522627, 3070356, 2633382, 2200348]
41794B200348m32895m24620m01287l66472l30148k98088k64684k16080j41183
41785f75109m1262O8870J67180K31836K45006J94431P6727r7066k98741m88331
41775f16459o26808o89009o69346n78817m37714k69525r8209N2714J62075K15243
41765c555855K09279J55755P8248M848m0445m3294q19P8502J76481K70353L41800
41754b325147L85442M10767M35868M77047N40264O18147O93336P46174P62692
41745B744590P38437O76140N79327M47050K74507O0454j83722m31522o49528q11276
41735C444457r07012r43776r38428r09443q70382q25505p68818o88438n75196
41726c982541m30188k65863j00130N1691J81460K87895L73779M42994M97561N35169
$$ y = [2200348, 1767453, 1342833, 941546, 575074, 244926, -53162, -317846, -533926, -675109, -716371, -647501, -480321, -248485, -3479, 190952, 267679, 170613, -128128, -616459, -1243267, -1932276, -2601622, -3180439, -3618153, -3887678, -3985887, -3933173, -3771098, -3555855, -3346576, -3190821, -3112573, -3107725, -3148170, -3191464, -3192283, -3113781, -2937300, -2666947, -2325147, -1939705, -1528938, -1093070, -616023, -75759, 542388, 1235724, 1981898, 2744590, 3483027, 4159167, 4738494, 5185544, 5460051, 5520505, 5336783, 4905261, 4255733, 3444457, 2537445, 1593669, 655241, -254202, -1124584, -1950089, -2718907, -3407345, -3982541, -4412729, -4678592, -4778722, -4727031, -4545571, -4257676, -3883897, -3440903, -2943342, -2408173]
41716b408173N49799N36837M99006M47533L97821L64216L57243L82347M38865
41707A565494N20996O21851P37143Q64152R96795J121871J219730J268548J250061
41698A0166641J155437R89552P71287N28698K90555P7433j03712k58382l97036
41689A3220473n26153o43640p40478q06029q33589q23977p85241p27967o59408
41680F673991n81599m94964m02949l12707k32003j66349j18625q9839p8997q2552
41670D113407r5299j13131j35554j65439k06097k58653l22051l94297m71993n48292
41660A402601o12899o56378o75754o76083o66087o51471o31084n98320n45968
41651d311443m70659l74379k63601j48199m0750M5656J02763J33658J55153J91896
$$ y = [-2408173, -1858374, -1321537, -822531, -374998, 22823, 387039, 744282, 1126629, 1565494, 2086490, 2708341, 3445484, 4309636, 5306431, 6428302, 7648032, 8916580, 10166641, 11322078, 12311630, 13082917, 13611615, 13902170, 13979603, 13875891, 13617509, 13220473, 12694320, 12050680, 11310202, 10504173, 9670584, 8846607, 8061366, 7333399, 6673991, 6092392, 5597428, 5194479, 4881772, 4649769, 4483420, 4364795, 4274956, 4195959, 4113407, 4018108, 3904977, 3769423, 3603984, 3397887, 3139234, 2817183, 2422886, 1950893, 1402601, 789702, 133324, -542430, -1218513, -1884600, -2536071, -3167155, -3765475, -4311443, -4782102, -5156481, -5420082, -5568281, -5609031, -5563375, -5460612, -5326954, -5171801, -4979905]
41641d979905K64012L75933N14287O55711P77578Q63775R04483Q95152Q38710
41632A109736P48804O48783N64124N11808M93121M94412M94830M75467M24983
41623E966068L41543K33432J18158J7228n2916q7842r4187q2060n7211j8173M0964
41612F325004J24602K30417L48382M64308N63910O33701O60657O35218N57390
41603A0543589M39987L05144J77443P8811K5091K1165N5849J02985J31947J22031
41593A2004042P0800q203r4384j68430k16381k31035k13418j74580j34601j15803
41583A0718007j30794j71692k09026k04001j28030K2310K23100M32214O02728
41574A1154816O95020O85693N72641L75263J30369j14398l08857m11236m00579
$$ y = [-4979905, -4715893, -4339960, -3825673, -3169962, -2392384, -1528609, -624126, 271026, 1109736, 1858540, 2507323, 3071447, 3583255, 4076376, 4570788, 5065618, 5541085, 5966068, 6307611, 6541043, 6659201, 6676429, 6623513, 6535671, 6441484, 6359424, 6302213, 6284040, 6325004, 6449606, 6680023, 7028405, 7492713, 8056623, 8690324, 9350981, 9986199, 10543589, 10983576, 11288720, 11466163, 11544974, 11570065, 11591230, 11647079, 11750064, 11882011, 12004042, 12074842, 12066639, 11972255, 11803825, 11587444, 11356409, 11142991, 10968411, 10833810, 10718007, 10587213, 10415521, 10206495, 10002494, 9874464, 9896774, 10119874, 10552088, 11154816, 11849836, 12535529, 13108170, 13483433, 13613802, 13499404, 13190547, 12779311, 12378732]
41565A2378732k85110j00753J00677K67831L63853L74427L09259J97441P7156
41556A3683513j7755o9167p8376o0423l3211q401J1567L0595N3474Q1356J10523
41545A3703695J34832J49200J50622J36414J03164M8871k4064j08918j97586k82818
41535A3813412l58615m21414m72847n20136n70850o25584o75386p05485p00327
41526H762768o45914n31517l54253j24983J30097L74919N73190O97540P35671
41517I617518O92627N88155M49287L01813J65912N7411r670k4743J3626R3902
41507A1945838J94981K95594L83171M56733N23505N92523O68445P47605Q17482
41498A6625877Q59771Q55877P93162O70516N01184L09790J22857m2283j82480
$$ y = [12378732, 12093622, 11992869, 12093546, 12361377, 12725230, 13099657, 13408916, 13606357, 13683513, 13665758, 13596591, 13518215, 13457792, 13424581, 13416180, 13427747, 13458342, 13511816, 13593172, 13703695, 13838527, 13987727, 14138349, 14274763, 14377927, 14426798, 14402734, 14293816, 14096230, 13813412, 13454797, 13033383, 12560536, 12040400, 11469550, 10843966, 10168580, 9463095, 8762768, 8116854, 7585337, 7231084, 7106101, 7236198, 7611117, 8184307, 8881847, 9617518, 10310145, 10898300, 11347587, 11649400, 11815312, 11872723, 11863053, 11838310, 11851936, 11945838, 12140819, 12436413, 12819584, 13276317, 13799822, 14392345, 15060790, 15808395, 16625877, 17485648, 18341525, 19134687, 19805203, 20306387, 20616177, 20739034, 20696751, 20514271]
41489B0514271l04701m17977n28503o39621p53016q68142r80991j084498j170552
41480A3766270j231536j260141j248349j187904j074076r11850p20172n29170
41472E603072l69413k59009j97250j69415j59040j58277j68589j92154k22493
41463C707432k43679k39619k05340j50281r1227m1680o030J9376M2549P3817J24781
41452B990099K05108L16890M50647N87092P04145P84767Q21658Q17786P83616
41443H461808P32125O73175O09779N38399M53113L50923K34920J13582k727j05506
41433A2059591j90167k56604l09384l56900m07574m63692n17284n52394n52740
41424H452852n09354m24040l08577j81493o3294K8727Q3735R6906O6997m572j11646
$$ y = [20514271, 20209570, 19791593, 19263090, 18623469, 17870453, 17002311, 16021320, 14936822, 13766270, 12534734, 11274593, 10026244, 8838340, 7764264, 6852414, 6132242, 5603072, 5233659, 4974650, 4777400, 4607985, 4448945, 4290668, 4122079, 3929925, 3707432, 3463753, 3224134, 3018794, 2868513, 2777286, 2735606, 2729576, 2748952, 2791501, 2865318, 2990099, 3195207, 3512097, 3962744, 4549836, 5253981, 6038748, 6860406, 7678192, 8461808, 9193933, 9867108, 10476887, 11015286, 11468399, 11819322, 12054242, 12167824, 12165097, 12059591, 11869424, 11612820, 11303436, 10946536, 10538962, 10075270, 9557986, 9005592, 8452852, 7943498, 7519458, 7210881, 7029388, 6966094, 6994821, 7078556, 7175462, 7242459, 7237887, 7126241]
41413G126241k40258l67684m66001n10575m90660m15809l12264k10249j30387
41404C982354p7978m6917k8239j7229j6198l3274p9213j64104k94224m67971o70973
41393B086034q73693j035641j116138j086969r41331o96148l87475o1067K38000
41384c874428M72680O17887O63906O20378N17122L96923L01240K56024K65165
41375B36897L13844L78250M35710M70414M73805M42166L74542K72062J37805k3043
41365C512452k02258l86856n58199o93594p70919p74656p00524n56111l57379
41356a488044j23380J28556L86278O43872Q98196J141120J353087J505064J569258
41347F014007J531091J394514J179154R12846O23210L30782M6276k26026m80478
$$ y = [7126241, 6885983, 6518299, 6052298, 5541723, 5051063, 4635254, 4322990, 4112741, 3982354, 3904376, 3857459, 3829220, 3811991, 3795793, 3762519, 3683306, 3519202, 3224978, 2757007, 2086034, 1212341, 176700, -939438, -2026407, -2967738, -3663886, -4051361, -4112428, -3874428, -3401748, -2783861, -2119955, -1499577, -982455, -585532, -284292, -28268, 236897, 550741, 928991, 1364701, 1835115, 2308920, 2751086, 3125628, 3397690, 3535495, 3512452, 3310194, 2923338, 2365139, 1671545, 900626, 125970, -574554, -1130665, -1488044, -1611424, -1482868, -1096590, -452718, 445478, 1586598, 2939685, 4444749, 6014007, 7545098, 8939612, 10118766, 11031612, 11654822, 11985604, 12031880, 11805854, 11325376]
41338A1325376p03113q71183r61008r60405q78194p44311o00171m84954m24542
41329D697495m26323m79903n62501o46932p09371p34702p18803o67075n88565
41320h36680m88444l65563k18660n5184J07805K53457L76303M83573N85688O84890
41310E27185P70680Q23266Q20892P47659O00835L95839J64571n5707k38105l75885
41300D181230m79233n62707o33388o86689p09699o88524o15808m94676l37078
41291a026572j58539K6068K03864L64060M97507N94472O42072O26414N40991L94784
41281B705121K12752K9284j19209k00098j91052q7325R4482L18984N39257P06860
41271D009056P84695P59878O48748M88554L20254J73375O0564j8498o8762r2822
$$ y = [11325376, 10622263, 9751080, 8790072, 7829667, 6951473, 6207162, 5606991, 5122037, 4697495, 4271172, 3791269, 3228768, 2581836, 1872465, 1137763, 418960, -248115, -836680, -1325124, -1690687, -1909347, -1964531, -1856726, -1603269, -1226966, -743393, -157705, 527185, 1297865, 2121131, 2942023, 3689682, 4290517, 4686356, 4850927, 4795220, 4557115, 4181230, 3701997, 3139290, 2505902, 1819213, 1109514, 420990, -194818, -689494, -1026572, -1185111, -1159043, -955179, -591119, -93612, 500860, 1142932, 1769346, 2310337, 2705121, 2917873, 2947157, 2827948, 2627850, 2436798, 2349473, 2443955, 2762939, 3302196, 4009056, 4793751, 5553629, 6202377, 6690931, 7011185, 7184560, 7245124, 7226626, 7157864, 7065042]
41261G065042q9300n6527L183Q2941J73258K62806L38247L87042M03321L90745
41251H960758L58463L14528K63673K09605J55902J02822M4220l0255j27649k43216
41241A0008851l56054m33065m42497l71654k37368q0506N2886J31893J51310J29060
41231H552856R3456O6428N0615K7839k9536j41490l08108n08017p05798q62868
41221F235377r47258r39661q35496o44734l91289j11225J52748L60820M85744
41212C365026N18409M68572L62326K36407J28339O4389N1184P6108J15980J48685
41202E535425J61514J52645J26112Q4829K8164m3176j19629j80886k03263j71679
41192E370056q8354K6299J40293K21333K48200K16884J38452L1224q6699k01124
$$ y = [7065042, 6975742, 6919215, 6922398, 7005339, 7178597, 7441403, 7779650, 8166692, 8570013, 8960758, 9319221, 9633749, 9897422, 10107027, 10262929, 10365751, 10409971, 10379716, 10252067, 10008851, 9652797, 9219732, 8777235, 8405581, 8168213, 8087707, 8140593, 8272486, 8423796, 8552856, 8646312, 8712740, 8763355, 8791194, 8761658, 8620168, 8312060, 7804043, 7098245, 6235377, 5288119, 4348458, 3512962, 2868228, 2476939, 2365714, 2518462, 2879282, 3365026, 3883435, 4352007, 4714333, 4950740, 5079079, 5143468, 5194652, 5270760, 5386740, 5535425, 5696939, 5849584, 5975696, 6060525, 6088689, 6045513, 5925884, 5744998, 5541735, 5370056, 5281702, 5308001, 5448294, 5669627, 5917827, 6134711, 6273163, 6304387, 6217688, 6016564]
41182F016564l02876l88595m60866n26180n91076o58190p23267p73785p90739
41173H00990p54830o55040m94713k91071o8380J50885L51643N26025O69391P77262
41163A012162Q46032Q76082Q73830Q51038Q21971P99740P92881Q03970Q31097
41154H508803Q70493R17742R67761J015600J057593J089832J104154J086859J023713
41145A7642550R06871P36608N17313K54357m3847l61736o76274r61792j196443
41136A6817607j366039j463150j482699j418588j266098j029164p25124l80798
41128G685947k3091L26118O45997R09756J085017J144464J079131R03421O48098
41119A4404858L47677L2473k70352n32101p23086q21305q22803p44421o15557
$$ y = [6016564, 5713688, 5325093, 4864227, 4338047, 3746971, 3088781, 2365514, 1591729, 800990, 46160, -608880, -1103593, -1394664, -1463044, -1312159, -960516, -434491, 234900, 1012162, 1858194, 2734276, 3608106, 4459144, 5281115, 6080855, 6873736, 7677706, 8508803, 9379296, 10297038, 11264799, 12280399, 13337992, 14427824, 15531978, 16618837, 17642550, 18549421, 19286029, 19803342, 20057699, 20013852, 19652116, 18975842, 18014050, 16817607, 15451568, 13988418, 12505719, 11087131, 9821033, 8791869, 8066745, 7685947, 7662856, 7988974, 8634971, 9544727, 10629744, 11774208, 12853339, 13756760, 14404858, 14752535, 14785008, 14514656, 13982555, 13259469, 12438164, 11615361, 10870940, 10255383]
41110A0255383m64073l05453j41188L3733K19611M03595N58485O49813O48878
41101A1858784N46387L59793J29136r7539k81432m03223m61437m62427m10604
41092A0777438l06008j49371N1334K79011N10722P22153Q90703R98417J035927
41083A4810326J004937R16099P83365O19006M31499K25092M06k42617m99726p59496
41073A7288891j006113j225878j411845j563288j681138j762873j800529j784019
41065E053208j708019j576381j399667j189428r57409p21439n09487l53186k73301
41056c635109k68592l16282l82656m36466m58707m45440m03466l42460k69328
41047f958506j87716j00324r982Q1463J74464K72352L81546N10775O67564Q52661
$$ y = [10255383, 9791310, 9485857, 9344669, 9378402, 9598013, 10001608, 10560093, 11209906, 11858784, 12405171, 12764964, 12894100, 12796561, 12515129, 12111906, 11650469, 11188042, 10777438, 10471430, 10322059, 10373393, 10652404, 11163126, 11885279, 12775982, 13774399, 14810326, 15815263, 16731362, 17514727, 18133733, 18565232, 18790324, 18790730, 18548113, 18048387, 17288891, 16282778, 15056900, 13645055, 12081767, 10400629, 8637756, 6837227, 5053208, 3345189, 1768808, 369141, -820287, -1777696, -2499135, -3008622, -3361808, -3635109, -3903701, -4219983, -4602639, -5039105, -5497812, -5943252, -6346718, -6689178, -6958506, -7146222, -7246546, -7256528, -7175065, -7000601, -6728249, -6346703, -5835928, -5168364, -4315703]
41037d315703J056692J262253J449648J601372J703269J744274J717291J621183
41029G840279J462997J259900J039440Q34922O74672N70290N12643M79418M48336
41020A5122897M05801L46092K64972J55429R943j72391l79497n85995p59928q72607
41010A3534716r05943q54613p24982n33975l08376q1943J11554K47181L14294
41001A0797913L14853K56537J46790p383j94912l96756n86928p38292q29817q51863
40991G910142q07836p12181n85859m50622l22965k08687j00515J7872J60966L29164
40981E229479N03393O50759P37132P38358O44961M61566K05152r6059m04647o79099
40971G990995q81878r87892r89736q97208p31653n19487k89217p1326J04764K20111
$$ y = [-4315703, -3259011, -1996758, -547110, 1054262, 2757531, 4501805, 6219096, 7840279, 9303276, 10563176, 11602616, 12437538, 13112210, 13682500, 14195143, 14674561, 15122897, 15528698, 15874790, 16139762, 16295191, 16305134, 16132743, 15753246, 15167251, 14407323, 13534716, 12628773, 11774160, 11049178, 10515203, 10206827, 10124884, 10236438, 10483619, 10797913, 11112766, 11369303, 11516093, 11508710, 11313798, 10917042, 10330114, 9591822, 8762005, 7910142, 7102306, 6390125, 5804266, 5353644, 5030679, 4821992, 4721477, 4739349, 4900315, 5229479, 5732872, 6383631, 7120763, 7859121, 8504082, 8965648, 9170800, 9074741, 8670094, 7990995, 7109117, 6121225, 5131489, 4234281, 3502628, 2983141, 2693924, 2622598, 2727362, 2947473]
40961B947473K76428K96641L12344L46791M05881M81378N60261O31631O87584
40952F946412P20125P18512O70456N67507M11194K15312K639k01686l76820n10970
40942I162681o03384o62544p01023p29933p56264p83258q11464q39028q62175
40933B413608q76734q79941q71442q53621q31269q09089p86602p54256o96307
40924d945653o00857m69711l20126j78052o9259j3382k0039q4804j86763k91837
40914g180483l63025l73647l17531k10995q4664L1768J23291J93518K57843L32822
40904g591103M29020N48423O83799Q19399R35229J014567J050107J043604R99923
40895f7032R22086Q13660O87002N68430M92167M85010N52995O79763Q35846R90091
$$ y = [2947473, 3223901, 3520542, 3832886, 4179677, 4585558, 5066936, 5627197, 6258828, 6946412, 7666537, 8385049, 9055505, 9623012, 10034206, 10249518, 10252157, 10050471, 9673651, 9162681, 8559297, 7896753, 7195730, 6465797, 5709533, 4926275, 4114811, 3275783, 2413608, 1536874, 656933, -214509, -1068130, -1899399, -2708488, -3495090, -4249346, -4945653, -5546510, -6016221, -6336347, -6514399, -6583658, -6597040, -6617079, -6701883, -6888646, -7180483, -7543508, -7917155, -8234686, -8445681, -8530345, -8498577, -8375286, -8181768, -7923925, -7591103, -7162083, -6613660, -5929861, -5110462, -4175233, -3160666, -2110559, -1066955, -67032, 855054, 1668714, 2355716, 2924146, 3416313, 3901323, 4454318, 5134081, 5969927, 6960018]
40885F960018J116528J196652J220218J185472J097893R67791Q08871O39089M81791
40876A5674323L63019L03213L07374L61390M38212N09198N52572N56021N16813
40867A9582135M41786L45005K41146J38545L8193o0410j52303k25087k63416k57221
40857A9828373k08710j33035n0632K4128Q9438J53282K25578L12484M14997N28384
40847B1184287O40180P29543P71994P49201O58285N14755L47054J85691N2601
40838B5833591m4006j07397j45237j63365j64786j53211j36079j23279j23405
40829B4672826j42419j85714k58572l60968m80489n91874o66269o83728o40381
40820B0662412n48050m29738l13420k23662j72397j53923j48030j29314p7118
$$ y = [6960018, 8076546, 9273198, 10493416, 11678888, 12776781, 13744572, 14553443, 15192532, 15674323, 16037342, 16340555, 16647929, 17009319, 17447531, 17956729, 18509301, 19065322, 19582135, 20023921, 20368926, 20610072, 20748617, 20786810, 20726400, 20574097, 20349010, 20085594, 19828373, 19619663, 19486628, 19435996, 19460124, 19549562, 19702844, 19928422, 20240906, 20655903, 21184287, 21824467, 22554010, 23326004, 24075205, 24733490, 25248245, 25595299, 25780990, 25833591, 25789585, 25682188, 25536951, 25373586, 25208800, 25055589, 24919510, 24796231, 24672826, 24530407, 24344693, 24086121, 23725153, 23244664, 22652790, 21986521, 21302793, 20662412, 20114362, 19684624, 19371204, 19147542, 18975145, 18821222, 18673192, 18543878, 18466760]
40811A8466760J7462J48162K94446M28041N23916N70688N75237N59643N52009
40802B2136364N74585O34246P20687Q13894Q95811R58260J003366J039133J074406
40793B9850752J114767J159358J199954J223940J219986J182584J112957J017002
40785C9081300R02195P74483O35907M84419L16602J31508o7220k71630m70526
40776D1517038o50040p94645q89753r25460q99979q21693p08523n82586m60215
40767C4784144l42783k16434o3028J25365L39594N58001P56211R13890J016520
40758C7871480J055818J031439R52601Q37350P09698N95846N19146M92873N13051
40749D4579302N57055N91651N87164N29287M22046K82578J32960o606j22130k07435
$$ y = [18466760, 18484222, 18632384, 18926830, 19354871, 19878787, 20449475, 21024712, 21584355, 22136364, 22710949, 23345195, 24065882, 24879776, 25775587, 26733847, 27737213, 28776346, 29850752, 30965519, 32124877, 33324831, 34548771, 35768757, 36951341, 38064298, 39081300, 39983495, 40757978, 41393885, 41878304, 42194906, 42326414, 42259194, 41987564, 41517038, 40866998, 40072353, 39182600, 38257140, 37357161, 36535468, 35826945, 35244359, 34784144, 34441361, 34224927, 34161899, 34287264, 34626858, 35184859, 35941070, 36854960, 37871480, 38927298, 39958737, 40911338, 41748688, 42458386, 43054232, 43573378, 44066251, 44579302, 45136357, 45728008, 46315172, 46844459, 47266505, 47549083, 47682043, 47675437, 47553307, 47345872]
40739D7345872k61835k84211k67635k00147p3021J08867L22004N27796O82413
40730D7900103P48777P07897N67124L61780J47180j7523q6761l9507J19286L63668
40720E0772024O53375R40755J179826J337795J404480J393262J332009J249862
40712F0263388J168323J100202J053306J033161J042313J078324J134350J203585
40704F9076952J284414J381551J501753J648013J817306K002751K196808K392532
40696H3302080K583712K765775K936639L095020L236175L348593L415445L420910
40688A08104349L357846L232262L061786K868833K672562K484582K310991K158622
40680A30251833K040593J977012J990108K096637K301556K595654K956946L354105
$$ y = [47345872, 47084037, 46799826, 46532191, 46332044, 46259023, 46367890, 46689894, 47217690, 47900103, 48648880, 49356777, 49923901, 50285681, 50432861, 50415338, 50328577, 50289070, 50408356, 50772024, 51425399, 52366154, 53545980, 54883775, 56288255, 57681517, 59013526, 60263388, 61431711, 62531913, 63585219, 64618380, 65660693, 66739017, 67873367, 69076952, 70361366, 71742917, 73244670, 74892683, 76709989, 78712740, 80909548, 83302080, 85885792, 88651567, 91588206, 94683226, 97919401, 101267994, 104683439, 108104349, 111462195, 114694457, 117756243, 120625076, 123297638, 125782220, 128093211, 130251833, 132292426, 134269438, 136259546, 138356183, 140657739, 143253393, 146210339, 149564444]
40672A49564444L750942M112382M412093M639101M799020M907836M981913N031199
40664A86198930N059846N071804N074949N079667N093127N113464N127448N113477
40656B26932712N049943M926181M749870M545231M342188M163736M019727L909241
40648B62638829L826531L764057L710869L649802L557974L411312L190342K884011
40640B90633727K490693K017343J477834Q91268K80781l27122r04018j423103
40632B95137403j864191k217599k484655k675326k805130k892800k957937l017075
40624B74222690l078933l142920l204538l265453l340048l451344l618135l842954
40616B47278365m109632m391599m665245m920258n160823n396910n631927n856481
$$ y = [149564444, 153315386, 157427768, 161839861, 166478962, 171277982, 176185818, 181167731, 186198930, 191258776, 196330580, 201405529, 206485196, 211578323, 216691787, 221819235, 226932712, 231982655, 236908836, 241658706, 246203937, 250546125, 254709861, 258729588, 262638829, 266465360, 270229417, 273940286, 277590088, 281148062, 284559374, 287749716, 290633727, 293124420, 295141763, 296619597, 297510865, 297791646, 297464524, 296560506, 295137403, 293273212, 291055613, 288570958, 285895632, 283090502, 280197702, 277239765, 274222690, 271143757, 268000837, 264796299, 261530846, 258190798, 254739454, 251121319, 247278365, 243168733, 238777134, 234111889, 229191631, 224030808, 218633898, 213001971, 207145490]
40608B07145490o052794o204495o302756o345605o334605o273425o167795o024064
40600A57439951n846022n632515n377812n074991m721530m325465l908842l504966
40592A19047808l149208k867732k669807k546591k475383k427119k375200k303366
40584I8233402k209382k102768j998537j911174j851623j826829j840212j891841
40576H2601036j977069k083482k189214k267441k297783k277687k224796k167740
40568F5115824k130930k121432k123786k105637k032781j885955j668779j402437
40560D9644087j113450q25192n57470l30215j65175q3014r7052k06771l94974
40551D5870774o31297q81079j115029j315041j474549j594547j677113j718863
$$ y = [207145490, 201092696, 194888201, 188585445, 182239840, 175905235, 169631810, 163464015, 157439951, 151593929, 145961414, 140583602, 135508611, 130787081, 126461616, 122552774, 119047808, 115898600, 113030868, 110361061, 107814470, 105339087, 102911968, 100536768, 98233402, 96024020, 93921252, 91922715, 90011541, 88159918, 86333089, 84492877, 82601036, 80623967, 78540485, 76351271, 74083830, 71786047, 69508360, 67283564, 65115824, 62984894, 60863462, 58739676, 56634039, 54601258, 52715303, 51046524, 49644087, 48530637, 47705445, 47147975, 46817760, 46652585, 46569571, 46472519, 46265748, 45870774, 45239477, 44358398, 43243369, 41928328, 40453779, 38859232, 37182119, 35463256]
40543C5463256j707764j626375j461157j212893r01655n63053k38003L8679K46447
40534B8037482L82146M57641M92151N01757M91500M55597L86317K85293J68413
40525C1658297N9548k3088p7929j19783j68479k35627l19283m08294m90123n55683
40515B9319556o00892o28051o47367o74634p23041p93630q72364r36651r65729
40506B2477197r46940q75764p54236n92104m09413k35378j01079k8917k4734p6992
40496A8431640j63234k59740l48654m19306m65451m82796m69451m28255l68218
40487A5026535l03152k47241k08994j87053j71603j51910j25527j02684j02450
40478A3425921j42645k28822l47902m70061n59068n86935n45602m49058l24885
$$ y = [35463256, 33755492, 32129117, 30667960, 29455067, 28553412, 27990359, 27752356, 27791035, 28037482, 28419628, 28877269, 29369420, 29871177, 30362677, 30818274, 31204591, 31489884, 31658297, 31717845, 31694757, 31616828, 31497045, 31328566, 31092939, 30773656, 30365362, 29875239, 29319556, 28718664, 28090613, 27443246, 26768612, 26045571, 25251941, 24379577, 23442926, 22477197, 21530257, 20654493, 19900257, 19308153, 18898740, 18663362, 18562283, 18533366, 18508632, 18431640, 18268406, 18008666, 17660012, 17240706, 16775255, 16292459, 15823008, 15394753, 15026535, 14723383, 14476142, 14267148, 14080095, 13908492, 13756582, 13631055, 13528371, 13425921, 13283276, 13054454, 12706552, 12236491, 11677423, 11090488, 10544886, 10095828, 9770943]
40469I770943k00798r4127q105O6548J47584K54397L97707N69760P42997Q80679
40459A2527585R53006R47890Q71277P40546N77094M01037K28531P2260n5487j40464
40449A7123275j68184j29071k3080J38789L34886N33730O97074P88224P85185
40440B0080828O92643N44445L91928K81487K32678K29850K32601J98301J02758
40431B2987519n1295k39001m26119n82851o93038p55046p75425p61885p21715
40422A7981144o64662o03300n47705m99887m55263m10342l68297l37164l23961
40413A3770563l31311l57913m00036m52683n12107n79106o58698p53817q58232
40404H866660r56624j033020j079807j099491j099485j086517j064758j035816
$$ y = [9770943, 9570145, 9476018, 9467913, 9534461, 9682045, 9936442, 10334149, 10903909, 11646906, 12527585, 13480591, 14428481, 15299758, 16040304, 16617398, 17018435, 17246966, 17319226, 17263739, 17123275, 16955091, 16826020, 16802940, 16941729, 17276615, 17810345, 18507419, 19295643, 20080828, 20773471, 21317916, 21709844, 21991331, 22224009, 22453859, 22686460, 22884761, 22987519, 22936224, 22697223, 22271104, 21688253, 20995215, 20240169, 19464744, 18702859, 17981144, 17316482, 16713182, 16165477, 15665590, 15210327, 14799985, 14431688, 14094524, 13770563, 13439252, 13081339, 12681303, 12228620, 11716513, 11137407, 10478709, 9724892, 8866660, 7910036, 6877016, 5797209, 4697718, 3598233, 2511716, 1446958, 411142]
40396D11142r97820r44561q67969p63599o34638m90652l42439j97360n7696P8590
40386d807002K15925L57980N04120O48065P80553Q93666R82440J042889J070491
40377A689127J062599J023172R64544R03335Q52551Q14718P80395P33301O59141
40368I482883N52370M16991K62892J02688m8661j74243k59002k96170k91962k64682
40358I483104k37836k30120k47506k82475l21465l55274l84114m13391m44233
40349F566690m67093m63235m12303l00560j26448R6371L38048N55730P03475P47099
40339G237774O77019N12233K93784P1351j11907k31761k88626l03735l06408l17787
40329G231937l39047l50584l23187k35423q7382R6948K79347M23000N06110N28154
$$ y = [411142, -586678, -1531239, -2399208, -3162807, -3797445, -4288097, -4630536, -4827896, -4885592, -4807002, -4591077, -4233097, -3728977, -3080912, -2300359, -1406693, -424253, 618636, 1689127, 2751726, 3774898, 4739442, 5642777, 6495328, 7310046, 8090441, 8823742, 9482883, 10035253, 10452244, 10715136, 10817824, 10769163, 10594920, 10335918, 10039748, 9747786, 9483104, 9245268, 9015148, 8767642, 8485167, 8163702, 7808428, 7424314, 7010923, 6566690, 6099597, 5636362, 5224059, 4923499, 4797051, 4893422, 5231470, 5787200, 6490675, 7237774, 7914793, 8427026, 8720810, 8792161, 8680254, 8448493, 8159867, 7856132, 7549724, 7231937, 6892890, 6542306, 6219119, 5983696, 5896314, 5993262, 6272609, 6695609, 7201719, 7729873]
40319G729873N07164M70107M41366M35241M55414M99267N62222O38920P22090
40310A2461664Q01728Q65925R02220Q98101Q41179P20970N32693K80950j9070
40301A8286360l42810o58523r30458j124525j216128j196691j075183q73837o20430
40292A0247775l41066n7325K10638M38613N97901O63850O28118N04206L21381
40283A3214091J12562r4510k78982m24928n20393n58737n40668m74996l76720
40274A0056719k62058j42553k2679R6290K09289L04265L66007L82922L50472K70081
40264A1608755J47363p536j78861l45690m84035n70329n86930n28703m06539k44353
40254H403142p1660Q3161J96775K53671K48540J86302P9030n7982k08881l59476
$$ y = [7729873, 8237037, 8707144, 9148510, 9583751, 10039165, 10538432, 11100654, 11739574, 12461664, 13263392, 14129317, 15031537, 15929638, 16770817, 17491787, 18024480, 18305430, 18286360, 17943550, 17285027, 16354569, 15230044, 14013916, 12817225, 11742042, 10868205, 10247775, 9906709, 9849384, 10060022, 10498635, 11096536, 11760386, 12388504, 12892710, 13214091, 13326653, 13232143, 12953161, 12528233, 12007840, 11449103, 10908435, 10433439, 10056719, 9794661, 9652108, 9629429, 9725719, 9935008, 10239273, 10605280, 10988202, 11338674, 11608755, 11756118, 11748582, 11569721, 11224031, 10739996, 10169667, 9582737, 9054034, 8647495, 8403142, 8331482, 8414643, 8611418, 8865089, 9113629, 9299931, 9378961, 9320979, 9112098, 8752622]
40244H752622m99638o23969p29367q12324q69715r02239r15626r17292r11620
40235A570832q98110q73168q33180p76490p03314o13946n07076l80217k32270
40226d246939o5872J12416K93445M66702O21365P48189Q42133R04297R41978R66327
40216A584041R87273J006825J014870R92612R23886Q07104O58431N03481L64058
40207H842581K49325J55652P2132j3616j11960k29072l64614n10066o49870p66290
40197F674202q46164q86055q93060q81011q63881q49272q34708q08390p54195
40188i42534o58719n17022l34384j23712R9323L20272N26773P06795Q46977R33910
40178H57679R58575R20570Q28172O93327N25625L31117J17432r9858k96819m48134
$$ y = [8752622, 8252984, 7629015, 6899648, 6087324, 5217609, 4315370, 3399744, 2482452, 1570832, 672722, -200446, -1033626, -1810116, -2513430, -3127376, -3634452, -4014669, -4246939, -4312811, -4200395, -3906950, -3440248, -2818883, -2070694, -1228561, -324264, 617714, 1584041, 2571314, 3578139, 4593009, 5585621, 6509507, 7316611, 7975042, 8478523, 8842581, 9091906, 9247558, 9319690, 9306074, 9194114, 8965042, 8600428, 8090362, 7440492, 6674202, 5828038, 4941983, 4048923, 3167912, 2304031, 1454759, 620051, -188339, -942534, -1601253, -2118275, -2452659, -2576371, -2477048, -2156776, -1630003, -923208, -76231, 857679, 1816254, 2736824, 3564996, 4258323, 4783948, 5115065, 5232497, 5132639, 4835820, 4387686]
40168D387686n35591n51528m96815l77976k05989M694K38314M79209P11008R15737
40158D568749J076069J179768J222518J207444J143047J041145R14184P71933
40150A3124857O19505M58732K92151J26992k3944j46606k33857k91499l35689
40141A3590642l82764m40729n10124n91485o89877q11326r55205j110197j257823
40132F841112j381737j476586j549509j611846j666617j701626j693415j619030
40124e859254j467695j246191r75739o82381l86893j00628J71376M25118O55815
40115i466472Q59585J034596J179396J289667J356002J364584J301813J161874
40107H1045R52717O95160M14859J33124j36349l83195n93458p46999q22819q09517
$$ y = [4387686, 3852095, 3300567, 2803752, 2425776, 2219787, 2224481, 2462795, 2942004, 3653012, 4568749, 5644818, 6824586, 8047104, 9254548, 10397595, 11438740, 12352924, 13124857, 13744362, 14203094, 14495245, 14622237, 14598293, 14451687, 14217830, 13926331, 13590642, 13207878, 12767149, 12257025, 11665540, 10975663, 10164337, 9209132, 8098935, 6841112, 5459375, 3982789, 2433280, 821434, -845183, -2546809, -4240224, -5859254, -7326949, -8573140, -9548879, -10231260, -10618153, -10718781, -10547405, -10122287, -9466472, -8606887, -7572291, -6392895, -5103228, -3747226, -2382642, -1080829, 81045, 1033762, 1728922, 2143781, 2276905, 2140556, 1757361, 1163903, 416904, -405915, -1215432]
40097a215432p13471n58315l75499j92569k6890J12081K15626K70447K60121J72883
40087b051018J0313k09159m54117o88845q82487j015146j079064j075039j007065
40078h451627q79722p00069m80733k39105P835K48151M74335O78317Q47633R66785
40068g528200J022870J011449R39118Q21718O78838N26848L74077K21570O9704
40059a862008p3404j87748k45198k19996j01144R8989L44152N83540P68975Q73068
40049b0774Q98461Q71529Q23946P74690P24270O62064N77816M69075L43815K20955
40039F345847J28112R3488J33074K40417L86065N27557O24473O50753N98773M75081
40029A0203640K93583P2599j63958l87227n70085o96628p67670p99538q18401
$$ y = [-1215432, -1928903, -2487218, -2862717, -3055286, -3082176, -2970095, -2754469, -2484022, -2223901, -2051018, -2040705, -2249864, -2703981, -3392826, -4275313, -5290459, -6369523, -7444562, -8451627, -9331349, -10031418, -10512151, -10751256, -10743421, -10495270, -10020935, -9342618, -8494985, -7528200, -6505330, -5493881, -4554763, -3733045, -3054207, -2527359, -2153282, -1931712, -1862008, -1935412, -2123160, -2368358, -2588354, -2689498, -2590509, -2246357, -1662817, -893842, -20774, 877687, 1749216, 2573162, 3347852, 4072122, 4734186, 5312002, 5781077, 6124892, 6345847, 6473959, 6567447, 6700521, 6940938, 7327003, 7854560, 8479033, 9129786, 9728559, 10203640, 10497223, 10569822, 10405864, 10018637, 9448552, 8751924, 7984254, 7184716, 6366315]
40020F366315q52471r22582j032811j165366j283559j342826j306091j157598
40012b696989r09045n94802k59013N8140L29168N41697O95808P97750Q53172Q64847
40002c19267Q36570P78099P04307O28725N58538M95928M42946M03775L82124L76425
39992E288170L76586L65070L23548K42865J29570K435j20056k31003l34527m32944
39982E609714n13528n48551n11264l95807k25009m0084J19519K32622L01312L44669
39972D373593L85923M39310N03567N65466O09301O23606O01095N36288M27023
39963I065172K79499J10636n6406k01275l13838l95093m51295m85595m93403m64668
39953F593734l90835k71432j17360M9041J97060K94781L19446K66435J51109J378
$$ y = [6366315, 5513844, 4591262, 3558451, 2393085, 1109526, -233300, -1539391, -2696989, -3606034, -4200836, -4459849, -4401709, -4072541, -3530844, -2835036, -2037286, -1184114, -319267, 517303, 1295402, 1999709, 2628434, 3186972, 3682900, 4125846, 4529621, 4911745, 5288170, 5664756, 6029826, 6353374, 6596239, 6725809, 6728244, 6608188, 6377185, 6042658, 5609714, 5096186, 4547635, 4036371, 3640564, 3415555, 3375471, 3494990, 3727612, 4028924, 4373593, 4759516, 5198826, 5702393, 6267859, 6877160, 7500766, 8101861, 8638149, 9065172, 9344671, 9455307, 9398901, 9197626, 8883788, 8488695, 8037400, 7551805, 7058402, 6593734, 6202899, 5931467, 5814107, 5863148, 6060208, 6354989, 6674435, 6940870, 7091979, 7093357]
39943G093357j55609l05628m51370o05569p77093r58872j125506j242083j278773
39934A92854j222692j080991q74994o30369l69055j05383J54559M11208O66770
39925b858093R17796J149168J334781J446260J465030J390656J241299J047201
39917G134098Q41121O49632M87463L55980K46264J46294M9725l7842r8696j10325
39907I663714n8246N1413J87418L02326L51873L14098J96689K9174j53647l26493
39897A0558319m79209o12595p29577q28503r02293r42452r44153r09623q48790
39888C361124p76809p08439o51399o03128n54324m97654m35693l82234l56058
39879a604614l71102m28796n16142o09954o85290p25178p27721p06636o83714
$$ y = [7093357, 6937748, 6632120, 6180750, 5575181, 4798088, 3839216, 2713710, 1471627, 192854, -1029838, -2110829, -2985823, -3616192, -3985247, -4090630, -3936071, -3524863, -2858093, -1940297, -791129, 543652, 1989912, 3454942, 4845598, 6086897, 7134098, 7975219, 8624851, 9112314, 9468294, 9714558, 9860852, 9910577, 9872735, 9774039, 9663714, 9605468, 9656881, 9844299, 10146625, 10498498, 10812596, 11009285, 11038459, 10884812, 10558319, 10079110, 9466515, 8736938, 7908435, 7006142, 6063690, 5119537, 4209914, 3361124, 2584315, 1875876, 1224477, 621349, 67025, -430629, -866322, -1248556, -1604614, -1975716, -2404512, -2920654, -3530608, -4215898, -4941076, -5668797, -6375433, -7059147]
39870g059147o76445o87992p05577p07946o76828o05619n00908l76949k47335
39861a2244746j19730K830J16360K12603K82279L22516L41656L57519L90795M57112
39851i880806N59671O84286Q00869Q74306Q80932Q20959P19216O14402N43256
39842c382909N26857N64153O34851P09880P63966P84445P73532P44687P15332
39833B834794O98659O97803P05182P07633O94653O64733O25385N86388N51472
39824H766702N15244M67374L99331L07578J92144N4041j05189k81632m66799o47335
39814I201459q07662r33895j016184j048646j029347r61472q52889p11737n41997
39805A297630l45572j30424Q3443K66521L88572M27591L76336K46367O7598j19000
$$ y = [-7059147, -7735592, -8423584, -9129161, -9837107, -10513935, -11119554, -11620462, -11997411, -12244746, -12364476, -12361646, -12245286, -12032683, -11750404, -11427888, -11086232, -10728713, -10337918, -9880806, -9321135, -8636849, -7835980, -6961674, -6080742, -5259783, -4540567, -3926165, -3382909, -2856052, -2291899, -1657048, -947168, -183202, 601243, 1374775, 2119462, 2834794, 3533453, 4231256, 4936438, 5644071, 6338724, 7003457, 7628842, 8215230, 8766702, 9281946, 9749320, 10148651, 10456229, 10648373, 10702414, 10597225, 10315593, 9848794, 9201459, 8393797, 7459902, 6443718, 5395072, 4365725, 3404253, 2551364, 1839627, 1297630, 952058, 821634, 905077, 1171598, 1560170, 1987761, 2364097, 2610464, 2678062, 2559062]
39795B559062k73430l67275l88469l40437k37681r9731N4359K08746L50548M68785
39785A934477N54516O02200O11156N85973N34875M65953L83438K87226J76356
39776F136170N3114p6158k03762l23708m32416n27275o05041o61575o92838o96185
39766A970326o70799o16751n33267m18328k71568r9657Q0137K43143L67159M42710
39756D93105M76065M83055M79241M73981M71224M73204M81501M94137N02898M95606
39746E324017M63243M06764L38412K76670K38133K30536K49695K81165L05489
39737H114124L04724K67705J92443Q5331m1723j74354k97843l99066m69442n07661
39727G074238n19532n14854n04527m99554n09199n35560n68182n85695n66120
$$ y = [2559062, 2285632, 1918357, 1529888, 1189451, 951770, 852039, 906398, 1115144, 1465692, 1934477, 2488993, 3091193, 3702349, 4288322, 4823197, 5289150, 5672588, 5959814, 6136170, 6189284, 6113126, 5909364, 5585656, 5153240, 4625965, 4020924, 3359349, 2666511, 1970326, 1299527, 682776, 149509, -268819, -540387, -640044, -559907, -316764, 50395, 493105, 969170, 1452225, 1931466, 2405447, 2876671, 3349875, 3831376, 4325513, 4828411, 5324017, 5787260, 6194024, 6532436, 6809106, 7047239, 7277775, 7527470, 7808635, 8114124, 8418848, 8686553, 8878996, 8964327, 8922604, 8748250, 8450407, 8051341, 7581899, 7074238, 6554706, 6039852, 5535325, 5035771, 4526572, 3991012, 3422830, 2837135, 2271015]
39718B271015m98821l89966k59424j32946l4503J8262J4781m9250j70514l33892
39708D34742n10051o60364p48617p52986o72174n24535l42018j61007j2506Q4519
39698c864997J24118J10524N5584k2559j02930j69489k19212k63044l17084l89552
39688e058641m72358n41536n64733n11582l64015j24100J83864N19261Q37479
39679f096361J102872J296489J415994J469623J468325J420248J329963J201770
39671D608923J043368Q65867O79619M89972K97638J03707q5589k58679m02451
39662G342375n06021n62315n69094n31870m68004m07888l88874m41696n75297
39653B891316p69229r79259j153635j251003j251892j161289j003940q15289o30956
$$ y = [2271015, 1772194, 1382228, 1122804, 989858, 955355, 973617, 988398, 939148, 768634, 434742, -75309, -735673, -1484290, -2237276, -2909450, -3433985, -3776003, -3937010, -3949516, -3864997, -3740879, -3630355, -3574771, -3597330, -3700260, -3869749, -4088961, -4352005, -4669089, -5058641, -5530999, -6072535, -6637268, -7148850, -7512865, -7636965, -7453101, -6933840, -6096361, -4993489, -3697000, -2281006, -811383, 656942, 2077190, 3407153, 4608923, 5652291, 6518158, 7197777, 7687749, 7985387, 8089094, 8003505, 7744826, 7342375, 6836354, 6274039, 5704945, 5173075, 4705071, 4297183, 3908309, 3466613, 2891316, 2122087, 1142828, -10807, -1261810, -2513702, -3674991, -4678931, -5494220, -6125176]
39644f125176m78074l70761l09519k83063k72385k57531k25238j73043j07377
39635h602167l8764K0685N6806N4928P072p9241j79184k59817k94868k75429k10657
39624i800636j19897k2436O8753J46670K06284K42283K51167K34670K00253J58028
39614h434861J17045Q2990N7270L7237J7971n259l5584p4449j21073j70909k14966
39603h744588k41706k40636k05629j37125m2434O6857J80266K93489M09559N34923
39593h127024O72452Q15127R44442J035799J068510J034305R39651Q02394O45882
39584a68462M92655L59296K54685J82135J41687J29179J34638J45251J51993J52572
39574A975629J46931J31537J01039N7099J5040k78L1004J07833K01972K67107
$$ y = [-6125176, -6603250, -6974011, -7283530, -7566593, -7838978, -8096509, -8321747, -8494790, -8602167, -8640931, -8620246, -8563440, -8508512, -8501440, -8580681, -8759865, -9019682, -9314550, -9589979, -9800636, -9920533, -9942969, -9874216, -9727546, -9521262, -9278979, -9027812, -8793142, -8592889, -8434861, -8317816, -8234826, -8177556, -8140319, -8122348, -8127607, -8163191, -8237640, -8358713, -8529622, -8744588, -8986294, -9226930, -9432559, -9569684, -9612118, -9545261, -9364995, -9071506, -8661947, -8127024, -7454572, -6639445, -5695003, -4659204, -3590694, -2556389, -1616738, -814344, -168462, 324193, 683489, 938174, 1120309, 1261996, 1391175, 1525813, 1671064, 1823057, 1975629, 2122560, 2254097, 2355136, 2412235, 2427275, 2426997, 2458001, 2565834, 2767806, 3034913]
39564C034913K59649J60246j5457k22276m04729n21088n59703n38362m88060m33510
39554B71623l83143l31544k67947j84276q0234L5577J49762K51347L36121M04022
39544B01308M53206M78067M73891M43666M00617L63991L50387L65666M02349M44119
39534D377267M73587M76786M42050L57952K16507K0925k10045m47206o62491q37957
39524D207375r66570j047149j079466j062934r98454q91553p55052o09131m76990
39515c679924l76729l13144k74161k34650j66900n3255J05751K92510M81455O49346
39505c569701P80574Q66916R05168Q94948Q36676P30617N79232L92533J91378
39496B608341L774j44687k39897k82415k84336k62545k31362j97060j56488j00640
$$ y = [3034913, 3294562, 3454808, 3439351, 3217075, 2812346, 2291258, 1731555, 1193193, 705133, 271623, -111520, -443064, -711011, -895287, -975521, -939944, -790182, -538835, -202714, 201308, 654514, 1132581, 1606472, 2050138, 2450755, 2814746, 3165133, 3530799, 3933148, 4377267, 4850854, 5327640, 5769690, 6127642, 6344149, 6365074, 6155029, 5707823, 5045332, 4207375, 3240805, 2193656, 1114190, 51256, -947198, -1838751, -2593803, -3202934, -3679924, -4056653, -4369797, -4643958, -4878608, -5045508, -5098763, -4993012, -4700502, -4219047, -3569701, -2789127, -1922211, -1017043, -122095, 714581, 1445198, 2024430, 2416963, 2608341, 2612115, 2467428, 2227531, 1945116, 1660780, 1398235, 1166873, 969813, 813325, 712685]
39486G12685k1587Q0671J95257L03575L87182M35244M46490M25200L75778L00232
39476C640727J98936P2254p8275k48835m31669o13487p75727q98862r70540r92783
39466a098261r81483r57019r33039r11968q88215q53035p96659p09401n84986
39457h714066m25068k40561m7482J40146L14976M74962O17494P35087Q17568Q59241
39447e467703Q64516Q47439Q26226Q16403Q24296Q41844Q45910Q06005O99323
39438A904259N25024L07841Q7798r7118k23699k85034k83992k27060j23331J3342
39428A598030J63161L01920M04709M51353M33031L58070K53984J63369J32862
39419D260489J96981L62666O02949Q64808J088014J225221J254163J178802J022080
$$ y = [712685, 691098, 771769, 967026, 1270601, 1657783, 2093027, 2539517, 2964717, 3340495, 3640727, 3839663, 3911917, 3833642, 3584807, 3153138, 2539651, 1763924, 865062, -105478, -1098261, -2079744, -3036763, -3969802, -4881770, -5769985, -6623020, -7419679, -8129080, -8714066, -9139134, -9379695, -9427177, -9287031, -8972055, -8497093, -7879599, -7144512, -6326944, -5467703, -4603187, -3755748, -2929522, -2113119, -1288823, -446979, 398931, 1204936, 1904259, 2429283, 2737124, 2824922, 2727804, 2504105, 2219071, 1935079, 1708019, 1584688, 1598030, 1761191, 2063111, 2467820, 2919173, 3352204, 3710274, 3964258, 4127627, 4260489, 4457470, 4820136, 5423085, 6287893, 7375907, 8601128, 9855291, 11034093, 12056173]
39410A2056173Q15383N88741L63849J51240m7089k30545l93658n26726o22965
39401A2154403o84366p19570p36131p34931p10932o58211n75508m70373l60029
39392F504352k67215k11914k03263k35512k89056l36024l49578l14261k32416
39383D065113j23009j3498P0919J15450J17756Q4190K4876m7019j12401j46456
39373D035921j27228m8724P1659J98384K93471L33404L17881K66234K04463J50823
39363E696288J08005O5335Q717o7820j55983k36432k89530l06248k91722k59683
39353D270927k22573j84468j40892q4632j3315O5606J34604J70710J53646P4649
39343D224262n8289k21881l84725n16168n93761o08833n69429m98223m24073l70480
$$ y = [12056173, 12871556, 13460297, 13824146, 13975386, 13928297, 13697752, 13304094, 12777368, 12154403, 11470037, 10750467, 10014336, 9279405, 8568473, 7910262, 7334754, 6864381, 6504352, 6237137, 6025223, 5821960, 5586448, 5297392, 4961368, 4611790, 4297529, 4065113, 3942104, 3928606, 3999525, 4114975, 4232731, 4316921, 4341797, 4294778, 4182377, 4035921, 3908693, 3859969, 3931628, 4130012, 4423483, 4756887, 5074768, 5341002, 5545465, 5696288, 5804293, 5869628, 5878345, 5810525, 5654542, 5418110, 5128580, 4822332, 4530610, 4270927, 4048354, 3863886, 3722994, 3638362, 3625047, 3690653, 3825257, 3995967, 4149613, 4224262, 4165973, 3944092, 3559367, 3043199, 2449438, 1840605, 1271176, 772953, 348880, -21600]
39333b1600l46732l46300l53422l54997l50654l53110l77302m27119m91183n50614
39323c973033n90903o08587o09757o03627n95728n84777n64999n31665m84571
39314i147647m26818l61759k92142k20815j49319p4227J4005J25764K63211M14211
39304i855536N53810O51901O82440O30864M98819L05710Q5347j22923k85330l81211
39294g236109m03714l55725k45546q4704J12388L28506N45014P45381R19395J064529
39284d610585J182752J275922J344157J386931J402521J384506J320254J195873
39276E882331J004823P52757M55498J34144j87691m84449p30445r04957r98745
39267D923266j018238r84315r25249q66820q24282p99309p81652p53707o96737
$$ y = [-21600, -368332, -714632, -1068054, -1423051, -1773705, -2126815, -2504117, -2931236, -3422419, -3973033, -4563936, -5172523, -5782280, -6385907, -6981635, -7566412, -8131411, -8663076, -9147647, -9574465, -9936224, -10228366, -10449181, -10598500, -10672727, -10658722, -10532958, -10269747, -9855536, -9301726, -8649825, -7967385, -7336521, -6837702, -6531992, -6446645, -6569568, -6854898, -7236109, -7639823, -7995548, -8241094, -8325798, -8213410, -7884904, -7339890, -6594509, -5675114, -4610585, -3427833, -2151911, -807754, 579177, 1981698, 3366204, 4686458, 5882331, 6887154, 7639911, 8095409, 8229553, 8041862, 7557413, 6826968, 5922011, 4923266, 3905028, 2920713, 1995464, 1128644, 304362, -494947, -1276599, -2030306, -2727043]
39258b727043n97231m51098k64321n1935J62240L46106M63940M85910L97627K04050
39248b031755p3067m00921p41954j059697j323148j508500j599424j588455j479661
39239a1806582j289331j042486p67200m90108k33467j2017J69993L18835M47015
39230a4705348N67324O88577Q13723R38983J054156J145878J204017J227309J223322
39221e842059J202209J169696J125688J069278J004581R41758Q93017Q67555Q68125
39212C299848Q88950R15131R25919R02686Q37489P35725O10707M74419L30918
39203I921792J75575p32k05139m36714o82951r20700j122367j266213j346135
39194D116416j374133j371702j354535j321541j256518j140533r64951p36287
$$ y = [-2727043, -3324274, -3775372, -4039693, -4091628, -3929388, -3583282, -3119342, -2633432, -2235805, -2031755, -2104822, -2505743, -3247697, -4307394, -5630542, -7139042, -8738466, -10326921, -11806582, -13095913, -14138399, -14905599, -15395707, -15629174, -15641191, -15471198, -15152363, -14705348, -14138024, -13449447, -12635724, -11696741, -10642585, -9496707, -8292690, -7065381, -5842059, -4639850, -3470154, -2344466, -1275188, -270607, 671151, 1564168, 2431723, 3299848, 4188798, 5103929, 6029848, 6932534, 7770023, 8505748, 9116455, 9590874, 9921792, 10097367, 10096635, 9891496, 9454782, 8771831, 7851131, 6728764, 5462551, 4116416, 2742283, 1370581, 16046, -1305495, -2562013, -3702546, -4667497, -5403784]
39186e403784m71980j92596Q3453L40568N64297P41093Q60991R21110R26676Q88302
39176g41870Q16681P16955N85661M13581J95121o0936l28069n70309p56975q73293
39166f03453r20128r04942q32707p04952n27836l21347j19411M1720J38612J68439
39156d586005J46001R5033L9610k841k6817l9391n3339p5374r8103j02620o9993
39145d773839P477J23227K61839M06682N44054O62992P53502Q05842Q11681P66649
39135C70106O73091N41151L87012K28731Q1732m3816j42420k10284k42702k34871
39125A407730j85942j02818m83J00392J76248K03996J67254O5042q2660k38427
39115A510332l60261m17343m00453l22705k12230j01758j9143J9444J2573k8603
$$ y = [-5403784, -5875764, -6068360, -5984907, -5644339, -5080042, -4338949, -3477958, -2556848, -1630172, -741870, 74811, 791766, 1377427, 1791008, 1986129, 1925193, 1597124, 1026815, 269840, -603453, -1523581, -2428523, -3261230, -3966182, -4494018, -4815365, -4934776, -4893056, -4754444, -4586005, -4440004, -4344971, -4305361, -4308202, -4335019, -4374410, -4427749, -4503123, -4601226, -4703846, -4773839, -4766362, -4643135, -4381296, -3974614, -3430560, -2767568, -2014066, -1208224, -396543, 370106, 1043197, 1584348, 1971360, 2200091, 2281823, 2238007, 2095587, 1885303, 1642601, 1407730, 1221788, 1118970, 1118487, 1218879, 1395127, 1599123, 1766377, 1831419, 1748759, 1510332, 1150071, 732728, 332275, 9570, -202660, -304418, -323561, -304117, -291544, -320147]
39105c20147q7300j48647k03027k44665k69211k73309k55690k18001j64747j02084
39095b286828l5511L1712R6593J51739J83712J78443J29703M2100p4153k09972
39085a792462l57529n03545o24099o88902o74570n77960m19747k35703o2121P5216
39075e861422J63714K00348J87106J28894L3529q8456k25266l65244m96596o06127
39065f929520o79296p02979o70090n84417m63770l38150k39807j87689j76058
39056a0971776j77617j61140j11783l9680K8428O7114O6495L3922j4944o6207
39046a1347188j11114j42614j50469j19463l2326J23175L45492O14166Q92880
39037i927461J140105J321660J420268J440235J405993J352704J310929J293268
$$ y = [-320147, -407447, -556094, -759121, -1003786, -1272997, -1546306, -1801996, -2019997, -2184744, -2286828, -2322339, -2290627, -2194034, -2042295, -1858583, -1680140, -1550437, -1508337, -1582490, -1792462, -2149991, -2653536, -3277635, -3966537, -4641107, -5219067, -5638814, -5874517, -5936638, -5861422, -5697708, -5497360, -5310254, -5181360, -5147831, -5236287, -5461553, -5826797, -6323393, -6929520, -7608816, -8311795, -8981885, -9566302, -10030072, -10368222, -10608029, -10795718, -10971776, -11149393, -11310533, -11422316, -11461996, -11433568, -11366454, -11299959, -11266037, -11280981, -11347188, -11458302, -11600916, -11751385, -11870848, -11903174, -11779999, -11434507, -10820341, -9927461, -8787356, -7465696, -6045428, -4605193, -3199200, -1846496, -535567, 757701]
39029G57701J291059J282004J242918J161157J041199R03804P76360O77655O06069
39020I739926N39909M50362L17939J41067o7212k88859n07637p09150q77747r96631
39010G741967j053594j049265j001965r44279r10838r22543r76204j046290j097989
39001a261000j103933j055698r65256q57307p57282o80866o28769n87658n36144
38992h433913m53805l30162j69669R773J83503L28249M28346M78594M83841M56596
38982g018647M14457L77726L65027L85419M30877M76605M92221M57463L71438
38973c247414K49572J11890k8594j70474l20235m84055o60635q39129j002676
38964f391750j135004j225764j270956j268358j212443j094403r08112o56592
$$ y = [757701, 2048760, 3330764, 4573682, 5734839, 6776038, 7679842, 8456202, 9133857, 9739926, 10279835, 10730197, 11048136, 11189203, 11121991, 10833132, 10325495, 9616345, 8738598, 7741967, 6688373, 5639108, 4637143, 3692864, 2782026, 1859483, 883279, -163011, -1261000, -2364933, -3420631, -4385887, -5243194, -6000476, -6681342, -7310111, -7897769, -8433913, -8887718, -9217880, -9387549, -9377776, -9194273, -8866024, -8437678, -7959084, -7475243, -7018647, -6604190, -6226464, -5861437, -5476018, -5045141, -4568536, -4076315, -3618852, -3247414, -2997842, -2885952, -2914546, -3085020, -3405255, -3889310, -4549945, -5389074, -6391750, -7526754, -8752518, -10023474, -11291832, -12504275, -13598678, -14506790, -15163382]
38956a5163382l53104j6666L32832O75608R89590J248746J425945J500940J469840
38947g889651J349713J173830R79226P93321O26232M71655L15848J51402j1161
38938b039585j42404k06636j80929o8066J03966K93321M58503N68781O08306N74619
38928c0124M74452L20067J27019q8538l14135n44028p76673j006641j217242j380973
38918d436816j469083j464294j368511j201221r90777p64996n46263l51174j90516
38909a2783651o6798K8189J10647J95665K87063L73479M33389M45720M00288L03657
38899a0272352J78565N7389k7809n5163j9768O4617J70078K64629L24023L39806
38889h975985L20472K87003K65710K80175L43770M55824O03694P68816R32062
$$ y = [-15163382, -15516486, -15533152, -15200320, -14524712, -13535122, -12286376, -10860431, -9359491, -7889651, -6539938, -5366108, -4386882, -3593561, -2967329, -2495674, -2179826, -2028424, -2039585, -2181989, -2388625, -2569554, -2637620, -2533654, -2240333, -1781830, -1213049, -604743, -30124, 444328, 764395, 891414, 802876, 488741, -55287, -831960, -1838601, -3055843, -4436816, -5905899, -7370193, -8738704, -9939925, -10930702, -11695698, -12241961, -12593135, -12783651, -12850449, -12822260, -12711613, -12515948, -12228885, -11855406, -11422017, -10976297, -10576009, -10272352, -10093787, -10036398, -10064207, -10119370, -10139138, -10074521, -9904443, -9639814, -9315791, -8975985, -8655513, -8368510, -8102800, -7822625, -7478855, -7023031, -6419337, -5650521, -4718459]
38880d718459J076320J188368J261669J297986J304786J289229J253330J193965
38872E147194J107156R92547Q53983O95899N19969L26949J23246p4505k43120
38863I449318l63635m31371m58047m64518m68893m77516m84607m80017m58163
38854E362551m20889l73976l22837k71544k23776j82764j50848j30699j27300
38845C157918j46707j89952k46085k91160k96688k43848j34694O984J45259K45611
38835B006638K85449K59062J77939O7460l9688j12116j27754p8784K8019J75456
38825B641681L42192N07169O50092P50659P91109P62565O70247N32731L75574
38816H024019K23840R7221Q412l6465l6912K135O9254J45953K09562K40852K32757
$$ y = [-4718459, -3642139, -2453771, -1192102, 105884, 1410670, 2699899, 3953229, 5147194, 6254350, 7246897, 8100880, 8796779, 9316748, 9643697, 9766943, 9692438, 9449318, 9085683, 8654312, 8196265, 7731747, 7262854, 6785338, 6300731, 5820714, 5362551, 4941662, 4567686, 4244849, 3973305, 3749529, 3566765, 3415917, 3285218, 3157918, 3011211, 2821259, 2575174, 2284014, 1987326, 1743478, 1608784, 1615768, 1761027, 2006638, 2292087, 2551149, 2729088, 2796548, 2756860, 2644744, 2516990, 2438206, 2466225, 2641681, 2983873, 3491042, 4141134, 4891793, 5682902, 6445467, 7115714, 7648445, 8024019, 8247859, 8345080, 8353492, 8317027, 8280115, 8282250, 8351504, 8497457, 8707019, 8947871, 9180628]
38805I180628J93825J42718R7146O5297M5025K8840Q312k5691q4751j82085l27196
38794I142068n18588p39584r61411j153480j295220j381553j418374j412439j364253
38785a102834j269149j124562r37400p26348n17701l36970k00496j10946n8295
38776f384701k4881Q402N7156J30526K29872L48694M74237N91331O87219P54675
38766c127470P91780P99933P83031P48132P05170O64252O32315O11796O01604
38757C210543N98694N99216N99104N93805N77206N41368M79095L88637K77056
38748G864724J59204N2422l0794q9447j36869j96989k94266m42189o36723q57565
38738E391508j075105j258830j384324j437937j419074j339788j221207j087076
$$ y = [9180628, 9374453, 9517171, 9614317, 9679614, 9724639, 9753479, 9761791, 9736100, 9651349, 9469264, 9142068, 8623480, 7883896, 6922485, 5769005, 4473785, 3092232, 1673858, 261419, -1102834, -2371983, -3496545, -4433945, -5160293, -5677994, -6014964, -6215460, -6326406, -6384701, -6409582, -6401180, -6344024, -6213498, -5983626, -5634932, -5160695, -4569364, -3882145, -3127470, -2335690, -1535757, -752726, -4594, 700576, 1364828, 1997143, 2608939, 3210543, 3809237, 4408453, 5007557, 5601362, 6178568, 6719936, 7199031, 7587668, 7864724, 8023928, 8076350, 8045556, 7956109, 7819240, 7622251, 7327985, 6885796, 6249073, 5391508, 4316403, 3057573, 1673249, 235312, -1183762, -2523550, -3744757, -4831833]
38730d831833r56549q39400p35769o39742n44390m45991l45831k48672j58873
38721i747050p7044L29P9365J67706K73595M02281N50111P01828Q36016R36084
38711e876779R98611J033300J056034J080258J111135J144432J170293J179677
38703B896961J169288J141497J099589J041806R58333Q33800O55341M22284J50829
38694A0369728j30621l92287o11616p74984q76170r17914r15926q97791q92150
38685C960269r13980r57786j004765j038076j054173j062481j075674j099261
38677d245927j127562j146972j143101j107897j044219r65647q90206q30194p84019
38668a3285744p35454o61146n42683l77849j85820k442J33940J98984J91452J30383
$$ y = [-4831833, -5788382, -6627782, -7363551, -8003293, -8547683, -8993674, -9339505, -9588177, -9747050, -9824094, -9823765, -9744400, -9576694, -9303099, -8900818, -8350707, -7648879, -6812863, -5876779, -4878168, -3844868, -2788834, -1708576, -597441, 546991, 1717284, 2896961, 4066249, 5207746, 6307335, 7349141, 8307474, 9141274, 9796615, 10218899, 10369728, 10239107, 9846820, 9235204, 8460220, 7584050, 6666136, 5750210, 4852419, 3960269, 3046289, 2088503, 1083738, 45662, -1008511, -2070992, -3146666, -4245927, -5373489, -6520461, -7663562, -8771459, -9815678, -10781325, -11671531, -12501725, -13285744, -14021198, -14682344, -15225027, -15602876, -15788696, -15791138, -15657198, -15458214, -15266762, -15136379]
38658a5136379M4686l6877r1279j03462o7554J2701J25365K53961L82467M99900
38648a4116471O02481O91919P70567Q36934Q85531R11393R14752R00652Q73778
38639f728464Q34512P80817P13348O37088N57577M76575L92346L03851K14373
38630a817977J31806O5925K3935O081M388O704L892n254j4789j6806p429Q934
38618a610590J8804L820n0486j45494k65612l82795m67466n00509m80705m24352
38608d305385l57291l03352k74937k70295k78269k87014k90954k91865k94356
38599f953718l00297l07079l10985l12254l16578l30572l54279l77565l84883
38590i948210l65775l22622k68669k17123j69513j12304k4507J08944K87230M93390
$$ y = [-15136379, -15091693, -15128570, -15219849, -15323311, -15390865, -15378164, -15252799, -14998838, -14616371, -14116471, -13513990, -12822071, -12051504, -11214570, -10329039, -9417646, -8502894, -7602242, -6728464, -5893952, -5113135, -4399787, -3762699, -3205122, -2728547, -2336201, -2032350, -1817977, -1686171, -1620246, -1596311, -1590230, -1585842, -1579138, -1575246, -1580500, -1595289, -1612095, -1619524, -1610590, -1591786, -1587966, -1638452, -1783946, -2049558, -2432353, -2899819, -3400328, -3881033, -4305385, -4662676, -4966028, -5240965, -5511260, -5789529, -6076543, -6367497, -6659362, -6953718, -7254015, -7561094, -7872079, -8184333, -8500911, -8831483, -9185762, -9563327, -9948210, -10313985, -10636607, -10905276, -11122399, -11291912, -11404216, -11428723, -11319779, -11032549, -10539159]
38580a0539159P02722Q93054J050238J167367J241206J269957J253443J194078
38572a767094J097174R71054Q27736O83193N54920M56318L90728L48789L10520
38563C873338K51182J49461l563j97824m04276n83213o97489p24123o59362n17094
38553D87037l24086j15462O9307J92070K24207J54233r719k43540n13196p79366
38543h58515j000698j138263j162165j058620q34931n20166j60211J92263M89641
38534f051665O98993Q07591Q24000P73882O89736N97769N08846M18366L13334
38525d19148J81305J8204j65872l45409m86464n60543n56941m85461l69608k37170
38515c427107j13334j5846M9245Q9005J18924J53445J97830K46395K86532L04617
$$ y = [-10539159, -9836437, -8943383, -7893145, -6725778, -5484572, -4214615, -2961172, -1767094, -669920, 301134, 1128870, 1812063, 2366983, 2823301, 3214029, 3562818, 3873338, 4124520, 4273981, 4270418, 4072594, 3668318, 3085105, 2387616, 1663493, 1004131, 487037, 162951, 47489, 116796, 308866, 533073, 687306, 677587, 434047, -79149, -858515, -1859213, -2997476, -4159641, -5218261, -6053192, -6573358, -6733569, -6541306, -6051665, -5352672, -4545081, -3721081, -2947199, -2257463, -1659694, -1150848, -732482, -419148, -237843, -219639, -385511, -730920, -1217384, -1777927, -2334868, -2820329, -3189937, -3427107, -3540441, -3556287, -3507042, -3418037, -3299113, -3145668, -2947838, -2701443, -2414911, -2110294]
38505b110294K90755K41813J62468O3338m4051j53237k65867l88924n27014o74426
38495c405439q12879r17988r71373r70869r31751q77860q28246p87590p45412
38486a1249407o83292n85082m44555k67369o7775J37124L32142N05985O50666
38477a1671563P60016Q28797Q52604Q27948P52377O25979M55108K56213N5497
38468f257024j17318k37354k89495k68436j76964k5051J71152L91380O12688Q08740
38458e387682R49918J008878R70768Q40853O42804M08517J67008o0630k59537
38449g19103m17662n25995n82596n95348n79094n48813n14819m83437m60434m52115
38439e879416m62193m86980n13151n20740m90799m13739k93286j44153J4025J61865
$$ y = [-2110294, -1819539, -1577726, -1415258, -1351920, -1395971, -1549208, -1815075, -2203999, -2731013, -3405439, -4218318, -5136306, -6107679, -7078548, -8010299, -8888159, -9716405, -10503995, -11249407, -11932699, -12517781, -12962336, -13229705, -13297480, -13160356, -12828214, -12322229, -11671563, -10911547, -10082750, -9230146, -8402198, -7649821, -7023842, -6568734, -6312521, -6257024, -6374342, -6611696, -6901191, -7169627, -7346591, -7371642, -7200490, -6809110, -6196422, -5387682, -4437764, -3428886, -2458118, -1617265, -974461, -565944, -398936, -459566, -719103, -1136765, -1662760, -2245356, -2840704, -3419798, -3968611, -4483430, -4966867, -5427301, -5879416, -6341609, -6828589, -7341740, -7862480, -8353279, -8767018, -9060304, -9204457, -9190432, -9028567]
38429i028567K82124L59454L80765L38636K37400R8002m3917j48663j87414j53755
38419g865935o6295L8477J20708J53565J33756P9960K0484k1127l3834j9015J2200
38408g447056L9959L6316k9992j82860m26084p36230j066804j362792j577907
38399a2753450j685897j682302j579683j401047j173856r24673o74962m39306
38391b2315176k25622l5361J36835L01277M67122O34756P92999R24286J014198
38382a8304686J057837J058279J019114R38343Q10423O35946M30623K24565N0950
38373a2078606o7788j27154j37674j14460o4925J8422J54336L58840O29002R34743
38363a0495264J223488J435377J522991J468458J290709J039025P75700N55778
$$ y = [-9028567, -8746443, -8386989, -8006224, -7667588, -7430188, -7332186, -7376103, -7524766, -7712180, -7865935, -7932230, -7893753, -7773045, -7619480, -7485724, -7405764, -7385280, -7406407, -7440241, -7459256, -7447056, -7407097, -7370781, -7400773, -7583633, -8009717, -8745947, -9812751, -11175543, -12753450, -14439347, -16121649, -17701332, -19102379, -20276235, -21200908, -21875870, -22315176, -22540798, -22576159, -22439324, -22138047, -21670925, -21036169, -20243170, -19318884, -18304686, -17246849, -16188570, -15169456, -14231113, -13420690, -12784744, -12354121, -12129556, -12078606, -12146394, -12273548, -12411222, -12525682, -12590607, -12572185, -12417849, -12059009, -11430007, -10495264, -9271776, -7836399, -6313408, -4844950, -3554241, -2515216, -1739516, -1183738]
38355a183738M11885L48943L50163L91185M53874N30654O18028P06840P78262
38346C406096Q08104P76230O76208N20305L35606J51580j3406j57306k89182m20396
38336E793839n59849p13674q83950j063537j231492j356395j408857j375287j262756
38327d061958j092219q86827o64435m37425k16715j5201J51628K67602L18871
38318f636679K96763K00589M1121j56714l56286n19740o22439o61968o55251o26462
38308i697066n94613n67822n45240n22872m98603m73316m48024m20238l83294
38299a4151088l29426k53887j57533m7892O1055J52573K16292K58415L03057L79045
38289a3569389M99542O50265P96252R02084R50416R46716R09774Q57679Q00275
$$ y = [-1183738, -771853, -422910, -72747, 318438, 772312, 1302966, 1920994, 2627834, 3406096, 4214200, 4990430, 5666638, 6186943, 6522549, 6674129, 6660723, 6503417, 6214235, 5793839, 5233990, 4520316, 3636366, 2572829, 1341337, -15058, -1423915, -2799202, -4061958, -5154177, -6041004, -6705439, -7142864, -7359579, -7374780, -7223152, -6955550, -6636679, -6339916, -6139327, -6098206, -6254920, -6611206, -7130946, -7753385, -8415353, -9070604, -9697066, -10291679, -10859501, -11404741, -11927613, -12426216, -12899532, -13347556, -13767794, -14151088, -14480514, -14734401, -14891934, -14939826, -14878771, -14726198, -14509906, -14251491, -13948434, -13569389, -13069847, -12419582, -11623330, -10721246, -9770830, -8824114, -7914340, -7056661, -6256386]
38280f256386P41922O89157O54393O51445O86829P54264Q36682R13901R70478
38271F42685R99252R99676R73435R20343Q36133P12618N40833L17270N0471k36859
38261F755857n13096p47704r19936j021965j056838j034721r69832q77699p71561
38252a157495o59206n43888m30279l30230k61206k36707k56526l05609l62406
38243d543552m09846m41301m59023m67990m70504m65122m49145m21077l81403
38234h508963l33504k85913k52696k47781k74713l19265l51186l35087k45128
38225a1154236p6977J48080L88697N95968P26939P54158O69905M86052K30693
38216g230721n7586l36621n67596p21092p81330p48012o35908m72534k93317j33829
$$ y = [-6256386, -5514464, -4825307, -4170914, -3519469, -2832640, -2078376, -1241694, -327793, 642685, 1641937, 2641613, 3615048, 4535391, 5371524, 6084142, 6624975, 6942245, 6992716, 6755857, 6242761, 5495057, 4575121, 3553156, 2496318, 1461597, 491765, -385934, -1157495, -1816701, -2360589, -2790868, -3121098, -3382304, -3619011, -3875537, -4181146, -4543552, -4953398, -5394699, -5853722, -6321712, -6792216, -7257338, -7706483, -8127560, -8508963, -8842467, -9128380, -9381076, -9628857, -9903570, -10222835, -10574021, -10909108, -11154236, -11231213, -11083133, -10694436, -10098468, -9371529, -8617371, -7947466, -7461414, -7230721, -7288307, -7624928, -8192524, -8913616, -9694946, -10442958, -11078866, -11551400, -11844717, -11978546]
38206a1978546k1227L1428K5989k3906r8412j78522k51716l12197l55390l72860
38196a3535359l53890k92508j92335o4454P9029K29497L81477N29041O62485P68141
38186a1788876Q32080Q45575Q08364P27266O11829M71274L15648J59997K7200
38177f989643n4524n9573K5782J98121M37706P13200R87146J221512J384042J454223
38167f82008J425271J300600J088709Q02504M63599J05226k32568n13564p13846
38158C043923q23060q41224p76601o45739m72289k82379r8746O2979J94649K94183
38148c44304L63972M09333M36418M49728M50574M37820M10404L69523L19079K64449
38138C566996K10011J55298R1585L372j22614k85472m64849o27601p42164p91352
$$ y = [-11978546, -11999773, -11968345, -11942356, -11966262, -12064674, -12243196, -12494912, -12807109, -13162499, -13535359, -13889249, -14181757, -14374092, -14438546, -14359517, -14130020, -13748543, -13219502, -12557017, -11788876, -10956796, -10111221, -9302857, -8575591, -7963762, -7492488, -7176840, -7016843, -6989643, -7044167, -7103740, -7077958, -6879837, -6442131, -5728931, -4741785, -3520273, -2136231, -682008, 743263, 2043863, 3132572, 3935076, 4398675, 4503901, 4271333, 3757769, 3043923, 2220863, 1379639, 603038, -42701, -514990, -797369, -896115, -833136, -638487, -344304, 19668, 429001, 865419, 1315147, 1765721, 2203541, 2613945, 2983468, 3302547, 3566996, 3777007, 3932305, 4023890, 4027262, 3904648, 3619176, 3154327, 2526726, 1784562, 993210]
38128I93210p77376p18361o39374n62847n03518m69651m66589m96809n55772o28617
38118d825704o92162p21461o97054o10734m69477k96396j26665J827O0528M0743
38108h336555m1714j50958k44285k88549k71139k00417r7577J3673J14356J92845
38098i310320K44196K68361K69006K53369K31829K15693K13501K28030K56084
38089g130251K90751L24084L48274L55370L37235K87345K04263R4758k5848j37385
38079e051404k21721k69903k85419k80921k69693k57339k38946k02979j38417
38070g216742m0723Q5700K27972L66408M76434N31893N11349M06551K28268M719
38060d418171k27456m34706n95440p04001p69265q07881q34681q55623q67473
$$ y = [993210, 215834, -502527, -1141901, -1704748, -2208266, -2677917, -3144506, -3641315, -4197087, -4825704, -5517866, -6239327, -6936381, -7547115, -8016592, -8312988, -8439653, -8437826, -8377298, -8336555, -8378269, -8529227, -8773512, -9062061, -9333200, -9533617, -9631194, -9617521, -9503165, -9310320, -9066124, -8797763, -8528757, -8275388, -8043559, -7827866, -7614365, -7386335, -7130251, -6839500, -6515416, -6167142, -5811772, -5474537, -5187192, -4982929, -4888171, -4914019, -5051404, -5273125, -5543028, -5828447, -6109368, -6379061, -6636400, -6875346, -7078325, -7216742, -7257465, -7171765, -6943793, -6577385, -6100951, -5569058, -5057709, -4651158, -4422890, -4418171, -4645627, -5080333, -5675773, -6379774, -7149039, -7956920, -8791601, -9647224, -10514697]
38051a0514697q62384q31979p68673o66879n26765l58294j80960j7747J13159
38042a4615219K03983K58049K86633L04504L26036L62354M18954M93445N74471
38033a1386790O43775O82734O81449O45446N95332N59178N62277O19426P31406
38024e665767Q84838J055353J214748J340080J419141J448623J427767J354260
38016D479043J225606J042543Q09253N30404K10255j42148n04841q40300j104148
38007E705667j261960j303479j244902j118664r58924p91994o34299m94234l73767
37998b476556k70131j79588j01766l9797N272M0234P8313J30584J98285K73211
37988b341939L44378M02992M41075M47273M06884L08707J54250l8043k37689m14107
$$ y = [-10514697, -11377081, -12209060, -12977733, -13644612, -14171377, -14529671, -14710631, -14728378, -14615219, -14411236, -14153187, -13866554, -13562050, -13236014, -12873660, -12454706, -11961261, -11386790, -10743015, -10060281, -9378832, -8733386, -8138054, -7578876, -7016599, -6397173, -5665767, -4780929, -3725576, -2510828, -1170748, 248393, 1697016, 3124783, 4479043, 5704649, 6747192, 7556445, 8086849, 8297104, 8154956, 7650115, 6809815, 5705667, 4443707, 3140228, 1895326, 776662, -182262, -974256, -1608555, -2102789, -2476556, -2746687, -2926275, -3028041, -3067838, -3062566, -3022332, -2944019, -2813435, -2615150, -2341939, -1997561, -1594569, -1153494, -706221, -299337, 9370, 163620, 125577, -112112, -526219]
37978e26219n48904o41431p04520p53266p94053q20466q17543p69900o67730n08405
37968g552437k96231m3477K27572M84745O90721Q11641Q26898P36952N66648L62022
37958c184946J80421P6215Q6250K19614M55127P47867J042560J288595J450807
$$ y = [-526219, -1075123, -1716554, -2421074, -3174340, -3968393, -4788859, -5606402, -6376302, -7044032, -7552437, -7848668, -7892145, -7664573, -7179828, -6489107, -5677466, -4850568, -4113616, -3546968, -3184946, -3004525, -2928310, -2842060, -2622446, -2167319, -1419452, -376892, 911703, 2362510]
$$ [...]
##END NTUPLES=NMR SPECTRUM
##END=
