##TITLE=31Pdec_DE-43_EA_TFA2
 CDCl3
 24 sc
 3.4.2024
##JCAMPDX= 6.0         $$ Bruker NMR JCAMP-DX V2.0
##DATA TYPE= NMR SPECTRUM
##DATA CLASS= NTUPLES
##ORIGIN= UXNMR, Bruker Analytische Messtechnik GmbH
##OWNER= root
$$ XWIN-NMR		Version 3.5
$$ Wed Apr  3 14:26:28 2024 Russian Standard Time (UT+4h)  she@DPX200
##.OBSERVE FREQUENCY= 81.013821
##.OBSERVE NUCLEUS= ^31P
##.ACQUISITION MODE= SIMULTANEOUS
##.ACQUISITION SCHEME= undefined
##.AVERAGES= 24
##.DIGITISER RES= 16
##SPECTROMETER/DATA SYSTEM= spect
##.PULSE SEQUENCE= zgpg30
##.SOLVENT NAME= CDCl3
##.SHIFT REFERENCE= (INTERNAL, CDCl3, 0, 248.564)
##AUDIT TRAIL= $$ (NUMBER, WHEN, WHO, WHERE, WHAT)
$$ ##TITLE= Audit trail, XWIN-NMR		Version 3.5
$$ ##JCAMPDX= 5.01
$$ ##ORIGIN= Bruker BioSpin GmbH
$$ ##OWNER= she
$$ F:/spectra/data/she/nmr/P31/1/pdata/1/auditp.txt
$$ ##AUDIT TRAIL=  $$ (NUMBER, WHEN, WHO, WHERE, WHAT)
(   1,<2024-04-03 14:25:25.96 +0400>,<she>,<DPX200>,
      <created by zg, POWCHK disabled, PULCHK disabled
       configuration hash MD5:
       00 E9 B6 7A A2 85 ED C7 34 08 36 98 17 FE 4E 26
       data hash MD5: 32K
       0D 5B FA A1 6B 05 83 E7 6D 9D 1C 4D 70 F6 18 B1>)
(   2,<2024-04-03 14:25:28.39 +0400>,<she>,<DPX200>,
      <Start of raw data processing
       efp BC_mod = 2 LB = 10 FT_mod = 6 PKNL = 1 PHC0 = -13223.5 PHC1 = 90.88333 SI = 64K 
       data hash MD5: 64K
       7E 1C 9D 28 B7 35 97 BA 5A CC 3F 07 E0 9D AC 3D>)
(   3,<2024-04-03 14:25:48.68 +0400>,<she>,<DPX200>,
      <pk PHC0 = 4.644561 PHC1 = -25.8 
       data hash MD5: 64K
       C3 A0 AC 34 A2 B4 3A FC 82 53 E9 FC 99 B4 8E 53>)
$$ ##END=
$$ 
$$ hash MD5
$$ D5 7E 85 22 C1 F1 D5 84 2E DC 20 C0 46 C7 6F 96
##$RELAX= 
##$RELAX= 
##$RELAX= 
##$RELAX= 
##$RELAX= 
##$RELAX= 
##$RELAX= 
##$RELAX= 
##$RELAX= 
$$ Bruker specific parameters
$$ --------------------------
##$DU= <F:/spectra>
##$EXPNO= 1
##$NAME= <P31>
##$PROCNO= 1
##$TYPE= <nmr>
##$USER= <she>
##$AMP= (0..31)
100 100 100 100 100 100 100 100 100 100 100 100 100 100 100 100 100 100 
100 100 100 100 100 100 100 100 100 100 100 100 100 100 
##$AQSEQ= 0
##$AQ_mod= 1
##$AUNM= <au_zg>
##$AUTOPOS= <>
##$BF1= 81.014009
##$BF2= 200.13
##$BF3= 200.13
##$BF4= 200.13
##$BF5= 200.13
##$BF6= 200.13
##$BF7= 200.13
##$BF8= 200.13
##$BYTORDA= 1
##$CFDGTYP= 0
##$CFRGTYP= 5
##$CHEMSTR= <none>
##$CNST= (0..31)
1 1 145 1 1 1 1 1 1 1 1 1 1 1 1 1 1 1 1 1 1 1 1 1 1 1 1 1 1 1 1 1 
##$CPDPRG= <waltz16>
##$CPDPRG1= <>
##$CPDPRG2= <waltz16>
##$CPDPRG3= <>
##$CPDPRG4= <mlev>
##$CPDPRG5= <mlev>
##$CPDPRG6= <mlev>
##$CPDPRG7= <mlev>
##$CPDPRG8= <mlev>
##$CPDPRGB= <>
##$CPDPRGT= <>
##$D= (0..31)
0 1 0 0 0 0 0 0 0 0 0 0.03 2e-05 3e-06 0 0 0 0 0 0 0 0 0 0 0 0 0 0 0 0 
0 0 
##$DATE= 1712139925
##$DBL= (0..7)
120 120 120 11 120 120 24 19 
##$DBP= (0..7)
150 150 150 150 150 150 150 150 
##$DBP07= 0
##$DBPNAM0= <>
##$DBPNAM1= <>
##$DBPNAM2= <>
##$DBPNAM3= <>
##$DBPNAM4= <>
##$DBPNAM5= <>
##$DBPNAM6= <>
##$DBPNAM7= <>
##$DBPOAL= (0..7)
0.5 0.5 0.5 0.5 0.5 0.5 0.5 0.5 
##$DBPOFFS= (0..7)
$$ [...]
##$SUBNAM2= <"">
##$SUBNAM3= <"">
##$SUBNAM4= <"">
##$SUBNAM5= <"">
##$SUBNAM6= <"">
##$SUBNAM7= <"">
##$SUBNAM8= <"">
##$SUBNAM9= <"">
##$SW= 501.771253377433
##$SWIBOX= (0..15)
0 1 3 0 0 0 0 0 0 0 0 0 0 0 0 0 
##$SW_h= 40650.406504065
##$TD= 32768
##$TD0= 1
##$TE= 0
##$TE2= 300
##$TE3= 300
##$TEG= 300
##$TL= (0..7)
0 120 53 12 22 120 120 120 
##$TP= (0..7)
150 150 150 150 150 150 150 150 
##$TP07= 0
##$TPNAME0= <>
##$TPNAME1= <>
##$TPNAME2= <>
##$TPNAME3= <>
##$TPNAME4= <>
##$TPNAME5= <>
##$TPNAME6= <>
##$TPNAME7= <>
##$TPOAL= (0..7)
0.5 0.5 0.5 0.5 0.5 0.5 0.5 0.5 
##$TPOFFS= (0..7)
0 0 0 0 0 0 0 0 
##$TUNHIN= 0
##$TUNHOUT= 0
##$TUNXOUT= 0
##$USERA1= <user>
##$USERA2= <user>
##$USERA3= <user>
##$USERA4= <user>
##$USERA5= <user>
##$V9= 5
##$VALIST= <valist>
##$VCLIST= <CCCCCCCCCCCCCCC>
##$VD= 0
##$VDLIST= <DDDDDDDDDDDDDDD>
##$VPLIST= <PPPPPPPPPPPPPPP>
##$VTLIST= <TTTTTTTTTTTTTTT>
##$WBST= 1024
##$WBSW= 4
##$XGAIN= (0..3)
0 0 0 0 
##$XL= 0
##$YL= 0
##$YMAX_a= 2157
##$YMIN_a= -2341
##$ZGOPTNS= <>
##$ZL1= 120
##$ZL2= 120
##$ZL3= 120
##$ZL4= 120
##$ABSF1= 0
##$ABSF2= 0
##$ABSG= 0
##$ABSL= 0
##$ALPHA= 0
##$AQORDER= 0
##$ASSFAC= 0
##$ASSFACI= 0
##$ASSFACX= 0
##$ASSWID= 0
##$AUNMP= <proc_1d>
##$AZFE= 0.1
##$AZFW= 0.5
##$BCFW= 0
##$BC_mod= 2
##$BYTORDP= 0
##$COROFFS= 0
##$CY= -3
##$DATMOD= 1
##$DC= 0
##$DFILT= <>
##$DTYPP= 0
##$F1P= 0
##$F2P= 0
##$FCOR= 1
##$FTSIZE= 65536
##$FT_mod= 6
##$GAMMA= 0
##$GB= 0
##$INTBC= 1
##$INTSCL= 6.047779e-11
##$ISEN= 30
##$LB= 10
##$LEV0= 0
##$LPBIN= 0
##$MAXI= 10000
##$MC2= 0
##$MEAN= 0
##$ME_mod= 0
##$MI= 50
##$NCOEF= 0
##$NC_proc= -10
##$NLEV= 6
##$NOISF1= 182.463
##$NOISF2= 159.3651
##$NSP= 0
##$NTH_PI= 0
##$NZP= 0
##$OFFSET= 248.5645
##$PC= 4
##$PHC0= -13218.86
##$PHC1= 65.08333
##$PH_mod= 1
##$PKNL= yes
##$PPARMOD= 0
##$PSCAL= 0
##$PSIGN= 0
##$REVERSE= no
##$SF= 81.0140089999694
##$SI= 65536
##$SIGF1= 159.3651
##$SIGF2= -187.1042
##$SINO= 113.3802
##$SIOLD= 16384
##$SREGLST= <1H.CDCl3>
##$SSB= 0
##$STSI= 65536
##$STSR= 0
##$SW_p= 40650.406504065
##$SYMM= 0
##$S_DEV= 0
##$TDeff= 32768
##$TDoff= 0
##$TI= <>
##$TILT= no
##$TM1= 0
##$TM2= 0
##$TOPLEV= 0
##$USERP1= <user>
##$USERP2= <user>
##$USERP3= <user>
##$USERP4= <user>
##$USERP5= <user>
##$WDW= 1
##$XDIM= 65536
##$YMAX_p= 397713781
##$YMIN_p= -86220391
$$ End of Bruker specific parameters
$$ ---------------------------------
##NTUPLES= NMR SPECTRUM
##VAR_NAME=  FREQUENCY,     SPECTRUM/REAL,   SPECTRUM/IMAG
##SYMBOL=    X,             R,               I
##VAR_TYPE=  INDEPENDENT,   DEPENDENT,       DEPENDENT
##VAR_FORM=  AFFN,          ASDF,            ASDF
##VAR_DIM=   65536,         65536,           65536
##UNITS=     HZ,            ARBITRARY UNITS, ARBITRARY UNITS
##FACTOR=    0.620285442955139, 1,           1
##FIRST=     20137.2065510682, 0,            0
##LAST=      -20513.1999529968, 0,           0
##MIN=       -20513.1999529968, -86220391,   0
##MAX=       20137.2065510682, 397713781,    0
$$ Real data points
##PAGE= N=1
##DATA TABLE= (X++(R..R)), XYDATA
$$ [...]
42934c076317k13407k04354j06095O0699K66942M81690O77178Q32094R31841R65483
$$ -3076317 -3289724 -3494078 -3600173 -3539474 -3272532 -2790842 -2113664 -1281570 -349729 615754
42924F15754R22834P97727N98436L57256J28245k9476p4305K041J73094L90241
$$ 615754 1538588 2336315 2934751 3292007 3420252 3390776 3316471 3318512 3491606 3881847
42914C881847O02703P75178Q95148R68591J009721J031683J041507J039477J022190
$$ 3881847 4484550 5259728 6154876 7123467 8133188 9164871 10206378 11245855 12268045
42905A2268045R87811R40098Q87770Q39213P96183P51040O89652N98727M73328
$$ 12268045 13255856 14195954 15083724 15922937 16719120 17470160 18159812 18758539 19231867
42896A9231867L19709J51892j4319j64310k83193l54450l64264l11385k15446
$$ 19231867 19551576 19703468 19689149 19524839 19241646 18887196 18522932 18211547 17996101
42887A7996101j15493n6885p3214j73455l41141n44808p53007r45294j114110
$$ 17996101 17880608 17823723 17750509 17577054 17235913 16691105 15938098 14992804 13878694
42878A3878694j258895j378818j469336j522310j526830j470838j346351j157433
$$ 13878694 12619799 11240981 9771645 8249335 6722505 5251667 3905316 2747883
42870B747883r24206o76704m40884k26634k6680J72681L76773N74319P41548Q54592
$$ 2747883 1823677 1146973 706089 479455 452775 625456 1002229 1576548 2318096 3172688
42860C172688R00018Q76683P91076O52881M74446K72614O9794j07835k35523k96662
$$ 3172688 4072706 4949389 5740465 6393346 6867792 7140406 7210200 7102365 6866842 6570180
42850F570180k86764k11844q3340Q5090K76570M68615O33835P45424P85659P52689
$$ 6570180 6283416 6071572 5988232 6073322 6349892 6818507 7452342 8197766 8983425 9736114
42840I736114O60462N30369L80046K17872M6606j28836k97042m42351n51039o16743
$$ 9736114 10396576 10926945 11306991 11524863 11571469 11442633 11145591 10703240 10152201 9535458
42830I535458o41970o35228o06093n61464n04993m39183l68361l00457k46029
$$ 9535458 8893488 8258260 7652167 7090703 6585710 6146527 5778166 5477709 5231680
42821E231680k15080k14503k48082l16663m15003n27419o29305o97300p20649
$$ 5231680 5016600 4802097 4554015 4237352 3822349 3294930 2665625 1968325 1247676
42812A247676p03286o55137n81442m79861l47093j88648k3423J20998K19567K60141
$$ 1247676 544390 -110747 -692189 -1172050 -1519143 -1707791 -1731214 -1610216 -1390649 -1130508
42802a130508K46756J95196J24925N2464j1009n8403q5390r2508q9339r4550j27486
$$ -1130508 -883752 -688556 -563631 -511167 -522176 -580579 -665969 -758477 -847816 -942366 -1069852
42791a069852j95189k84317l64331m00883l72772k84058j64236n5281O899N268
$$ -1069852 -1265041 -1549358 -1913689 -2314572 -2687344 -2971402 -3135638 -3190919 -3184020 -3178752
42781c178752n6396j58763k73858l72225m30445m35885l85513k81034j26423O9908
$$ -3178752 -3235148 -3393911 -3667769 -4039994 -4470439 -4906324 -5291837 -5572871 -5699294 -5629386
42771e629386K92260N18394P23344Q83223R78243R96532R38454Q17831O56574
$$ -5629386 -5337126 -4818732 -4095388 -3212165 -2233922 -1237390 -298936 518895 1175469
42762A175469M74511K81517P8754j31681l37424n15755o43034p05556p03995o51016
$$ 1175469 1649980 1931497 2010251 1878570 1541146 1025391 382357 -323199 -1027194 -1678210
42752a678210n66548m73432l93175l42007l29233l57928m24865n18161o16425
$$ -1678210 -2244758 -2718190 -3111365 -3453372 -3782605 -4140533 -4565398 -5083559 -5699984
42743e699984o94681p35776p38861p17596o89089o61755o29847n76730m83055
$$ -5699984 -6394665 -7130441 -7869302 -8586898 -9275987 -9937742 -10567589 -11144319 -11627374
42734a1627374l34292j24568J41846M48610P65500J050593J259043J355620J325239
$$ -11627374 -11961666 -12086234 -11944388 -11495778 -10730278 -9679685 -8420642 -7065022 -5739783
42725e739783J177727R45901O77179M20346K12538P2909M647N42M6742J24691
$$ -5739783 -4562056 -3616155 -2938976 -2518630 -2306092 -2233183 -2228536 -2227994 -2181252 -2056561
42715b056561K14881L02866L83322M58222N30783O00681O64333P18722P64597
$$ -2056561 -1841680 -1538814 -1155492 -697270 -166487 434194 1098527 1817249 2581846
42706B581846Q06152Q48138Q92725R37508R75064R94306R83856R35481Q44834
$$ 2581846 3387998 4236136 5128861 6066369 7041433 8035739 9019595 9955076 10799910
42697A0799910P09266N26750K99484L9984k27280m72696o72451q15129q99535
$$ 10799910 11509176 12035926 12335410 12375394 12148114 11675418 11002967 10187838 9288303
42688I288303r27330q97699q08333o61369m69472k57253n5969J06294K13435K63747
$$ 9288303 8360973 7463274 6654941 5993572 5524100 5266847 5210878 5317172 5530607 5794354
42678E794354K65122K27469J57942O0847n9955j99084l48958m99776o39648p55056
$$ 5794354 6059476 6286945 6444887 6505734 6445779 6246695 5897737 5397961 4758313 4003257
42668D003257q32099q59143q30991p53146o43048n25794m25180l54366l11069
$$ 4003257 3171158 2312015 1481024 727878 84830 -440964 -866144 -1220510 -1531579
42659a531579k79844k40547j78822r2870P599J09578K06497L02962M11672N44588
$$ -1531579 -1811423 -2051970 -2230792 -2323662 -2316063 -2206485 -1999988 -1697026 -1285354 -740766
42649g40766P03600Q75959J037643J163171J235881J252098J217541J140516J027621
$$ -740766 -37166 838793 1876436 3039607 4275488 5527586 6745127 7885643 8913264
42640H913264Q83667P13654N24482L25976J31287m3863j83346k73781l08326k90925
$$ 8913264 9796931 10510585 11035067 11361043 11492330 11448467 11265121 10991340 10683014 10392089
42630A0392089k39404j84146j60308j95851l01236m65901o62636q56962j017184
$$ 10392089 10152685 9968539 9808231 9612380 9311144 8845243 8182607 7325645 6308461
42621F308461j121432j159959j133107j047226r11454p36944n37420l28544j25336
$$ 6308461 5187029 4027070 2893963 1846737 935283 198339 -339081 -667625 -792961
42612g92961N9726K15581L30296L92412L97105L52033K76756J95683J30625R7984
$$ -792961 -733235 -517654 -187358 205054 602159 954192 1230948 1426631 1557256 1655240
42602A655240J09874J74464K92297M50364O19539P60415Q37113Q32052P52793
$$ 1655240 1765114 1939578 2231875 2682239 3301778 4062193 4899306 5731358 6484151
42593F484151O26587M86074L54760K40754J41682N5882r975m3801l9066l651M2158
$$ 6484151 7110738 7596812 7951572 8192326 8334008 8389890 8379915 8336114 8297048 8293397 8335555
42582H335555P7960R6406J07062J28185J72946K40463L17051L84680M29191M43425
$$ 8335555 8413515 8509921 8616983 8745168 8918114 9158577 9475628 9860308 10289499 10732924
42572A0732924M25319L73983K87268J63744Q857j59768l14203m26015m77546m67497
$$ 10732924 11158243 11532226 11819494 11983238 11992095 11832327 11518124 11092109 10614563 10147066
42562A0147066m09091l23882k34476j58431j05144p6282o7469o8687o4442l7375
$$ 10147066 9737975 9414093 9179617 9021186 8916042 8839760 8772291 8703604 8639162 8601787
42552H601787K3589J15129K17747L02773L44843L33522K78711K07899J56833J57242
$$ 8601787 8625376 8740505 8958252 9261025 9605868 9939390 10218101 10426000 10582833 10740075
42542A0740075K25630L56729N23750O85197P95637Q17683P33349N52225L12145
$$ 10740075 10965705 11322434 11846184 12531381 13327018 14144701 14878050 15430275 15742420
42533A5742420O9236j19742k14494k00343q7763R4954L12550N34037P40150R23590
$$ 15742420 15811656 15691914 15477420 15277077 15189314 15284268 15596818 16130855 16871005 17794595
42523A7794595J082853J215130J313445J368011J367908J300797J153080R14323
$$ 17794595 18877448 20092578 21406023 22774034 24141942 25442739 26595819 27510142
42515B7510142N85792J88017k38340o40270r66387j182241j281166j285279j234584
$$ 27510142 28095934 28283951 28045611 27405341 26438954 25256713 23975547 22690268 21455684
42506B1455684j168640j110662j062859j013942r51655q71823p80798o93344o28382
$$ 21455684 20287044 19176382 18113523 17099581 16147926 15276103 14495305 13801961 13173579
42497A3173579o02461o21777o77263p47568q08672q43237q44096q12224p52211
$$ 13173579 12571118 11949341 11272078 10524510 9715838 8872601 8028505 7216281 6464070
42488F464070o67127n54810m09596k30690l0468J66867L36662M64282N45217N78168
$$ 6464070 5796943 5242133 4832537 4601847 4571379 4738246 5074908 5539190 6084407 6662575
42478F662575N62055N00534M06246K96817J85150P3939m0392j58414k70926l58678
$$ 6662575 7224630 7725164 8131410 8428227 8613377 8687316 8646924 8488510 8217584 7858906
42468G858906l97775l68140k61811q7190J33337L70353N93489P73506Q83059R00502
$$ 7858906 7461131 7092991 6831180 6743990 6877327 7247680 7841169 8614675 9497734 10398236
42458A0398236Q16285O36800L82445Q2397k29708n19332p57227r28169j035968
$$ 10398236 11214521 11851321 12233766 12316163 12086455 11567123 10809896 9881727 8845759
42449H845759j098711j136451j160827j173725j173221j159780j138377j116862
$$ 8845759 7747048 6610597 5449770 4276045 3102824 1943044 804667 -312195
42441c12195j101662j091992j076395j037035r60985q48957p12540n62958m03705
$$ -312195 -1413857 -2505849 -3582244 -4619279 -5580264 -6429221 -7141761 -7704719 -8108424
42432h108424k34183n8902J08307K48934L48702M04292M24116M22717M11884L94514
$$ -8108424 -8342607 -8401509 -8293202 -8044268 -7695566 -7291274 -6867158 -6444441 -6032557 -5638043
42422e638043L66114L22550K66831K09348J62412J34501J28219J41772J71293
$$ -5638043 -5271929 -4949379 -4682548 -4473200 -4310788 -4176287 -4048068 -3906296 -3735003
42413c735003K11700K55855K93685L13171L03441K58100J76783O4741o8362k09710
$$ -3735003 -3523303 -3267448 -2973763 -2660592 -2357151 -2099051 -1922268 -1857527 -1925889 -2135599
42403b135599l44855m59716n42624n86180n88694n54324m90770m05567l04449
$$ -2135599 -2480454 -2940170 -3482794 -4068974 -4657668 -5211992 -5702762 -6108329 -6412778
42394f412778j93815q4123J1393Q3856J36161J83925K48551L46336M78934O29593
$$ -6412778 -6606593 -6690716 -6679323 -6595467 -6459306 -6275381 -6026830 -5680494 -5201560 -4571967
42384d571967P68170Q63926Q99110Q73862P98896O82361N22050L09614M3915k56542
$$ -4571967 -3803797 -2939871 -2040761 -1166899 -368003 314358 836408 1146022 1189937 933395
42374I33395n52258p94809r44729r83676r15433p59478n43929l00483n9874J52704
$$ 933395 381137 -413672 -1358401 -2342077 -3257510 -4016988 -4560917 -4861400 -4921274 -4768570
42364d768570L20268M33574M89352M89956M44824L71314K92251K30157K00922
$$ -4768570 -4448302 -4014728 -3525376 -3035420 -2590596 -2219282 -1927031 -1696874 -1495952
42355a495952K10048K52289L13600L74879M17704M30374M10115L59869K83736
$$ -1495952 -1285904 -1033615 -720015 -345136 72568 502942 913057 1272926 1556662
42346A556662J86825P8952k4805j10980j76644k30364k82237l32012l67852l78800
$$ 1556662 1743487 1822439 1797634 1686654 1510010 1279646 997409 665397 297545 -81255
42336h1255l70124l66292l96636m73861n82026o82703p34579p13974o25436m98371
$$ -81255 -451379 -817671 -1214307 -1688168 -2270194 -2952897 -3687476 -4401450 -5026886 -5525257
42326e525257l72688k81290k38011k35758k53370k65603k50965j95591r4395M8190
$$ -5525257 -5897945 -6179235 -6417246 -6653004 -6906374 -7171977 -7422942 -7618533 -7712928 -7664738
42316g664738K17490L90153N40539O50774P18245P54216P73432P82059P72820
$$ -7664738 -7447248 -7057095 -6516556 -5865782 -5147537 -4393321 -3619889 -2837830 -2065010
42307b065010P30334O41869N05652L32452J41799m3044j99114l07600l58463l54301
$$ -2065010 -1334676 -692807 -187155 145297 287096 244052 44938 -262662 -621125 -975426
42297i75426l10063k46608j80449j15345m1248N8425J95926L71920N75909P92054
$$ -975426 -1285489 -1532097 -1712546 -1827891 -1869139 -1810714 -1614788 -1242868 -666959 125095
42287A25095J004196J195908J347347J434761J437073J347528J182882R82523
$$ 125095 1129291 2325199 3672546 5107307 6544380 7891908 9074790 10057313
42279A0057313P96008O64784O07257O13607O50725O73295O36690N09651K85488
$$ 10057313 10853321 11518105 12125362 12738969 13389694 14062989 14699679 15209330 15494818
42270A5494818j1559l29875o05774p85062q40470p77201o26397m32043k37396
$$ 15494818 15483259 15153384 14547610 13762548 12922078 12144877 11518480 11086437 10849041
42261A0849041p4916L8472J00835J21322J15000R6695P3566L9300k4499j37463
$$ 10849041 10774125 10812597 10913432 11034754 11149754 11246449 11320015 11359315 11334816 11197353
42251A1197353l06332n18310p46890r64610j151909j296486j386584j406558j340204
$$ 11197353 10891021 10372711 9625821 8661211 7509302 6212816 4826232 3419674 2079470
42242B079470j180199r36350o35796l14681p751K57309M59809N85320O28657N99105
$$ 2079470 899271 -37079 -672875 -987556 -995307 -737998 -278189 307131 935788 1534893
42232A534893N22029M32387L61835L26837L25657L45968L76329M11857M50183
$$ 1534893 2056922 2489309 2851144 3177981 3503638 3849606 4225935 4637792 5087975
42223E087975M82715M89787M44649L24867J25536j32963m08132o49112q13827
$$ 5087975 5570690 6060477 6505126 6829993 6955529 6822566 6414434 5765322 4951495
42214D951495q80263q48214p34459n66174l73995j84165j0851J47096L01369M62833
$$ 4951495 4071232 3223018 2488559 1922385 1548390 1364225 1353374 1500470 1801839 2264672
42204B264672O30744P90108R18143R93414J000947R33363P92552N93133L63209
$$ 2264672 2895416 3685524 4603667 5597081 6598028 7531391 8323943 8917076 9280285
42195I280285J38316m9194j79331k48210k66380k53531k31578k18790k27164k62706
$$ 9280285 9418601 9369407 9190076 8941866 8675486 8421955 8190377 7971587 7744423 7481717
42185G481717l25741m09527m98898n72716o11548o06733n64257n00344m32896
$$ 7481717 7155976 6746449 6247551 5674835 5063287 4456554 3892297 3391953 2959057
42176B959057l76113l40396l32592l52007l85393m08549l96505l35213k26160
$$ 2959057 2582944 2242548 1909956 1557949 1172556 764007 367502 32289 -193871
42167a93871q2485P7637K34490L66886M53063M75881M30283L26740J86701L3434
$$ -193871 -276356 -198719 35771 402657 855720 1331601 1761884 2088624 2275325 2308759
42157B308759j14189k41643l36123l86490l85964l33902k34711r5291P6843K73340
$$ 2308759 2194570 1952927 1616804 1230314 844350 510448 275737 180446 257289 530629
42147E30629M82219O83710Q49117R47041R55777Q74406P24997N44461L70414K27443
$$ 530629 1012848 1696558 2545675 3492716 4448493 5322899 6047896 6592357 6962771 7190214
42137G190214J19727L3709n0588j46776k55654l67065m66142n40036n84102o06317
$$ 7190214 7309941 7343650 7293062 7146286 6890632 6523567 6057425 5517389 4933287 4326970
42127D326970o26091o64989p33519q23499r12597r77846j007318j000730r60229
$$ 4326970 3700879 3035890 2302371 1478872 566275 -411571 -1418889 -2419619 -3379848
42118c379848q81985p58351n89060l89798j88847j4533J15152J93182K17284J85674
$$ -3379848 -4261833 -5020184 -5609244 -5999042 -6187889 -6202422 -6087270 -5894088 -5676804 -5491130
42108e491130R9907k8249j73924l05812l99261m45825m50872m21466l55587k42258
$$ -5491130 -5391223 -5419472 -5593396 -5899208 -6298469 -6744294 -7195166 -7616632 -7972219 -8214477
42098h214477p2015J51189M05469O56980Q72969J034475J140881J203556J233641
$$ -8214477 -8286492 -8135303 -7729834 -7072854 -6199885 -5165410 -4024529 -2820973 -1587332
42089a587332J232821J192253J097646R35935P01200L99444N0587l14941o64784
$$ -1587332 -354511 837742 1935388 2871323 3572523 3971967 4022554 3707613 3042829
42080C042829r73658j227085j418070j540105j582482j532647j385495j153821
$$ 3042829 2069171 842086 -575984 -2116089 -3698571 -5231218 -6616713 -7770534
42072g770534q71325n83557l30773j32934J4575J33668K50239L81677N29241O76775
$$ -7770534 -8641859 -9225416 -9556189 -9689123 -9674548 -9540880 -9290641 -8908964 -8379723 -7702948
42062g702948P95705Q55332Q35763P38451N88499M25617K87284J93090J38807
$$ -7702948 -6907243 -6051911 -5216148 -4477697 -3889198 -3463581 -3176297 -2983207 -2844400
42053b844400J02299N7245j1795r9127j77825k11909j75587o7746Q8373K59692
$$ -2844400 -2742101 -2684856 -2696651 -2795778 -2973603 -3185512 -3361099 -3428845 -3340472 -3080780
42043c080780M20984N63671O91820Q10413R14211R83048R85550Q90206O80226
$$ -3080780 -2659796 -2096125 -1404305 -593892 320319 1303367 2288917 3179123 3859349
42034C859349L65930j2189l92787p11649r19911r95172r42709p88196n65492l04299
$$ 3859349 4225279 4213090 3820303 3108654 2188743 1193571 250862 -537334 -1102826 -1407125
42024a407125k3009K70012N68334Q58312J115213J307521J407665J403714J305353
$$ -1407125 -1430134 -1160122 -591788 266524 1381737 2689258 4096923 5500637 6805990
42015F805990J139960R40381P31495N23337L13719R6819j28515l54914n67315
$$ 6805990 7945950 8886331 9617826 10141163 10454882 10551701 10423186 10068272 9500957
42006I500957p46188q70750r21593q84289p55628n50465l03078n8478J42877K77349
$$ 9500957 8754769 7884019 6962426 6078137 5322509 4772044 4468966 4410488 4553365 4830714
41996D830714L41091L45887L13027K66196K22384J84678J44026R0647K5730l6841
$$ 4830714 5171805 5517692 5830719 6096915 6319299 6503977 6648003 6738650 6764380 6727539
41986F727539p9266r1065p4661m2998j1984P107J0305k598l3490q7176j66836
$$ 6727539 6648273 6557208 6482547 6439549 6427565 6434672 6444977 6442379 6408889 6321713 6154877
41975F154877k67739l74262m62075n04611m82068l90182k44574p7023P6028J87065
$$ 6154877 5887138 5512876 5050801 4546190 4064122 3673940 3429366 3352343 3428371 3615436
41965C615436K45698K57338K35258J93143J42809R5693O3511N5793P6037J19273
$$ 3615436 3861134 4118472 4353730 4546873 4689682 4785375 4848886 4904679 4980716 5099989
41955E099989J72451K17840K38876K26544J83093J20833N6478M504k6302l1076
$$ 5099989 5272440 5490280 5729156 5955700 6138793 6259626 6316104 6320608 6294306 6263230
41945F263230m478O0600J67741L08575M59201N86232O59300O62170N96516M77848
$$ 6263230 6258752 6319352 6487093 6795668 7254869 7841101 8500401 9162571 9759087 10236935
41935A0236935L26992J61654q313j80647l56993n38832p24993r10278j084053
$$ 10236935 10563927 10725581 10717268 10536621 10179628 9640796 8915803 8005525 6921472
41926F921472j229644j327146j360387j323955j224672j076454q93527o87062
$$ 6921472 5691828 4364682 3004295 1680340 455668 -620786 -1514313 -2201375
41918b201375m65234k33636M291K44374M76020O77807Q19146Q69056Q08963O43671
$$ -2201375 -2666609 -2900245 -2895954 -2651580 -2175560 -1497753 -678607 190449 999412 1643083
41908A643083M04473J41167r4071k62901l49710l60715l15137k32644j22606J9068
$$ 1643083 2047556 2188723 2094652 1831751 1482041 1121326 806189 573545 450939 470007
41898D70007K03894M40231P25165J042056J361920J646207J851144J935439J871229
$$ 470007 673901 1114132 1839297 2881353 4243273 5889480 7740624 9676063 11547292
41889A1547292J655038J313519Q99923M80979J18293j48855l12683l93981m28462
$$ 11547292 13202330 14515849 15415772 15896751 16015044 15866189 15553506 15159525 14731063
41880A4731063m49746m78514n22163n80871o52652p34237q19962r01573r69199
$$ 14731063 14281317 13802803 13280640 12699769 12047117 11312880 10492918 9591345 8622146
41871H622146j012508j021739r88506r06224p70845n83045l50953q9995J81610
$$ 8622146 7609638 6587899 5599393 4693169 3922324 3339279 2988326 2898331 3079941
41862C079941M48089O96704R13330J078704J170629J171392J074839Q88886O33291
$$ 3079941 3528030 4224734 5138064 6216768 7387397 8558789 9633628 10522514 11155805
41853A1155805L35248K5099k66870n13313o93671p98697q32420q08524p42594
$$ 11155805 11491053 11516152 11249282 10735969 10042298 9243601 8411181 7602657 6860063
41844F860063o46018n25413l85822k34082q1872N0700J34142J36923M0670j46531
$$ 6860063 6214045 5688632 5302810 5068728 4986856 5037556 5171698 5308621 5349291 5202760
41834E202760l89437o38542q47629r86154j042883j023020r42877q24931o93938
$$ 5202760 4813323 4174781 3327152 2340998 1298115 275095 -667782 -1492713 -2186651
41825b186651n73291m80436m22408l94211l82475l73613l62224l54151l61518
$$ -2186651 -2759942 -3240378 -3662786 -4056997 -4439472 -4813085 -5175309 -5529460 -5890978
41816e890978l92807m45052n03576n48564n63159n38309m73236l73344k47747
$$ -5890978 -6283785 -6728837 -7232413 -7780977 -8344136 -8882445 -9355681 -9729025 -9976772
41807i976772j07462L6265J74309L02026M19291N27173O23670P02588P56628P81910
$$ -9976772 -10084234 -10047969 -9873660 -9571634 -9152343 -8625170 -8001500 -7298912 -6542284 -5760374
41797e760374P80635P60995P34769P12859O99893O91631O78999O57474O34654
$$ -5760374 -4979739 -4218744 -3483975 -2771116 -2071223 -1379592 -700593 -43119 591535
41788E91535O28585O56405P20799Q03553Q70408Q84138Q18603O67219M43423J75210
$$ 591535 1220120 1876525 2597324 3400877 4271285 5155423 5974026 6641245 7084668 7259878
41778G259878j02433l54802n54175o85263p46971p48626p02526o17417m96157
$$ 7259878 7157445 6802643 6248468 5563205 4816234 4067608 3365082 2747665 2251508
41769B251508l37932j43614P8001L06761N13994O70747P56000P60296O85217N41984
$$ 2251508 1913576 1769962 1847963 2154724 2668718 3339465 4095465 4855761 5540978 6082962
41759F082962L50351J36527p1071k47944l80530m71290n37146n99106o68172p37681
$$ 6082962 6433313 6569840 6498769 6250825 5870295 5399005 4861859 4262753 3594581 2856900
41749B856900p87850p98782p62813o89169n99423n16330m51400l97331l29866
$$ 2856900 2069050 1270268 507455 -181714 -781137 -1297467 -1748867 -2146198 -2476064
41740b476064k18934m4161J92560M63353P21195R13972R99644R57543P93634N39278
$$ -2476064 -2694998 -2739159 -2546599 -2083246 -1362051 -448079 551565 1509108 2302742 2842020
41730B842020K43474m0008k66574m10431m66810m47763l74990k72325j58942m4449
$$ 2842020 3085494 3045486 2778912 2368481 1901671 1453908 1078918 806593 647651 603202
41720F03202P1772J96386L36393M96341O78206Q79328J087311J278010J422727
$$ 603202 674974 871360 1207753 1704094 2382300 3261628 4348939 5626949 7049676
41711G049676J500903J507135J446800J326311J148374R15818O39238L41433N5064
$$ 7049676 8550579 10057714 11504514 12830825 13979199 14895017 15534255 15875688 15930752
41702A5930752j85871l57085m52553m86758m89682m96403n35082o17797p37613
$$ 15930752 15744881 15387796 14935243 14448485 13958803 13462400 12927318 12309521 11571908
41693A1571908q71728r88072j053158j040737r40048p60315n28878k83805o3785
$$ 11571908 10700180 9712108 8658950 7618213 6678165 5917850 5388972 5105167 5041382
41684E041382J02527K05110K54380K72585K78402K75009K49953J85789P2790q4192
$$ 5041382 5143909 5349019 5603399 5875984 6154386 6429395 6679348 6865137 6937927 6853735
41674F853735k66699m48627o03835p13098p68443p72926p35877o66864n72523
$$ 6853735 6587036 6138409 5534574 4821476 4053033 3280107 2544230 1877366 1304843
41665A304843m57477l26825j87251m6117Q9987K15848L26898M17799M81620N10605
$$ 1304843 847366 520541 333290 287173 377160 593008 919906 1337705 1819325 2329930
41655B329930M98027M39601L34186J85501N310j84718l56251m82806n49238n56755
$$ 2329930 2827957 3267558 3601744 3787245 3792555 3607837 3251586 2768780 2219542 1662787
41645A662787n20661m62096l98738l40429k92118k59737k51359k70650l08501
$$ 1662787 1142126 680030 281292 -59137 -351255 -610992 -862351 -1133001 -1441502
41636a441502l42032l43941k95775j96171o0619Q3990K06332K78658K85995K33135
$$ -1441502 -1783534 -2127475 -2423250 -2619421 -2680040 -2596050 -2389718 -2111060 -1825065 -1591930
41626a591930J44227N3923n412j4306K8902J09569K03850K88283L47327L75963
$$ -1591930 -1447703 -1393780 -1399192 -1413498 -1384596 -1275027 -1071177 -782894 -435567 -59604
41616e9604L78174L63874L45585L35060L40258L62998L96753M25023M23307L67738
$$ -59604 318570 682444 1028029 1363089 1703347 2066345 2463098 2888121 3311428 3679166
41606C679166K48368P9234j03355k55977l48544l76754l58593l19589k79811k50909
$$ 3679166 3927534 4006768 3903413 3647436 3298892 2922138 2563545 2243956 1964145 1713236
41596A713236k39793k50748k84031l35586m00448m75920n59805o44818p14718
$$ 1713236 1473443 1222695 938664 603078 202630 -273290 -833095 -1477913 -2192631
41587b192631p46335p17031o13673m38730k11055L8457K74347M65174N91042O47793
$$ -2192631 -2938966 -3655997 -4269670 -4708400 -4919455 -4880998 -4606651 -4141477 -3550435 -2902642
41577b902642O46478O08836N60473N22440N02741M92139M68927M11731L12457
$$ -2902642 -2256164 -1647328 -1086855 -564415 -61674 430465 899392 1311123 1623580
41568A623580J80942L9205q9907j92413k66200l16976l51453l72732l79721l69189
$$ 1623580 1804522 1843727 1753820 1561407 1295207 978231 626778 254046 -125675 -494864
41558d94864l39376k94929k50275k25999k37096k81119l37389l79429l90936l73038
$$ -494864 -834240 -1129169 -1379444 -1605443 -1842539 -2123658 -2461047 -2840476 -3231412 -3604450
41548c604450l39461l05978k81885k65994k45919k00714j08761M0301K36322M49121
$$ -3604450 -3943911 -4249889 -4531774 -4797768 -5043687 -5244401 -5353162 -5312861 -5076539 -4627418
41538d627418O39165P71857Q27488Q02727P04654N42643L25356O5890k10381m65130
$$ -4627418 -3988253 -3216396 -2388908 -1586181 -881527 -338884 -13528 52362 -158019 -623149
41528f23149o57162p56701p54487o62083n05884l18138j27784M5737J93394L13439
$$ -623149 -1280311 -2037012 -2791499 -3453582 -3959466 -4277604 -4405388 -4359651 -4166257 -3852818
41518c852818M07737M79643N33178N72800O03454O30016O55722O81177P05771
$$ -3852818 -3445081 -2965438 -2432260 -1859460 -1256006 -625990 29732 710909 1416680
41509A416680P30522P59114P95786Q42526Q98303R60006J022285J074777J099212
$$ 1416680 2147202 2906316 3702102 4544628 5442931 6402937 7425222 8499999 9599211
41500I599211J071534R71416P94545N58550K97562N0034j51500k84828l39641
$$ 9599211 10670745 11642161 12436706 12995256 13292818 13342852 13191352 12906524 12566883
41491A2566883l19428k42282j37459l7558L0587N2997L1552j8282p4987j21402
$$ 12566883 12247455 12005173 11867714 11830156 11860743 11913740 11945292 11927010 11852023 11730621
41481A1730621j52735j76905k06170k45867k89273l22704l36094l30469l18504
$$ 11730621 11577886 11400981 11194811 10948944 10659671 10336967 10000873 9670404 9351900
41472I351900l20025l54902m33632n48206o70355p62732p98492p75788p15945
$$ 9351900 9031875 8676973 8243341 7695135 7024780 6262048 5463556 4687768 3971823
41463C971823o47200n87418n38544m93587m46189l93810l35215k68857j95174
$$ 3971823 3324623 2737205 2198661 1705074 1258885 865075 529860 261003 65829
41454F5829j19273m9767O513N0457R3179J51963K40220L58065M91345O19581P24446
$$ 65829 -53444 -103211 -96698 -46241 46938 198901 439121 797186 1288531 1908112 2632558
41443B632558P91473Q07483P61352O50186M85114K90903R9543n8334j60848j99418
$$ 2632558 3424031 4231514 4992866 5643052 6128166 6419069 6518612 6460278 6299430 6100012
41433F100012j79711j19372m3696J9980M8620K9102l8813j42625k59538l61409
$$ 6100012 5920301 5800929 5757233 5777213 5825833 5854935 5816122 5673497 5413959 5052550
41423E052550m23163m32998l98743l45412l04434l00554l42812m22933n20763
$$ 5052550 4629387 4196389 3797646 3452234 3147800 2847246 2504434 2081501 1560738
41414A560738o13797o86425p34684p64133p81637p85560p60983o84749n38572
$$ 1560738 946941 260516 -474168 -1238301 -2019938 -2805498 -3566481 -4251230 -4789802
41405d789802l22014n7248K15788M49232N97699O28778N33707L34577Q1775j60796
$$ -4789802 -5111816 -5169064 -4953276 -4504044 -3906345 -3277567 -2743860 -2409283 -2327508 -2488304
41395b488304l37062m16065l96708k99695j54022J2791J76879L16118M10579M47591
$$ -2488304 -2825366 -3241431 -3638139 -3937834 -4091856 -4079065 -3902186 -3586068 -3175489 -2727898
41385b727898M27775L66485K89096K22939J89909K01817K58694L49570M55282
$$ -2727898 -2300123 -1933638 -1644542 -1421603 -1231694 -1029877 -771183 -421613 33669
41376C3669N52790O20047O40053O02887N06044L54951J64307m2010k35330l90286
$$ 33669 586459 1206506 1846559 2449446 2955490 3310441 3474748 3432738 3197408 2807122
41366B807122m92178n39644n42498n16795m78730m38727l98195l50920k88441
$$ 2807122 2314944 1775300 1232802 716007 237277 -201450 -599645 -950565 -1239006
41357a239006k06147j07159k844Q9952J53546J73898J43653O4821m8170j68056
$$ -1239006 -1445153 -1552312 -1555156 -1465204 -1311658 -1137760 -994107 -929286 -977456 -1145512
41347a145512k61730l04347k91609k40160j75139j15309o7402l1469q315J96k069
$$ -1145512 -1407242 -1711589 -2003198 -2243358 -2418497 -2533806 -2601208 -2632677 -2640992 -2640796 -2642865
41336b642865k12K8087J00880K19762L64825N00230N88583O07298N57519M59863
$$ -2642865 -2643077 -2614990 -2514110 -2294348 -1929523 -1429293 -840710 -233412 324107 783970
41326G83970L40678K19403J04776j322r8755j86666k62725l22199l57172l57581
$$ 783970 1124648 1344051 1448827 1447505 1348750 1162084 899359 577160 219988 -137593
41316a37593l14468k24070r0926P0921K38493L82333M71635M82013M02989K40813
$$ -137593 -452061 -676131 -767057 -696136 -457643 -75310 396325 878338 1281327 1522140
41306A522140J4814k49506n26138p91365j024764j208891j327137j361482j294194
$$ 1522140 1536954 1287448 761310 -30055 -1054819 -2263710 -3590847 -4952329 -6246523
41297f246523j115330q31721m70400p3235L13775O50584R08987J074197J143398
$$ -6246523 -7361853 -8193574 -8663974 -8737209 -8423434 -7772850 -6863863 -5789666 -4646268
41288d646268J122645J023768Q62963O60675M40384K24652L0722j30413k51001
$$ -4646268 -3523623 -2499855 -1636892 -976217 -535833 -311181 -280459 -410872 -661873
41279f61873l23975l44897l16754k51778j67011p6095J7125J19044K39766L82214
$$ -661873 -985848 -1330745 -1647499 -1899277 -2066288 -2142383 -2125258 -2006214 -1766448 -1384234
41269a384234N33140O63135P37976P35361O56857N28292L88766K73693J99610
$$ -1384234 -851094 -187959 550017 1285378 1942235 2470527 2859293 3132986 3332596
41260C332596J58472J25466P5744j529j01022k09452l14741m09337m88783n49943
$$ 3332596 3491068 3616534 3692278 3690749 3589727 3380275 3065534 2656197 2167414 1617471
41250A617471n90385o07895o00282n66757n09998m36287l53030k65978j77748
$$ 1617471 1027086 419191 -181091 -747848 -1257846 -1694133 -2047163 -2313141 -2490889
41241b490889q6950J2124J26319K55777L86793M93927N52926N55276N12531M47350
$$ -2490889 -2577839 -2565715 -2439396 -2183619 -1796826 -1302899 -749973 -194697 317834 765184
41231G65184L79049L14402K48880J75454R3893J3975m9226q4309r0225p6342n7058
$$ 765184 1144233 1458635 1707515 1882969 1976862 1990837 1941611 1857302 1767077 1690735 1633677
41220A633677m5449m9507p1108j06119j44687j72162j71223j25279k2874J37446
$$ 1633677 1588228 1538721 1467613 1361494 1216807 1044645 873422 748143 725269 862715
41210H62715L43408N68683P77474R32885J005808R81065Q59677O58054M05353
$$ 862715 1206123 1774806 2552280 3485165 4490973 5472038 6331715 6989769 7395122
41201G395122J39513r7857k67322l37835k93369j39188R5205L60582O00874P69511
$$ 7395122 7534635 7436778 7169456 6831621 6538252 6399064 6494269 6854851 7455725 8225236
41191H225236Q41113Q13712P02960N33718L33744J31189m5844j71332k27439k12391
$$ 8225236 9066349 9880061 10583021 11116739 11450483 11581672 11535828 11364496 11137057 10924666
41181A0924666j43876n3787K2779N7385L3191n3712j94315l68711n51260p17538
$$ 10924666 10780790 10727003 10749782 10807167 10840358 10786646 10592331 10223620 9672360 8954822
41171H954822q49765r38842r83125r84696r44060q55631p07757m89487k01411
$$ 8954822 8105057 7166215 6183090 5198394 4254334 3398703 2690946 2201459 2000048
41162B000048J36684M88485Q14075J083859J282613J402296J434007J369605J211567
$$ 2000048 2136732 2625217 3439292 4523151 5805764 7208060 8642067 10011672 11223239
41153A1223239R79752P07298M29476J74508l9620k05120l24053m07110m69667
$$ 11223239 12202991 12910289 13339765 13514273 13474653 13269533 12945480 12538370 12068703
41144A2068703n25878n83820o44005p00985p45615p65888p46788o71849n28563
$$ 12068703 11542825 10959005 10315000 9614015 8868400 8102512 7355724 6683875 6155312
41135F155312l16039n0345K36188N01557P03458Q08323P98616O77616M69976K15878
$$ 6155312 5839273 5788928 6025116 6526673 7230131 8038454 8837070 9514686 9984662 10200540
41125A0200540m0838k65695m40379n59792o23537o30406n80711m82918l57041
$$ 10200540 10159702 9894007 9453628 8893836 8270299 7639893 7059182 6576264 6219223
41116F219223k31221j34450r0222j12388k02006l45643n17920o88888q32070r28400
$$ 6219223 5988002 5853552 5763330 5650942 5448936 5103293 4585373 3896485 3064415 2136015
41106B136015r66076r40831q58584p36777n99615m68466l54299k57468j73196
$$ 2136015 1169939 229108 -629476 -1366253 -1965868 -2434334 -2788633 -3046101 -3219297
41097c219297r6844k5425M2953J08387J66909K09589K25845K09814J65202J04171
$$ -3219297 -3316141 -3341566 -3298613 -3190226 -3023317 -2813728 -2587883 -2378069 -2212867 -2108696
41087b108696L9742k3711r5269j93427l35102n24375p47798r78405j184871j339904
$$ -2108696 -2068954 -2092665 -2187934 -2381361 -2716463 -3240838 -3988636 -4967041 -6151912 -7491816
41077g491816j423933j424533j335327j157717r04764o02452k84401J8028K83218
$$ -7491816 -8915749 -10340282 -11675609 -12833326 -13738090 -14340542 -14624943 -14606915 -14323697
41068a4323697M98778O54924P39383P40165O55218N01490L15605J44155K8741
$$ -14323697 -13824919 -13169995 -12430612 -11690447 -11035229 -10533739 -10218134 -10073979 -10045238
41059a0045238o441M0640J53299L05505M73320O43150Q12217R81292J145625J290572
$$ -10045238 -10051679 -10011039 -9857740 -9552235 -9078915 -8435765 -7623548 -6642256 -5496631 -4206059
41049d206059J393690J430949J384758J252320J050998Q15914N88506M01264K66909
$$ -4206059 -2812369 -1381420 3338 1255658 2306656 3122570 3711076 4112340 4379249
41040D379249J77376J12477N3307p146o2382j00406j15373j15134j20915j59959
$$ 4379249 4556625 4669102 4722409 4715263 4652881 4552475 4437102 4321968 4201053 4041094
41030D041094k54563m11901o19550q49628j069270j250931j376950j438006j429362
$$ 4041094 3786531 3374630 2755080 1905452 836182 -414749 -1791699 -3229705 -4659067
41021d659067j349117j199795r91021p39903m68273j99195M4781K42855L80119
$$ -4659067 -6008184 -7207979 -8199000 -8938903 -9407176 -9606371 -9561590 -9318735 -8938616
41012h938616M54456M80620M85905M98573N36624O03513O90885P83598Q63614
$$ -8938616 -8484160 -8003540 -7517635 -7019062 -6482438 -5878925 -5188040 -4404442 -3540828
41003c540828R13272R19226Q75739P85011O54993M97601L27979J62223J2395j17263
$$ -3540828 -2627556 -1708330 -832591 -47580 607413 1105014 1432993 1595216 1607611 1490348
40993A490348k28629l24266m04405m68556n17768n53949n77964n89655n88567
$$ 1490348 1261719 937453 533048 64492 -453276 -1007225 -1585189 -2174844 -2763411
40984b763411n72516n35258m67776l63801k24878o1051J11162K70027L89683M45043
$$ -2763411 -3335927 -3871185 -4338961 -4702762 -4927640 -4988691 -4877529 -4607502 -4217819 -3772776
40974c772776M21569L24808J82278L4470q0902j42818j52131j27484r6207q4506
$$ -3772776 -3351207 -3026399 -2844121 -2809651 -2890553 -3033371 -3185502 -3312986 -3409193 -3493699
40964c493699j08925j70863k57129l47223m22533m70405m81615m46839l58225
$$ -3493699 -3602624 -3773487 -4030616 -4377839 -4800372 -5270777 -5752392 -6199231 -6557456
40955f557456k15338k9606J77200L79556N55608O91358P79840Q17053P99872P30044
$$ -6557456 -6772794 -6802400 -6625200 -6245644 -5690036 -4998678 -4218838 -3401785 -2601913 -1871869
40945a871869O21907N05103M15771L79901M00425M56969N16957N49223N32596
$$ -1871869 -1249962 -744859 -329088 50813 451238 908207 1425164 1974387 2506983
40936B506983M58577L31914J71423R209j15411j67523j29076n862J74104L69927
$$ 2506983 2965560 3297474 3468897 3478106 3362695 3195172 3066096 3060234 3234338 3604265
40926C604265N41365O61721P24647P41947P34851P24793P27633P50275P87909
$$ 3604265 4145630 4807351 5531998 6273945 7008796 7733589 8461222 9211497 9999406
40917I999406Q23514Q32651P92471O89811N24665L10511P4492j43361k96654l47248
$$ 9999406 10822920 11655571 12448042 13137853 13662518 13973029 14047521 13904160 13607506 13260258
40907A3260258k82996j28134O1652K18525K86378K37972P9499j55959m20643o64927
$$ 13260258 12977262 12849128 12910780 13129305 13415683 13653655 13733154 13577195 13156552 12491625
40897A2491625q47576r42101r38928q44027o75298m58561k24325n247J67334K68946
$$ 12491625 11644049 10701948 9763020 8918993 8243695 7785134 7560809 7555562 7722896 7991842
40887G991842K88743K34287J30655J2206r0657j63425k11418k53463l09491l89240
$$ 7991842 8280585 8514872 8645527 8657733 8567076 8403651 8192233 7938770 7629279 7240039
40877G240039m87250n85411o61292o98059o90877o46827n80078n06652m40757
$$ 7240039 6752789 6167378 5506086 4808027 4117150 3470323 2890245 2383593 1942836
40868A942836l92025l63980l55780l66538l96740m43028m90824n13829m83672
$$ 1942836 1550811 1186831 831051 464513 67773 -375255 -866079 -1379908 -1863580
40859a863580l83021k12825R023K53311M84392O63841P56029P37972O10862M05948
$$ -1863580 -2246601 -2459426 -2450403 -2197092 -1712700 -1048859 -292830 445142 1056004 1461952
40849A461952J77843j4499j29781j57079j13337k9840O2520J41843J96858K24879
$$ 1461952 1639795 1625296 1495515 1338436 1225099 1195259 1257779 1399622 1596480 1821359
40839A821359K28781K13486J82311J35137P0220j1340j02451j91192k65492l17344
$$ 1821359 2050140 2263626 2445937 2581074 2651294 2639954 2537503 2346311 2080819 1763475
40829A763475l43055l39795l02247k23480j00748N7673K29783L84015M89043N25688
$$ 1763475 1420420 1080625 778378 554898 454150 511823 741606 1125621 1614664 2140352
40819B140352M96271M26282L54901L16510L22129L51849L63417L12061J70068
$$ 2140352 2636623 3062905 3417806 3734316 4056445 4408294 4771711 5083772 5253840
40810E253840o3446l64227o91087r95800j233911j376262j416705j369910j259624
$$ 5253840 5190394 4826167 4135080 3139280 1905369 529107 -887598 -2257508 -3517132
40801c517132j106634r25388p28378n29710l42510j73542k1937J15664K37300
$$ -3517132 -4623766 -5549154 -6277532 -6807242 -7149752 -7323294 -7345231 -7229567 -6992267
40792f992267L31441L80569L71624L06717K05625R7058M353o4666j17398j66666
$$ -6992267 -6660826 -6280257 -5908633 -5601916 -5396291 -5299233 -5294880 -5359546 -5476944 -5643610
40782e643610k17908k62045k79752k54651j85152q5549K2858J21477J98153K46417
$$ -5643610 -5861518 -6123563 -6403315 -6657966 -6843118 -6928667 -6905809 -6784332 -6586179 -6339762
40772f339762K65204K59891K41869K25556K25071K52399L16080M18797N54388
$$ -6339762 -6074558 -5814667 -5572798 -5347242 -5122171 -4869772 -4553692 -4134895 -3580507
40763c580507P06688Q52108R65669J028457J033580R87719R06689Q06321O94020
$$ -3580507 -2873819 -2021711 -1056042 -27585 1005995 1993714 2900403 3706724 4400744
40754D400744N67621M23419K66562J13516j6395j12217j74831k11002k25014k14316
$$ 4400744 4968365 5391784 5658346 5771862 5755467 5643250 5468419 5257417 5032403 4818087
40744D818087j69798p9446O4193K54133M63188O49422P71765Q06151P52009O26863
$$ 4818087 4648289 4568843 4633036 4887169 5350357 5999779 6771544 7577695 8329704 8956567
40734H956567M54570K55402M2834j73497l83555n75912p40535q71683r67099j023005
$$ 8956567 9411137 9666539 9709373 9535876 9152321 8576409 7835874 6964191 5997092 4974087
40724D974087j028699r66422q19933n88592k97254P096K71802M57847N50857N60148
$$ 4974087 3945388 2978966 2159033 1570441 1273187 1280283 1552085 2009932 2560789 3120937
40714C120937N09816M27343L33668K37935J39038L2655q1547j97464l05370l96791
$$ 3120937 3630753 4058096 4391764 4629699 4768737 4801392 4719845 4522381 4217011 3820220
40704C820220m67629n17569n46306n49706n20014m51131l44846k12202o8623P2638
$$ 3820220 3352591 2835022 2288716 1739010 1218996 767865 423019 210817 142194 214832
40694B14832K03362L18444M12009M74792M94754M61803L75535K51552J20400J7020
$$ 214832 418194 736638 1148647 1623439 2118193 2579996 2955531 3207083 3327483 3344503
40684C344503l4776l4331n816J2037j5515j00513k23580l41892m10903m07011
$$ 3344503 3309727 3275396 3269580 3281617 3266102 3165589 2942009 2600117 2189214 1782203
40674A782203l36959k29423j16640j8904O0476J30544K03374K84666L67560M32843
$$ 1782203 1445244 1215821 1099181 1080277 1140753 1271297 1474671 1759337 2126897 2559740
40664B559740M56702M22671L30558J96638M5698r8700k19599l06826l55931l69174
$$ 2559740 3016442 3439113 3769671 3966309 4012007 3913307 3693708 3386882 3030951 2661777
40654B661777l56585l32444l06465k76196k28507j50514m1547Q3072J98346K80909
$$ 2661777 2305192 1972748 1666283 1390087 1161580 1011066 969519 1052591 1250937 1531846
40644A531846L19167L18712L01305K96586L28699M04302N09332O17179P03695
$$ 1531846 1851013 2169725 2471030 2767616 3096315 3500617 4009949 4627128 5330823
40635E330823P60065P96071Q32166Q85403R57772J034061J090292J107020J078661
$$ 5330823 6090888 6886959 7719125 8604528 9562300 10596361 11686653 12793673 13872334
40626A3872334J013365R25029Q24139P13534N90281M50650K94674J28448l6238
$$ 13872334 14885699 15810728 16634867 17348401 17938682 18389332 18684006 18812454 18776216
40617A8776216j85078l06855l99472m72530n42686o22365p08698p81974q16827
$$ 18776216 18591138 18284283 17884811 17412281 16869595 16247230 15538532 14756558 13939731
40608A3939731p99078p36199o54783n88086n61784n84303o44600p17787p76289
$$ 13939731 13140653 12404454 11749671 11161585 10599801 10015498 9370898 8653111 7876822
40599G876822q00815p84855p30952o42993n20720l59977j58235P7593L25599N49841
$$ 7876822 7076007 6291152 5560200 4917207 4396487 4036510 3878275 3955868 4281467 4831308
40589D831308P09057P69278P14318N50507L05884K4731k42623m53638n86020o42855
$$ 4831308 5540365 6309643 7023961 7574468 7880352 7905083 7662460 7208822 6622802 5979947
40579E979947o48752o39999o52320p08130q06599r22428j016279j051203j004273
$$ 5979947 5331195 4691196 4038876 3330746 2524147 1601719 585440 -465763 -1470036
40570a470036q68150o47305l56278k0915L22722O35562Q86591J062137J169169
$$ -1470036 -2338186 -2985491 -3341769 -3362684 -3039962 -2404400 -1517809 -455672 713497
40561G13497J231032J276691J327641J389047J449814J490154J490464J436173
$$ 713497 1944529 3221220 4548861 5937908 7387722 8877876 10368340 11804513
40553A1804513J318496J134630Q89882O00912K96810J4802k10020l57227m28698
$$ 11804513 13123009 14257639 15147521 15748433 16045243 16060045 15850025 15492798 15064100
40544A5064100m45762m37076m25101m19354m18462m16901m11096m02396l97282
$$ 15064100 14618338 14181262 13756161 13336807 12918345 12501444 12090348 11687952 11290670
40535A1290670m05657m37483m97936n82629o76199p57226q08333q25100q16948
$$ 11290670 10885013 10447530 9949594 9366965 8690766 7933540 7125207 6300107 5483159
40526E483159p99021p81484p63927p37030o87877o04908m81964l22319j41243
$$ 5483159 4684138 3902654 3138727 2401697 1713820 1108912 626948 304629 163386
40517A63386L6271J83095K78410L11918K84163K07115J06070J7620k0887J3229
$$ 163386 199657 382752 661162 973080 1257243 1464358 1570428 1588048 1567161 1580390
40507A580390J17576K66103M21091N49135O33956O80184P06118P30381P62117
$$ 1580390 1697966 1964069 2385160 2934295 3568251 4248435 4954553 5684934 6447051
40498F447051Q00889Q43283Q88639R39876J000629J071274J145379J208273J239686
$$ 6447051 7247940 8091223 8979862 9919738 10920367 11991641 13137020 14345293 15584979
40489A5584979J220234J138848R97507Q10972O01112L88533J86825L317j55686
$$ 15584979 16805213 17944061 18941568 19752540 20353652 20742185 20929010 20932327 20776641
40480B0776641k81033l61857l90185l66061l01230k18977j47633j09145j09660
$$ 20776641 20495608 20133751 19743566 19377505 19076275 18857298 18709665 18600520 18490860
40471A8490860j38453j74291j93476j76168j11686k604J35761K82549M21231N44820
$$ 18490860 18352407 18178116 17984640 17808472 17696786 17694182 17829943 18112492 18533723 19078543
40461A9078543O52628P42111Q03319Q20971P82324O84528N36515L56144J66933
$$ 19078543 19731171 20473282 21276601 22097572 22879896 23564424 24100939 24457083 24624016
40452B4624016l442j25260j73033j35519k3934J28497K77977L87593M41381M47146
$$ 24624016 24620574 24495314 24322281 24186762 24162828 24291325 24569302 24956895 25398276 25845422
40442B5845422M27434M04618L88527L72793L41546K82668J99258J11018M3735
$$ 25845422 26272856 26677474 27066001 27438794 27780340 28063008 28262266 28373284 28417019
40433B8417019J4137K0879M7044P0206P1847M1679k1727j11055k11744l07328
$$ 28417019 28431156 28452035 28499079 28569285 28641132 28682811 28661084 28550029 28338285 28030957
40423B8030957l87539m53384n14480n80684o54680p29895p92630q25354q10204
$$ 28030957 27643418 27190034 26675554 26094870 25440190 24710295 23917665 23092311 22282107
40414B2282107p33245n89313l86209j46841R2504K89564M08465M31890L66548
$$ 22282107 21548862 20959549 20573340 20426499 20519003 20808567 21217032 21648922 22015470
40405B2015470K39660Q9566m5003j34317j63790j35017o1642L6844J39989K29970
$$ 22015470 22255130 22344696 22299693 22165376 22001586 21866569 21804927 21841771 21981760 22211730
40395B2211730K95349L33806L50413L51450L39470L15154K84569K64157K77503
$$ 22211730 22507079 22840885 23191298 23542748 23882218 24197372 24481941 24746098 25023601
40386B5023601L44837M71926O44983Q34422J005438J130163J195721J205281J173042
$$ 25023601 25368438 25840364 26485347 27319769 28325207 29455370 30651091 31856372 33029414
40377C3029414J117070J054311R99533R65759R61835R86504J024451J050505J040820
$$ 33029414 34146484 35200795 36200328 37166087 38127922 39114426 40138877 41189382 42230202
40368D2230202R82469Q75113P27293N53709L74663K13057Q7113L882m0170n1653
$$ 42230202 43212671 44087784 44815077 45368786 45743449 45956506 46043619 46047501 46007331 45955678
40358D5955678l1835K6607J35696L02981N21637P66199R98593J182979J300777
$$ 45955678 45923843 45950450 46086146 46389127 46910764 47676963 48675556 49858535 51159312
40349E1159312J356193J368947J359785J338426J300394J232606J122796R67208
$$ 51159312 52515505 53884452 55244237 56582663 57883057 59115663 60238459 61205667
40341F1205667P73120N55691L31954J17117p3318k18438k91508k68608j41226
$$ 61205667 61978787 62534478 62866432 62983549 62910231 62691793 62400285 62131677 61990451
40332F1990451P7668L58734O67382R72483J249806J483268J666367J802180J899373
$$ 61990451 62068119 62426853 63094235 64066718 65316524 66799792 68466159 70268339 72167712
40323G2167712J965539K002469K007119J977886J922154J860391J824228J849129
$$ 72167712 74133251 76135720 78142839 80120725 82042879 83903270 85727498 87576627
40315H7576627J964513K185069K506031K903309L337519L760740M125771M397325
$$ 87576627 89541140 91726209 94232240 97135549 100473068 104233808 108359579 112756904
40307A12756904M561787M629743M628228M586416M523031M441586M334164M190813
$$ 112756904 117318691 121948434 126576662 131163078 135686109 140127695 144461859 148652672
40299A48652672M010420L807655L611323L454010L359009L331776L359101L415627
$$ 148652672 152663092 156470747 160082070 163536080 166895089 170226865 173585966 177001593
40291A77001593L476151L529536L585381L665614L784860L935240M088762M214289
$$ 177001593 180477744 184007280 187592661 191258275 195043135 198978375 203067137 207281426
40283B07281426M293287M322648M307231M252972M166949M061376L955312L871948
$$ 207281426 211574713 215897361 220204592 224457564 228624513 232685889 236641201 240513149
40275B40513149L834285L861741L967312M154218M413820M727660N072968N427030
$$ 240513149 244347434 248209175 252176487 256330705 260744525 265472185 270545153 275972183
40267B75972183N767687O072930O323613O507875O621608O663434O629983O517722
$$ 275972183 281739870 287812800 294136413 300644288 307265896 313929330 320559313 327077035
40259C27077035O329951O081420N795523N496319N201280M917947M643748M367815
$$ 327077035 333406986 339488406 345283929 350780248 355981528 360899475 365543223 369911038
40251C69911038M075407L755209L406371L039972K672887K318449J981369J660113
$$ 369911038 373986445 377741654 381148025 384187997 386860884 389179333 391160702 392820815
40243C92820815J353373J064949Q04369N83914M13338K93302K10113J35592L4016
$$ 392820815 394174188 395239137 396043506 396627420 397040758 397334060 397544173 397679765 397713781
40234C97713781j26301l62540o72848j039396j436559j839567k229221k591415
$$ 397713781 397587480 397224940 396552092 395512696 394076137 392236570 390007349 387415934
40226C87415934k913779l183127l385931l512205l561567l548451l501665l455749
$$ 387415934 384502155 381319028 377933097 374420892 370859325 367310874 363809209 360353460
40218C60353460l437971l459589l516580l596396l683353l760596l813035l834259
$$ 360353460 356915489 353455900 349939320 346342924 342659571 338898975 335085940 331251681
40210C31251681l832905l830948l852074l906767l983466m051264m073115m023200
$$ 331251681 327418776 323587828 319735754 315828987 311845521 307794257 303721142 299697942
40202B99697942l899533l725224l537953l373801l253773l179147l136892l111215
$$ 299697942 295798409 292073185 288535232 285161431 281907658 278728511 275591619 272480404
40194B72480404l093546l084788l090298l113806l155149l210247l269399l315000
$$ 272480404 269386858 266302070 263211772 260097966 256942817 253732570 250463171 247148171
40186B47148171l324348l279819l180257l044540k904456k792171k729578k723123
$$ 247148171 243823823 240544004 237363747 234319207 231414751 228622580 225893002 223169879
40178B23169879k764041k833121k908718k975186l027584l070506l112518l160016
$$ 223169879 220405838 217572717 214663999 211688813 208661229 205590723 202478205 199318189
40170A99318189l213656l268406l316536l351694l372011l380834l385404l394608
$$ 199318189 196104533 192836127 189519591 186167897 182795886 179415052 176029648 172635040
40162A72635040l416677l457556l520797l608939l723856l863709m018425m169974
$$ 172635040 169218363 165760807 162240010 158631071 154907215 151043506 147025081 142855107
40154A42855107m300419m402056m479815m542962m593828m623376m615642m555312
$$ 142855107 138554688 134152632 129672817 125129855 120536027 115912651 111297009 106741697
40146A06741697m432902m247008m005638l726651l435175l156864k909089k694345
$$ 106741697 102308795 98061787 94056149 90329498 86894323 83737459 80828370 78134025
40138G8134025k500096k305811k093522j856242j601411j350485j136045r94670
$$ 78134025 75633929 73328118 71234596 69378354 67776943 66426458 65290413 64295743
40130F4295743r53680j015918j152510j310874j435435j489986j470313j401514
$$ 64295743 63342063 62326145 61173635 59862761 58427326 56937340 55467027 54065513
40122E4065513j322107j263359j234959j224191j207236j164465j091943j005551
$$ 54065513 52743406 51480047 50245088 49020897 47813661 46649196 45557253 44551702
40114D4551702r37232r24258r94899j156580j390927j655652j891178k032697
$$ 44551702 43614470 42690212 41695313 40538733 39147806 37492154 35600976 33568279
40106C3568279k029092j864257j569152j214776q87685o60598n71232o14284p45006
$$ 33568279 31539187 29674930 28105778 26891002 26003317 25342719 24771487 24157203 23412197
40097B3412197q92326r80901r57414q10133n70927k99416o0117R5391J37686O3103
$$ 23412197 22519871 21538970 20581556 19771423 19200496 18901080 18840963 18936354 19074040 19137143
40087A9137143j06256l27826n49898p25572q24318q38237p81806o84137n75122
$$ 19137143 19030887 18703061 18153163 17427591 16603273 15765036 14983230 14299093 13723971
40078A3723971m71585l71833k62090j29744K6042J92210L47340M70099N46573
$$ 13723971 13252386 12880553 12618463 12488719 12514761 12706971 13054311 13524410 14070983
40069A4070983N73986N59034N10863M32802L19376J61632m3351k86322n47105
$$ 14070983 14644969 15204003 15714866 16147668 16467044 16628676 16585325 16299003 15751898
40060A5751898q01285j027794j213636j353882j447635j493509j488645j431240
$$ 15751898 14950613 13922819 12709183 11355301 9907666 8414157 6925512 5494272
40052E494272j322461j165214r62595p20215m51154j77473P5601K89256M56804
$$ 5494272 4171811 3006597 2044002 1323787 872633 695160 770761 1060017 1516821
40043A516821N81064O66203P11335P11474O64936N80636M79019L85572L20899
$$ 1516821 2097885 2764088 3475423 4186897 4851833 5432469 5911488 6297060 6617959
40034F617959K92664K93004L02429K98211K62701J87611P4424o5638k10228l25688
$$ 6617959 6910623 7203627 7506056 7804267 8066968 8254579 8329003 8263365 8053137 7727449
40024G727449l72502l17860j51137J05850M01773O73698Q71913R77521J002718
$$ 7727449 7354947 7037087 6885950 6991800 7393573 8067271 8939184 9916705 10919423
40015A0919423R75612R21397Q51509P64618O54916N20153L64116J93556J3873
$$ 10919423 11895035 12816432 13667941 14432559 15087475 15607628 15971744 16165300 16179173
40006A6179173j72019l61157n47805p23923q82296j018867j131838j218826j275392
$$ 16179173 16007154 15645997 15098192 14374269 13491973 12473106 11341268 10122442 8847050
39997H847050j296537j279514j225280j137656j021093q78195p07967n06746k73584
$$ 8847050 7550513 6270999 5045719 3908063 2886970 2008775 1300808 794062 520478
39988E20478j8617K31483M36421N53456N51356M21365J82011j23515m37780p04651
$$ 520478 501861 733344 1169765 1723221 2274577 2695942 2877953 2754438 2316658 1612007
39978A612007q83588r56392r25599q09038o34991m37695k50474r6931J4448Q7422
$$ 1612007 728419 -227973 -1153572 -1962610 -2597601 -3035296 -3285770 -3382701 -3368253 -3280831
39968c280831J28831J41245J23710P8693J7594m0483p5777p6258m3628N599M5968
$$ -3280831 -3152000 -3010755 -2887045 -2808352 -2790758 -2831241 -2907018 -2983276 -3026904 -3021305 -2975337
39957b975337N5531K9161j5881m6695k9588N6264K12626M23000O57376Q80408
$$ -2975337 -2919806 -2890645 -2906526 -2953221 -2982809 -2926545 -2713919 -2290919 -1633543 -753135
39947g53135J063499J196849J292709J375175J462459J554176J631357J666984
$$ -753135 310364 1507213 2799922 4175097 5637556 7191732 8823089 10490073
39939A0490073J639815J545262J398937J229978J066260R20578P87620O53014
$$ 10490073 12129888 13675150 15074087 16304065 17370325 18290903 19078523 19731537
39931A9731537N06063L46596J83446K9018j04543k05909k64577k74303k40130
$$ 19731537 20237600 20584196 20767642 20796660 20692117 20486208 20221631 19947328 19707198
39922A9707198j83357j37429j34045j87817k89964m14545n31433o17263o60025
$$ 19707198 19523841 19386412 19252367 19064550 18774586 18360041 17828608 17211345 16551320
39913A6551320o59595o28034n89068n71666n95439o55276p18882p43646p03087
$$ 16551320 15891725 15263691 14674623 14102957 13507518 12852242 12133360 11389714 10686627
39904A0686627o02974m74782l52648k53098j72125r7532k1820N5686J35078K19755
$$ 10686627 10083653 9608871 9256223 9003125 8831000 8733468 8711648 8767334 8902412 9122167
39894I122167L13160M14001N16672O15053P03295P72948Q13020Q16323P86307
$$ 9122167 9435327 9849328 10366000 10981053 11684348 12457296 13270316 14086639 14872946
39885A4872946P36095O79781O24094N67241N03942M31067L50146K66729J88247
$$ 14872946 15609041 16288822 16912916 17480157 17984099 18415166 18765312 19032041 19220288
39876A9220288J21875P3347M6615M3080N9613Q6627J08606J07747O9115j4558
$$ 19220288 19342163 19415510 19462125 19505205 19564818 19651445 19760051 19867798 19936913 19922355
39866A9922355j39183k87834m33793n49318o17245o38978o33589o27602o40806
$$ 19922355 19783172 19495338 19061545 18512227 17894982 17256004 16622415 15994813 15354007
39857A5354007o76329p21094p55524p64666p43436o95853o32942n70771n25316
$$ 15354007 14677678 13956584 13201060 12436394 11692958 10997105 10364163 9793392 9268076
39848I268076n03521m97228m87135m54898l93694l10191k19635j39810q6884p2524
$$ 9268076 8764555 8267327 7780192 7325294 6931600 6621409 6401774 6261964 6175080 6102556
39838F102556j01925j73908k83369m23446n84241p49095q94476r98081j050902
$$ 6102556 6000631 5826723 5543354 5119908 4535667 3786572 2892096 1894015 843113
39829H43113j062060j050465j030554j005271r70522r23020q62334p87261o93109
$$ 843113 -218947 -1269412 -2299966 -3305237 -4275759 -5198779 -6061113 -6848374 -7541483
39820g541483n73570m24414k44919l6550J97811M50881P05231R30998J093117
$$ -7541483 -8115053 -8539467 -8784386 -8820936 -8623125 -8172244 -7467013 -6536015 -5442898
39811e442898J166335J147300J053457R09790P35091N38595L27113J13457q2540
$$ -5442898 -4276563 -3129263 -2075806 -1166016 -430925 107670 434783 548240 465700
39802D65700k41214l51981m17221m49774m67385m87048n19483n63914o05957o21525
$$ 465700 224486 -127495 -544716 -994490 -1461875 -1948923 -2468406 -3032320 -3638277 -4259802
39792d259802n85835m82732l10030p9568J87198M65948P35387R79170J183719
$$ -4259802 -4845637 -5328369 -5638399 -5717967 -5530769 -5064821 -4329434 -3350264 -2166545
39783b166545J335279J419639J424754J343771J176862R32545O29587K98195k2780
$$ -2166545 -831266 588373 2013127 3356898 4533760 5466305 6095892 6394087 6371307
39774F371307k94117m86797n89407o09043n66473m87832l94773k96360j87885
$$ 6371307 6077190 5590393 5000986 4391943 3825470 3337638 2942865 2646505 2458620
39765B458620n9070R3016K55568M01982N02485N37059N04102M20364L11831K00824
$$ 2458620 2399550 2492566 2748134 3150116 3652601 4189660 4693762 5114126 5425957 5626781
39755E626781R7403l65r9900k07327l24183m47616n72662o94946q12119r23072
$$ 5626781 5724184 5723819 5623919 5416592 5092409 4644793 4072131 3377185 2565066 1641994
39745A641994j026015j117124j190321j237157j246489j205184j101678r32444
$$ 1641994 615979 -501145 -1691466 -2928623 -4175112 -5380296 -6481974 -7414418
39737g414418p08417m56249k11471o381J40195K26105K62750K69621K68209K75038
$$ -7414418 -8122835 -8579084 -8790555 -8796936 -8656741 -8430636 -8167886 -7898265 -7630056 -7355018
39727g355018K94986L18862L28064L04382K39339J38151J7362j00902j94517k45961
$$ -7355018 -7060032 -6741170 -6413106 -6108724 -5869385 -5731234 -5713872 -5814774 -6009291 -6255252
39717f255252k46800k01036j23058k8204P8746K07539L74524N88254Q38622J096146
$$ -6255252 -6502052 -6703088 -6826146 -6854350 -6775604 -6568065 -6193541 -5605287 -4766665 -3670519
39707c670519J321560J480788J557526J556171J493682J387268J247470J080215
$$ -3670519 -2348959 -868171 689355 2245526 3739208 5126476 6373946 7454161
39699G454161Q93154O99482N16843L63352K52795J89563J64554J55191J32315
$$ 7454161 8347315 9046797 9563640 9926992 10179787 10369350 10533904 10689095 10821410
39690A0821410P2232l2292j68522l09647m26443m99037n24412n17408n04471n11466
$$ 10821410 10893642 10861350 10692828 10383181 9956738 9457701 8933289 8415881 7911410 7399944
39680G399944n50372o12094o70667o97493o77221o14867n29425m38782l47005
$$ 7399944 6849572 6237478 5566811 4869318 4192097 3577230 3047805 2609023 2262018
39671B262018k42596j07452P0794K90364N33541P70230R64880J084821J107888
$$ 2262018 2019422 1911970 1982764 2273128 2806669 3576899 4541779 5626600 6734488
39662F734488J027594Q55294O18968L57984J13855q0269k07351k68846k81746
$$ 6734488 7762082 8617376 9236344 9594328 9708183 9627914 9420563 9151717 8869971
39653H869971k71654k63895k75962l14760l79096m64028n63119o67963p67635
$$ 8869971 8598317 8334422 8058460 7743700 7364604 6900576 6337457 5669494 4901859
39644D901859q50383r07117r33816r30313q96336q29028p25642n89764m35169
$$ 4901859 4051476 3144359 2210543 1280230 383894 -445134 -1170776 -1760540 -2195709
39635b195709k83679j59204q2036o4368j06210j93205k99371l94703m54062m64128
$$ -2195709 -2479388 -2638592 -2720628 -2784996 -2891206 -3084411 -3383782 -3778485 -4232547 -4696675
39625d696675m26683l56045k69550j76537p5615L6549J54380K63077L49940M15782
$$ -4696675 -5123358 -5479403 -5748953 -5925490 -6001105 -5964556 -5810176 -5547099 -5197159 -4781377
39615d781377M75187N45432O33034P27390Q05080Q41217Q19543P34668N87646
$$ -4781377 -4306190 -3760758 -3127724 -2400334 -1595254 -754037 65506 800174 1387820
39606A387820L82578J29848j47456m12382o22385p42700p57047o71197n09972
$$ 1387820 1770398 1900246 1752790 1340408 718023 -24677 -781724 -1452921 -1962893
39597a962893l10077j11001N3643J61891K05507J90188J35147O9487K1428K749
$$ -1962893 -2272970 -2383971 -2330328 -2168437 -1962930 -1772742 -1637595 -1568108 -1546680 -1543931
39587a543931p64k2650r4465k24065l87955n41384o38178o48574n67340m11048
$$ -1543931 -1544695 -1567345 -1661810 -1885875 -2273830 -2815214 -3453392 -4101966 -4669306 -5080354
39577e080354k08879O987K07317L67884M70053N02442M64987L74264K65684J87236
$$ -5080354 -5289233 -5282246 -5074929 -4707045 -4236992 -3734550 -3269563 -2895299 -2629615 -2442379
39567b442379J83932K79928M68925P18265R82401J216449J383921J459575J431221
$$ -2442379 -2258447 -1978519 -1509594 -791329 191072 1407521 2791442 4251017 5682238
39558E682238J301571J087792Q16744N17276K13648p6862l42185n72624p60341
$$ 5682238 6983809 8071601 8888345 9405621 9619269 9542407 9200222 8627598 7867257
39549G867257r01715r99230j058952j084245j071667j014124r09445p67239o09116
$$ 7867257 6965542 5966312 4907360 3823115 2751448 1737324 827879 60640 -548476
39540e48476m63089l55608l03723l09458l59380m30526m99206n47110n62626n39931
$$ -548476 -1011565 -1367173 -1670896 -1980354 -2339734 -2770260 -3269466 -3816576 -4379202 -4919133
39530d919133m78682l83724k63005j24329K6371J84026L42776M96088O38274P64718
$$ -4919133 -5397815 -5781539 -6044544 -6168873 -6142502 -5958476 -5615700 -5119612 -4481338 -3716620
39520c716620Q69419R42190R69209R38228Q45638P00303N20803L27277J33774
$$ -3716620 -2847201 -1905011 -935802 2426 848064 1548367 2069170 2396447 2530221
39511B530221n2524k24543l68222m63667m95447m63216l82409k73818j50732j4118
$$ 2530221 2477697 2253154 1884932 1421265 925818 462602 80193 -193625 -344357 -358475
39501c58475J40947L13362M87736O35312P23295P27180O39964M74060K55134J1461
$$ -358475 -217528 95834 583570 1218882 1942177 2669357 3309321 3783381 4038515 4049976
39491D049976k34634m68366o78245q52068r77688j047216j059967j021667r41747
$$ 4049976 3815342 3346976 2668731 1816663 838975 -208241 -1268208 -2289875 -3231622
39482c231622q31774p05794n80456m72577l94173l47945l26273l14149k93865
$$ -3231622 -4063396 -4769190 -5349646 -5822223 -6216396 -6564341 -6890614 -7204763 -7498628
39473g498628k50043j75093p4297L2940J18809J57995J37274N8198o7168k22447
$$ -7498628 -7748671 -7923764 -7998061 -7965121 -7846312 -7688317 -7551043 -7492845 -7560013 -7782460
39463g782460l90604n54555o97447q04237q63473q68104q16296p13504n73586
$$ -7782460 -8173064 -8727619 -9425066 -10229303 -11092776 -11960880 -12777176 -13490680 -14064266
39454a4064266m15444k56032j05397L2130J53555K55405L35982L98121M48973
$$ -14064266 -14479710 -14735742 -14841139 -14809009 -14655454 -14400049 -14064067 -13665946 -13216973
39445a3216973M96909N47878O03553O62336P22163P82257Q42300R00803R55164
$$ -13216973 -12720064 -12172186 -11568633 -10906297 -10184134 -9401877 -8559577 -7658774 -6703610
39436f703610J002543J038785J056105J043935R95172R13131Q11802P07374O07248
$$ -6703610 -5701067 -4662282 -3606177 -2562242 -1567070 -653939 157863 865237 1472485
39427A472485N05790L90523K53469R8206o1778k09408l28799m07535m39446m27989
$$ 1472485 1978275 2368798 2622267 2720473 2658695 2449287 2120488 1712953 1273507 845518
39417H45518l86138l30454k72885k15754j52404p2666K9380J49069K70446L72110
$$ 845518 459380 128926 -143959 -359713 -512117 -584783 -555403 -406334 -135888 236222
39407B36222M35983M54324M32869L89455L47255L23891L22122L28615L21844K84289
$$ 236222 672205 1126529 1559398 1948853 2296108 2619999 2942121 3270736 3592580 3876869
39397C876869K12726J21980L9295r878j7266K295J9176N649n0389j41568k46329
$$ 3876869 4089595 4211575 4250870 4240992 4223726 4226021 4245197 4250846 4200457 4058889 3812560
39386C812560l38533l97105m12930l90994l47310l02623k76473k83534l30893
$$ 3812560 3474027 3076922 2663992 2272998 1925688 1623065 1346592 1063058 732165
39377G32165m14265n14706o00473o36682n98793m82045l01999q7681J27514L13636
$$ 732165 317900 -196806 -797279 -1433961 -2032754 -2514799 -2816798 -2904479 -2776965 -2463329
39367b463329M50272N31417N67516N81882O00498O39558O97844P58369P97174
$$ -2463329 -2013057 -1481640 -914124 -332242 268256 907814 1605658 2364027 3161201
39358C161201P93471P36650O28900M83826L21906J64575K9607p0833j30529j50108
$$ 3161201 3954672 4691322 5320222 5804048 6125954 6290529 6320136 6249303 6118774 5968666
39348E968666j39024j16603j09057j41349k27007l61675n24650o87427q23870
$$ 5968666 5829642 5713039 5603982 5462633 5235626 4873951 4349301 3661874 2838004
39339B838004r16513r56986r42791q74831p58414o06028m37200k73182j29985
$$ 2838004 1921491 964505 21714 -853117 -1611531 -2217559 -2654759 -2927941 -3057926
39330c057926j5064P1163J32953J78727K19929K65680L14726L51414L50515K88742
$$ -3057926 -3072990 -3001827 -2868874 -2690147 -2470218 -2204538 -1889812 -1538398 -1187883 -899141
39320h99141J55953l9490k72207n06619p07289q49550r25238r39721r02789q20803
$$ -899141 -743188 -782678 -1054885 -1561504 -2268793 -3118343 -4043581 -4983302 -5886091 -6706894
39310f706894o95326n27002l20208q6143J55990L80901N63512O87756P52863P73276
$$ -6706894 -7402220 -7929222 -8249430 -8335573 -8179583 -7798682 -7235170 -6547414 -5794551 -5021275
39300e021275P72095P70757P79304P92104P92151P61563O91220N83834M50020
$$ -5021275 -4249180 -3478423 -2699119 -1907015 -1114864 -353301 337919 921753 1371773
39291A371773L01537J45696j6725j89905l78953n85406q04025j022030j221423
$$ 1371773 1673310 1819006 1802281 1612376 1233423 648017 -156008 -1178038 -2399461
39282b399461j383692j494106j543438j527993j450161j318810j146558r44539
$$ -2399461 -3783153 -5277259 -6820697 -8348690 -9798851 -11117661 -12264219 -13208758
39274a3208758p20027m80164k37410j0037J82817L26061M10321M32749L99860
$$ -13208758 -13928785 -14408949 -14646359 -14656396 -14473579 -14147518 -13737197 -13304448 -12904588
39265a2904588L30386K53434K00146J92376K34714L14574M09793M98001N61774
$$ -12904588 -12574202 -12320768 -12120622 -11928246 -11693532 -11378958 -10969165 -10471164 -9909390
39256i909390N88846N71866N11044M17721L14177K27793J82013J88400K43407
$$ -9909390 -9320544 -8748678 -8237634 -7819913 -7505736 -7277943 -7095930 -6907530 -6664123
39247f664123L31706M34774N39580O41106P37026Q19684Q73175Q78640Q23735
$$ -6664123 -6332417 -5897643 -5358063 -4716957 -3979931 -3160247 -2287072 -1408432 -584697
39238e84697P09573N51490L74707K07327P2710j6316n8031n6192j2600P4903K06349
$$ -584697 124876 676366 1051073 1258400 1331110 1314794 1256763 1200571 1187971 1262874 1469223
39227A469223L70782N43028O89264P77015P83207O97850N24990K82196k610k97964
$$ 1469223 1840005 2383033 3072297 3849312 4632519 5330369 5855359 6137555 6134945 5836981
39217E836981n76799q20709j017960j157757j226626j211397j108510r33888p25205
$$ 5836981 5260182 4439473 3421513 2263756 1037130 -174267 -1282777 -2216665 -2941870
39208b941870n31589l93711l24904l05339k94276k53818j68664m8184Q9695K37741
$$ -2941870 -3473459 -3867170 -4192074 -4497413 -4791689 -5045507 -5214171 -5262355 -5172660 -4934919
39198d934919M04040N98823Q17903J039120J233022J375162J449810J447600J365760
$$ -4934919 -4530879 -3932056 -3114153 -2075033 -842011 533151 1982961 3430561 4796321
39189D796321J213056J013046P99112O02155M38348L04388J82172M8658j15411
$$ 4796321 6009377 7022423 7821535 8423690 8862038 9166426 9348598 9397256 9281845
39180I281845l21045n69064q47858j131693j383378j563140j640445j602985j458969
$$ 9281845 8960800 8391736 7543878 6412185 5028807 3465667 1825222 222237 -1236732
39171a236732j232491r54224o51425l42069l6300K56471N21053P36369Q81833
$$ -1236732 -2469223 -3423447 -4074872 -4416941 -4453241 -4196770 -3675717 -2939348 -2057515
39162b057515R45041R25732Q35166O93226N24739L55071K04971Q6384P34o0275
$$ -2057515 -1112474 -186742 648424 1341650 1866389 2221460 2426431 2512815 2513549 2453274
39152B453274j12216j73709k60028l76187n13227o50103p59541q14396p93116
$$ 2453274 2341058 2167349 1907321 1531134 1017907 367804 -391737 -1206133 -1999249
39143a999249o85270m96493k49310K2895K86295N15563O97505Q29786R17011R66065
$$ -1999249 -2684519 -3181012 -3430322 -3407427 -3121132 -2605569 -1908064 -1078278 -161267 804798
39133H04798R82733R71740R39718Q97406Q57847Q31706Q23717Q32377Q51508Q71435
$$ 804798 1787531 2759271 3698989 4596395 5454242 6285948 7109665 7942042 8793550 9664985
39123I664985Q79300Q59937P99201O90315N40342L70911K09530P5939k5904j03682
$$ 9664985 10544285 11404222 12203423 12893738 13434080 13804991 14014521 14090460 14064556 13960874
39113A3960874j65018k09214k28555k15943j71481j03818k6806M5891J05434J49221
$$ 13960874 13795856 13586642 13358087 13142144 12970663 12866845 12840039 12885930 12991364 13140585
39103A3140585J78519J95212K01694K04047K13139K38832K80211L21606L40543
$$ 13140585 13319104 13514316 13716010 13920057 14133196 14372028 14652239 14973845 15314388
39094A5314388L21947K66016J84004Q9149o271q6814j32553j27595p1973J6109
$$ 15314388 15636335 15902351 16086355 16175504 16169233 16082419 15949866 15822271 15750298 15766407
39084A5766407J11135J93251K50775K72582K41893J40053m2758k98997o02718
$$ 15766407 15877542 16070793 16321568 16594150 16836043 16976096 16933338 16634341 16031623
39075A6031623r15264j194406j403974j520951j538058j462770j315012j123720
$$ 16031623 15116359 13921953 12517979 10997028 9458970 7996200 6681188 5557468
39067E557468r20316p29399n61572m14183k80456j60632o6500j5348j7905o9990
$$ 5557468 4637152 3907753 3346181 2931998 2651542 2490910 2424410 2409062 2391157 2321167
39057B321167j54389k49636l36869m00535m27361m08911l45630k45609j17042
$$ 2321167 2166778 1917142 1580273 1179738 752377 343466 -2164 -247773 -364815
39048c64815L8159K22380M33516O57646Q69135J037470J136047J148784J073002
$$ -364815 -326656 -104276 329240 986886 1856021 2893491 4029538 5178322 6251324
39039F251324R18873P06596M62089K11188k6878k43978m42107o27061q01368r61738
$$ 6251324 7170197 7876793 8338882 8550070 8523192 8279214 7837107 7210046 6408678 5446940
39029E446940j101948j217304j306450j369815j407217j417135j397272j344348
$$ 5446940 4344992 3127688 1821238 451423 -955794 -2372929 -3770201 -5114549
39021e114549j252138j110578r09819o49266l45624l3074K45590M51477N59507
$$ -5114549 -6366687 -7477265 -8387084 -9036350 -9381974 -9415048 -9169458 -8717981 -8158474
39012h158474N63093M73887L17392J25953o8277k38586l67260m47460m81669m76327
$$ -8158474 -7595381 -7121494 -6804102 -6678149 -6746426 -6985012 -7352272 -7799732 -8281401 -8757728
39002h757728m36746l67191k74930j71461o7337L4477J39636K57235L93982N52224
$$ -8757728 -9194474 -9561665 -9836595 -10008056 -10075393 -10040916 -9901280 -9644045 -9250063 -8697839
38992h697839P30935R26578J132040J334086J511158J634429J674041J608848
$$ -8697839 -7966904 -7040326 -5908286 -4574200 -3063042 -1428613 245428 1854276
38984A854276J434921J169070Q46476N13257K14963j5671j65567k38555k46113
$$ 1854276 3289197 4458267 5304743 5818000 6032963 6017292 5851725 5613170 5367057
38975E367057k00206j13530m207J02660J80502K11113J92364J38862P4648K1537
$$ 5367057 5166851 5053321 5049114 5151774 5332276 5543389 5735753 5874615 5949263 5970800
38965E970800j0442k5271l5583n4468q9318j39139j94793k42652k72157k83842
$$ 5970800 5960358 5935087 5899504 5845036 5755718 5616579 5421786 5179134 4906977 4623135
38955D623135k91141l12717l60480m32647n16361n95946o59475p00203p14987
$$ 4623135 4331994 4019277 3658797 3226150 2709789 2113843 1454368 754165 39178
38946C9178p03271o67644o14196n51163m86852m29096l86439l68377l82042m26774
$$ 39178 -664093 -1331737 -1945933 -2497096 -2983948 -3413044 -3799483 -4167860 -4549902 -4976676
38936d976676m91075n55230n98517o07229n80088n29227m75933m41833m38930
$$ -4976676 -5467751 -6022981 -6621498 -7228727 -7808815 -8338042 -8813975 -9255808 -9694738
38927i694738m63397m96347n10755m80901l90771k39043l9100J86249M12970O22457
$$ -9694738 -10158135 -10654482 -11165237 -11646138 -12036909 -12275952 -12315052 -12128803 -11715833 -11093376
38917a1093376Q03094R47424J048917J101855J104380J062237R90224R09664Q41808
$$ -11093376 -10290282 -9342858 -8293941 -7192086 -6087706 -5025469 -4035245 -3125581 -2283773
38908b283773P99543P82148P77241P69369P48960P14696O67991O05740N18908
$$ -2283773 -1484230 -702082 75159 844528 1593488 2308184 2976175 3581915 4100823
38899D100823L98725K44901O9035j08563k64968l79539m37045m31126l68717k72435
$$ 4100823 4499548 4744449 4813484 4704921 4439953 4060414 3623369 3192243 2823526 2551091
38889B551091j76242j12750r7254j17996j39918j20349k7547J47106L86403O52183
$$ 2551091 2374849 2262099 2164845 2046849 1906931 1786582 1759035 1906141 2292544 2944727
38879B944727Q95108J067299J134729J084576R24823O78188L75469N1686k55939
$$ 2944727 3839835 4907134 6041863 7126439 8051262 8729450 9104919 9156605 8900666
38870H900666n11457o86824p69768p68707p11099o34328n71632n38553n26236
$$ 8900666 8389209 7702385 6932617 6163910 5452811 4818483 4246851 3708298 3182062
38861C182062n05406m39352k99308p5293K20783N58635Q96884J191206J401350
$$ 3182062 2676656 2237304 1937996 1862703 2083486 2642121 3539005 4730211 6131561
38852F131561J496350J458625J287501J000679O31593K22956j80255n35855q08710
$$ 6131561 7627911 9086536 10374037 11374716 12006309 12229265 12049010 11513155 10704445
38843A0704445r76387j034922r99540q97631p58144o05051m57587l32346k41388
$$ 10704445 9728058 8693136 7693596 6795965 6037821 5432770 4975183 4642837 4401449
38834D401449j87474j63035j56046j58165j68018j87662k15841k43147k52717
$$ 4401449 4213975 4050940 3894894 3736729 3568711 3381049 3165208 2922061 2669344
38825B669344k27954j64262p6309O946N7731O4090L3412j5479o4305j04215j37815
$$ 2669344 2441390 2277128 2200819 2207765 2265496 2329586 2362998 2347519 2283214 2178999 2041184
38814B041184j73453k14688k52580k67999k43173j73918p4235K7856R9443J13166
$$ 2041184 1867731 1653043 1400463 1132464 889291 715373 641138 668994 768437 881603
38804H81603N6756o1083k11819l56463m59989n04538m95070m54897m13588l93352
$$ 881603 938359 877276 665457 308994 -150995 -655533 -1150603 -1605500 -2019088 -2412440
38794b412440l99729m20030m30199m07597l43480k47701j42636n1211J2562M6040
$$ -2412440 -2812169 -3232199 -3662398 -4069995 -4413475 -4661176 -4803812 -4855023 -4842461 -4796421
38784d796421N5034M9370L8551K8090J8301P369l005m369J6093O9824J62750K94674
$$ -4796421 -4741387 -4692017 -4653466 -4625376 -4607075 -4599706 -4602711 -4607080 -4590987 -4521163 -4358413 -4063739
38772d063739M59750O45738Q33251R97888J115620J168768J149737J061125R12483
$$ -4063739 -3603989 -2958251 -2125000 -1127112 -11492 1157276 2307013 3368138 4280621
38763D280621P15816M83363K29572k5669k58053m45588n76351o51229o80096o74333
$$ 4280621 4996437 5479800 5709372 5683703 5425650 4980062 4403711 3752482 3072386 2398053
38753B398053o40122n76383m79607l52984k12662q5196K430L3315O343o3785j51111
$$ 2398053 1757931 1181548 701941 348957 136295 51099 53529 86844 93187 29402 -121709
38742a21709k26425k66169k58805k07355j29245n3203j0711k2706q8627j86150
$$ -121709 -348134 -614303 -873108 -1080463 -1209708 -1262911 -1273622 -1296328 -1384955 -1571105
38732a571105k82517l49667l73951l56523l07405k38997j62780q8337k1403L9422
$$ -1571105 -1853622 -2203289 -2577240 -2933763 -3241168 -3480165 -3642945 -3731282 -3752685 -3713263
38722c713263J03523J83662K88010M13958N46346O59878P25936P24035O53693
$$ -3713263 -3609740 -3426078 -3138068 -2724110 -2177764 -1517886 -791950 -67915 585778
38713E85778N38417M16891L25793K84315K87622L10291L17051K77048J76692K5713
$$ 585778 1124195 1541086 1866879 2151194 2438816 2749107 3066158 3343206 3519898 3545611
38703C545611j46283l00581m02312m31019l86212k86800j64660n5051J1737J4809
$$ 3545611 3399328 3098747 2696435 2265416 1879204 1592404 1427744 1372693 1384430 1399239
38693A399239n5595j96133l88361o00686p96865r47801j039433j072386j055616
$$ 1399239 1343644 1147511 759150 158464 -638401 -1586202 -2625635 -3698021 -4753637
38684d753637j000089r16516q16013p09800o06029n06212m04850k92457j59054
$$ -4753637 -5753726 -6670242 -7486255 -8196055 -8802084 -9308296 -9713146 -10005603 -10164657
38675a0164657K846J93546L99959N94120P42069Q19081Q19735P56438O51243N29379
$$ -10164657 -10161811 -9968265 -9568306 -8974186 -8232117 -7413036 -6593301 -5836863 -5185620 -4656241
38665d656241M16540L36136L04058L22921L79453M47662M98074N09187M73838
$$ -4656241 -4239701 -3903565 -3599507 -3276586 -2897133 -2449471 -1951397 -1442210 -968372
38656i68372L95963K81557J32674n1044k66750n04591p47868r75787j166909j302089
$$ -968372 -572409 -290852 -158178 -209222 -475972 -980563 -1728431 -2704218 -3871127 -5173216
38646e173216j366353j350347j252888j084248q67369o34674m21341k57471j60622
$$ -5173216 -6539569 -7889916 -9142804 -10227052 -11094421 -11729095 -12150436 -12407907 -12568529
38637a2568529j29975j45262j73655j83505j58142j01467l1587L3714Q9961J48424
$$ -12568529 -12698504 -12843766 -13017421 -13200926 -13359068 -13460535 -13492122 -13458408 -13368447 -13220023
38627a3220023K26841L36681M77098O38290Q08019R74283J123295J237597J298238
$$ -13220023 -12993182 -12656501 -12179403 -11541113 -10733094 -9758811 -8635516 -7397919 -6099681
38618f099681J290778J211671J071556Q93647P08213N46274M34985L94114M31288
$$ -6099681 -4808903 -3597232 -2525676 -1632029 -923816 -377542 57443 451557 882845
38609H82845N36442O80057Q19337R10871R23483Q45829O87498M74513K40205J3768
$$ 882845 1419287 2099344 2918681 3829552 4753035 5598864 6286362 6760875 7001080 7014848
38599G014848j88366l63615n17413o55891p81911q94926r92497j071761j129467
$$ 7014848 6826482 6462867 5945454 5289563 4507652 3612726 2620229 1548468 419001
38590D19001j159638j150413j084968r49645p44741m88537k10307O1641L07215
$$ 419001 -740637 -1891050 -2976018 -3925663 -4670404 -5158941 -5369248 -5307607 -5000392
38581e000392N13820O72022P72989Q09363P78960O89738N62651M27509L11314
$$ -5000392 -4486572 -3814550 -3041561 -2232198 -1453238 -763500 -200849 226660 537974
38572E37974K26095J65579J13011N3245j9304r9654j75489k31733k55255k38902
$$ 537974 764069 929648 1042659 1095904 1076600 976946 801457 569724 314469 75567
38562G5567j83550r7613N131J08244J95560K54114K76484K62055K17214J54458
$$ 75567 -107983 -205596 -200465 -92221 103339 357453 633937 895992 1113206 1267664
38552A267664Q9626L6923L194j5485l2562o4978j24695k11412l10363l97134m47533
$$ 1267664 1357290 1394213 1397407 1381922 1349360 1284382 1159687 948275 637912 240778 -206755
38541b06755m47003l94371k99254j76485m1581R1614K12115L12763L90598M45513
$$ -206755 -653758 -1048129 -1347383 -1523868 -1565449 -1473835 -1261720 -948957 -558359 -112846
38531a12846M76571M77557M35827L38098J81423j8643k30294m17190n50787o15307
$$ -112846 363725 841282 1277109 1615207 1796630 1777987 1547693 1130503 579716 -35591
38521c5591o05824n25421l85080k04243q416J76329L28814M35791M92996N05507
$$ -35591 -641415 -1166836 -1551916 -1756159 -1764575 -1588246 -1259432 -823641 -330645 174862
38511A74862M86796M54611M23934M00472L78641L45268K87277K00382R4199j1148
$$ 174862 661658 1116269 1540203 1940675 2319316 2664584 2951861 3152243 3246442 3235294
38501C235294r7862j65135k33636l34685m91736p07381r62822j226175j461572
$$ 3235294 3137432 2972297 2738661 2403976 1912240 1204859 242037 -984138 -2445710
38492b445710j634437j714101j677843j518712j253688r24940n89186k98490q2553
$$ -2445710 -4080147 -5794248 -7472091 -8990803 -10244491 -11169431 -11758617 -12057107 -12139660
38483a2139660N8174J46149K12303K82053L68598M74389N96031P26898Q56555
$$ -12139660 -12081486 -11935337 -11723034 -11440981 -11072383 -10597994 -10001963 -9275065 -8418510
38474h418510R70699J055288J103852J122587J127759J135066J147673J152648
$$ -8418510 -7447811 -6392523 -5288671 -4166084 -3038325 -1903259 -755586 397062
38466C97062J129761J066154R65527Q45728P28246O27244N43240M62594L62184
$$ 397062 1526823 2592977 3558504 4404232 5132478 5759722 6302962 6765556 7127740
38457G127740K18051J5500k43279n38036q37023j107826j325882j476425j552039
$$ 7127740 7345791 7361291 7118012 6579976 5742953 4635127 3309245 1832820 280781
38448B80781j550915j477519j343004j163644r59255p53379n73111m45151l88024
$$ 280781 -1270134 -2747653 -4090657 -5254301 -6213556 -6966935 -7540046 -7985197 -8373221
38439h373221m04283m76960n72413o49205o70130o13396m79508k91455q6427R9750
$$ -8373221 -8777504 -9254464 -9826877 -10476082 -11146212 -11759608 -12239116 -12530571 -12616998 -12517248
38429a2517248K48038L60816M52051N31599N96398O33415O29348N80191M96882
$$ -12517248 -12269210 -11908394 -11456343 -10924744 -10328346 -9694931 -9065583 -8485392 -7988510
38420g988510M04696L34451L08341L28974L79808M36715M82061N11561N30487
$$ -7988510 -7583814 -7249363 -6941022 -6612048 -6232240 -5795525 -5313464 -4801903 -4271416
38411d271416N43588N47246N29977M80413L96082K86556J69821O5615r906m6382
$$ -4271416 -3727828 -3180582 -2650605 -2170192 -1774110 -1487554 -1317733 -1252118 -1262024 -1308406
38401a308406l9263J0389R5225K00714L05913L87171M24175M05742L32555K15927
$$ -1308406 -1347669 -1337280 -1242055 -1041341 -735428 -348257 75918 481660 814215 1030142
38391A030142P4261p0274j94577k78652l11293k94479k43198j80715j32256j19480
$$ 1030142 1104403 1034129 839552 560900 249607 -44872 -288070 -468785 -601041 -720521
38381g20521j56465k47239l84939n51941p21043q59939r40514r49453q92948p92461
$$ -720521 -876986 -1124225 -1509164 -2061105 -2782148 -3642087 -4582601 -5532054 -6425002 -7217463
38371g217463o76231n72848n07544m97281n43847o29785p22496p86004p94132
$$ -7217463 -7893694 -8466542 -8974086 -9471367 -10015214 -10644999 -11367495 -12153499 -12947631
38362a2947631p37802o23894m68658k91264j10357N7470J99541L09414L88663
$$ -12947631 -13685433 -14309327 -14777985 -15069249 -15179606 -15122136 -14922595 -14613181 -14224518
38353a4224518M47434N02811N72505O63475P61232Q29399Q23660P13413M98192
$$ -14224518 -13777084 -13274273 -12701768 -12038293 -11277061 -10447662 -9624002 -8910589 -8412397
38344h412397K09648j00567l78895n84159o93045o99019o10133m47736k42824
$$ -8412397 -8202749 -8303316 -8682211 -9266370 -9959415 -10658434 -11268567 -11716303 -11959127
38335a1959127k7832J72124L42038M73483N61015O03241O05542N78669N32755
$$ -11959127 -11986959 -11814835 -11472797 -10999314 -10438299 -9835058 -9229516 -8650847 -8118092
38326h118092M72221L96042L02399J93301P6296l6831j32713j98711k24161k01387
$$ -8118092 -7645871 -7249829 -6947430 -6754129 -6677833 -6714664 -6847377 -7046088 -7270249 -7471636
38316g471636j27546o734J49778L26257N06587O76815Q24757R37862J002062J004108
$$ -7471636 -7599182 -7605916 -7456138 -7129881 -6623294 -5946479 -5121722 -4183860 -3181798 -2177690
38306b177690R37407Q07973O35673M49011K76633J40417N2109J2159R771K5536
$$ -2177690 -1240283 -432310 203363 652374 929007 1069424 1121533 1133692 1143463 1168999
38296A168999L8082L2887Q261k5640n4173o6656o0535m0115j3208J0883K1910
$$ 1168999 1207081 1239968 1248229 1222589 1168416 1101760 1041225 1001110 987902 998785 1020695
38285A020695J0218k9067r0577j55813j97059j88896j22041j0393J14238K16070
$$ 1020695 1030913 1001846 911269 755456 558397 369501 247460 237067 351305 567375
38275E67375K68665K61604K01762J12925L3296O471O4466K09667M08209O02341
$$ 567375 836040 1097644 1299406 1412331 1445627 1452098 1516564 1726231 2134440 2736781
38265B736781P36042P77682P26143O00535M24871K18715l719k30128m47158o39987
$$ 2736781 3472823 4250505 4976648 5577183 6002054 6220769 6217050 5986922 5539764 4899777
38255D899777p93872q95914r36399r11250q26516p01365n63872m39445l39738
$$ 4899777 4105905 3209991 2273592 1362342 535826 -165539 -729411 -1168856 -1508594
38246a508594k60310j87031j04647k850J19703K52595L74131M57098M78008M25577
$$ -1508594 -1768904 -1955935 -2060582 -2063432 -1943729 -1691134 -1317003 -859905 -381897 43680
38236D3680L05473J39902l9064k01727l33270m38621n35592o40923p58669q77449
$$ 43680 349153 489055 449991 248264 -85006 -523627 -1059219 -1700142 -2458811 -3336260
38226c336260r75683j029768j021491r44141q06761o33958m58379l07359j90823
$$ -3336260 -4311943 -5341711 -6363202 -7307343 -8114104 -8748062 -9206441 -9513800 -9704623
38217i704623r8817j0962Q8734K02086L17312M16696M84567N12181N00059M58545
$$ -9704623 -9803440 -9814402 -9725668 -9523582 -9206270 -8789574 -8305007 -7792826 -7292767 -6834222
38207f834222M05946L64466L55663L95779M89845O25738P73701Q95722R61470
$$ -6834222 -6428276 -6063810 -5708147 -5312368 -4822523 -4196785 -3423084 -2527362 -1565892
38198a565892R60686R03716Q10279O94598N57231L89064J84114m8983k85852m95818
$$ -1565892 -605206 298510 1108789 1803387 2360618 2749682 2933796 2884813 2598961 2103143
38188B103143o53975p47434p73789p36028o39285m91395l05124r8455J08516K98139
$$ 2103143 1449168 701734 -72055 -808083 -1447368 -1938763 -2243887 -2342342 -2233826 -1935687
38178a935687M58196N81837O65214P04460O94102O29004N09485L45708J56970
$$ -1935687 -1477491 -895654 -230440 474020 1168122 1797126 2306611 2652319 2809289
38169B809289l4156k08317l52541m60026n28956n61910n65771n50962n28483n04666
$$ 2809289 2775133 2566816 2214275 1754249 1225293 663383 97612 -453350 -981833 -1486499
38159a486499m76865m34344l64629k60405j22554M0039K11283L69678M93407N67532
$$ -1486499 -1963364 -2397708 -2762337 -3022742 -3145296 -3105257 -2893974 -2524296 -2030889 -1463357
38149a463357N88838N65928N16616M64731M35882M51681N24634O55882Q34721
$$ -1463357 -874519 -308591 208025 672756 1108638 1560319 2084953 2740835 3575556
38140C575556J037682J228513J363169J401335J320311J124215Q43426N24208
$$ 3575556 4613238 5841751 7204920 8606255 9926566 11050781 11894207 12418415
38132A2418415K13692n2056k51971l77705m30943m22993l73893l07625k45491
$$ 12418415 12632107 12580051 12328080 11950375 11519432 11096439 10722546 10414921 10169430
38123A0169430k03074j92837k28131l22611m83261p01104r46135j171265j325290
$$ 10169430 9966356 9773519 9545388 9222777 8739516 8038412 7092277 5921012 4595722
38114D595722j369742j291791j107035q51332n66527k87127l3207J89606L85403
$$ 4595722 3225980 1934189 827154 -24178 -590705 -877832 -911039 -721433 -336030
38105c36030N61395P21605Q62991R76448J053258J093248J108206J116734J133325
$$ -336030 225365 946970 1809961 2786409 3839667 4932915 6041121 7157855 8291180
38096H291180J159116J180280J174168J118469R98540Q11224N66013K83994n828
$$ 8291180 9450296 10630576 11804744 12923213 13921753 14732977 15298990 15582984 15577156
38087A5577156k72470m89451o40338p23051p51535p51498p49356p60177p83636
$$ 15577156 15304686 14815235 14174897 13451846 12700311 11948813 11199457 10439280 9655644
38078I655644q10890q35527q59596q91821r41653j013306j101658j191742j263668
$$ 9655644 8844754 8009227 7149631 6257810 5316157 4302851 3201193 2009451 745783
38069G45783j301958j303728j279553j245935j214944j188953j164107j138114
$$ 745783 -556175 -1859903 -3139456 -4385391 -5600335 -6789288 -7953395 -9091509
38061i091509j113930j095452j080542j060268j026695r82224r41680r24768r43777
$$ -9091509 -10205439 -11300891 -12381433 -13441701 -14468396 -15450620 -16392300 -17317068 -18260845
38052a8260845r93746j050785j080653j054440r62729q19255o51757m86650l37291
$$ -18260845 -19254591 -20305376 -21386029 -22440469 -23403198 -24222453 -24874210 -25360860 -25698151
38043b5698151k01438o6797P9782K43962M19618N90877P40084Q57371R45445J016171
$$ -25698151 -25899589 -25966386 -25886604 -25642642 -25223024 -24632147 -23892063 -23034692 -22089247 -21073076
38033b1073076J082015J148721J213194J265811J294802J291205J252606J183132
$$ -21073076 -19991061 -18842340 -17629146 -16363335 -15068533 -13777328 -12524722 -11341590
38025a1341590J089219R75142Q42783O94751N35828L70971K04057M1011j05964
$$ -11341590 -10252371 -9277229 -8434446 -7739695 -7203867 -6832896 -6628839 -6587828 -6693792
38016f693792k19464k84183k94386k55828j82510r2108k188P3094J25564J53190
$$ -6693792 -6913256 -7197439 -7491825 -7747653 -7930163 -8022271 -8024459 -7951365 -7825801 -7672611
38006g672611J57633J41573J08630O5639K4092j749J320M3389J31907K70844M54984
$$ -7672611 -7514978 -7373405 -7264775 -7199136 -7175044 -7176793 -7175473 -7132084 -7000177 -6729333 -6274349
37995f274349O62390Q53225R79498J001880R04785P02845M36290J56887q9029
$$ -6274349 -5611959 -4758734 -3779236 -2777356 -1872571 -1169726 -733436 -576549 -665578
37986f65578k71160l74703l93992l29819j93267r848J82438L40966M28473M22378
$$ -665578 -936738 -1311441 -1705433 -2035252 -2228519 -2238367 -2055929 -1714963 -1286490 -864112
37976h64112L20875J42500q1175l14230n21256o70045p37669p19476o32867n09709
$$ -864112 -543237 -400737 -481912 -796142 -1317398 -1987443 -2725112 -3444588 -4077455 -4587164
37966d587164l81387k66708j69393q3609j339Q3479J74714K74858L83948M96726
$$ -4587164 -4968551 -5235259 -5404652 -5488261 -5489600 -5406121 -5231407 -4956549 -4572601 -4075875
37956d075875O00977O79822P17948P08717O57970N81916N00351M29960L81960
$$ -4075875 -3474898 -2795076 -2077128 -1368411 -710441 -128525 371826 801786 1183746
37947A183746L63603L79863M33046N21223O36801P64663Q79809R47421R29197
$$ 1183746 1547349 1927212 2360258 2881481 3518282 4282945 5162754 6110175 7039372
37938G039372P96194N43040J95583j93845n62924q59798j056722j151357j158653
$$ 7039372 7835566 8378606 8574189 8380344 7817420 6957622 5900900 4749543 3590890
37929C590890j100576r98440q68666p22164n67781m17507k88088j95983j49186
$$ 3590890 2490314 1491874 623208 -98956 -666737 -1084244 -1372332 -1568315 -1717501
37920a717501j43061j62928j89672k03720j87417j28578k5485J10199K55354L81495
$$ -1717501 -1860562 -2023490 -2213162 -2416882 -2604299 -2732877 -2758362 -2648163 -2392809 -2011314
37910b011314M62542M82230M39042L45784K23421R3053k8761j30478k05027k50247
$$ -2011314 -1548772 -1066542 -627500 -281716 -58295 34758 5997 -124481 -329508 -579755
37900e79755k68698k65025k42653k03029j48201q4165k1796K6172N0764N1120
$$ -579755 -848453 -1113478 -1356131 -1559160 -1707361 -1791526 -1813322 -1787150 -1736386 -1685266
37890a685266L3547N315l1879q3506j58453k63515l98974n56163p18405q67193
$$ -1685266 -1651719 -1646404 -1678283 -1761789 -1920242 -2183757 -2582731 -3138894 -3857299 -4724492
37880d724492r91716j094245j185078j269845j340502j379081j371491j318907
$$ -4724492 -5716208 -6810453 -7995531 -9265376 -10605878 -11984959 -13356450 -14675357
37872a4675357j235977j137267j024180q84472p04990m86304k46965j5469J81486
$$ -14675357 -15911334 -17048601 -18072781 -18957253 -19662243 -20148547 -20395512 -20410981 -20229495
37863b0229495L26027M10899M40116M28616L97215L62976L32568L05293K82425
$$ -20229495 -19903468 -19492569 -19052453 -18623837 -18226622 -17863646 -17531078 -17225785 -16943360
37854a6943360K72404K86319L28981L94514M68950N35142N75541N74152N21301
$$ -16943360 -16670956 -16384637 -16055656 -15661142 -15192192 -14657050 -14081509 -13507357 -12986056
37845a2986056M20840K93757J72569Q8162N7710Q1422J48540K46392L65796N00210
$$ -12986056 -12565216 -12271459 -12098890 -12010728 -11953018 -11871596 -11723056 -11476664 -11110868 -10610658
37835a0610658O40758P72584Q77376R41664R64100R54832R27765Q92918Q54384
$$ -10610658 -9969900 -9197316 -8319940 -7378276 -6414176 -5459344 -4531579 -3638661 -2784277
37826b784277Q12718P67836P20716O73883O30324N90935N52909N10967M59933
$$ -2784277 -1971559 -1203723 -483007 190876 821200 1412135 1965044 2476011 2935944
37817B935944L95588L13463K08181P5515q3362k57816m27094n65627o53090o83077
$$ 2935944 3331532 3644995 3853176 3928691 3845329 3587513 3160419 2594792 1941702 1258625
37807A258625o63859o11009n38444m54584l64532k74092j90768j20417o2444q407
$$ 1258625 594766 -16243 -554687 -1009271 -1373803 -1647895 -1838663 -1959080 -2021524 -2029931
37797b029931N3445J30625K21463L15928M00678M64813N03991N21690N27227N31225
$$ -2029931 -1976486 -1845861 -1624398 -1308470 -907792 -442979 61012 582702 1109929 1641154
37787A641154N40715N55939N69883N70653N46076M88511L97209K77475J38839
$$ 1641154 2181869 2737808 3307691 3878344 4424420 4912931 5310140 5587615 5726454
37778E726454n495j38547k41472k98485l02200k55576j69055n5070P6623K20800
$$ 5726454 5720959 5582412 5340940 5042455 4740255 4484679 4315624 4260554 4337177 4557977
37768D557977L75973N41294P11694Q73391J003832J078340J079973J005700Q64655
$$ 4557977 4933950 5475244 6186938 7060329 8064161 9142501 10222474 11228174 12092829
37759A2092829O70878M36516J69721j22867m32365p45791j046463j314750j528463
$$ 12092829 12763707 13200223 13369944 13247077 12814712 12068921 11022458 9707708 8179245
37750H179245j665383j709798j659784j529013j341141j121704q93007o72410
$$ 8179245 6513862 4804064 3144280 1615267 274126 -847578 -1740585 -2412995
37742b412995m71443k95041j42407r560J07884K12405L02677L72929M14827M20734
$$ -2412995 -2884438 -3179479 -3321886 -3331446 -3223562 -3011157 -2708480 -2335551 -1920724 -1499990
37732a499990L86004L09941J97274N9993q3512k13863l17945l93547m49590n02640
$$ -1499990 -1113986 -804045 -606771 -546778 -630290 -844153 -1162098 -1555645 -2005235 -2507875
37722b507875n70225o61798p71228q76468r48311r63204r11859p98987o36143
$$ -2507875 -3078100 -3739898 -4511126 -5387594 -6335905 -7299109 -8210968 -9009955 -9646098
37713i646098m33945j99306O0884L33303N95541Q21649R93604J110253J185821
$$ -9646098 -10080043 -10279349 -10218465 -9885162 -9289621 -8467972 -7474368 -6364115 -5178294
37704e178294J237744J272116J277182J229399J108104R09474O51409L66842R0068
$$ -5178294 -3940550 -2668434 -1391252 -161853 946251 1855725 2507134 2873976 2964044
37695B964044j54884l56659n09684o05142o28709n68171m25452k23514k661J91174
$$ 2964044 2809160 2452501 1942817 1337675 708966 140795 -284657 -508171 -510832 -319658
37685c19658L19372L60074L13130J99576N4038q8541k04574k84586l27405l33787
$$ -319658 -286 359788 672918 872494 926532 837991 633417 348831 21426 -312361
37675c12361l05907k50940j81986j13074n1911L424O0668J24934J91715K47063
$$ -312361 -618268 -869208 -1051194 -1164268 -1216179 -1212755 -1152087 -1027153 -835438 -588375
37665e88375K75826K72170K44223K09218J83417J74665J81439J95956K07319K03737
$$ -588375 -312549 -40379 203844 413062 596479 771144 952583 1148539 1355858 1559595
37655A559595J75357J17625L2880p0833j81546k83854l59947l94505l82602l34656
$$ 1559595 1734952 1852577 1885457 1814624 1633078 1349224 989277 594772 212170 -122486
37645a22486k73356k23781k02704k12536k41844k71409k83024k66913k24362j65398
$$ -122486 -395842 -619623 -822327 -1034863 -1276707 -1548116 -1831140 -2098053 -2322415 -2487813
37635b487813j04413n6102l1687l4772n8485q7031j02660r4121o0586q239N6445
$$ -2487813 -2592226 -2648328 -2680015 -2714787 -2773272 -2860303 -2962963 -3057084 -3117670 -3125909 -3069464
37624c069464J29415K05030K70970L09941L08585K65322J90054R7572J956q4623
$$ -3069464 -2940049 -2735019 -2464049 -2154108 -1845523 -1580201 -1390147 -1292575 -1290619 -1375242
37614a375242j51356j89436j93623j63978j08251m3617O774K4427P132k8767n9320
$$ -1375242 -1526598 -1716034 -1909657 -2073635 -2181886 -2225503 -2218729 -2194302 -2187170 -2215937 -2275257
37603b275257o9703o4739o6149r8842j75135k86892m11064n25257o22719p15920
$$ -2275257 -2344960 -2409699 -2475848 -2574690 -2749825 -3036717 -3447781 -3973038 -4595757 -5311677
37593e311677q26264r67121j131473j291470j409665j455507j418088j308051
$$ -5311677 -6137941 -7105062 -8236535 -9528005 -10937670 -12393177 -13811265 -15119316
37585a5119316j147832r57462p46444n16900k73064k7335K02122L99087N56094
$$ -15119316 -16267148 -17224610 -17971054 -18487954 -18761018 -18788353 -18586231 -18187144 -17631050
37576a7631050O76965P74808Q66213R63312J067471J168254J248024J289420J282369
$$ -17631050 -16954085 -16179277 -15313064 -14349752 -13282281 -12114027 -10866003 -9576583 -8294214
37567h294214J228258J139499J034367R29992Q38078P65209P15460O91825O95074
$$ -8294214 -7065956 -5926457 -4892090 -3962098 -3124020 -2358811 -1643351 -951526 -256452
37558b56452P21495P61871Q03217Q33013Q43403Q32476Q01724P51457O77180N69746
$$ -256452 465043 1226914 2030131 2863144 3706547 4539023 5340747 6092204 6769384 7339130
$$ [...]
##END NTUPLES=NMR SPECTRUM
##END=
