##TITLE=31Pdec_DE-43_EA_TFA
 CDCl3
 24 sc
 2.4.2024
##JCAMPDX= 6.0         $$ Bruker NMR JCAMP-DX V2.0
##DATA TYPE= NMR SPECTRUM
##DATA CLASS= NTUPLES
##ORIGIN= UXNMR, Bruker Analytische Messtechnik GmbH
##OWNER= root
$$ XWIN-NMR		Version 3.5
$$ Tue Apr  2 16:17:24 2024 Russian Standard Time (UT+4h)  she@DPX200
##.OBSERVE FREQUENCY= 81.013821
##.OBSERVE NUCLEUS= ^31P
##.ACQUISITION MODE= SIMULTANEOUS
##.ACQUISITION SCHEME= undefined
##.AVERAGES= 24
##.DIGITISER RES= 16
##SPECTROMETER/DATA SYSTEM= spect
##.PULSE SEQUENCE= zgpg30
##.SOLVENT NAME= D2O
##.SHIFT REFERENCE= (INTERNAL, D2O, 0, 248.564)
##AUDIT TRAIL= $$ (NUMBER, WHEN, WHO, WHERE, WHAT)
$$ ##TITLE= Audit trail, XWIN-NMR		Version 3.5
$$ ##JCAMPDX= 5.01
$$ ##ORIGIN= Bruker BioSpin GmbH
$$ ##OWNER= she
$$ F:/spectra/data/she/nmr/P31/1/pdata/1/auditp.txt
$$ ##AUDIT TRAIL=  $$ (NUMBER, WHEN, WHO, WHERE, WHAT)
(   1,<2024-04-02 16:16:17.18 +0400>,<she>,<DPX200>,
      <created by zg, POWCHK disabled, PULCHK disabled
       configuration hash MD5:
       00 E9 B6 7A A2 85 ED C7 34 08 36 98 17 FE 4E 26
       data hash MD5: 32K
       51 45 D3 80 B8 E5 75 30 61 C5 6B DA 67 90 27 D7>)
(   2,<2024-04-02 16:16:22.53 +0400>,<she>,<DPX200>,
      <Start of raw data processing
       efp BC_mod = 2 LB = 10 FT_mod = 6 PKNL = 1 PHC0 = -13253.43 PHC1 = 90.88333 SI = 64K 
       data hash MD5: 64K
       0C E7 C8 89 E0 CE 3D 73 F3 B6 C5 31 0F A4 4A 83>)
(   3,<2024-04-02 16:16:37.37 +0400>,<she>,<DPX200>,
      <pk PHC0 = 29.9335 PHC1 = 0 
       data hash MD5: 64K
       8A 0C 5D CD 57 B5 E5 DF 02 01 FB 54 56 52 75 A3>)
$$ ##END=
$$ 
$$ hash MD5
$$ DE 14 0D B7 BD 2A 3B A7 6D 11 1A B6 1D 7C 40 9B
##$RELAX= 
##$RELAX= 
##$RELAX= 
##$RELAX= 
##$RELAX= 
##$RELAX= 
##$RELAX= 
##$RELAX= 
##$RELAX= 
$$ Bruker specific parameters
$$ --------------------------
##$DU= <F:/spectra>
##$EXPNO= 1
##$NAME= <P31>
##$PROCNO= 1
##$TYPE= <nmr>
##$USER= <she>
##$AMP= (0..31)
100 100 100 100 100 100 100 100 100 100 100 100 100 100 100 100 100 100 
100 100 100 100 100 100 100 100 100 100 100 100 100 100 
##$AQSEQ= 0
##$AQ_mod= 1
##$AUNM= <au_zg>
##$AUTOPOS= <>
##$BF1= 81.014009
##$BF2= 200.13
##$BF3= 200.13
##$BF4= 200.13
##$BF5= 200.13
##$BF6= 200.13
##$BF7= 200.13
##$BF8= 200.13
##$BYTORDA= 1
##$CFDGTYP= 0
##$CFRGTYP= 5
##$CHEMSTR= <none>
##$CNST= (0..31)
1 1 145 1 1 1 1 1 1 1 1 1 1 1 1 1 1 1 1 1 1 1 1 1 1 1 1 1 1 1 1 1 
##$CPDPRG= <waltz16>
##$CPDPRG1= <>
##$CPDPRG2= <waltz16>
##$CPDPRG3= <>
##$CPDPRG4= <mlev>
##$CPDPRG5= <mlev>
##$CPDPRG6= <mlev>
##$CPDPRG7= <mlev>
##$CPDPRG8= <mlev>
##$CPDPRGB= <>
##$CPDPRGT= <>
##$D= (0..31)
0 1 0 0 0 0 0 0 0 0 0 0.03 2e-05 3e-06 0 0 0 0 0 0 0 0 0 0 0 0 0 0 0 0 
0 0 
##$DATE= 1712060176
##$DBL= (0..7)
120 120 120 11 120 120 24 19 
##$DBP= (0..7)
150 150 150 150 150 150 150 150 
##$DBP07= 0
##$DBPNAM0= <>
##$DBPNAM1= <>
##$DBPNAM2= <>
##$DBPNAM3= <>
##$DBPNAM4= <>
##$DBPNAM5= <>
##$DBPNAM6= <>
##$DBPNAM7= <>
##$DBPOAL= (0..7)
0.5 0.5 0.5 0.5 0.5 0.5 0.5 0.5 
##$DBPOFFS= (0..7)
$$ [...]
##$SUBNAM2= <"">
##$SUBNAM3= <"">
##$SUBNAM4= <"">
##$SUBNAM5= <"">
##$SUBNAM6= <"">
##$SUBNAM7= <"">
##$SUBNAM8= <"">
##$SUBNAM9= <"">
##$SW= 501.771253377433
##$SWIBOX= (0..15)
0 1 3 0 0 0 0 0 0 0 0 0 0 0 0 0 
##$SW_h= 40650.406504065
##$TD= 32768
##$TD0= 1
##$TE= 0
##$TE2= 300
##$TE3= 300
##$TEG= 300
##$TL= (0..7)
0 120 53 12 22 120 120 120 
##$TP= (0..7)
150 150 150 150 150 150 150 150 
##$TP07= 0
##$TPNAME0= <>
##$TPNAME1= <>
##$TPNAME2= <>
##$TPNAME3= <>
##$TPNAME4= <>
##$TPNAME5= <>
##$TPNAME6= <>
##$TPNAME7= <>
##$TPOAL= (0..7)
0.5 0.5 0.5 0.5 0.5 0.5 0.5 0.5 
##$TPOFFS= (0..7)
0 0 0 0 0 0 0 0 
##$TUNHIN= 0
##$TUNHOUT= 0
##$TUNXOUT= 0
##$USERA1= <user>
##$USERA2= <user>
##$USERA3= <user>
##$USERA4= <user>
##$USERA5= <user>
##$V9= 5
##$VALIST= <valist>
##$VCLIST= <CCCCCCCCCCCCCCC>
##$VD= 0
##$VDLIST= <DDDDDDDDDDDDDDD>
##$VPLIST= <PPPPPPPPPPPPPPP>
##$VTLIST= <TTTTTTTTTTTTTTT>
##$WBST= 1024
##$WBSW= 4
##$XGAIN= (0..3)
0 0 0 0 
##$XL= 0
##$YL= 0
##$YMAX_a= 2210
##$YMIN_a= -2085
##$ZGOPTNS= <>
##$ZL1= 120
##$ZL2= 120
##$ZL3= 120
##$ZL4= 120
##$ABSF1= 0
##$ABSF2= 0
##$ABSG= 0
##$ABSL= 0
##$ALPHA= 0
##$AQORDER= 0
##$ASSFAC= 0
##$ASSFACI= 0
##$ASSFACX= 0
##$ASSWID= 0
##$AUNMP= <proc_1d>
##$AZFE= 0.1
##$AZFW= 0.5
##$BCFW= 0
##$BC_mod= 2
##$BYTORDP= 0
##$COROFFS= 0
##$CY= -3
##$DATMOD= 1
##$DC= 0
##$DFILT= <>
##$DTYPP= 0
##$F1P= 0
##$F2P= 0
##$FCOR= 1
##$FTSIZE= 65536
##$FT_mod= 6
##$GAMMA= 0
##$GB= 0
##$INTBC= 1
##$INTSCL= 6.047779e-11
##$ISEN= 30
##$LB= 10
##$LEV0= 0
##$LPBIN= 0
##$MAXI= 10000
##$MC2= 0
##$MEAN= 0
##$ME_mod= 0
##$MI= 50
##$NCOEF= 0
##$NC_proc= -9
##$NLEV= 6
##$NOISF1= 182.463
##$NOISF2= 159.3651
##$NSP= 0
##$NTH_PI= 0
##$NZP= 0
##$OFFSET= 248.5645
##$PC= 4
##$PHC0= -13223.5
##$PHC1= 90.88333
##$PH_mod= 1
##$PKNL= yes
##$PPARMOD= 0
##$PSCAL= 0
##$PSIGN= 0
##$REVERSE= no
##$SF= 81.0140089999694
##$SI= 65536
##$SIGF1= 159.3651
##$SIGF2= -187.1042
##$SINO= 113.3802
##$SIOLD= 16384
##$SREGLST= <1H.CDCl3>
##$SSB= 0
##$STSI= 65536
##$STSR= 0
##$SW_p= 40650.406504065
##$SYMM= 0
##$S_DEV= 0
##$TDeff= 32768
##$TDoff= 0
##$TI= <>
##$TILT= no
##$TM1= 0
##$TM2= 0
##$TOPLEV= 0
##$USERP1= <user>
##$USERP2= <user>
##$USERP3= <user>
##$USERP4= <user>
##$USERP5= <user>
##$WDW= 1
##$XDIM= 65536
##$YMAX_p= 451077473
##$YMIN_p= -25591118
$$ End of Bruker specific parameters
$$ ---------------------------------
##NTUPLES= NMR SPECTRUM
##VAR_NAME=  FREQUENCY,     SPECTRUM/REAL,   SPECTRUM/IMAG
##SYMBOL=    X,             R,               I
##VAR_TYPE=  INDEPENDENT,   DEPENDENT,       DEPENDENT
##VAR_FORM=  AFFN,          ASDF,            ASDF
##VAR_DIM=   65536,         65536,           65536
##UNITS=     HZ,            ARBITRARY UNITS, ARBITRARY UNITS
##FACTOR=    0.620285442955139, 1,           1
##FIRST=     20137.2065510682, 0,            0
##LAST=      -20513.1999529968, 0,           0
##MIN=       -20513.1999529968, -25591118,   0
##MAX=       20137.2065510682, 451077473,    0
$$ Real data points
##PAGE= N=1
##DATA TABLE= (X++(R..R)), XYDATA
$$ [...]
42577e916604k58707k58308k45945k16967j71177j12615m7319J9340Q3598J42189
42567f982515J91269K27237K48911K58640K61078K60669K59857K58890K56731
42558d759233K52087K43942K31533K14291J92145J65793J36190J03633O7951L0633
42548c121035k952k4176k5257l726L6562Q8518J45971K05574K66111L26974L87218
42537a720218M44876M96405N37117N63158N73381N68863N50330N16536M65845
42528B996293L99211L20897K35856J46548N2461m7523j52538k58937l60711m49652
42518B881905n15490n47828n40483m95798m25609l47966k81654k40822k30763
42509g44508k45921k71806k91282k92323k72477k37564j96429j56134j20915r4606
$$ y = [-5916604, -6175311, -6433619, -6679564, -6896531, -7067708, -7180323, -7227642, -7208302, -7124704, -6982515, -6791246, -6564009, -6315098, -6056458, -5795380, -5534711, -5274854, -5015964, -4759233, -4507146, -4263204, -4031671, -3817380, -3625235, -3459442, -3323252, -3219619, -3151668, -3121035, -3123987, -3148163, -3173420, -3177146, -3140584, -3052066, -2906095, -2700521, -2434410, -2107436, -1720218, -1275342, -778937, -241820, 321338, 894719, 1463582, 2013912, 2530448, 2996293, 3395504, 3716401, 3952257, 4098805, 4151266, 4103743, 3951205, 3692268, 3331557, 2881905, 2366415, 1818587, 1278104, 782306, 356697, 8731, -272923, -513745, -744508, -990429, -1262235, -1553517, -1845840, -2118317, -2355881, -2552310, -2708444, -2829359, -2923965]
42499b923965q2918r1563j20453j59193j89340j93177j62920j03989l1078L9488
42489d019108R6125J33736J50807J45129J12647N0847l6493j37683k35981l14792
42479d054766l62327l74322l54212l10432k51756j83405j06406k0320P3335J70023
42469e774588K64202L52504M35164N14571N92126O65771P29350P73680P88452
42460f58768P64474O95937N82210M28544K45495M7653j47571l21064m54236n33130
42450F49544n53256n22250m58149l83425l17313k69553k38471k14448j86955j50807
42440b645083j08331o7529l8772l1768n2736j01556j70007k42570l00418l27686
42430d086456l17586k75129k14385j51472r7364n4318j7080K2651P1129J29335
$$ y = [-2923965, -3006883, -3098446, -3218899, -3378092, -3567432, -3760609, -3923529, -4027518, -4058596, -4019108, -3922983, -3789247, -3638440, -3493311, -3380664, -3329817, -3366310, -3503993, -3739974, -4054766, -4417093, -4791415, -5145627, -5456059, -5707815, -5891220, -5997626, -6017946, -5944611, -5774588, -5510386, -5157882, -4722718, -4208147, -3616021, -2950250, -2220900, -1447220, -658768, 105706, 801643, 1383853, 1812397, 2057892, 2105545, 1957974, 1636910, 1182674, 649544, 96288, -425962, -884111, -1267536, -1584849, -1854402, -2092873, -2307321, -2494276, -2645083, -2753414, -2820943, -2859715, -2891483, -2944219, -3045775, -3215782, -3458352, -3758770, -4086456, -4404042, -4679171, -4893556, -5045028, -5142392, -5196710, -5213790, -5191139, -5120010, -4990675]
42420d990675J92925K54475L05766L39226L49601L36551L06224K69377K36528
42411b400002K13699K01474J96955J96420J96955J96434J92052J78587J48450
42402f78976R4337J3218r0883k06798l18709m10307m69266m90357m75575m31470
42392c464786l65463k83470j89593q6962K1501J32749K42913L45837M32037M90184
42382b725053N11578M95016M48174L84088L15242K49369J89137J34467Q4965M1047
42372A28030M324k1938l2687k2779R306N8108J11473J55418J80860J87845J84626
42361I42586J82279J87953K00407K10042K03103J67673R8522r71j20173k44889
42351A826532l61573m60010n33772n79438n96033n84885n49270m93858m24747
$$ y = [-4990675, -4797750, -4543275, -4237509, -3898283, -3548682, -3212131, -2905907, -2636530, -2400002, -2186303, -1984829, -1787874, -1591454, -1394499, -1198065, -1006013, -827426, -678976, -584639, -571421, -662304, -869102, -1187811, -1598118, -2067384, -2557741, -3033316, -3464786, -3830249, -4113719, -4303312, -4390274, -4368773, -4236024, -3993111, -3647274, -3215237, -2725053, -2213475, -1718459, -1270285, -886197, -570955, -321586, -132449, 2018, 86983, 128030, 132354, 110416, 77729, 54950, 64256, 122364, 233837, 389255, 570115, 757960, 942586, 1124865, 1312818, 1513225, 1723267, 1926370, 2094043, 2192565, 2191594, 2071421, 1826532, 1464959, 1004949, 471177, -108261, -704294, -1289179, -1838449, -2332307, -2757054]
42342b757054l49971k79187k21730j84053j67977j70051j81827j91446j87055
42333d690351j60770j10703m0070M5106J37903K32053L23868M13415N02857N92099
42323b754593O75394P42316P82191P87664P55068O83688N76983M44970L03965
42314B997646J72245O4601j0495n0945o0298m6758k0636R230L7218N8982O8288
42303C219078N7075K0035l9904j10574j75977k24488k53667k68481k75679k79989
42293A667429k84710k94104l13603l46917l92508m42128m82510m99681m84528
42284a873260m37208l67950k93396k30062j88018j67762j61482j57613j45912
42275d022663j20777q2276l5451J1935N3048Q5589J13181J43361J83166K34531
$$ y = [-2757054, -3107025, -3386212, -3607942, -3791995, -3959972, -4130023, -4311850, -4503296, -4690351, -4851121, -4961824, -5001894, -4956788, -4818885, -4586832, -4262964, -3849549, -3346692, -2754593, -2079199, -1336883, -554692, 232972, 988040, 1671728, 2248711, 2693681, 2997646, 3169891, 3234492, 3223997, 3173052, 3112754, 3065996, 3045360, 3054590, 3091808, 3150790, 3219078, 3276153, 3296188, 3256284, 3145710, 2969733, 2745245, 2491578, 2223097, 1947418, 1667429, 1382719, 1088615, 775012, 428095, 35587, -406541, -889051, -1388732, -1873260, -2310468, -2678418, -2971814, -3201876, -3389894, -3557656, -3719138, -3876751, -4022663, -4143440, -4225716, -4261167, -4249232, -4196184, -4110595, -3997414, -3854053, -3670887, -3436356]
42265c436356K91919L44029L79115L90498L78010L44831K93514K25114J41203
42256f48123M5936n3515j47573k25714k79515l06623l12688l09008l07248l14949
42246b859020l33583l58282l78354l79813l50917k88259j98629r4484J3321J19407
42236e108613K21669L16054L93654M42722M54226M27173L70332K99230K30241
42227a953312J75669J42448J33497J48741J84187K30889K76199L07504L16156
42218c8022K99278K58891J99616J26842M6392l4787j08680j67955k08089k27685
42208A45801k26586k04323j61429j03063m1245P358K7799J3734k9037q4268j31209
42197g86468j51786j35726q1892L194J07676K16651L15106L91644M41227M64870
$$ y = [-3436356, -3144437, -2800408, -2421293, -2030795, -1652785, -1307954, -1014440, -789326, -648123, -602187, -655702, -803275, -1028989, -1308504, -1615127, -1927815, -2236823, -2544071, -2859020, -3192603, -3550885, -3929239, -4309052, -4659969, -4948228, -5146857, -5241341, -5228020, -5108613, -4886944, -4570890, -4177236, -3734514, -3280288, -2853115, -2482783, -2183553, -1953312, -1777643, -1635195, -1501698, -1352957, -1168770, -937881, -661682, -354178, -38022, 261256, 520147, 719763, 846605, 892997, 858210, 749530, 581575, 373486, 145801, -80785, -285108, -446537, -549600, -590845, -583487, -555688, -541954, -570991, -655259, -786468, -938254, -1073980, -1155872, -1152678, -1045002, -828351, -513245, -121601, 319626, 784496]
42187G84496M66679M50943M21151L80139L29368K67386J89548R0680l0410j67584
42177C182396l07574m33667n30811n89792o09056n93943n53778m97863m31990
42168a366078l57272k71976j75456p1863K8712J12833J69021J92759J87943J64130
42158a387247J31911R9484P1513M9898L6039L3906N1140R5162J65450K48463L21029
42147h3252L60720L55488L06582K25212J27311K9319n4928j16453j51798j61490
42137H36711j47385j11129n4965J6238R4525J71462K41833L04752L60786M07886
42127B120714M39990M49466M31196L85358L17478K36130J49994O6211r525p2749
42117D514263j21602j58799j91315k26518k67136l08733l41377l54183l40104
$$ y = [784496, 1251175, 1702118, 2123269, 2503408, 2832776, 3100162, 3289710, 3380390, 3349980, 3182396, 2874822, 2441155, 1910344, 1320552, 711496, 117553, -436225, -934088, -1366078, -1723350, -1995326, -2170782, -2242645, -2213933, -2101100, -1932079, -1739320, -1551377, -1387247, -1255336, -1155852, -1084339, -1034441, -998402, -964496, -913356, -818194, -652744, -404281, -83252, 277468, 632956, 939538, 1164750, 1292061, 1321380, 1266452, 1149999, 998201, 836711, 689326, 578197, 523232, 539470, 633995, 805457, 1047290, 1352042, 1712828, 2120714, 2560704, 3010170, 3441366, 3826724, 4144202, 4380332, 4530326, 4596537, 4587012, 4514263, 4392661, 4233862, 4042547, 3816029, 3548893, 3240160, 2898783, 2544600, 2204496]
42108B204496k98799k36681j64499r3711l2910J4570N1024Q2534J15741J54706
42098A796471J98685K41229K71714K80017K62397K23900J74336J20653O2416n603
42088C626215q6425j76041k65014l44653m12033m69854n22061n69295o06874o25125
42078d51160o11495n54905m52001l11765j54470m852J16211J97050K36430K41879
42068a749078K26533K05353J91480J93280K12232K42238K71515K87493K82698
42059C63744K58236K22620J86948J59605J43490J36225J31774J21997R8437N5111
42049A878187q405q5637j64518k30226k68434k68936k29441j57538o8765J8599
42039D14886Q9159J34167J53289J54385J50465J53601J68407J89115K02200J92685
$$ y = [2204496, 1905697, 1669016, 1504517, 1410806, 1377896, 1392466, 1443490, 1526024, 1641765, 1796471, 1995156, 2236385, 2508099, 2788116, 3050513, 3274413, 3448749, 3569402, 3631818, 3626215, 3539790, 3363749, 3098735, 2754082, 2342049, 1872195, 1350134, 780839, 173965, -451160, -1062655, -1617560, -2069561, -2381326, -2535796, -2540648, -2424437, -2227387, -1990957, -1749078, -1522545, -1317192, -1125712, -932432, -720200, -477962, -206447, 81046, 363744, 621980, 844600, 1031548, 1191153, 1334643, 1470868, 1602642, 1724639, 1823076, 1878187, 1869782, 1784145, 1619627, 1389401, 1120967, 852031, 622590, 465052, 396287, 414886, 504045, 638212, 791501, 945886, 1096351, 1249952, 1418359, 1607474, 1809674, 2002359]
42029B002359J50324P2973l3413j57306k85208m04504n04296n74801o07730n99044
42019i40646n52350m79277l95279l13492k40822j77928j21436o6025o037O2330
42009c230962J38227K14763K81108L27554L50167L51874L39777L21123L00414
42000f05955K78493K53340K22005J82718J35753Q2901K6914k7683p3522j01743
41990C73221j06341q8569n7501k6351p531r572l6083q5217j49504k17519k77939
41979f88906l23604l52684l66529l66788l54265l29717k95231k54653k12555j72275
41969c717207j34642r8787o4441l3286p513J3252L3659O1263J02861J60995K32605
41958c451241L10136L83742M42693M75561M70765M18987L17042J70985l665j85163
$$ y = [2002359, 2152683, 2225656, 2192243, 2034937, 1749729, 1345225, 840929, 266128, -341602, -940646, -1492996, -1972273, -2367552, -2681044, -2921866, -3099794, -3221230, -3287255, -3293292, -3230962, -3092735, -2877972, -2596864, -2269310, -1919143, -1567269, -1227492, -906369, -605955, -327462, -74122, 147883, 330601, 466354, 549255, 576169, 548486, 474964, 373221, 266880, 178311, 120810, 94459, 86928, 77356, 41273, -43944, -193448, -410967, -688906, -1012510, -1365194, -1731723, -2098511, -2452776, -2782493, -3077724, -3332377, -3544932, -3717207, -3851849, -3950636, -4015077, -4048363, -4055876, -4042624, -4008965, -3947702, -3844841, -3683846, -3451241, -3141105, -2757363, -2314670, -1839109, -1368344, -949357, -632315, -461330, -464995, -650158]
41948f50158l51277m85217n78941o32664o51813o43790o15378n70630n10091m32767
41938f122726l39997k37893j36171m5033K7211P5587J00504J09579J16041J32520
41928f320378J64021K05490K45383K71701K76316K56561K15487J61432J05930
41919d418057N9585K8121J1474O281R146J8187L2694N2472P7272J05541J32264
41908c885020J47740J39753R9377K7424o2734j48187k03896k10836j61602o2192
41898d320173O9725K09228L29817M08611M29822L86431K80834J24763o1755k52747
41888b395444m19789n36188n81365n44909m29549k52162m1639J67009L41434M60702
41878d231900N19991N28762N03462M59385M06537L51149K99803K61419K44884
$$ y = [-650158, -1001435, -1486652, -2065593, -2698257, -3350070, -3993860, -4609238, -5179868, -5689959, -6122726, -6462723, -6700616, -6836787, -6881820, -6854609, -6779022, -6678518, -6568939, -6452898, -6320378, -6156357, -5950867, -5705484, -5433783, -5157467, -4900906, -4685419, -4523987, -4418057, -4358472, -4330351, -4318877, -4312596, -4303450, -4285263, -4252569, -4200097, -4122825, -4017284, -3885020, -3737280, -3597527, -3498150, -3470726, -3533460, -3681647, -3885543, -4096379, -4257981, -4320173, -4250448, -4041220, -3711403, -3302792, -2872970, -2486539, -2205705, -2080942, -2142697, -2395444, -2815233, -3351421, -3932786, -4477695, -4907244, -5159406, -5201045, -5034036, -4692602, -4231900, -3711909, -3183147, -2679685, -2220300, -1813763, -1462614, -1162811, -901392, -656508]
41869f56508K53989K83098L16262L30954L06166K32151J16520j7547j40239k25751
41859G99095k59387k39925j78609r5683j4361M6699P9632Q9629R2171J05891J43269
41848E68421K03110K69378L17956L27837K90217K10864J06055m168j01752j73993
41838B013925k15042k26263k15090j91670j64127j35601j05786p5812n1691m2566
41828E90277n5114q8795j35079j80168k09408k12425j87744j44401r8453o5683
41818g86993n4835o4943q7442j11469j29940j43595j60301j89250k33559k86609
41808b248936l34752l64314l67888l46350l06404k56232k01988j46588r0441l2948
41798d696841K6239Q6529J46327K03546K56540L04646L47434L82915M06230M10613
$$ y = [-656508, -402519, -119421, 196841, 527795, 833961, 1066112, 1182632, 1165085, 1024846, 799095, 539708, 299783, 121174, 25491, 11130, 57829, 137461, 227090, 319261, 425152, 568421, 771531, 1040909, 1358865, 1686702, 1976919, 2187783, 2293838, 2289670, 2187918, 2013925, 1798883, 1572620, 1357530, 1165860, 1001733, 866132, 760346, 684534, 632843, 590277, 535163, 446368, 311289, 131121, -78287, -290712, -478456, -622857, -721310, -786993, -841828, -906771, -994213, -1105682, -1235622, -1379217, -1539518, -1728768, -1962327, -2248936, -2583688, -2948002, -3315890, -3662240, -3968644, -4224876, -4426864, -4573452, -4663893, -4696841, -4670602, -4584073, -4437746, -4234200, -3977660, -3673014, -3325580, -2942665, -2536435, -2125822]
41788b125822L90572L45403K80780K07458J37939Q3033N0213M4190O7907J21778
41778c96549K01191K95219L88994M68463N23636N48303N38425M92407M13397L10728
41768C784214J98062Q9021o716q4416j42316j78904j92365j83251j58441j32328
41758B992560j22856j43844j98285k77004l63778m43676n09442n62251o07363
41749b35939o48514o84626p09661p14267o87953o21732n11247l59617j78608J2662
41739e339502J91505L36913M34658M80348M79334M43730L88015L25197K64924
41730a994878K13491J74496J49045J35893J32520J36885J48188J65583J86128
41721e52649K04320K14071K11639J97430J75665J52671J35076J28400J35204J52257
$$ y = [-2125822, -1735250, -1389847, -1109067, -901609, -763670, -680637, -630424, -586234, -518327, -396549, -195358, 99861, 488855, 957318, 1480954, 2029257, 2567682, 3060089, 3473486, 3784214, 3982276, 4071297, 4064581, 3980165, 3837849, 3658945, 3466580, 3283329, 3124888, 2992560, 2869704, 2725860, 2527575, 2250571, 1886793, 1443117, 933675, 371424, -235939, -884453, -1569079, -2278740, -2993007, -3680960, -4302692, -4813939, -5173556, -5352164, -5339502, -5147997, -4811084, -4376426, -3896078, -3416744, -2973014, -2584999, -2259802, -1994878, -1781387, -1606891, -1457846, -1321953, -1189433, -1052548, -904360, -738777, -552649, -348329, -134258, 77381, 274811, 450476, 603147, 738223, 866623, 1001827, 1154084]
41711A154084J68638J68092J36142O7291l3152j52982k77571l90976m75447n13775
41701a49656m95553m23655l16372k02992j13956o9659p3521j13428j70203k27129
41691b356124k74934l11311l38034l58594l76670l94517m11129m21461m17791
41682e660565l92688l41692k64575j65474n2553O3538J72969K70093L53584M22736
41672e594627M73473M98222M89621M44517L65466K59983J38856J3959j04042k06773
41662c221345k87139l37684l50723l20751k47059j34596O955J64587L23174M66827
41652c937754N80927O54809O84530O74560O37155N88945N45663N17006N03497
41643A449338M96724M83283M51139L95308L19581K33582J47500O7761m651p3153
$$ y = [1154084, 1322722, 1490814, 1626956, 1694247, 1661095, 1508113, 1230542, 839566, 364119, -149656, -645209, -1068864, -1385236, -1588228, -1702184, -1771843, -1845364, -1958792, -2128995, -2356124, -2631058, -2942369, -3280403, -3638997, -4015667, -4410184, -4821313, -5242774, -5660565, -6053253, -6394945, -6659520, -6824994, -6877547, -6814009, -6641040, -6370947, -6017363, -5594627, -5121154, -4622932, -4133311, -3688794, -3323328, -3063345, -2924489, -2910530, -3014572, -3221345, -3508484, -3846168, -4196891, -4517642, -4764701, -4899297, -4892342, -4727755, -4404581, -3937754, -3356827, -2702018, -2017488, -1342928, -705773, -116828, 428835, 945841, 1449338, 1946062, 2429345, 2880484, 3275792, 3595373, 3828955, 3976455, 4044216, 4039565, 3966412]
41633C966412j42347k13721k82679l39421l73743l80770l63804l32761k99351
41624A237815k71566k50099k28810j99589j58779j10312o2677k1970J3251N1084
41614a652J00365J64182K36672L04300L50400L61091L30226K61391J66314O0748
41604B334037m0219j25820j90929k34370k55509k52233k22638j68539r6613j5429
41594G31738O8467J51185K28508K92976L34166L41954L10244K39386J36887J6725
41584B852236j02856k03103k69524k96068k86829k54404k15841j87923j83027
41575H52661k06178k54067l16796l81539m35807m68611m70409m33901l56330k41619
41565b712596j00414N2262K00486L30493M32315M99921N30583N24699M86204M22258
$$ y = [3966412, 3824065, 3610344, 3327665, 2988244, 2614501, 2233731, 1869927, 1537166, 1237815, 966249, 716150, 487340, 287751, 128972, 18660, -44017, -65987, -52736, -1652, 98713, 262895, 499567, 803867, 1154267, 1515358, 1845584, 2106975, 2273289, 2334037, 2293818, 2167998, 1977069, 1742699, 1487190, 1234957, 1012319, 843780, 747167, 731738, 800205, 951390, 1179898, 1472874, 1807040, 2148994, 2459238, 2698624, 2835511, 2852236, 2749380, 2546277, 2276753, 1980685, 1693856, 1439452, 1223611, 1035688, 852661, 646483, 392416, 75620, -305919, -741726, -1210337, -1680746, -2114647, -2470977, -2712596, -2813010, -2760748, -2560262, -2229769, -1797454, -1297533, -766950, -242251, 243953, 666211]
41555F66211L40882K47891J46415M0648n9427j38094j80585j81325j46471q8966
41545F47179k1282M8141J14092J72913K22152K60401K86221K97315K91541K68963
41535B587636K32797J88699J43471J03653P3535N3177L8300K2867K608k3286n3069
41524C370388q4568j16734j49741j83874k18344k51304k81144l07464l30154l47206
41514A099855l53354l41040l03330k37547j48224m7702M6995J20352J64344J80508
41504A80857J76900J62007J39405J06567N8749m868p8099j50856k15943k73146
41494A01573l27005l81039m34198m81853n18315n37831n34967n07311m59783m05554
41484d486283l60042l31498l16037l01747k78608k46484k15403j98319k01586
$$ y = [666211, 1007093, 1254984, 1401399, 1442047, 1382620, 1244526, 1063941, 882616, 736145, 647179, 625897, 674038, 788130, 961043, 1183195, 1443596, 1729817, 2027132, 2318673, 2587636, 2820433, 3009132, 3152603, 3256256, 3329791, 3382968, 3421268, 3444135, 3446743, 3423457, 3370388, 3285820, 3169086, 3019345, 2835471, 2617127, 2365823, 2084679, 1777215, 1447061, 1099855, 746501, 405461, 102131, -135416, -283640, -331342, -284347, -163995, 349, 180857, 357757, 519764, 659169, 765736, 824485, 819617, 741518, 590662, 374719, 101573, -225432, -606471, -1040669, -1522522, -2040837, -2578668, -3113635, -3620946, -4080729, -4486283, -4846325, -5177823, -5493860, -5795607, -6074215, -6320699, -6536102, -6734421, -6936007]
41475f936007k19801k38794k44655k32073k05807j74808j44146j10931o6775m701
41465h578498P4211J58727K31202K74875K80496K49202J91333J22624N9543J5060
41455f921225l938K836L0060O8170J04871J27556J27058J01300N6305L640m3986
41444f347353p6157q6267p2181l6840J2017O4056J09820J43661J65342J80415
41434e943487J98761K30363K79140L38752L94301M30059M38437M24130M00476
41425b809068L80472L68655L59114L40191L01929K41556J64743Q2971Q403n1630
41415f12664r8036j39286j86767k48485l24112m03698m70618n07491n02211m51512
41405c944880l61160k43437j13179J6081J34166K33627L07780L49960L55412L24601
$$ y = [-6936007, -7155808, -7394602, -7639257, -7871330, -8077137, -8251945, -8396091, -8507022, -8573797, -8578498, -8504287, -8345560, -8114358, -7839483, -7558987, -7309785, -7118452, -6995828, -6936285, -6921225, -6925163, -6922327, -6892267, -6824097, -6719226, -6591670, -6464612, -6363312, -6307007, -6303367, -6347353, -6423510, -6509777, -6581958, -6618798, -6606781, -6542725, -6432905, -6289244, -6123902, -5943487, -5744726, -5514363, -5235223, -4896471, -4502170, -4072111, -3633674, -3209544, -2809068, -2428596, -2059941, -1700827, -1360636, -1058707, -817151, -652408, -569437, -561034, -612664, -710700, -849986, -1036753, -1285238, -1609350, -2013048, -2483666, -2991157, -3493368, -3944880, -4306040, -4549477, -4662656, -4646575, -4512409, -4278782, -3971002, -3621042, -3265630, -2941029]
41395b941029K65347J91972J21570O9043M2890M3218O2233Q6963J03747J03467
41385a850579Q5052N5068K3433j775j7209k3841k4545k1806j7099j2103j0148
41374a815552j5520k9945m8621n9442m6999L68Q4172J93473L07967M04883M65948
41363e59268M81401M50738L81781K88682J88089R3804J2662n5506j14442j67920
41353A000021k18670k69220l22701l82566m51271n27861o05034o67888o97124
41344c142314o76381n99308m71625l07872j26592N2672K10858L31273M02491M20605
41334c906193L89241L17360K16347R8013k5880j43536k43775l17535l59060l65961
41324d340979l38731k80666j97903r8704P985J13768K11460K95501L62198M09284
$$ y = [-2941029, -2675682, -2483710, -2362140, -2293097, -2250207, -2206989, -2144756, -2057793, -1954046, -1850579, -1765527, -1710459, -1687026, -1688801, -1706010, -1729851, -1754396, -1776202, -1793301, -1805404, -1815552, -1831072, -1861017, -1909638, -1969080, -2016079, -2015711, -1931539, -1738066, -1430099, -1025216, -559268, -77867, 372871, 754652, 1043334, 1231423, 1325227, 1337889, 1282383, 1167941, 1000021, 781351, 512131, 189430, -193136, -644407, -1172268, -1777302, -2445190, -3142314, -3818695, -4418003, -4889628, -5197500, -5324092, -5271420, -5060562, -4729289, -4326798, -3906193, -3516952, -3199592, -2983245, -2885232, -2911112, -3054648, -3298423, -3615958, -3975018, -4340979, -4679710, -4960376, -5158279, -5256983, -5248998, -5135230, -4923770, -4628269, -4266071, -3856787]
41314c856787M35002M37979M18529L80047L28619K70547K09606J46158P8524N289
41304a146487p3058j53439k29741k92438l29757l31751k96053k31202j54242q3375
41294c321543l0553J260J5076J4168k265l9787j05966k05620l35890m83303o25043
41283e119466p34691p89917p78510p00822n68767m02068k22540m8147J10723K51562
41273i002643L77180M91384N93967O77480P29205P38814P06809O46993N80786
41264c460025N27426M96223M84494M81151M73344M52473M16701L69666L17431
41255E58884K65770K18685J77975J43585J14038Q6299N5906J9220k2255n9109
41245A558998p6650o2348j2663O5602J59218K53451L34863L92575M20069M17105
$$ y = [-3856787, -3421785, -2983806, -2565277, -2185230, -1856611, -1586064, -1376458, -1230300, -1151776, -1146487, -1219545, -1372984, -1602725, -1895163, -2224920, -2556671, -2852724, -3083926, -3238168, -3321543, -3352096, -3350836, -3335760, -3321592, -3323857, -3363644, -3469610, -3675230, -4011120, -4494423, -5119466, -5854157, -6644074, -7422584, -8123406, -8692173, -9094241, -9316781, -9364928, -9254205, -9002643, -8625463, -8134079, -7540112, -6862632, -6133427, -5394613, -4687804, -4040811, -3460025, -2932599, -2436376, -1951882, -1470731, -997387, -544914, -128213, 241453, 558884, 824654, 1043339, 1221314, 1364899, 1478937, 1565236, 1621142, 1640362, 1618107, 1558998, 1482348, 1420000, 1407337, 1472939, 1632157, 1885608, 2220471, 2613046, 3033115, 3450220]
41235C450220L89145L43404K84597K14278J33829M7208l9590j21225j94938k60672
41225D246256l20507l77914m36280m96765n57155o12784o58571o90428p05552
41216f09700p02408o80761o41403n85559n14756m31504l40063k46183j55937p4753
41206d983027p415M1486O7705O8710M5877O473l6106o5362o7658l8171J7125Q4782
41194d865581J49548J98445K22093K15519J80219J25973O9451K8742J6718L7258
41184c621615Q5886J53100K27399K96726L49344L75862L72388L42874K98472K53476
41174h66088K19800K03102K02782K15379K38319K70477L08944L45224L65355L55595
41164A858889L10326K36511J51205P3742J7672j3349k5249l0734m5422q3154j51423
$$ y = [3450220, 3839365, 4182769, 4467366, 4681644, 4815473, 4862681, 4823091, 4701866, 4506928, 4246256, 3925749, 3547835, 3111555, 2614790, 2057635, 1444851, 786280, 95852, -609700, -1312108, -1992869, -2634272, -3219831, -3734587, -4166091, -4506154, -4752337, -4908274, -4983027, -4990442, -4948956, -4881251, -4812541, -4766664, -4760191, -4796297, -4861659, -4929317, -4967488, -4950363, -4865581, -4716033, -4517588, -4295495, -4079976, -3899757, -3773784, -3704333, -3675591, -3658873, -3621615, -3535729, -3382629, -3155230, -2858504, -2509160, -2133298, -1760910, -1418036, -1119564, -866088, -646288, -443186, -240404, -25025, 213294, 483771, 792715, 1137939, 1503294, 1858889, 2169215, 2405726, 2556931, 2630673, 2648345, 2634996, 2609747, 2579013, 2533591, 2450437, 2299014]
41153B299014k49007l66825m90230o00580o76971p00873o63535n71439m44506
41144b464952l06886j75730n4634O4258J90529L24106M50203N45104N89044N76948
41134b62010N19933M38342L52670K77802K21693J86292J68543J60842J52271J31970
41124B348348R3854L9450k3740q7146j45456j97923k47382k98576l55694m18690
41114G07045m80057n25316n38342n08602m36123l32054k15758j10084l5741n655
41104b480687k1228p2536j42525k12581k66129k89375k71313k05878r6293M1896
41094d016649J83225L00611L75106M01375L86726L46102K96943K55617K34696
41085a236248K40164K68894L07764L35930L30745K75880J68099J8923j49809l13739
$$ y = [2299014, 2050007, 1683182, 1192952, 592372, -84599, -785472, -1449007, -2020446, -2464952, -2771838, -2947568, -3002202, -2937944, -2747415, -2423309, -1973106, -1428002, -838958, -262010, 257923, 696265, 1048935, 1326737, 1548430, 1734722, 1903265, 2064107, 2216378, 2348348, 2442202, 2481652, 2457912, 2370766, 2225310, 2027387, 1780005, 1481429, 1125735, 707045, 226988, -298328, -836670, -1345272, -1781395, -2113449, -2329207, -2439291, -2475032, -2480687, -2501915, -2574451, -2716976, -2929557, -3195686, -3485061, -3756374, -3962252, -4058545, -4016649, -3833424, -3532813, -3157707, -2756332, -2369606, -2023504, -1726561, -1470944, -1236248, -996084, -727190, -419426, -83496, 247249, 523129, 691228, 710151, 560342, 246603]
41075B46603m52755n53943o10882o21843n89189n20482m29357l33665k50527j90655
41065d306695j55488j39019j33100j32876j38913j54808j82132k16256k45894
41056e805181k56725k37141j83013r8726O031J21403K40665L59657M73708N75029
41046d804293O52429O93245O86619O27239N18460L73421K13111O1468o1072j43166
41036a182539j84626j93995j83486j64567j46101j34111j31249j35772j41791
41027b598237j42257j33504j18238j04218r9158j05142j16403j21938j11249p9817
41017c730161l1135K5618Q0369J25929J58420J75348J74202J53165J12653N5692
41007b699900j3015q8355j65886k42969l19272l95261m68936n33591n79248n96842
$$ y = [246603, -206152, -760095, -1370977, -1992820, -2582009, -3102491, -3531848, -3865513, -4116040, -4306695, -4462183, -4601202, -4734302, -4867178, -5006091, -5160899, -5343031, -5559287, -5805181, -6061906, -6299047, -6482060, -6580786, -6574755, -6453352, -6212687, -5853030, -5379322, -4804293, -4151864, -3458619, -2772000, -2144761, -1626301, -1252880, -1039769, -978301, -1039373, -1182539, -1367165, -1561160, -1744646, -1909213, -2055314, -2189425, -2320674, -2456446, -2598237, -2740494, -2873998, -2992236, -3096454, -3195612, -3300754, -3417157, -3539095, -3650344, -3730161, -3761296, -3735678, -3655309, -3529380, -3370960, -3195612, -3021410, -2868245, -2755592, -2699900, -2712915, -2801270, -2967156, -3210125, -3529397, -3924658, -4393594, -4927185, -5506433, -6103275]
40997f103275n81698n33930m56775l55085k34910j03314L2181J64166K85523L89303
40987g497814M68903N18863N36299N22571M83957M30229L71543L16110K70670
40978c578669K42616K40212K68842L25548L96638M61355N00168N03044M73145
40969a67101M24189L73512L34853L14279L09789L12900L10856K89703K38775J55520
40959B897275M8099o6361j67630k39891k77388k85406k76316k63264k54992k53486
40949H60640k53979k46753k21184j71737j02732k7725L7293Q2417J07892J21170
40939A85302J29995J37055J39443J31877J10387P4074K5154l1669r0120j43911
40929F67587j88612k22865k48331k68645k87909l09128l33190l59171l85803m12977
$$ y = [-6103275, -6684973, -7218903, -7675678, -8030763, -8265673, -8368987, -8336806, -8172640, -7887117, -7497814, -7028911, -6510048, -5973749, -5451178, -4967221, -4536992, -4165449, -3849339, -3578669, -3336053, -3095841, -2826999, -2501451, -2104813, -1643458, -1143290, -640246, -167101, 257088, 630600, 965453, 1279732, 1589521, 1902421, 2213277, 2502980, 2741755, 2897275, 2945374, 2879013, 2711383, 2471492, 2194104, 1908698, 1632382, 1369118, 1114126, 860640, 606661, 359908, 138724, -33013, -135745, -163470, -126177, -43760, 64132, 185302, 315297, 452352, 591795, 723672, 834059, 908133, 933287, 901618, 811498, 667587, 478975, 256110, 7779, -260866, -548775, -857903, -1191093, -1550264, -1936067, -2349044]
40919b349044m42193m75730n14908n57947n98384o25470o26899n92519n17458
40910g300552m04187k63225j10955L6397J69866K90035M01484N03305N83676O23126
40900e471030O04057N20014L79816K05768K7762j24507k29073k76709k71471k26776
40890d862149j59308q3900j1117N2688J04081J40913J60922J61213J39260R5171
40880d262226L3813l5048r9437j49304j79500j89914j83475j64195j36540j05554
40870e471380p6509n3816l9695l2961k7864j3490K4757J00506K19908L76857N53100
40859d440587P22968Q59632R40062R48448Q79113P38613N45522L26964J12959
40850A633694o9866k03552k81566l07657k91286k42407j68766p6418K8182J36677
$$ y = [-2349044, -2791237, -3266967, -3781875, -4339822, -4938206, -5563676, -6190575, -6783094, -7300552, -7704739, -7967964, -8078919, -8042522, -7872656, -7582621, -7181137, -6677832, -6094156, -5471030, -4866973, -4346959, -3967143, -3761375, -3733613, -3858120, -4087193, -4363902, -4635373, -4862149, -5021457, -5105357, -5116474, -5063786, -4959705, -4818792, -4657870, -4496657, -4357397, -4262226, -4228413, -4263461, -4362898, -4512202, -4691702, -4881616, -5065091, -5229286, -5365826, -5471380, -5547889, -5601705, -5641400, -5674361, -5702225, -5715715, -5690958, -5590452, -5370544, -4993687, -4440587, -3717619, -2857987, -1917925, -969477, -90364, 648249, 1193771, 1520735, 1633694, 1563828, 1360276, 1078710, 771053, 479767, 237360, 68594, -7824, 20358, 157035]
40840A57035K38685L22914L78769L97886L75422L11455K12453R1674l2845j42448
40830B311000k22143k63133k63624k28935j70984j05941m9390j0601J0848K3804
40820A030901M0225O9164J13357J69628K31679K92868L47222L88803M11073M08353
40810C503273L79282L29300K68825K07534J49363R2522L3718k8142r2179j58441
40800D685055k29607l09467l99319m95265n88523o68758p28326p64411p77735
40791b76356p69341p38517o83846o06408n12543m13854l23924k53075k04012j70995
40781d952871j43399j11553p1197k3934K5911P5394J25260J79415K41886L12692
40771d342396L84698M44156M75909M70675M29478L62224K82366K02034J29982
$$ y = [157035, 395720, 718634, 1097403, 1495289, 1870711, 2182166, 2394619, 2486293, 2453448, 2311000, 2088857, 1825724, 1562100, 1333165, 1162181, 1056240, 1006850, 996249, 1007097, 1030901, 1071126, 1140290, 1253647, 1423275, 1654954, 1947822, 2295044, 2683847, 3094920, 3503273, 3882555, 4211855, 4480680, 4688214, 4837577, 4930099, 4963817, 4935675, 4843496, 4685055, 4455448, 4145981, 3746662, 3251397, 2662874, 1994116, 1265790, 501379, -276356, -1045697, -1784214, -2468060, -3074468, -3587011, -4000865, -4324789, -4577864, -4781876, -4952871, -5096270, -5207823, -5279020, -5302954, -5277043, -5201649, -5076389, -4896974, -4655088, -4342396, -3957698, -3513542, -3037633, -2566958, -2137480, -1775256, -1492890, -1290856, -1160874]
40762a160874P1304K7616k186k0138k7710k6062j7520o118L800R655J1735J2875
40750a123623J7148K7870M5402O5909Q2150Q6068P1823L8183r903o0846r8312
40739h58131j06194p5315q066Q2374J78164K64436L33815L85721M22018M42794
40729A061616M45344M26513L85756L25862K50876J63660O5826l9971j47717k47838
40719B689927l29276l82338m00904l83294l31921k52478j53408m6023N5481J35296
40709F01062J79307J79339J35745N6209m8473j68216k94238m17144n25629o07808
40699i09846o54055o59079o22188n46408m37221l01425j46372K0004J88385L47003
40689c721202M81407N76207O19314O07238N48414M61759L70683K95747K49637
$$ y = [-1160874, -1089570, -1061954, -1064140, -1084278, -1111988, -1138050, -1155570, -1161688, -1157888, -1148233, -1136498, -1123623, -1106475, -1078605, -1033203, -967294, -885144, -799076, -727253, -689070, -698973, -759819, -858131, -964325, -1039640, -1047706, -965332, -787168, -522732, -188917, 196804, 618822, 1061616, 1506960, 1933473, 2319229, 2645091, 2895967, 3059627, 3125453, 3085482, 2937765, 2689927, 2360651, 1978313, 1577409, 1194115, 862194, 609716, 456308, 410285, 465766, 601062, 780369, 959708, 1095453, 1151662, 1103189, 934973, 640735, 223591, -302038, -909846, -1563901, -2222980, -2845168, -3391576, -3828797, -4130222, -4276594, -4256590, -4068205, -3721202, -3239795, -2663588, -2044274, -1437036, -888622, -426863, -56180, 239567, 489204]
40680D89204K35791K49588K80598L15615L42761L55567L54552L44618L29999L10782
40670C609075K83815K46880K02413J57893J23048J05786J08716J26943J47711
40661E112280J52717J23351M7443p5317k31700l97580n43846o43984o81238o52649
40651B209477n67919m43826k97881j44890L097J35820K44832L24241L70892L83903
40641B217746L64554L16628K45920J58551N9879m4258j45148k30976k89852l13492
40631B339552k98663k46703j63153n7665N7608J71154K74343L61284M27729M70945
40621C336431M89872M83770M49908L83295K79993J42043j9677j86912l39397m61749
40611D557577n48526o04524o39792o62213o72545o65135o33592n77072n02981
$$ y = [489204, 724995, 974583, 1255181, 1570796, 1913557, 2269124, 2623676, 2968294, 3298293, 3609075, 3892890, 4139770, 4342183, 4500076, 4623124, 4728910, 4837626, 4964569, 5112280, 5264997, 5388348, 5435791, 5360474, 5128774, 4731194, 4187348, 3543364, 2862126, 2209477, 1641558, 1197732, 899851, 754961, 758058, 893878, 1138710, 1462951, 1833843, 2217746, 2582300, 2898928, 3144848, 3303399, 3363278, 3319020, 3173872, 2942896, 2653044, 2339552, 2040889, 1794186, 1631033, 1573368, 1630976, 1802130, 2076473, 2437757, 2865486, 3336431, 3826303, 4310073, 4759981, 5143276, 5423269, 5565312, 5545635, 5358723, 5019326, 4557577, 4009051, 3404527, 2764735, 2102522, 1429977, 764842, 131250, -445822, -948803]
40602i48803m24793l56865l09254k84853k79788k86353k96203l01726k95745k71748
40592d056131k25969j59875q0534J725P6621J36289J76135J94703J93104J74033
40582c569899J40447R4049L4674l8475j24036k16032l03391l71617m05997l96045
40572e156322l40106k47345j34732k0478Q1291J61287K12779K30466K12721J65360
40562d835079J03118M6543J5499K3024P2707J59529K71986L94266N09157O02118
40552b637132O64726O95471O97936O78644O45928O09073N76344N52075N34704
40543C017769N17677M92906M54592M01032L34074K57489J75545R1969R416p0225
40533E682244j44794k11239k66241l07443l34104l47292l50393l49413l51354
$$ y = [-948803, -1373596, -1730461, -2039715, -2324568, -2604356, -2890709, -3186912, -3488638, -3784383, -4056131, -4282100, -4441975, -4522509, -4520784, -4444163, -4307874, -4131739, -3937036, -3743932, -3569899, -3429452, -3335403, -3300729, -3339204, -3463240, -3679272, -3982663, -4354280, -4760277, -5156322, -5496428, -5743773, -5878505, -5898983, -5817692, -5656405, -5443626, -5213160, -5000439, -4835079, -4731961, -4685418, -4669919, -4646895, -4574188, -4414659, -4142673, -3748407, -3239250, -2637132, -1972406, -1276935, -578999, 99645, 745573, 1354646, 1930990, 2483065, 3017769, 3535446, 4028352, 4482944, 4883976, 5218050, 5475539, 5651084, 5743053, 5752469, 5682244, 5537450, 5326211, 5059970, 4752527, 4418423, 4071131, 3720738, 3371325, 3019971]
40524C019971l60553l75728l90810l99051l96654l82907l57696l19727k67109
40515b30264j98809j14870j5783R6961K18499L38734M43752N20561N62413N71327
40505B192521N56285N27967M93073M51820M00084L33959K52531J57138M9570o7130
40495E347818j85358k91540l70230m11780m17483l98095l67577l37277l13713
40486B254765k99400k94637k99047l11969l31108l50237l58528l43320k94878
40477f28359k09926r2409M7546J95302L34075M48017N24960N57823N44827M88981
40467B210837L96749K76041J35149j5870j62669k86587l69125l98584l74223l05659
40457A106059k08985j02656m441P1197J15838J29110J18502R6549P6383O7512
$$ y = [3019971, 2659418, 2283690, 1892880, 1493829, 1097175, 714268, 356572, 36845, -230264, -429073, -543943, -559726, -462765, -244266, 94468, 538220, 1058781, 1621194, 2192521, 2748806, 3276773, 3769846, 4221666, 4621750, 4955709, 5208240, 5365378, 5414948, 5347818, 5162460, 4870920, 4500690, 4088910, 3671427, 3273332, 2905755, 2568478, 2254765, 1955365, 1660728, 1361681, 1049712, 718604, 368367, 9839, -333481, -628359, -838285, -930694, -883148, -687846, -353771, 94246, 619206, 1177029, 1721856, 2210837, 2607586, 2883627, 3018776, 3002906, 2840237, 2553650, 2184525, 1785941, 1411718, 1106059, 897074, 794418, 789977, 861174, 977012, 1106122, 1224624, 1321173, 1397556, 1465068]
40447A465068P3313R1001J13849J34570J48269J53524J51056J41241J22927R5443
40437B690261O2462L3698K1290L2569O4753J05738J40003J55044J44926J10940
40427C561684O0972Q065l2562m8245l3684O913O1786J16302J57069J73494J57944
40416D189738J07178K5221p5455j77155k63195l22796l51734l50018l19845k65733
40406B196206j96019j23410o2945k7347k2030m2927p8874j17160j48437j68016
40396A209041j73868j64517j39495j01762n8808k0206P014K1653K7930L1974L7478
40385F76434M2977M2432K9311K000l3226o4229p9208p3174n0372k0863O228K7343
40373E05653M3498N5904O3870O7228O9447P7062R6085J29537J77717K38993L09532
$$ y = [1465068, 1538381, 1629382, 1743231, 1877801, 2026070, 2179594, 2330650, 2471891, 2594818, 2690261, 2752723, 2786421, 2807711, 2840280, 2905033, 3010771, 3150774, 3305818, 3450744, 3561684, 3622656, 3630721, 3598159, 3549914, 3516230, 3523143, 3584929, 3701231, 3858300, 4031794, 4189738, 4296916, 4322137, 4246682, 4069527, 3806332, 3483536, 3131802, 2781784, 2461939, 2196206, 2000187, 1876777, 1813832, 1786485, 1764455, 1721528, 1642654, 1525494, 1377057, 1209041, 1035173, 870656, 731161, 629399, 570591, 550385, 557399, 579052, 606982, 638956, 676434, 719411, 761843, 791154, 793154, 759928, 695699, 616491, 543317, 492945, 472082, 478310, 505653, 549151, 605055, 668925, 736153, 805600, 882662, 978747, 1108284, 1286001, 1524994, 1834526]
40362A834526L83063M51949N08725N46853N61269N49773N14848M64144M08591
40353F223741L58572L19871K91816K69127K46256K20747J93493J66845J42474
40344H432942J19457R2704N3236q173r5362k02916l16674m18295m91876n29865
40334F635178n35140n17397m86255m46441l98768l44776k89749k41212k04896
40325C170544j82225j71191j68904j72900j80227j86091j84321j69884j41350
40316A613451j01171n3609k265N0618J02618J48979J82306J95016J83345J50755
40306B470043J09076P6172O9771R9258J60029K34740L01332L42701L52065L32307
40296D547494K91991K42021J94179J59742J46026J52023J67217J76357J67853
$$ y = [1834526, 2217589, 2669538, 3178263, 3725116, 4286385, 4836158, 5351006, 5815150, 6223741, 6582313, 6902184, 7194000, 7463127, 7709383, 7930130, 8123623, 8290468, 8432942, 8552399, 8645103, 8698339, 8690166, 8594804, 8391888, 8075214, 7656919, 7165043, 6635178, 6100038, 5582641, 5096386, 4649945, 4251177, 3906401, 3616652, 3375440, 3170544, 2988319, 2817128, 2648224, 2475324, 2295097, 2109006, 1924685, 1754801, 1613451, 1512280, 1458671, 1456406, 1507024, 1609642, 1758621, 1940927, 2135943, 2319288, 2470043, 2579119, 2655291, 2725062, 2824320, 2984349, 3219089, 3520421, 3863122, 4215187, 4547494, 4839485, 5081506, 5275685, 5435427, 5581453, 5733476, 5900693, 6077050, 6244903]
40287F244903J39969J01174O5863M8752N9969J01519J66219K40170L07709L55891
40277G832138L76454L66057L26640K66064J96993J32708Q1731M5132J8545l150
40267I639312k2206l7001m2583l1698K932O4450J47200K34551L01278L20418K72473
40256A0849126J53444k2185k25065m19369n71927o59214o71456o13890n04912
40247G314552l70990k39587j32317o0563k4733j6936k5460l9096n0160n6010n8859
40236F239841o3358p2415q3738r0300q5121o6941m1962k0141r137j0643k1108
40225E674977l5120m8488n9505o8553p6899q5333r3458j00161j04772j07645j09455
40214D785588j10201j09475j08029j08730j15122j28432j45579j59835j63332
$$ y = [6244903, 6384872, 6486046, 6551909, 6600661, 6660630, 6762149, 6928368, 7168538, 7476247, 7832138, 8208592, 8574649, 8901289, 9167353, 9364346, 9497054, 9578785, 9623917, 9642462, 9639312, 9617106, 9580105, 9537522, 9505824, 9508756, 9573206, 9720406, 9954957, 10256235, 10576653, 10849126, 11002570, 10980385, 10755320, 10335951, 9764024, 9104810, 8433354, 7819464, 7314552, 6943562, 6703975, 6571658, 6511095, 6486362, 6469426, 6443966, 6404870, 6354710, 6298700, 6239841, 6176483, 6104068, 6020330, 5930030, 5844909, 5777968, 5736006, 5715865, 5706728, 5696085, 5674977, 5639857, 5591369, 5531864, 5463311, 5386412, 5301079, 5207621, 5107460, 5002688, 4895043, 4785588, 4675387, 4565912, 4457883, 4349153, 4234031, 4105599, 3960020, 3800185, 3636853]
40205C636853j50081j19240p8085m2121k9506n1343j04306j71339k29743k60320
40195B400769k52178k03064j18266r793J05467K10020K91271L44951L74424L86875
40185C530476L89345L86472L79896L68567L49810L21364K83783K42076K05449
40176F457238J84854J89019K20407K72675L30638L73208L79357L35904K43797
40167H987097J18701j5418j36196k30487k96206l38825l65321l78632l75170l46725
40157F622818k85801j91590p3520M9522J54601K22984K47190K32718J93543J44944
40147G317409R8231N9489L1130J4005Q590J4718L0432N1544P3318R3782J16042
40136G908690J47233J94488K61097L45500M42734N45423O42627P18599P54963
$$ y = [3636853, 3486772, 3367532, 3289447, 3247326, 3217820, 3166477, 3062171, 2890832, 2661089, 2400769, 2148591, 1945527, 1827261, 1817468, 1922935, 2132955, 2424226, 2769177, 3143601, 3530476, 3919821, 4306293, 4686189, 5054756, 5404566, 5725930, 6009713, 6251789, 6457238, 6642092, 6831111, 7051518, 7324193, 7654831, 8028039, 8407396, 8743300, 8987097, 9105798, 9090380, 8954184, 8723697, 8427491, 8088666, 7723345, 7344713, 6969543, 6622818, 6337017, 6145427, 6071907, 6121429, 6276030, 6499014, 6746204, 6978922, 7172465, 7317409, 7415640, 7475129, 7506259, 7520264, 7528854, 7543572, 7574004, 7625548, 7698866, 7792648, 7908690, 8055923, 8250411, 8511508, 8857008, 9299742, 9845165, 10487792, 11206391, 11961354]
40127A1961354P36953O59891N31489L68968J93731K6261j17708k29584l08187
40118A3823168l57449l82667l87378l72539l38208k86407k22961j56562r5439
40109A1223558m4285l848K6974M8939O2062O6655O4447N8885N4746N7207P0461
40098A1685801R6202J32799J75848K19862K59897K91685L10057L07337K74007
40089A3753495K02229R0238n5368k21151l91351n52740o96849q18274r10727r64695
40079I434807r69389r17897q11778o61886m85156k99355j18483M9134J99515L29756
40069E749268M34976N07294N37782N21324M62279L76487K86093K09125J51518
40060I236146J07908O9882L3851K410k0350l4209m4420n8972q4144j21729j69542
$$ y = [11961354, 12698307, 13358198, 13889687, 14258655, 14452386, 14478647, 14360939, 14131355, 13823168, 13465719, 13083052, 12695674, 12323135, 11984927, 11698520, 11475559, 11318997, 11223558, 11179273, 11175425, 11202399, 11251338, 11313400, 11380055, 11444502, 11503387, 11558133, 11615340, 11685801, 11782003, 11914802, 12090650, 12310512, 12570409, 12862094, 13172151, 13479488, 13753495, 13955724, 14045962, 13990594, 13769443, 13378092, 12825352, 12128503, 11310229, 10399502, 9434807, 8465418, 7547521, 6735743, 6073857, 5588701, 5289346, 5170863, 5219997, 5419512, 5749268, 6184244, 6691538, 7229320, 7750644, 8212923, 8589410, 8875503, 9084628, 9236146, 9344054, 9413936, 9447787, 9450197, 9429847, 9395638, 9351218, 9292246, 9208102, 9086373, 8916831]
40049H916831k24042k82026l39458l88771m18246m15687l74683k99094k02439
40040E972385j02866j7270M2335O9952O5895L7373j301l0545l0369J2588R8559
40029F116736K12049L25376M07815M36923M06961L30165K30386J33271N9100K1087
40019H679869K6507P6319J62677K67984L68513M41088M68673M42482L61786K33472
40009A1529370P1795j03199k69445m07773n05312n55749n57398n11681m23486
40000H267122l02320j62241j9880J08091K06816K64562K74450K36768J60510O2547
39990I096425l6041j15343j61597j69988j44475r5147l4482K6047P8071J16787
39980H560257J40015J46759J36594J10560P2518K9061j2489m6427o9700q1844
$$ y = [8916831, 8692789, 8410763, 8071305, 7682534, 7264288, 6848601, 6473918, 6174824, 5972385, 5869519, 5852249, 5894584, 5964536, 6030431, 6067804, 6066503, 6035958, 6005589, 6018177, 6116736, 6328785, 6654161, 7061976, 7498899, 7905860, 8236025, 8466411, 8599682, 8658782, 8679869, 8706376, 8782695, 8945372, 9213356, 9581869, 10022957, 10491630, 10934112, 11295898, 11529370, 11601165, 11497966, 11228521, 10820748, 10315436, 9759687, 9202289, 8690608, 8267122, 7964802, 7802561, 7782681, 7890772, 8097588, 8362150, 8636600, 8873368, 9033878, 9096425, 9060384, 8945041, 8783444, 8613456, 8468981, 8373834, 8339352, 8365399, 8443470, 8560257, 8700272, 8847031, 8983625, 9094185, 9166703, 9195764, 9183275, 9136848, 9067148, 8985304]
39970H985304q5042q4175q5385r2790j05289j16044j15131r3475m5895K7473J20847
39959H310398K23119L19240L93232M32354M30702L90623L21463K36181J46968
39950A1204280O1635j7114q9021j52635k04078k38890k54349k49817k25604j82514
39940I651893j22593m9832L0071J10286J83212K41309K79511K98598L07005L18568
39930A1248028L46343L95733M61163N28249N79715O01352N85110N29262M37233
39921A5712188L16614J78498L6314r6307k07938k91013l42243l62080l53552l20898
39911A4269583k68380j99860j18754k7805P1372J77856K89484M00528N01502N82285
39901A5677811O36980O66675O77510O75300O60968O30108N75999M93095L79501
$$ y = [8985304, 8900262, 8816087, 8730702, 8637912, 8532623, 8416579, 8301448, 8207973, 8162078, 8189551, 8310398, 8533517, 8852757, 9245989, 9678343, 10109045, 10499668, 10821131, 11057312, 11204280, 11265915, 11248801, 11159780, 11007145, 10803067, 10564177, 10309828, 10060011, 9834407, 9651893, 9529300, 9479468, 9509539, 9619825, 9803037, 10044346, 10323857, 10622455, 10929460, 11248028, 11594371, 11990104, 12451267, 12979516, 13559231, 14160583, 14745693, 15274955, 15712188, 16028802, 16207300, 16243614, 16147307, 15939369, 15648356, 15306113, 14944033, 14590481, 14269583, 14001203, 13801343, 13682589, 13654784, 13726156, 13904012, 14193496, 14594024, 15095526, 15677811, 16314791, 16981466, 17658976, 18334276, 18995244, 19625352, 20201351, 20694446, 21073947]
39892B1073947K38879Q1680p5725k14329l16087l66344l56234k86539j70761l3270
39882A9575217R8353K02420K68568K98005L00338K88844K75215K65415K59108
39873B1831483K53929K52109K64075L04749L84117M99084O33234P64482Q74318
39864B6061580R52670R97765J014274J011716J002293R97092J002057J016433
39856C4055880J034718J050488J059707J062048J060216J058016J058588J064190
39848D2503851J077382J101087J135294J172354J196423J190552J147875J078696
39840E1603514J008098R65716R74141J041885J163313J323987J507709J701599
39832F1289962J897842K093028K286533K479053K672081K868865L075897L302942
$$ y = [21073947, 21312826, 21394506, 21318781, 21104452, 20788365, 20422021, 20065787, 19779248, 19608487, 19575217, 19673570, 19875990, 20144558, 20442563, 20742901, 21031745, 21306960, 21572375, 21831483, 22085412, 22337521, 22601596, 22906345, 23290462, 23789546, 24422780, 25187262, 26061580, 27014250, 28012015, 29026289, 30038005, 31040298, 32037390, 33039447, 34055880, 35090598, 36141086, 37200793, 38262841, 39323057, 40381073, 41439661, 42503851, 43581233, 44682320, 45817614, 46989968, 48186391, 49376943, 50524818, 51603514, 52611612, 53577328, 54551469, 55593354, 56756667, 58080654, 59588363, 61289962, 63187804, 65280832, 67567365, 70046418, 72718499, 75587364, 78663261, 81966203]
39824H1966203L560694L857673M198904M587096N024737N515203O062109O667634
39816A21440253P331243Q049982Q820100R638649J0503997J1415488J2372595
39809A89572307J3372793J4407408J5457136J6490764J7468744J8348459J9085472
39802C04203083J9627744J9905892J9826593J9275754J8134447J6306477J3752616
39795D31032606J0522330O770919K751618j220099m822151p785230r937606j1222313
39787D16090074j1685260j1444911j0659354r501404q142958o744991n451202
39780C52459994m385473l651454l329861l470224m078784n108793o460269p993255
39772C13981881r552733j0997172j2220278j3158979j3788057j4107756j4132356
$$ y = [81966203, 85526897, 89384570, 93583474, 98170570, 103195307, 108710510, 114772619, 121440253, 128771496, 136821478, 145641578, 155280227, 165784224, 177199712, 189572307, 202945100, 217352508, 232809644, 249300408, 266769152, 285117611, 304203083, 323830827, 343736719, 363563312, 382839066, 400973513, 417279990, 431032606, 441554936, 448325855, 451077473, 449857374, 445035223, 437249993, 427312387, 416090074, 404404814, 392959903, 382300549, 372799145, 364656187, 357911196, 352459994, 348074521, 344423067, 341093206, 337622982, 333544198, 328435405, 321975136, 313981881, 304429148, 293431976, 281211698, 268052719, 254264662, 240156906, 226024550]
39765B26024550j3884505j3395292j2705657j1864937j0925980r940022q954095
39758A44354062q010318p144568o383950n745141n235209m853891m594495m442215
39750I7944275m371595m346526m324655m265096m136333l921606l620709l248470
39742F5709285k830435k396565j974364j583655j235003r32062o75938m68502
39734E3612761l12774k10628j59414j49245j62656j78376j79187j60147j31467
39725E1968867j13488j27208j86747k97111m55661o54030q79092j113811j338706
39716D6803013j533850j680855j764984j777548j718321j596708j430308j240663
39708C4059776j048018q68002p11960n89568n10109m80017m97945n51503o18933
$$ y = [226024550, 212140045, 198744753, 186039096, 174174159, 163248179, 153308157, 144354062, 136343744, 129199176, 122815226, 117070085, 111834876, 106980985, 102386490, 97944275, 93572680, 89226154, 84901499, 80636403, 76500070, 72578464, 68957755, 65709285, 62878850, 60482285, 58507921, 56924266, 55689263, 54757201, 54081263, 53612761, 53299987, 53089359, 52929945, 52780700, 52618044, 52439668, 52260481, 52100334, 51968867, 51855379, 51728171, 51541424, 51244313, 50788652, 50134622, 49255530, 48141719, 46803013, 45269163, 43588308, 41823324, 40045776, 38327455, 36730747, 35300439, 34059776, 33011758, 32143756, 31431796, 30842228, 30332119, 29852102, 29354157, 28802654, 28183721]
39699B8183721o75332p00085o82191o22234n31481m29019l37442k77736k64333
39690B3663868l01783l83954m95572o15027p17940p82047p93582p52750o74426
39681A8146787n82349m99496m39947m06004l90652l82908l72791l53724l22186
39672A4396730k76563k17200j47491p3854l375N9455J14182J62989K07776K47748
39662A4470397K78432K92372K81811K42953J79971J05664L7379r781k8625k1881
39652A5828692p50J8552J9219j1919q2177j93496l43658n25109p21499r06408
39642A3081447j048253j120275j109695j021006q72960o92240n06709l39599k05375
39633F165335j08053m2408K551L9213P7460J22133J72489K23665K69260L03318
$$ y = [28183721, 27508389, 26808304, 26126113, 25503879, 24972398, 24543379, 24205937, 23928201, 23663868, 23362085, 22978131, 22482559, 21867532, 21149592, 20367545, 19573963, 18821213, 18146787, 17564438, 17064942, 16624995, 16218991, 15828339, 15445431, 15072640, 14718916, 14396730, 14120167, 13902967, 13755476, 13681622, 13678247, 13737702, 13851884, 14014873, 14222649, 14470397, 14748829, 15041201, 15323012, 15565965, 15745936, 15851600, 15888979, 15879198, 15850573, 15828692, 15827942, 15846494, 15865713, 15853794, 15771617, 15578121, 15234463, 14709354, 13987855, 13081447, 12033194, 10912919, 9803224, 8782218, 7909258, 7217018, 6710309, 6370710, 6165335, 6057282, 6014874, 6017425, 6056638, 6134098, 6256231, 6428720, 6652385, 6921645, 7224963]
39623G224963L20693L16491K86485K29203J47880M9799n6760j64748k67059l53327
39613G733620m09311m21503l84492l05552k02803r7752o680O4298J18194J61743
39603F249762J99790K33018K59437K77202K86311K88520K86480K83016K80706
39594H644242K81358K85091K89481K89662K79919K56158K17858J68466J14159
39585A0826394O1675J6085k0678n0099p6603j06513j45927j96978k54074l03751
39575I749531l30057l22838k83283k23078j58437j03220o4871m4336l8839m5107
39565H135465o1141q6086j19638j62512k17785k90892l86345n02179o26293p38281
39555D944313q15921q41763q06586p10671n64962l91034k17109p0382L0189P7307
$$ y = [7224963, 7545656, 7862147, 8148632, 8377835, 8525715, 8575514, 8518754, 8354006, 8086947, 7733620, 7324309, 6902806, 6518314, 6212762, 6009959, 5912207, 5905527, 5969825, 6088019, 6249762, 6449552, 6682570, 6942007, 7219209, 7505520, 7794040, 8080520, 8363536, 8644242, 8925600, 9210691, 9500172, 9789834, 10069753, 10325911, 10543769, 10712235, 10826394, 10888069, 10904154, 10883476, 10833377, 10756774, 10650261, 10504334, 10307356, 10053282, 9749531, 9419474, 9096636, 8813353, 8590275, 8431838, 8328618, 8263747, 8219411, 8180572, 8135465, 8074324, 7988238, 7868600, 7706088, 7488303, 7197411, 6811066, 6308887, 5682594, 4944313, 4128392, 3286629, 2480043, 1769372, 1204410, 813376, 596267, 525885, 556074, 633381]
39545F33381P5523L9711q976n0406p3114p7180p0790o3925o3494p1292q3922r4318
39533I1198r4830q0833n3006j7089J8905M8997P3111R7918J33278J86154K55824
39522F59627L33100M03309M51140M65801M45198L97310L36916K78446K29095J87321
39512D187263J47967J09676P8015O1672O5365Q5594J11877J30999J30620J01457
39502E210505L9349n2487j62925k75373l72058m38170m64921m51278m03420l31148
39492B298074k42956j43245l3655Q3216K01026L09710L97962M56920M83315M80459
39482D290826M56254M19372L75680L26330K67981J95131J03979l904j19992k29697
39472F081960l14850l57305l43944k72057j52253o414J38763K59569L41388L81133
$$ y = [633381, 708904, 748615, 739639, 689233, 616119, 538939, 468149, 404224, 340730, 269438, 185516, 91198, -3632, -84465, -137471, -154560, -135655, -86658, -13547, 84371, 217649, 403803, 659627, 992727, 1396036, 1847176, 2312977, 2758175, 3155485, 3492401, 3770847, 3999942, 4187263, 4335230, 4444906, 4522921, 4584593, 4649958, 4735552, 4847429, 4978428, 5109048, 5210505, 5249854, 5197367, 5034442, 4759069, 4387011, 3948841, 3483920, 3032642, 2629222, 2298074, 2055118, 1911873, 1878218, 1961434, 2162460, 2472170, 2870132, 3327052, 3810367, 4290826, 4747080, 5166452, 5542132, 5868462, 6136443, 6331574, 6435553, 6431649, 6311657, 6081960, 5767110, 5409805, 5065861, 4793804, 4641551, 4635137, 4773900, 5033469, 5374857, 5755990]
39462E755990L85382L65134L30140K86170K36059J82166J27447P4719K5792j8494
39452G750505n8095r4217j29512j66522k04903k40216k65987k77378k73292k55891
39442E784492k29109j97480j64725j31922r6981n6826j0586L9568R0417J39403
39432E166251J83655K18319K37549K38085K21189J89905J44162P9269r526j19708
39422F549150k37639l41666m10636m32909m10910l59161k97357k42597k04673
39413C611602j85689j82561j90092k03065k16831k26829k28003k15099j83629
39404A779804j30821n6344L6647J40577K43952L33668L97519M25679M12116L57373
39394C940170K71380J72731Q2800J7306j9885l7292n0322p2736j10061j58729
$$ y = [5755990, 6141372, 6506506, 6836646, 7122816, 7358875, 7541041, 7668488, 7743207, 7768999, 7750505, 7692410, 7598193, 7468681, 7302159, 7097256, 6857040, 6591053, 6313675, 6040383, 5784492, 5555383, 5357903, 5193178, 5061256, 4964275, 4907449, 4896863, 4936431, 5026848, 5166251, 5349906, 5568225, 5805774, 6043859, 6265048, 6454953, 6599115, 6678384, 6668858, 6549150, 6311511, 5969845, 5559209, 5126300, 4715390, 4356229, 4058872, 3816275, 3611602, 3425913, 3243352, 3053260, 2850195, 2633364, 2406535, 2178532, 1963433, 1779804, 1648983, 1592639, 1629286, 1769863, 2013815, 2347483, 2745002, 3170681, 3582797, 3940170, 4211550, 4384281, 4467081, 4484387, 4464502, 4427210, 4376888, 4304152, 4194091, 4035362]
39384D035362k10655k59162l02349l42729l84145m27877m70591n06537n32912
39375E98405n53365n75560o04650o38704o69678o87751o84914o55984n98002n09524
39365e579727l90906k46043q4646P7429K21632L32561M02653M33216M32232M10940
39355c990659L80760L51103L28185L14910L11605L17047L29385L46739L67193
39346i43732L87916M03803M07173L90182L49509K90163K24717J67422J26840J01911
39336A905904Q3789O1819K9941r652m6976o8298o2121k4719L7195J08127J69073
39325B184082K03544K01499J60410Q4872j3993j19917k14632k82182l12417l02287
39315A588979k55031j77968p9688L1673J47616K56747L44351L96855M08919L87183
$$ y = [4035362, 3824707, 3565545, 3263196, 2920467, 2536322, 2108445, 1637854, 1131317, 598405, 45040, -530520, -1135170, -1773874, -2443552, -3131303, -3816217, -4472201, -5070203, -5579727, -5970633, -6216676, -6301322, -6223893, -6002261, -5669700, -5267047, -4833831, -4401599, -3990659, -3609899, -3258796, -2930611, -2615701, -2304096, -1987049, -1657664, -1310925, -943732, -555816, -152013, 255160, 645342, 994851, 1285014, 1509731, 1677153, 1803993, 1905904, 1989693, 2051512, 2081453, 2071801, 2024825, 1956527, 1894406, 1869687, 1906882, 2015009, 2184082, 2387626, 2589125, 2749535, 2834407, 2820414, 2700497, 2485865, 2203683, 1891266, 1588979, 1333948, 1155980, 1076292, 1107965, 1255581, 1512328, 1856679, 2253534, 2662453, 3049636]
39305C049636L46940L04167K68699K42517K22626K05459J89924J77796J71839
39296E179603J73172J79465J84675J80170J57351J11681M6672k5394q8310j30488
39286E968597j51434j60957j71591j90128k14623k38228k55905k68562k82312
39277D034857l04134l37206l78613m20495m53652m71356m71175m54593m25853
39268C17780l91280l58692l35526l25940l29158l40886l56548l72833l85891l88812
39258c267786l72347l29432k59739j70157p1031K8695J24224K14501K99566L77503
39248c426003M43111M89272N10302N05523M81538M52060M34473M43816M87157
39239H21249N61548O56049P55289Q42625R03020R25783R05836Q42713P38833N99105
$$ y = [3049636, 3396576, 3700743, 3969442, 4211959, 4434585, 4640044, 4829968, 5007764, 5179603, 5352775, 5532240, 5716915, 5897085, 6054436, 6166117, 6212789, 6187395, 6099085, 5968597, 5817163, 5656206, 5484615, 5294487, 5079864, 4841636, 4585731, 4317169, 4034857, 3730723, 3393517, 3014904, 2594409, 2140757, 1669401, 1198226, 743633, 317780, -73500, -432192, -767718, -1093658, -1422816, -1763702, -2120250, -2493083, -2878974, -3267786, -3640133, -3969565, -4229304, -4399461, -4470492, -4441797, -4317573, -4103072, -3803506, -3426003, -2982892, -2493620, -1983318, -1477795, -996257, -544197, -109724, 334092, 821249, 1382797, 2038846, 2794135, 3636760, 4539780, 5465563, 6371399, 7214112, 7952945, 8552050]
39229H552050M31638K47879O1862j10638k53605l54575m09961m27685m23561m13119
39219F900285m04729l98651l91554l81461l68535l51528l24579k78951k09187
39210C791110j18383j8297P5090J46645J85290J85461J47580P7279j6646j24620
39200D330509k37628l47617m47906n34080o04480o59193o97897p18373p17033
39191f33698o91092o40626n69217m82873l87843k88608j87486q6360J1265J00209
39181c856329J75900K36633K83614L19209L45434L63718L75468L82546L87142
39172i86665L90827L93118L90836L79433L55911L21261K80196K37883J95767J49915
39162B108482R3676K2890o0396j48058k28430k88825l17701l07509k57534j74535
$$ y = [8552050, 8983688, 9231567, 9293429, 9182791, 8929186, 8574611, 8164650, 7736965, 7313404, 6900285, 6495556, 6096905, 5705351, 5323890, 4955355, 4603827, 4279248, 4000297, 3791110, 3672727, 3654430, 3729520, 3876165, 4061455, 4246916, 4394496, 4471775, 4455129, 4330509, 4092881, 3745264, 3297358, 2763278, 2158798, 1499605, 801708, 83335, -633698, -1324790, -1965416, -2534633, -3017506, -3405349, -3693957, -3881443, -3967803, -3956538, -3856329, -3680429, -3443796, -3160182, -2840973, -2495539, -2131821, -1756353, -1373807, -986665, -595838, -202720, 188116, 567549, 923460, 1244721, 1524917, 1762800, 1958567, 2108482, 2202158, 2225048, 2164652, 2016594, 1788164, 1499339, 1181638, 874129, 616595, 442060]
39152D42060p0859L8108J35784K06616K39523K30895J84666J09305J4215r2153
39142A438160k01903l06189l94528m56309m84133m76343m36323l69145k78922
39133a965635j69731m9384O8185J65471K28515K53526K47837K24586J95479J66345
39123f34806J36660J01638N5609m214p5325j50659k21667k80808l21857l39460
39113a734889l29983k93380k33987j59137p6501Q071R0967J69424K39632K96510
39103b023273L35944L57992L68146L75460L88797M13476M49522M91617N30557
39094A688238N55945N59201N35364M82895M02631K97957J76659N2220n8233j39103
39084D553774j81289j83507j50023q7470l265R3938J93201K81503L46184L78808
$$ y = [442060, 371201, 409309, 545093, 751709, 991232, 1222127, 1406793, 1516098, 1530313, 1438160, 1236257, 930068, 535540, 79231, -404902, -881245, -1317568, -1686713, -1965635, -2135366, -2184750, -2116565, -1951094, -1722579, -1469053, -1221216, -996630, -801151, -634806, -498146, -396508, -340899, -345113, -420438, -571097, -792764, -1073572, -1395429, -1734889, -2064872, -2358252, -2592239, -2751376, -2827877, -2819806, -2728839, -2559415, -2319783, -2023273, -1687329, -1329337, -961191, -585731, -196934, 216542, 666064, 1157681, 1688238, 2244183, 2803384, 3338748, 3821643, 4224274, 4522231, 4698890, 4751110, 4692877, 4553774, 4372485, 4188978, 4038955, 3951485, 3948220, 4042158, 4235359, 4516862, 4863046, 5241854]
39074E241854L77835L47989K97113K33297J63838R4917L0473k8899q4938j38720
39064F534759j88592k31484k66368k96307l26918l62746m04596m49582m93007
39055C515159n30348n58442n75975n83289n81298n69896n47122n10100m57081
39046a398392l88959l09084k21671j29792l4049O7326J76690K94560M18347N43044
39036i81980O62657P70509Q58458R16863R36964R14799Q54173P66616O68153N74206
39026F941418M95016M33754L87857L51867L19210K82543K34528J70475R0981J213
39016I708862r3397j91074k93026l98554n00481n85267o38054o49488o20077n59493
39006E179951m81197l96009l09026k21662j36270n8951K071M1656O2880P7934
$$ y = [5241854, 5619689, 5967678, 6264791, 6498088, 6661926, 6756843, 6787316, 6758417, 6673479, 6534759, 6346167, 6114683, 5848315, 5552008, 5225090, 4862344, 4457748, 4008166, 3515159, 2984811, 2426369, 1850394, 1267105, 685807, 115911, -431211, -941311, -1398392, -1787351, -2096435, -2318106, -2447898, -2481947, -2414621, -2237931, -1943371, -1525024, -981980, -319323, 451186, 1309644, 2226507, 3163471, 4078270, 4932443, 5699059, 6367212, 6941418, 7436434, 7870188, 8258045, 8609912, 8929122, 9211665, 9446193, 9616668, 9707649, 9708862, 9615465, 9424391, 9131365, 8732811, 8232330, 7647063, 7009009, 6359521, 5739444, 5179951, 4698754, 4302745, 3993719, 3772057, 3635787, 3576836, 3578907, 3620563, 3683443, 3761377]
38996C761377J03050J50132K21020L08308M00670M86961N56141N95741N93295
38987G176695N41225M41307L04722J47535j5107j72288l16607m40987n36106n90786
38977F539603n95177n45046m45057l09668j61011k4072P9334J35740J42775J08760
38967D926181M9301j8169p9805j28468j63634j88995k09593k29496k50241k70146
38957C436935k84925k89784k82262k64250k42112k24994k22230k40674k82160
38948A103544l41434m05547m55839m72785m42464l62243k42965j06336K1677J18910
38938a585482J74059J90690J86483J86611K13269K76724L72857M87217O01226
38929A103654O96694P58577P77511P51909O88064N97902M95753L95272L06612
$$ y = [3761377, 3864427, 4014559, 4235579, 4543887, 4944557, 5431518, 5987659, 6583400, 7176695, 7717920, 8159227, 8463949, 8611484, 8596377, 8424089, 8107482, 7666495, 7130389, 6539603, 5944426, 5399380, 4954323, 4644655, 4483644, 4459572, 4538906, 4674646, 4817421, 4926181, 4975482, 4957313, 4877508, 4749040, 4585406, 4396411, 4186818, 3957322, 3707081, 3436935, 3152010, 2862226, 2579964, 2315714, 2073602, 1848608, 1626378, 1385704, 1103544, 762110, 356563, -99276, -572061, -1014525, -1376768, -1619733, -1726069, -1704392, -1585482, -1411423, -1220733, -1034250, -847639, -634370, -357646, 15211, 502428, 1103654, 1800348, 2558925, 3336436, 4088345, 4776409, 5374311, 5870064, 6265336, 6571948]
38920F571948K34326J77380J31955R5355O8000N1885M6794M7348M3356K3443k0500
38909G471290r1023j85934l00548m28592n60984o84406p82465q39954q47666q04720
38899A944998p17732n98618m62675l26966k08368j21125p4018o7170q9953j23152
38889h44779j46797j49746j33979j10240q9012p3925o1413m5145k1549P116L4185
38878a635284N3630O4484P0357P4378P4829O5947M3056P580l1305n8499n7248
38867a328075j5309O8554J81353K99337L97692M60918M87264M84871M63772M30293
38857A930670L86849L34708K75522K10361J38359N7425l3054j29608k24128l05582
38847B641522l62864l87598l76836l35874k79877k31455k12746k35117k92978
$$ y = [6571948, 6806274, 6983654, 7115609, 7210964, 7278964, 7330849, 7377643, 7424991, 7468347, 7491790, 7471290, 7380267, 7194333, 6893785, 6465193, 5904209, 5219803, 4437338, 3597384, 2749718, 1944998, 1227266, 628648, 165973, -160993, -369361, -490486, -564504, -631674, -721627, -844779, -991576, -1141322, -1275301, -1385541, -1474553, -1548478, -1609891, -1655036, -1676585, -1669469, -1635284, -1581654, -1517170, -1446813, -1372435, -1297606, -1231659, -1188603, -1181023, -1212328, -1270827, -1328075, -1343384, -1274830, -1093477, -794140, -396448, 64470, 551734, 1036605, 1500377, 1930670, 2317519, 2652227, 2927749, 3138110, 3276469, 3333894, 3300840, 3171232, 2947104, 2641522, 2278658, 1891060, 1514224, 1178350, 898473, 667018, 454272, 219155, -73823]
38838g3823l66478m31735m71912m82344m67902m36528l94282l44078k86291k19077
38828c974450j38996m3581O4911J77991K83763L72270M39340M86402N16933N32438
38818a282979N31186N11003M73967M28598L86952L58682L46594L46321L49228
38809B449552L46518L33138L10354K85261K66856K60735K65913K75445K79945
38800E073717K71531K46376K04829J49423Q1995J763r4241k08384l38590m75731
38790D912688o04377p07477p72519p95343p79552p33081o65062n84388m99001
38781a228112m15130l36837k66249k03758j47371r2143l1131M1769J28515K24875
38771b325572L20789M03397M61521M89125M85927M55744M04471L38583K63998
$$ y = [-73823, -440301, -872036, -1343948, -1826292, -2294194, -2730722, -3125004, -3469082, -3755373, -3974450, -4113446, -4157027, -4092116, -3914125, -3630362, -3258092, -2818752, -2332350, -1815417, -1282979, -751793, -240790, 233177, 661775, 1048727, 1407409, 1754003, 2100324, 2449552, 2796070, 3129208, 3439562, 3724823, 3991679, 4252414, 4518327, 4793772, 5073717, 5345248, 5591624, 5796453, 5945876, 6027871, 6029634, 5935393, 5727009, 5388419, 4912688, 4308311, 3600834, 2828315, 2032972, 1253420, 520339, -144723, -729111, -1228112, -1643242, -1980079, -2246328, -2450086, -2597457, -2689600, -2720731, -2678962, -2550447, -2325572, -2004783, -1601386, -1139865, -650740, -164813, 290931, 695402, 1033985, 1297983]
38762A297983J85847J09969M4458k100k5886l1540k9507k8738l1662l5405l6776
38751A416643l5730l5233l9238n1198p3719j08290j54080k06242k55653k91331
38741A65929l04363k90806k52108j93727j22693m4630L8276J25802K14666K94402
38731c69252L49300L66205L42140K85893K13406J41351Q2939M6415L4548M4325
38721A537270O7776R4959J18110J34237J44101J48478J44822J27123Q9158K8964
38711B634998m8337j31159k05285k58693k84665k82054k53869k06167j47901r0325
38701G26543m4597j7919j0249j3612j4792p07L5651R1455J54534K07723K34629
38690A348659K24320J74040R0032j3807j19687k11247k78209l18224l35189l35136
$$ y = [1297983, 1483830, 1593799, 1638257, 1636157, 1610271, 1578731, 1549224, 1520486, 1488824, 1453419, 1416643, 1380913, 1345680, 1306442, 1255244, 1181525, 1073235, 919155, 712913, 457260, 165929, -138434, -429240, -681348, -875075, -997768, -1042398, -1004122, -878320, -663654, -369252, -19952, 346253, 688393, 974286, 1187692, 1329043, 1411982, 1458397, 1492945, 1537270, 1605046, 1700005, 1818115, 1952352, 2096453, 2244931, 2389753, 2516876, 2606034, 2634998, 2586661, 2455502, 2250217, 1991524, 1706859, 1424805, 1170936, 964769, 816868, 726543, 681946, 664027, 653778, 640166, 625374, 624667, 660318, 751773, 906307, 1114030, 1348659, 1572979, 1747019, 1837051, 1823244, 1703557, 1492310, 1214101, 895877, 560688, 225552]
38680B25552l22346k98245k63222k18585j65985j05269l4289M7888J37399K25664
38670g71438L03394L64931M09535M39298M55937M58702M44306M08540L48764K66223
38660C128192J67179O2001l7449j20889j81893k19279k37638k46082k54146k66370
38650A793626k79492k84858k74174k44196j97821j42124q5155l2863J2666N2852
38640C18461R0454J27052J61282J87981J98718J84343J39121O3981l3248j40241
38630A297904k42966l27409l80894l94108l63626k93516j95014q4397K0004J00842
38620h63180J44411J42698R4555N763j12143k44251l75336m92456n86128o50542
38610b936609o83911o88739o70105o31518n71482m85064l70472k35243r6457K5532
$$ y = [225552, -96794, -395039, -658261, -876846, -1042831, -1148100, -1182389, -1134501, -997102, -771438, -468044, -103113, 306422, 745720, 1201657, 1660359, 2104665, 2513205, 2861969, 3128192, 3295371, 3357372, 3319923, 3199034, 3017141, 2797862, 2560224, 2314142, 2059996, 1793626, 1514134, 1229276, 955102, 710906, 513085, 370961, 285806, 252943, 265609, 318461, 408915, 535967, 697249, 885230, 1083948, 1268291, 1407412, 1471393, 1438145, 1297904, 1054938, 727529, 346635, -47473, -411099, -704615, -899629, -984026, -964022, -863180, -718769, -576071, -481516, -475753, -587896, -832147, -1207483, -1699939, -2286067, -2936609, -3620520, -4309259, -4979364, -5610882, -6182364, -6667428, -7037900, -7273143, -7369600, -7344068]
38600g344068J15431J68490J90900J95512J95136J96719J99289J96123J79040
38591e707428J42301Q4895J1112p0525j49505k15377k58607k71051k47687j89459
38581f871331j04813p928Q5335J61156K09824K26994K14664J80889J37505R6817
38571e670888O8932N9971P0546R5162J24313J49495J68219J85369K10175K51476
38561d287230L14322L98545M97989N99933O86315P38548P44667P04363O28232
38552A025684N32293M32556L42901K74636K34236K19380K17706K11745J87676
38543C678813J41601P9457J2276m8954r6407j26827j41621j45403j43201j38023
38533C071711j30134j17915r9177p2471l8327k99L4493N5452M9572M386q6993
$$ y = [-7344068, -7228637, -7060147, -6869247, -6673735, -6478599, -6281880, -6082591, -5886468, -5707428, -5565127, -5480232, -5469120, -5539645, -5689150, -5904527, -6163134, -6434185, -6681872, -6871331, -6976144, -6984072, -6898737, -6737581, -6527757, -6300763, -6086099, -5905210, -5767705, -5670888, -5601956, -5541985, -5471439, -5376277, -5251964, -5102469, -4934250, -4748881, -4538706, -4287230, -3972908, -3574363, -3076374, -2476441, -1790126, -1051578, -306911, 397452, 1025684, 1557977, 1990533, 2333434, 2608070, 2842306, 3061686, 3279392, 3491137, 3678813, 3820414, 3899871, 3912147, 3863193, 3766786, 3639959, 3498338, 3352935, 3209734, 3071711, 2941577, 2823662, 2724485, 2652014, 2613687, 2613388, 2647881, 2703333, 2752905, 2757291, 2670298]
38522B670298k20720l79999n37667o63006p30683p28897o63243n53710m25835
38513b233462l01092j92092j04067l9314n2J2268l37l0679o7785j01078j24575
38502c182265j37936j43349j41007j27368r7913n1647O980P0203J30441J82074
38492c491787K21282K46122K57943K62388K67795K81222L04755L34623L63031
38483i52626L80475L76876L42420K70083J60112K3575j18547k41693l26770l67405
38473d53500l71771l58160l46759l51796l77296m17054m57799m84217m84332m53184
38463d555868l93222l11914k18459j20970k4378P0521J66174K65653L69771M75036
38453d277656N72712O49299O89438O81496O23700N27154M13197L05924K23789
$$ y = [2670298, 2449578, 2069579, 1531912, 868906, 138223, -590674, -1253917, -1807627, -2233462, -2534554, -2726646, -2830713, -2870027, -2870079, -2857811, -2858148, -2888827, -2956612, -3057690, -3182265, -3320201, -3463550, -3604557, -3731925, -3829838, -3881485, -3874505, -3804302, -3673861, -3491787, -3270505, -3024383, -2766440, -2504052, -2236257, -1955035, -1650280, -1315657, -952626, -572151, -195275, 147145, 417228, 577340, 600915, 482368, 240675, -86095, -453500, -825271, -1183431, -1530190, -1881986, -2259282, -2676336, -3134135, -3618352, -4102684, -4555868, -4949090, -5261004, -5479463, -5600433, -5624811, -5554290, -5388116, -5122463, -4752692, -4277656, -3704944, -3055645, -2366207, -1684711, -1061011, -533857, -120660, 185264, 409053]
38444D09053J74986J58329J66982J91131K18613K35908K31123J97398J34354M7535
38434B165412n2735j52939k39491l03015l41110l57288l56723l41944l11636k63191
38424e54660j96540j15841k7748O1630J47945K27221K93729L39750L58332L47896
38414H81714L15719K77049K49137K43451K60954K93127L27265L52240L61488L52343
38404C914487L23586K74262K05153J21205L2069n0201j14744j55094j71116j68903
38394D210704j57831j45667j34828j22659j05160q0552m9394j1377L7597J04197
38384C545030J92104K96713M05280N02919N79152O29705O53384O48330O11447
38375H064064N41178M41162L22007J99429Q8969j22o8077j23026j76089k36132
$$ y = [409053, 584039, 742368, 909350, 1100481, 1319094, 1555002, 1786125, 1983523, 2117877, 2165412, 2112677, 1959738, 1720247, 1417232, 1076122, 718834, 362111, 20167, -291469, -554660, -751200, -867041, -894789, -833159, -685214, -457993, -164264, 175486, 533818, 881714, 1197433, 1474482, 1723619, 1967070, 2228024, 2521151, 2848416, 3200656, 3562144, 3914487, 4238073, 4512335, 4717488, 4838693, 4870762, 4820561, 4705817, 4550723, 4379607, 4210704, 4052873, 3907206, 3772378, 3649719, 3544559, 3464007, 3414613, 3403236, 3440833, 3545030, 3737134, 4033847, 4439127, 4942046, 5521198, 6150903, 6804287, 7452617, 8064064, 8605242, 9046404, 9368411, 9567840, 9656809, 9656687, 9588610, 9465584, 9289495, 9053363]
38365I053363l06015l80791m48149m91907m97966m60201l83152k80226j68573
38356E636383o3332K5753R3728J36884J50114J28403P1481j2979j11221k08995
38346E846219k96259l68006m22016m56606m70394m63846m40734m07623l71169
38337B149566l34691k96223k49459j87548j08143j7003P2324J42836J79670J74101
38327A525430J25314M1056o2810j65211k45564k90181k96508k73415k37158k03906
38317h2953j81759j66796j46208j06654m2363M1741J32448K13356K69855K92764
38307B23431K80665K40599J86264J33543R4862P5049P0753P3460P4124O6869N0260
38296A569879K6693J547j7588k3055j1378J2894L7793M9737M0516J0476l3113
$$ y = [9053363, 8747348, 8366557, 7918408, 7426501, 6928535, 6468334, 6085182, 5804956, 5636383, 5573051, 5598804, 5692532, 5829416, 5979530, 6107933, 6179414, 6166435, 6055214, 5846219, 5549960, 5181954, 4759938, 4303332, 3832938, 3369092, 2928358, 2520735, 2149566, 1814875, 1518652, 1269193, 1081645, 973502, 956499, 1028823, 1171659, 1351329, 1525430, 1650744, 1691800, 1628990, 1463779, 1218215, 928034, 631526, 358111, 120953, -82953, -264712, -431508, -577716, -684370, -726733, -684992, -552544, -339188, -69333, 223431, 504096, 744695, 930959, 1064502, 1159364, 1234413, 1305166, 1378626, 1452750, 1519619, 1569879, 1596572, 1598119, 1580531, 1557476, 1546098, 1558992, 1596785, 1646522, 1687038, 1697514, 1664401]
38285A664401q0052j20980j50016j66123j72679j75617j81401j95815k23071k64577
38275f5930l17900l77247m35435m85764n22310n39339n31579m96199m34996l54571
38265d561270k63817j70441p9073P593Q5488J46272J77678J67984J12543J8436
38255d358607r5806k05439k87182l26021l18522k71316j95675j01433N568J21035
38245f033398K37619L43098M23563M68900M75906M47189L88226L06086K10496
38236b732315J14662L3129k3062n0508n3122l7243o414L9131R7872J62313K19548
38225b236009K57104K69069K58013K32148K00459J68563J37067J02873O2613J6359
38215e31741l0425o7798q5127p6235m2841O181N9058J05222J36599J47059J32802
$$ y = [1664401, 1584349, 1463369, 1313353, 1147230, 974551, 798934, 617533, 421718, 198647, -65930, -383830, -761077, -1196512, -1682276, -2204586, -2743925, -3275504, -3771703, -4206699, -4561270, -4825087, -4995528, -5074601, -5067008, -4981520, -4835248, -4657570, -4489586, -4377043, -4358607, -4454413, -4659852, -4947034, -5273055, -5591577, -5862893, -6058568, -6160001, -6154433, -6033398, -5795779, -5452681, -5029118, -4560218, -4084312, -3637123, -3248897, -2942811, -2732315, -2617653, -2584524, -2607586, -2658094, -2711216, -2748459, -2754873, -2715742, -2617870, -2455557, -2236009, -1978905, -1709836, -1451823, -1219675, -1019216, -850653, -713586, -610713, -548100, -531741, -562166, -629964, -715091, -791326, -834167, -827986, -768928, -663706, -527107, -380048, -247246]
38204b47246R4340L8274k3239p5910j08547j17630j08017q8696o6753m4809k3720
38193g71953p042k137j6862n4995j13910j85368k58169l21370l67164l92431l97985
38182b889386l85705l55696l06063k36015j49936n8778K2729Q0978J06774R5459
38172d075639M6082l7460j43619k52817l42579l95823m06395l78457l22039k49321
38162f558067j73092j05317n4270k1577j970J3243L0906N2290P3107Q6761Q8355
38151f569631P7210N7513L7285K5584K8537M6543P4862J06612J34697J51255J47349
38140e682184J16032N7657j7088q9638j40294j55240j30527p2024P458R1819J64901
38129e849128K13387K29909K15552J79861J37291J01536Q0579P4716P7997Q1753
$$ y = [-247246, -152906, -114632, -137871, -213781, -322328, -439958, -547975, -636671, -703424, -748233, -771953, -778995, -781132, -797994, -852989, -966899, -1152267, -1410436, -1731806, -2098970, -2491401, -2889386, -3275091, -3630787, -3936850, -4172865, -4322801, -4381579, -4358850, -4277872, -4171098, -4075639, -4029557, -4067017, -4210636, -4463453, -4806032, -5201855, -5608250, -5986707, -6308746, -6558067, -6731159, -6836476, -6890746, -6912323, -6914293, -6901050, -6870144, -6817854, -6744747, -6657986, -6569631, -6492421, -6434908, -6397623, -6372039, -6343502, -6296959, -6222097, -6115485, -5980788, -5829533, -5682184, -5566152, -5508495, -5525583, -5615221, -5755515, -5910755, -6041282, -6113306, -6105848, -6014029, -5849128, -5635741, -5405832, -5190280, -5010419, -4873128, -4771592, -4691013, -4616297, -4538300, -4456547]
38119d456547P8209O2234L0857j7896q4638j66376k54760l37815m05306m53985
38109f006023m88231n15043n37065n48744n37984m91520m00510k63807q8411J12233
38099i765105L20899N19089O89080Q16356Q93041R20836R10731Q78442Q38145
38090b978486P98401P61670P26030O87054O39005N75345M88829L72470K22606
38081B292924M3332j50915l37469m91795n94790o37874o24209n65980m79453l80827
38071a927056k84891k05166j52446j31049j36045j54826j72557j77655j64122
38062c505813j30635p8472j0312O9370J53139K30365K89023L18789L13476K71803
38052b079267J97266R8340j1230j13586j90161k26175k14368j56847o4688M5157
$$ y = [-4456547, -4378338, -4316104, -4285247, -4303143, -4387781, -4554157, -4808917, -5146732, -5552038, -6006023, -6494254, -7009297, -7546362, -8095106, -8633090, -9124610, -9525120, -9788927, -9877338, -9765105, -9444206, -8925117, -8236037, -7419681, -6526640, -5605804, -4695073, -3816631, -2978486, -2180085, -1418415, -692385, -5331, 633674, 1209019, 1697848, 2070318, 2292924, 2336256, 2185341, 1847872, 1356077, 761287, 123413, -500796, -1066776, -1546229, -1927056, -2211947, -2417113, -2569559, -2700608, -2836653, -2991479, -3164036, -3341691, -3505813, -3636448, -3714920, -3725232, -3655862, -3502723, -3272358, -2983335, -2664546, -2351070, -2079267, -1882001, -1783661, -1794891, -1908477, -2098638, -2324813, -2539181, -2696028, -2760716, -2715559]
38042b715559J55428K54291L37700M06799M62784N03491N23976N19690M89401
38033I38001M35890L64676K82070J93951J05472K1002n5880j22091j74675k11501
38023A776915k33312k45020k53882k65090k78347k88364k88789k76914k56452
38014f09255k36864k28932k38784k64219k96149l24093l41528l47731l45663l38070
38004c571288l24618l01874k65993k16167j56623r5941m3945p221J4818L0702
37994d938150N3047R1596J47562K13114K76039L26067L58645L74647L77605L71253
37984b348575L59013L44964L34602L33921L46471L69657L93087M01354L80725
37975I15219L25871K42276J43391M5003m0000j05017j50619j82399k06300k24243
$$ y = [-2715559, -2560131, -2305840, -1968140, -1561341, -1098557, -595066, -71090, 448600, 938001, 1373891, 1738567, 2020637, 2214588, 2320060, 2341062, 2285182, 2163091, 1988416, 1776915, 1543603, 1298583, 1044701, 779611, 501264, 212900, -75889, -352803, -609255, -846119, -1075051, -1313835, -1578054, -1874203, -2198296, -2539824, -2887555, -3233218, -3571288, -3895906, -4197780, -4463773, -4679940, -4836563, -4932504, -4976449, -4983670, -4968852, -4938150, -4885103, -4793507, -4645945, -4432831, -4156792, -3830725, -3472080, -3097433, -2719828, -2348575, -1989562, -1644598, -1309996, -976075, -629604, -259947, 133140, 534494, 915219, 1241090, 1483366, 1626757, 1671760, 1631760, 1526743, 1376124, 1193725, 987425, 763182]
37965G63182k33197k28168k06191j68599j21230p3608l6849j9582k3151l9508
37955c86901n3827n0319j8163M4198J27030K11003K73856L00053K87884K49513
37945I84327K04199J69238J53410J55662J68804J85431K01873K17736K32451K42603
37935B915734K42312K25741J89606J34533O5251j0415q3322j44728j87135k04615
37925C142962j93674j54649r2631j6780O1903J33392J90968K32135K57607K68592
37915C829825K63956K39321J89190J11221J0244j00211j99895k66636k82658k40686
37905C553671j48018k6491R2929J79592K12584J85881J07607m909j31474k54447
37895C766925l61664m46046n03205n30062n26481m97955m55439m10797l70911
$$ y = [763182, 529985, 301817, 95626, -72973, -194203, -267811, -304660, -324242, -347393, -386901, -440728, -491047, -509210, -465012, -337982, -126979, 146877, 446930, 734814, 984327, 1188526, 1357764, 1511174, 1666836, 1835640, 2021071, 2222944, 2440680, 2673131, 2915734, 3158046, 3383787, 3573393, 3707926, 3773177, 3762762, 3679440, 3534712, 3347577, 3142962, 2949288, 2794639, 2702008, 2685228, 2747131, 2880523, 3071491, 3303626, 3561233, 3829825, 4093781, 4333102, 4522292, 4633513, 4643757, 4543546, 4343651, 4077015, 3794357, 3553671, 3405653, 3379162, 3472091, 3651683, 3864267, 4050148, 4157755, 4152846, 4021372, 3766925, 3405261, 2959215, 2456010, 1925948, 1399467, 901512, 446073, 35276, -335635]
37886c35635l34903k96434k49376j93237j35218q7739o2850o6545r5742j38915
37876a996594j79936k03661k01287j73317j28945q2171m6093k7628k5072l0074
37866c094778l2770k6680j0497J3235M0716O9145R8148J29662J66056K07516K51189
37855b189058K93220L31979L69056M06301M40960M63373M60134M20841L43614
37846A340420K36009J12301r963j12710j80258k02813j79382j18282l4634N3995
37836I04683J31901J87919K16299K16710J93909J56525J14563P6453M6938K6372
37826B272272J1530j666j4192k1614j6322O666M5107Q9583J27391J47190J42615
37815B788560J14116O8013J2235m8891j16655j95141k86189l86418m87778n79803
$$ y = [-335635, -670538, -966972, -1216348, -1409585, -1544803, -1632542, -1695392, -1761937, -1857679, -1996594, -2176530, -2380191, -2581478, -2754795, -2883740, -2965911, -3012004, -3039632, -3064704, -3094778, -3127548, -3154228, -3164725, -3151490, -3110774, -3041629, -2943481, -2813819, -2647763, -2440247, -2189058, -1895838, -1563859, -1194803, -788502, -347542, 115831, 575965, 996806, 1340420, 1576429, 1688730, 1678767, 1566057, 1385799, 1182986, 1003604, 885322, 850688, 904683, 1036584, 1224503, 1440802, 1657512, 1851421, 2007946, 2122509, 2198962, 2245900, 2272272, 2283802, 2282136, 2267944, 2246330, 2230008, 2236674, 2281781, 2371364, 2498755, 2645945, 2788560, 2902676, 2970689, 2982924, 2934033, 2817378, 2622237, 2336048, 1949630, 1461852, 882049]
37805H82049o51281o91394o91917o50755n74479m77146l75348k82225k03634j38257
37795c854387q1695l2452M471K0080Q683k6248p2998j18222j53489j77485j94031
37784d677773k08449k24323k41982k59248k73521k83045k86267k80470k61674
37775f996752k26365j73997j08517l7435L1798R6132J58526K25020K99215L78414
37765f353961M53745N13472N47212N49456N21357M69965M05154L36181K70122
37756b287297K12177J65655J30179R9794O4145J3529n5091j35216k12795k71670
37746b276590k99587k92366k54946j99503j41828r7039p5076p6782r2968j08507
37736c915192j09943r1630n6612j3488K6652N1728N0755J8173m2030j16517j88033
$$ y = [882049, 230768, -460626, -1152543, -1803298, -2377777, -2854923, -3230271, -3512496, -3716130, -3854387, -3936082, -3968534, -3964063, -3943983, -3935300, -3961548, -4034546, -4152768, -4306257, -4483742, -4677773, -4886222, -5110545, -5352527, -5611775, -5885296, -6168341, -6454608, -6735078, -6996752, -7223117, -7397114, -7505631, -7543066, -7511268, -7415136, -7256610, -7031590, -6732375, -6353961, -5900216, -5386744, -4839532, -4290076, -3768719, -3298754, -2893600, -2557419, -2287297, -2075120, -1909465, -1779286, -1679492, -1615347, -1601818, -1656909, -1792125, -2004920, -2276590, -2576177, -2868543, -3123489, -3322992, -3464820, -3561859, -3636935, -3713717, -3806685, -3915192, -4025135, -4116765, -4173377, -4186865, -4160213, -4108485, -4057730, -4039557, -4081587, -4198104, -4386137]
37725d386137k42356k72275k77440k62186k33572j99959j69175j46252j31750
37716f321102j21524j07928q2114l7347K7373J05468J84656K51718K96988L15882
37706e487930L07739K74311K19443J49782P5276P919m1933p0168q0786q2267q0306
37695d808920p2599m9889k061P5412J78386K94852M08263N01953N63198N85715
37685b325690N70037N22127M50763L64536K69695J70224P0057k4627j05027j61591
37675a99496j86847j78168j39769q2763k2167K8391O1074P4606P1792N6500L2156
37664d84691J377l4094p3006j13357j51014j79699j92861j86511j61705j25789
37654a701350r1284p1777p5951j03293j44582j87072k20575k40559k47228k42874
$$ y = [-4386137, -4628493, -4900768, -5178208, -5440394, -5673966, -5873925, -6043100, -6189352, -6321102, -6442626, -6550554, -6632668, -6670015, -6642642, -6537174, -6352518, -6100800, -5803812, -5487930, -5180191, -4905880, -4686437, -4536655, -4461379, -4453460, -4495393, -4565561, -4646347, -4728614, -4808920, -4881519, -4931408, -4933469, -4858057, -4679671, -4384819, -3976556, -3474603, -2911405, -2325690, -1755653, -1233526, -782763, -418227, -148532, 21692, 91749, 67122, -37905, -199496, -386343, -564511, -704280, -787043, -809210, -780819, -719745, -645139, -573347, -516847, -484691, -483314, -517408, -590414, -703771, -854785, -1034484, -1227345, -1413856, -1575561, -1701350, -1792634, -1864411, -1940362, -2043655, -2188237, -2375309, -2595884, -2836443, -3083671, -3326545]
37644c326545k30414k13628j97277j85256j77698j69771j53722j22948p5586j6285
37634d869130M3906Q9826J06871Q6735L1385m7262j31759k04970k54198k72268
37624e420864k56590k08146j31187l2807P8259J92866L01797L95876M67190N11155
37614d102451N27427N18673M88549M40729L79323L09753K39400J77549J34062
37605h86986J16666J27889J63328K12033K58934K88698K89783K56961J91576J00571
37595A119453m415j08359j95825k55267k82262k79865k56664k24070j93817j75890
37585h56981j77248k01513k48966l16170l95431m74996n40606n78146n76989n33094
37575d900140m50645l41310k21155j06319q726O6604J21019J58406J80610J85905
$$ y = [-3326545, -3556959, -3770587, -3967864, -4153120, -4330818, -4500589, -4654311, -4777259, -4852845, -4869130, -4825224, -4735398, -4628527, -4541792, -4510407, -4557669, -4689428, -4894398, -5148596, -5420864, -5677454, -5885600, -6016787, -6049594, -5971335, -5778469, -5476672, -5080796, -4613606, -4102451, -3575024, -3056351, -2567802, -2127073, -1747750, -1437997, -1198597, -1021048, -886986, -770320, -642431, -479103, -267070, -8136, 280562, 570345, 827306, 1018882, 1119453, 1115038, 1006679, 810854, 555587, 273325, -6540, -263204, -487274, -681091, -856981, -1034229, -1235742, -1484708, -1800878, -2196309, -2671305, -3211911, -3790057, -4367046, -4900140, -5350785, -5692095, -5913250, -6019569, -6028295, -5961691, -5840672, -5682266, -5501656, -5315751]
37565e315751J71763J39294R5466N1842K1357J4796L7505Q6818J51776K16406
37555d328728K65532K90321K91103K76794K61378K58585K76577L15065L66388
37546a726985M19951M67234N04323N30670N45669N46495N29418M93250M41094
37537B751119L78103L07355K27936J37295L5985o8696j62650k29079k55471k40365
37527B881532j95784j43111j04299r3427j12955j55570k09332k62779l07639l38426
37517I58210l50481l38965l00574k37149j58150p9393j7862J4676J5748q152m5680
37506e47772q5765j20961j48175j67612j81133j90356j94865j91459j75314j42414
37496b145826r1815k6984M3648J07520J51318J66401J52917J19426P8252L9887
$$ y = [-5315751, -5143988, -5004694, -4909228, -4857386, -4836029, -4821233, -4783728, -4696910, -4545134, -4328728, -4063196, -3772875, -3481772, -3204978, -2943600, -2685015, -2408438, -2093373, -1726985, -1307034, -839800, -335477, 195193, 740862, 1287357, 1816775, 2310025, 2751119, 3129222, 3436577, 3664513, 3801808, 3837793, 3769097, 3606447, 3377368, 3121897, 2881532, 2685748, 2542637, 2438338, 2344911, 2231956, 2076386, 1867054, 1604275, 1296636, 958210, 607729, 268764, -31810, -268959, -427109, -506502, -524364, -509688, -493940, -502092, -547772, -633537, -754498, -902673, -1070285, -1251418, -1441774, -1636639, -1828098, -2003412, -2145826, -2237641, -2264625, -2220977, -2113457, -1962139, -1795738, -1642821, -1523395, -1445143, -1405256]
37486a405256R339j4766l8579o9312j10924j61637k14437k59432k86424k87880
37476b839308k62600k18019j67810j24844r4382p3071n4229l4552j6959q343j4891
37465c909008l8165p3305j09190j30580j22650p7017L619J05833K11546L06065
37455c832852L82562M40198M78559M93682M78773M28128L40537K20469P8122p0374
37445e62196k04001l01434l48806l46049l06805k51326j96973j52212j16480q4134
37435b870416m8959p085M2179R6961J54132K10477K63090L09018L44790L66433
37425a139380L70051L52587L12640K51435J73671Q7348K039p3824j34749j77801
37415B4017k00571j99536j70392j10401k1438Q8033K03514L08002L87269M34333
$$ y = [-1405256, -1395917, -1410683, -1449262, -1518574, -1629498, -1791135, -2005572, -2265004, -2551428, -2839308, -3101908, -3319927, -3487737, -3612581, -3706963, -3780034, -3834263, -3868815, -3885774, -3894117, -3909008, -3947173, -4020478, -4129668, -4260248, -4382898, -4459915, -4456296, -4350463, -4138917, -3832852, -3450290, -3010092, -2531533, -2037851, -1559078, -1130950, -790413, -569944, -491822, -562196, -766197, -1067631, -1416437, -1762486, -2069291, -2320617, -2517590, -2669802, -2786282, -2870416, -2919375, -2926460, -2884281, -2787320, -2633188, -2422711, -2159621, -1850603, -1505813, -1139380, -769329, -416742, -104102, 147333, 321004, 408352, 410391, 336567, 201818, 24017, -176554, -376090, -546482, -656883, -678321, -590288, -386774, -78772, 308497, 742830]
37405G42830M50921M45457M28971M10999L97033L88036L81237L71160L50850L14384
37395D681878K60867J97355J37201R3206O9610N8605M4035J0172m9659j29414
37385E373856k13515k84380l29361l43431l27996k89044k36757j85437j51264
37376C012671j47167j77060k33061k98027l52718l83766l88056l71327l42850
37367C18639l10392k78738k51619k33839k30519k43436k67823k93166l08191l06748
37357b405832k90603k67224k43659k19918j86641j29975m1588P3465J97264L07387
37347c207324L86406M26604M29450M02617L56328K99331K36007J66945R3171K0476
37337c89989l9989p5511p7333m4963J2306P7210J29329J51175J32742P2978k0758
$$ y = [742830, 1193751, 1639208, 2068179, 2479178, 2876211, 3264247, 3645484, 4016644, 4367494, 4681878, 4942745, 5140100, 5277301, 5370507, 5440117, 5498722, 5542757, 5552929, 5503270, 5373856, 5160341, 4875961, 4546600, 4203169, 3875173, 3586129, 3349372, 3163935, 3012671, 2865504, 2688444, 2455383, 2157356, 1804638, 1420872, 1032816, 661489, 318639, 8247, -270491, -522110, -755949, -986468, -1229904, -1497727, -1790893, -2099084, -2405832, -2696435, -2963659, -3207318, -3427236, -3613877, -3743852, -3785440, -3711975, -3514711, -3207324, -2820918, -2394314, -1964864, -1562247, -1205919, -906588, -670581, -503636, -410465, -389989, -429978, -505489, -582822, -627785, -615479, -538269, -408940, -257765, -125023, -52045, -72803]
37326g2803j33537k44071l28403l66803l51094k87728j94409r2284J734P8911
37316a990487J38393J84254K22135K56402K87965L13077L24351L14634K81749
37307C32473K30334J69067J06134M7562o93l1241l8443k4613k785Q084p539n4883
37295G33457j28333k15130k99283l64674l98928l97959l68003l22581k76341k40424
37285b278199k21496k22350k41503k72291l03899l24938l27355l08466k70730
37276d771227k20049j62817j02377l7018L8192J26422K24951L25322M16999M90618
37266c670984N38269N52236N25286M53826L42283K05819O9166l9016r4638q5967
37256a203720j6800R6380K31164L66017M84546N76826O38908O71418O77691O61854
$$ y = [-72803, -206340, -450411, -778814, -1145617, -1496711, -1784439, -1978848, -2071132, -2069398, -1990487, -1852094, -1667840, -1445705, -1189303, -901338, -588261, -263910, 50724, 332473, 562807, 731874, 838008, 885570, 884877, 853636, 815193, 790580, 787795, 795879, 788340, 733457, 605124, 389994, 90711, -273963, -672891, -1070850, -1438853, -1761434, -2037775, -2278199, -2499695, -2722045, -2963548, -3235839, -3539738, -3864676, -4192031, -4500497, -4771227, -4991276, -5154093, -5256470, -5293488, -5255296, -5128874, -4903923, -4578601, -4161602, -3670984, -3132715, -2580479, -2055193, -1601367, -1259084, -1053265, -984099, -1023115, -1117753, -1203720, -1220520, -1124140, -892976, -526959, -42413, 534413, 1173321, 1844739, 2522430, 3184284]
37246C184284O27496N77409N13990M39452L55633K63938J65669O1851m7950j66267
37236E975505k95627m34106n72413o95911p90521q47659q64678q42042p81449
37227a48901o87565n71279m49776l41132k56468j95577j49039j04417n1992J2078
37217b944068Q4859J57477K17851K54092K56607K18639J37789J9900j17390k45900
37207a960144l34101l56661l01705j73482R459K19541M27069O06109P37608Q10469
37197c15838Q22524P81369P02511O03336M95550L81536K57498J20745k4742j68167
37187C656322k96224l97833m66110m97606m91054m47687l72887k77114j74378
37178B35429p8633n9N6785R2424J10496J15845J13351J06838R7374Q2129N6013
$$ y = [3184284, 3811780, 4389189, 4903179, 5342631, 5698264, 5962202, 6127871, 6189722, 6141772, 5975505, 5679878, 5245772, 4673359, 3977448, 3186927, 2339268, 1474590, 632548, -148901, -836466, -1407745, -1857521, -2198653, -2455121, -2650698, -2799737, -2904154, -2956146, -2944068, -2859209, -2701732, -2483881, -2229789, -1973182, -1754543, -1616754, -1596854, -1714244, -1960144, -2294245, -2650906, -2952611, -3126093, -3116634, -2897093, -2470024, -1863915, -1126307, -315838, 506686, 1288055, 1990566, 2593902, 3089452, 3470988, 3728486, 3849231, 3824489, 3656322, 3360098, 2962265, 2496155, 1998549, 1507495, 1059808, 686921, 409807, 235429, 156796, 156737, 213522, 305946, 416442, 532287, 645638, 752476, 849850, 931979, 987992]
37167I87992J6364l3059q2906j23668j50681j64623j68429j64701j55506j43221
37157a82438j30293j17847j04440q6137n8224j7779L4667R6043J63678K37203
37147a65567L16614L97364M66894N07227N03521M53325L69787K76103J95165J41365
37137C461798J18286J20577J36381J49466J42964J05292L5385n6386j52433k34919
37127C826411k92151l22117l31982l33825l38647l51804l71969l93523m10735
37118F79658m21546m29053m39622m58614m86832n20164n51852n74596n81028n64021
37108d347670n18588m44461l46578k32657j10256J3924J32752K38329L24191L88521
37098d902493M35238M71714N04679N36948N66781N89962O03383O07772O07429
$$ y = [987992, 1004356, 971297, 888391, 764723, 614042, 449419, 280990, 116289, -39217, -182438, -312731, -430578, -535018, -621155, -679379, -697158, -662491, -566448, -402770, -165567, 151047, 548411, 1015305, 1522532, 2026053, 2479378, 2849165, 3125268, 3320433, 3461798, 3580084, 3700661, 3837042, 3986508, 4129472, 4234764, 4270149, 4213763, 4061330, 3826411, 3534260, 3212143, 2880161, 2546336, 2207689, 1855885, 1483916, 1090393, 679658, 258112, -170941, -610563, -1069177, -1556009, -2076173, -2628025, -3202621, -3783649, -4347670, -4866258, -5310719, -5657297, -5889954, -6000210, -5986286, -5853534, -5615205, -5291014, -4902493, -4467255, -3995541, -3490862, -2953914, -2387133, -1797171, -1193788, -586016, 21413]
37089B1413O06676O05528N98169N75903N32713M69381L93244L14135K39820J73929
37079D530911J16542O5476J7116l2468q5420j40192j91847k34656k65113k83296
37069C497053k92010k94219k90129k75944k45921j96914j32448o3583o108K5036
37059A724813K2559q136m9731q1029q7672o7871k9663J6589O3706J08219J47928
37048A759712J80227K02581K14014K15821K10909K02617J93928J87006J82329
37039C549144J77850J69603J54449J33029J09992R0608P6213O2213M0389M229
37029D567719m6149j02667j52618j84826j94938j86770j69286j51343j37556j27470
37019C114096j17986j06932r5042q5172p9907p9983q4914r4888j11443j35541
$$ y = [21413, 628089, 1233617, 1831786, 2407689, 2940402, 3409783, 3803027, 4117162, 4356982, 4530911, 4647453, 4712929, 4730045, 4697577, 4612157, 4471965, 4280118, 4045462, 3780349, 3497053, 3205043, 2910824, 2620695, 2344751, 2098830, 1901916, 1769468, 1705885, 1699777, 1724813, 1747372, 1739236, 1689505, 1608476, 1520804, 1452933, 1423270, 1439859, 1503565, 1611784, 1759712, 1939939, 2142520, 2356534, 2572355, 2783264, 2985881, 3179809, 3366815, 3549144, 3726994, 3896597, 4051046, 4184075, 4294067, 4384675, 4460888, 4523101, 4563490, 4567719, 4521570, 4418903, 4266285, 4081459, 3886521, 3699751, 3530465, 3379122, 3241566, 3114096, 2996110, 2889178, 2794136, 2708964, 2629057, 2549074, 2464160, 2369272, 2257829, 2122288]
37009B122288j64385j90220k03212j96706j70667j30487q2863l2859J5597N7814
$$ y = [2122288, 1957903, 1767683, 1564471, 1367765, 1197098, 1066611, 983748, 950889, 966486, 1024300]
$$ [...]
##END NTUPLES=NMR SPECTRUM
##END=
