##TITLE=31Pdec_DE-43H_2
 D2O, 64 sc
 30.10.2024
##JCAMPDX= 6.0         $$ Bruker NMR JCAMP-DX V2.0
##DATA TYPE= NMR SPECTRUM
##DATA CLASS= NTUPLES
##ORIGIN= UXNMR, Bruker Analytische Messtechnik GmbH
##OWNER= root
$$ XWIN-NMR		Version 3.5
$$ Wed Oct 30 15:24:36 2024 Russian Standard Time (UT+4h)  she@DPX200
##.OBSERVE FREQUENCY= 81.013821
##.OBSERVE NUCLEUS= ^31P
##.ACQUISITION MODE= SIMULTANEOUS
##.ACQUISITION SCHEME= undefined
##.AVERAGES= 64
##.DIGITISER RES= 17
##SPECTROMETER/DATA SYSTEM= spect
##.PULSE SEQUENCE= zgpg30
##.SOLVENT NAME= D2O
##.SHIFT REFERENCE= (INTERNAL, D2O, 0, 198.062)
##AUDIT TRAIL= $$ (NUMBER, WHEN, WHO, WHERE, WHAT)
$$ ##TITLE= Audit trail, XWIN-NMR		Version 3.5
$$ ##JCAMPDX= 5.01
$$ ##ORIGIN= Bruker BioSpin GmbH
$$ ##OWNER= she
$$ F:/spectra/data/she/nmr/P31/2/pdata/1/auditp.txt
$$ ##AUDIT TRAIL=  $$ (NUMBER, WHEN, WHO, WHERE, WHAT)
(   1,<2024-10-30 15:19:09.76 +0400>,<she>,<DPX200>,
      <created by zg, POWCHK disabled, PULCHK disabled
       configuration hash MD5:
       00 E9 B6 7A A2 85 ED C7 34 08 36 98 17 FE 4E 26
       data hash MD5: 32K
       AE 2B 0E 92 52 4D 5E 0C 24 A8 C0 C1 05 A7 72 45>)
(   2,<2024-10-30 15:23:27.00 +0400>,<she>,<DPX200>,
      <Start of raw data processing
       efp BC_mod = 2 LB = 1.5 FT_mod = 6 PKNL = 1 PHC0 = 2346.808 PHC1 = 813.4884 SI = 64K 
       data hash MD5: 64K
       2D 6B CD 76 11 AF B6 D7 2C 74 6C 74 2A 3E 57 40>)
(   3,<2024-10-30 15:23:54.76 +0400>,<she>,<DPX200>,
      <pk PHC0 = -534.1912 PHC1 = 424.3997 
       data hash MD5: 64K
       3B 95 2D 58 B4 34 48 B5 97 96 F0 65 93 2E 8D D5>)
(   4,<2024-10-30 15:23:58.71 +0400>,<she>,<DPX200>,
      <abs ABSG = 5 
       data hash MD5: 64K
       C4 3A 51 49 BE 07 EC 18 60 61 C6 B3 93 D1 B2 CD>)
(   5,<2024-10-30 15:24:08.32 +0400>,<she>,<DPX200>,
      <abs ABSG = 5 
       data hash MD5: 64K
       7E A8 76 B9 70 61 FA 72 65 D4 F3 69 2C 2C 7F D7>)
$$ ##END=
$$ 
$$ hash MD5
$$ B6 DB 96 FF FE C7 8F 2D 27 B3 D8 EA AE 83 59 5C
##$RELAX= 
##$RELAX= 
##$RELAX= 
##$RELAX= 
##$RELAX= 
##$RELAX= 
##$RELAX= 
##$RELAX= 
$$ Bruker specific parameters
$$ --------------------------
##$DU= <F:/spectra>
##$EXPNO= 2
##$NAME= <P31>
##$PROCNO= 1
##$TYPE= <nmr>
##$USER= <she>
##$AMP= (0..31)
100 100 100 100 100 100 100 100 100 100 100 100 100 100 100 100 100 100 
100 100 100 100 100 100 100 100 100 100 100 100 100 100 
##$AQSEQ= 0
##$AQ_mod= 1
##$AUNM= <au_zg>
##$AUTOPOS= <>
##$BF1= 81.014009
##$BF2= 200.13
##$BF3= 200.13
##$BF4= 200.13
##$BF5= 200.13
##$BF6= 200.13
##$BF7= 200.13
##$BF8= 200.13
##$BYTORDA= 1
##$CFDGTYP= 0
##$CFRGTYP= 5
##$CHEMSTR= <none>
##$CNST= (0..31)
1 1 145 1 1 1 1 1 1 1 1 1 1 1 1 1 1 1 1 1 1 1 1 1 1 1 1 1 1 1 1 1 
##$CPDPRG= <waltz16>
##$CPDPRG1= <>
##$CPDPRG2= <waltz16>
##$CPDPRG3= <>
##$CPDPRG4= <mlev>
##$CPDPRG5= <mlev>
##$CPDPRG6= <mlev>
##$CPDPRG7= <mlev>
##$CPDPRG8= <mlev>
##$CPDPRGB= <>
##$CPDPRGT= <>
##$D= (0..31)
0 1 0 0 0 0 0 0 0 0.06 0 0.03 2e-05 3e-06 0 0 0.0002 0 0 0 0 0 0 0 0 0 
0 0 0 0 0 0 
$$ [...]
##$SUBNAM3= <"">
##$SUBNAM4= <"">
##$SUBNAM5= <"">
##$SUBNAM6= <"">
##$SUBNAM7= <"">
##$SUBNAM8= <"">
##$SUBNAM9= <"">
##$SW= 400.765351723535
##$SWIBOX= (0..15)
0 1 3 0 0 0 0 0 0 0 0 0 0 0 0 0 
##$SW_h= 32467.5324675325
##$TD= 32768
##$TD0= 1
##$TE= 0
##$TE2= 300
##$TE3= 300
##$TEG= 300
##$TL= (0..7)
0 120 53 12 22 120 120 120 
##$TP= (0..7)
150 150 150 150 150 150 150 150 
##$TP07= 0
##$TPNAME0= <>
##$TPNAME1= <>
##$TPNAME2= <>
##$TPNAME3= <>
##$TPNAME4= <>
##$TPNAME5= <>
##$TPNAME6= <>
##$TPNAME7= <>
##$TPOAL= (0..7)
0.5 0.5 0.5 0.5 0.5 0.5 0.5 0.5 
##$TPOFFS= (0..7)
0 0 0 0 0 0 0 0 
##$TUNHIN= 0
##$TUNHOUT= 0
##$TUNXOUT= 0
##$USERA1= <user>
##$USERA2= <user>
##$USERA3= <user>
##$USERA4= <user>
##$USERA5= <user>
##$V9= 5
##$VALIST= <valist>
##$VCLIST= <CCCCCCCCCCCCCCC>
##$VD= 0
##$VDLIST= <DDDDDDDDDDDDDDD>
##$VPLIST= <PPPPPPPPPPPPPPP>
##$VTLIST= <TTTTTTTTTTTTTTT>
##$WBST= 1024
##$WBSW= 4
##$XGAIN= (0..3)
0 0 0 0 
##$XL= 0
##$YL= 0
##$YMAX_a= 11118
##$YMIN_a= -14787
##$ZGOPTNS= <>
##$ZL1= 120
##$ZL2= 120
##$ZL3= 120
##$ZL4= 120
##$ABSF1= 198.0616
##$ABSF2= -202.7028
##$ABSG= 5
##$ABSL= 3
##$ALPHA= 0
##$AQORDER= 0
##$ASSFAC= 0
##$ASSFACI= 0
##$ASSFACX= 0
##$ASSWID= 0
##$AUNMP= <proc_1d>
##$AZFE= 0.1
##$AZFW= 0.5
##$BCFW= 0
##$BC_mod= 2
##$BYTORDP= 0
##$COROFFS= 0
##$CY= -3
##$DATMOD= 1
##$DC= 0
##$DFILT= <>
##$DTYPP= 0
##$F1P= 0
##$F2P= 0
##$FCOR= 1
##$FTSIZE= 65536
##$FT_mod= 6
##$GAMMA= 0
##$GB= 0
##$INTBC= 1
##$INTSCL= 9.790993e-09
##$ISEN= 30
##$LB= 1.5
##$LEV0= 0
##$LPBIN= 0
##$MAXI= 10000
##$MC2= 0
##$MEAN= 0
##$ME_mod= 0
##$MI= 50
##$NCOEF= 0
##$NC_proc= -8
##$NLEV= 6
##$NOISF1= 182.463
##$NOISF2= 159.3651
##$NSP= 0
##$NTH_PI= 0
##$NZP= 0
##$OFFSET= 198.0616
##$PC= 4
##$PHC0= 1812.617
##$PHC1= 1237.888
##$PH_mod= 1
##$PKNL= yes
##$PPARMOD= 0
##$PSCAL= 0
##$PSIGN= 0
##$REVERSE= no
##$SF= 81.0140089999434
##$SI= 65536
##$SIGF1= 159.3651
##$SIGF2= -187.1042
##$SINO= 113.3802
##$SIOLD= 16384
##$SREGLST= <1H.CDCl3>
##$SSB= 0
##$STSI= 65536
##$STSR= 0
##$SW_p= 32467.5324675325
##$SYMM= 0
##$S_DEV= 0
##$TDeff= 32768
##$TDoff= 0
##$TI= <>
##$TILT= no
##$TM1= 0
##$TM2= 0
##$TOPLEV= 0
##$USERP1= <user>
##$USERP2= <user>
##$USERP3= <user>
##$USERP4= <user>
##$USERP5= <user>
##$WDW= 1
##$XDIM= 65536
##$YMAX_p= 382195611
##$YMIN_p= -130635725
$$ End of Bruker specific parameters
$$ ---------------------------------
##NTUPLES= NMR SPECTRUM
##VAR_NAME=  FREQUENCY,     SPECTRUM/REAL,   SPECTRUM/IMAG
##SYMBOL=    X,             R,               I
##VAR_TYPE=  INDEPENDENT,   DEPENDENT,       DEPENDENT
##VAR_FORM=  AFFN,          ASDF,            ASDF
##VAR_DIM=   65536,         65536,           65536
##UNITS=     HZ,            ARBITRARY UNITS, ARBITRARY UNITS
##FACTOR=    0.49542278885378, 1,            1
##FIRST=     16045.7642231865, 0,            0
##LAST=      -16421.768244346, 0,            0
##MIN=       -16421.768244346, -130635725,   0
##MAX=       16045.7642231865, 382195611,    0
$$ Real data points
##PAGE= N=1
##DATA TABLE= (X++(R..R)), XYDATA
$$ [...]
##PAGE= N=2
##DATA TABLE= (X++(I..I)), XYDATA
7467h118657K837051Q76128j896420l382410j980385J454709M026695L734611
$$ -8118657 -5281606 -4405478 -6301898 -9684308 -11664693 -10209984 -6183289 -2448678
7459b448678J278686j253519k397085j735081J79658J558499N70326j934840k324472
$$ -2448678 -1169992 -2423511 -4820596 -6555677 -6376019 -4817520 -4247194 -6182034 -8506506
7450h506506J316408N602422N281795J51106m198433l550107m59594k78497l455326
$$ -8506506 -7190098 -1587676 3694119 3845225 -353208 -3903315 -4362909 -4641406 -8096732
7441h096732n027031j765917L369684N406628L568293R45975n33131j769494l341823
$$ -8096732 -13123763 -14889680 -11519996 -6113368 -2545075 -1599100 -2132231 -3901725 -7243548
7432g243548l757630j956191O27062J985321K014965J657651R95630o2016l41883
$$ -7243548 -11001178 -12957369 -12330307 -10344986 -8330021 -6672370 -5676740 -5738756 -6080639
7423f080639J190836L069847K532781p16549l703549l618051p48590K405528L741129
$$ -6080639 -4889803 -1819956 712825 -3724 -3707273 -7325324 -8073914 -5668386 -1927257
7414a927257K822207O84169r72646j136642m96048n13158j354538j602523k92203
$$ -1927257 894950 1579119 606473 -530169 -1026217 -1539375 -2893913 -4496436 -4788639
7405d788639J655091K466488J329652j096152l320941m007244l002509j489122
$$ -4788639 -3133548 -667060 662592 -433560 -3754501 -7761745 -10764254 -12253376
7397a2253376n04429L56043J768495K825138K134520N01379J58939J079434Q52157
$$ -12253376 -12757805 -12401762 -10633267 -7808129 -5673609 -5172230 -5013291 -3933857 -3081700
7388c081700q02881o28717K857422N604717L030664l123894o866472n900968l388161
$$ -3081700 -3884581 -4513298 -1655876 3948841 6979505 3855611 -3010861 -8911829 -12299990
7379a2299990j998251o80164J592533K989332J923988k6742n69893K79716J530072
$$ -12299990 -14298241 -14978405 -13385872 -10396540 -8472552 -8499294 -9069187 -8789471 -7259399
7370g259399L093253M304831L278898K99613r16280J425366L350233Q72492k828865
$$ -7259399 -4166146 138685 3417583 3717196 2800916 4226282 7576515 8449007 5620142
7361E620142j628748L315089M234337j431277o543499m596455J102859L052966
$$ 5620142 3991394 7306483 11540820 10109543 3566044 -1030411 72448 3125414
7353C125414J70040k499206k078861l87879P75513J790974K552729J896418L18742
$$ 3125414 3295454 796248 -1282613 -1670492 -894979 895995 3448724 5345142 5663884
7344E663884j70264M94501K13970j531445k744749k250793r62407O53168L034356
$$ 5663884 5493620 5988121 6202091 4670646 1925897 -324896 -1287303 -634135 2400221
7335B400221M783139L284865n55843k123446K98459K642910J555592k36594R69779
$$ 2400221 7183360 10468225 9912382 7788936 8087395 10730305 12285897 12049303 13019082
7326A3019082K972420J293209k572475k831418J110414L155889j42856m449064
$$ 13019082 15991502 17284711 14712236 11880818 12991232 16147121 16004265 11555201
7318A1555201m600336k034026j426008l188265l750545j740802L11339K79687
$$ 11555201 6954865 4920839 3494831 306566 -3443979 -5184781 -4873442 -4593755
7310d593755q34775j020568J76843J798012K624996J889208R2736q83686J77152
$$ -4593755 -5428530 -6449098 -6272255 -4474243 -1849247 39961 132697 -750989 -573837
7301e73837J820420J535938o24490j911848p95659R37382J057869J44547K66459
$$ -573837 1246583 2782521 2158031 246183 -549476 387906 1445775 1590322 1856781
7292A856781J524224J988511Q50730l67561k66424L96351J77421o21938l84781
$$ 1856781 3381005 5369516 6220246 5852685 5586261 5982612 6160033 5538095 5153314
7283E153314J318658K930293K774912Q39242j589989l333035l952792l514160
$$ 5153314 6471972 9402265 12177177 13016419 11426430 8093395 4140603 626443
7275F26443k242418l60690J812459L495118L522086J436012j656315m037619m951895
$$ 626443 -1615975 -1976665 -164206 3330912 6852998 8289010 6632695 2595076 -2356819
7266b356819m355950j829020K259919M748744K011907m351007p289468k594023
$$ -2356819 -6712769 -8541789 -6281870 -1533126 478781 -3872226 -11161694 -13755717
7258a3755717M904122P071387K869016j354196j356190L60131M46573Q2659J511709
$$ -13755717 -8851595 -1780208 1088808 -265388 -1621578 -1261447 -814874 -732215 779494
7249G79494L188092K321902k35992j608871j735904k638229l868339k874307J03944
$$ 779494 3967586 6289488 6053496 4444625 2708721 70492 -3797847 -6672154 -6568210
7240f568210J475514l88880k544338j679032J547548M073068M535798M024114
$$ -6568210 -5092696 -5481576 -8025914 -9704946 -8157398 -4084330 451468 4475582
7232D475582L724249L355862J810647j229278m289417n149238l550514k006157
$$ 4475582 8199831 11555693 13366340 12137062 7847645 2698407 -852107 -2858264
7224b858264k501492l318346j396332K654968M798291L146754L55104n67998o9533
$$ -2858264 -5359756 -8678102 -10074434 -7419466 -2621175 525579 880683 312685 243152
7215B43152j30943r72023j625246j922457j984541j281427P7913O76562K6328
$$ 243152 112209 -859814 -2485060 -4407517 -6392058 -7673485 -7595572 -6919010 -6892682
7206f892682l06412M70543N70202j107603k207405m35997K195775K342591Q93856
$$ -6892682 -7199094 -6728551 -6158349 -7265952 -9473357 -9909354 -7713579 -5370988 -4477132
7197d477132J190008K717324J776514j448706k159449J072883L092114J47549
$$ -4477132 -3287124 -569800 1206714 -241992 -2401441 -1328558 1763556 1911105
7189A911105l658986k531072J875020L074584j63975k305544J08562L521995L226594
$$ 1911105 -1747881 -4278953 -2403933 670651 506676 -1798868 -1690306 1831689 5058283
7180E058283j8285k170011j960482j474191k027130k593265k170244j237699l87262
$$ 5058283 5039998 2869987 909505 -564686 -2591816 -5185081 -7355325 -8593024 -8980286
7171h980286O85890K050963K672461J641061l60884j604012j050804Q56486K746318
$$ -8980286 -8294396 -6243433 -3570972 -1929911 -2290795 -3894807 -4945611 -4089125 -1342807
7162a342807L251429J910598k15394j215953l88247O75661N444j939556k663045
$$ -1342807 1908622 3819220 3603826 2387873 1999626 2675287 2680731 741175 -1921870
7153a921870j037888J129138J669729Q21790K37532M15620P55405J293114K337801
$$ -1921870 -2959758 -1830620 -160891 660899 898431 1314051 2069456 3362570 5700371
7144E700371K771776J064917j731808k387807J01527K583157J767678j449981
$$ 5700371 8472147 9537064 7805256 5417449 5518976 8102133 9869811 8419830
7136H419830l604918l411662k571628k271414j432982P94824K785697K330518
$$ 8419830 4814912 1403250 -1168378 -3439792 -4872774 -4077950 -1292253 1038265
7128A038265J2596j047405Q14753L331750L021214j02315k277484j064831J168859
$$ 1038265 1050861 3456 818209 4149959 7171173 7068858 4791374 3726543 4895402
7119D895402O80888k028971k946206p66220R67022p52127l838429m289393j749340
$$ 4895402 5576290 3547319 601113 -165107 801915 49788 -3788641 -8078034 -9827374
7110i827374Q91663K006304K304517K178663J086054m53953j016219p04450r55960
$$ -9827374 -8935711 -6929407 -4624890 -2446227 -1360173 -1814126 -2830345 -3534795 -4490755
7101d490755j623449q41227J590843L287384K749878J362932O88552J01970j228221
$$ -4490755 -6114204 -6955431 -5364588 -2077204 672674 2035606 2724158 2826128 1597907
7092A597907k083149j005932J057699J952953J179151j65409j409943k595917
$$ 1597907 -485242 -1491174 -433475 1519478 2698629 2533220 1123277 -1472640
7084a472640l368444l028926j302503J643176M869159N829558K085363m525376
$$ -1472640 -4841084 -7870010 -9172513 -7529337 -2660178 3169380 5254743 729367
7076G29367p796257m034358K572715M676837Q67292l353352l214646L22103L450291
$$ 729367 -7066890 -11101248 -8528533 -3851696 -2984404 -6337756 -9552402 -9230299 -5780008
7067e780008L902444J616888j830232l360483q31904L494729M721575J681357
$$ -5780008 -1877564 -260676 -2090908 -5451391 -6283295 -2788566 1933009 3614366
7059C614366j546256j855096j190756k069995k771842o95712K354119K655606
$$ 3614366 2068110 213014 -977742 -3047737 -5819579 -6515291 -4161172 -1505566
7051a505566N35484o52529l42851q27800k036043j303283J164607J666610o60163
$$ -1505566 -970082 -1622611 -1965462 -2793262 -4829305 -6132588 -4967981 -3301371 -3961534
7042c961534j696989R69902L544555J721814k467149l667094q94523K028420K580070
$$ -3961534 -5658523 -4688621 -1144066 577748 -1889401 -5556495 -6451018 -4422598 -1842528
7033a842528J947935J564662J039633K21076L03365J756627L211634L299593K068765
$$ -1842528 105407 1670069 2709702 2930778 3234143 4990770 8202404 11501997 13570762
7024A3570762J37472j978816l346420l037244j528822l34290p2482l15922j160621
$$ 13570762 13708234 11729418 8382998 5345754 3816932 3482642 3410160 3094238 1933617
7015A933617k896359l993103j928310K999645O838764O369110K757513m31571
$$ 1933617 -962742 -4955845 -6884155 -3884510 2954254 9323364 12080877 11649306
7007A1649306j435811j171019j120956j753377k388763j909322l59092J60340
$$ 11649306 10213495 9042476 7921520 6168143 3779380 1870058 1510966 1671306
6999A671306k066631m900789m042435P93212M501149L398797K92272l06152Q81773
$$ 1671306 -395325 -5296114 -9338549 -8545337 -4044188 -645391 -353119 -659271 222502
6990B22502Q8573k287700k003431J669457M133420K310305j132444k419092j780221
$$ 222502 311075 -1976625 -3980056 -2310599 1822821 4133126 3000682 581590 -1198631
6981a198631j375548j155487J87294K167447L258860L380578L299247K734243
$$ -1198631 -2574179 -3729666 -3542372 -1374925 1883935 5264513 8563760 11298003
6973A1298003J131934q39916k432111m013429n195782l686837J166724N340903
$$ 11298003 12429937 11590021 9157910 5144481 -51301 -3738138 -2571414 2769489
6965B769489M290859n85600l471274k114069k99813j428237l563385l089725k94493
$$ 2769489 7060348 6474748 3003474 889405 589592 -838645 -4402030 -7491755 -7786248
6956g786248J562033R71525p17233j866353j830342l19016K290832M213283L734866
$$ -7786248 -6224215 -5252690 -5969923 -7836276 -9666618 -9985634 -7694802 -3481519 253347
6947B53347J520430l5741K45711J389080K148879K251309J550386m15187l197163
$$ 253347 1773777 1738036 1983747 3372827 5521706 7773015 9323401 8908214 5711051
6938E711051m842602l564246K06691L853934M646988K073245j441606k618132
$$ 5711051 868449 -2695797 -2489106 1364828 6011816 8085061 6643455 4025323
6930D025323r29307M91029j177485m226823m299939m31808L448095L963487K495082
$$ 4025323 3096016 3587045 2409560 -1817263 -6117202 -6549010 -3100915 862572 3357654
6921C357654J999170K100533M53561k461389l567179k009730k73207J04322O48441
$$ 3357654 5356824 7457357 7910918 5449529 1882350 -127380 -400587 -296265 352176
6912C52176K474743L687086K357812j21191j082404m50279j55915p52776j046780
$$ 352176 2826919 6514005 8871817 8750626 7668222 7217943 7062028 6309252 5262472
6903E262472n38368M2705M62449J224933K023367J671944j63272k377022l555704
$$ 5262472 4724104 4766809 5229258 6454191 8477558 10149502 9986230 7609208 4053504
6894D053504k793121j6247L258619M399132K596418M48460N70906J608735L36709
$$ 4053504 1260383 1244136 4502755 8901887 11498305 11946765 12517671 14126406 14463115
6885A4463115k944353m499040k778398m43870M7191n50668j026513k065951l773410
$$ 14463115 11518762 7019722 4241324 3797454 3844645 3293977 2267464 201513 -3571897
6876c571897l900795j253371J520340J431400m19754q52273M45784J059525L2524
$$ -3571897 -7472692 -8726063 -7205723 -5774323 -6194077 -7046350 -6600566 -5541041 -5508517
6867e508517j023869o37947J086769L342993M855764L914793L51648l171871m025278
$$ -5508517 -6532386 -7170333 -6083564 -2740571 2115193 6029986 6381634 3209763 -815515
6858h15515l003031k601596k899123j946729M47738K437848L332839L925562L755506
$$ -815515 -3818546 -6420142 -9319265 -11265994 -10818256 -8380408 -5047569 -1122007 2633499
6849B633499J487188j604182k081314O53416K986896K098832n22310k053722k068532
$$ 2633499 4120687 2516505 435191 1088607 4075503 6174335 5652025 3598303 1529771
6840A529771j501399m06976J122284J788875R00616k80999p40084j439694k963807
$$ 1529771 28372 -378604 743680 2532555 3433171 3152172 2412088 972394 -1991413
6831a991413l364245q68821K631778L533490J368194o94272r5439K252161L475362
$$ -1991413 -5355658 -6224479 -3592701 -59211 1308983 614711 519272 2771433 6246795
6822F246795J789361j989121n070351n020871k082639J241904L120331L792982
$$ 6246795 8036156 6047035 976684 -4044187 -6126826 -4884922 -1764591 2028391
6814B028391L746996K358872m68114l005871l659311k947043k038764p37390J283603
$$ 2028391 5775387 8134259 7666145 4660274 1000963 -1946080 -3984844 -4722234 -3438631
6805c438631K566757J431000j247162k789704j868934N38659K634702K851709
$$ -3438631 -871874 559126 -688036 -3477740 -5346674 -4808015 -2173313 678396
6797F78396M66628l152764m868365l069725K14183J967690J636777L28002j511374
$$ 678396 1145024 -2007740 -6876105 -9945830 -9731647 -7763957 -6127180 -5799178 -7310552
6788g310552l219169k692870P51790L828633L183457N82539J85599J761313J522053
$$ -7310552 -10529721 -13222591 -12470801 -8642168 -5458711 -4876172 -4690573 -2929260 -1407207
6779a407207o83992p47904K183646L484246P63029j750281l05615J712657o66648
$$ -1407207 -2091199 -2839103 -655457 2828789 3591818 1841537 1535922 3248579 2581931
6770B581931n247594n437443k73466M132271L360183o1046j429327L2358J824212
$$ 2581931 -2665663 -8103106 -8376572 -4244301 -884118 -945164 -2374491 -2342133 -517921
6761e17921K210456J428912K91179o59469j088132r00089k07261P40041J212507
$$ -517921 1692535 3121447 3412626 2753157 1665025 764936 557675 1297716 2510223
6752B510223K01563k054786l427207k265498N8030P73484l30780o91287R90416
$$ 2510223 2711786 657000 -2770207 -5035705 -4977675 -4204191 -4534971 -5226258 -4235842
6743d235842K723269K289368M82230k98417M75600J119113M18179q75625j354315
$$ -4235842 -1512573 776795 1259025 960608 1436208 2555321 2973500 2097875 743560
6734G43560o92784K90342P34278N25495J56767J0344o3443k81728k55919N74069
$$ 743560 50776 341118 1075396 1600891 1757658 1768002 1704559 1422831 1166912 1740981
6724A740981J699127J648655J25072p28009J266820M614208M753515l53825o638860
$$ 1740981 3440108 5088763 5213835 4485826 5752646 10366854 15120369 14766544 8127684
6715H127684q077325l950943N48301J304109j2203K60061K089732K869313K329322
$$ 8127684 50359 -3900584 -3352283 -2048174 -2060377 -1800316 289416 3158729 5488051
6706E488051K405200K779198Q50432l064151m642220j727463J828409J345627
$$ 5488051 7893251 10672449 11522881 8458730 3816510 2089047 3917456 5263083
6698E263083k205613m119796k564304J33907J763051K332161K134075Q48572r81652
$$ 5263083 3057470 -1062326 -3626630 -3492723 -1729672 602489 2736564 3585136 2603484
6689B603484j981164j874602j485488q13919P85586K537270K666961J077548o54965
$$ 2603484 622320 -1252282 -2737770 -3551689 -2766103 -228833 2438128 3515676 2860711
6680B860711k046227l853424n202336l750575J26166K388354N38193k692401l121591
$$ 2860711 814484 -3038940 -8241276 -11991851 -11865685 -9477331 -8939138 -11631539 -14753130
6671a4753130o25694J536008J394171j61472j371469q71833K049538O136958P964040
$$ -14753130 -15378824 -13842816 -12448645 -12610117 -13981586 -14853419 -12803881 -6666923 1297117
6662A297117N524563J405669k09398P81870P12056j877596m009336l111540q99187
$$ 1297117 6821680 8227349 8017951 8799821 9511877 7634281 3624945 513405 -385782
6653c85782l17423j050417p95082N38193R52507J28274q132J109858J351420m54712
$$ -385782 -703205 -1753622 -2548704 -2010511 -1058004 -929730 -937862 171996 1523416 1068704
6643A068704j806792K03976M097300N211201J849705k190082k363203J073928
$$ 1068704 -738088 -534112 3563188 8774389 10624094 8434012 6070809 7144737
6635G144737L902335L315401N55753j568117j963946j569824j652104k466564
$$ 7144737 11047072 14362473 14918226 13350109 11386163 9816339 8164235 5697671
6627E697671k983541j778994J055475L094129K060885p87507j673202N23383K201149
$$ 5697671 2714130 935136 1990611 5084740 7145625 6358118 4684916 5208299 7409448
6618G409448m0666m086292m646114m08879M060509M255647J064836j446414j835218
$$ 7409448 7368782 3282490 -1363624 -1772503 2288006 6543653 7608489 6162075 4326857
6609D326857k407063m828768p013957n683233r24964L490114M413723K565342
$$ 4326857 1919794 -2908974 -9922931 -15606164 -16531128 -13041014 -8627291 -6061949
6601f061949Q65606P77326J564606K266215K497982J533333j224490m353370n096750
$$ -6061949 -5196343 -4419017 -2854411 -588196 1909786 3443119 2218629 -2134741 -7231491
6592g231491k944238o13722k14857m66317N23093J827932J648586R54306J885250
$$ -7231491 -10175729 -10789451 -11004308 -11470625 -10947532 -9119600 -7471014 -6516708 -4631458
6583d631458L512047K910588L21348o36336J331565K944642J336247j919118l762806
$$ -4631458 -1119411 1791177 2112525 1476189 2807754 5752396 7088643 5169525 1406719
6574A406719l827592l274841j896882P26316K873238K524100O85083J94811J675078
$$ 1406719 -2420873 -5695714 -7592596 -6866280 -3993042 -1468942 -783859 -589048 1086030
6565A086030K946873K154715m64786l508892n303705m458868j411860J135876
$$ 1086030 4032903 6187618 5722832 2213940 -3089765 -7548633 -8960493 -7824617
6557g824617J145189j17878k43506O01387N55978l73965o66680m74492j004106
$$ -7824617 -6679428 -6797306 -7040812 -6439425 -5883447 -6257412 -6924092 -7398584 -8402690
6548h402690j128597J278250M351030L270552k181966n720063k898571K694202
$$ -8402690 -9531287 -8253037 -3902007 -631455 -2813421 -8533484 -11432055 -8737853
6540h737853N038111L825519K643623K047924m830k339746j217792K921595M909098
$$ -8737853 -3699742 125777 2769400 4817324 4812494 2472748 1254956 4176551 9085649
6531I085649K498222l28682J7362J279667j06161k665247k516680j90779P4486
$$ 9085649 11583871 11255189 11272551 12552218 12446057 9780810 7264130 7073351 7147837
6522G147837k649457m326690k297141O51613O75590j511522k261702o28397P76280
$$ 7147837 4498380 171690 -2125451 -1473838 -798248 -2309770 -4571472 -5199869 -4423589
6513d423589L15615k29788J193402L440044L689606J465567q19139j253414n86166
$$ -4423589 -4107974 -4337762 -3144360 295684 3985290 5450857 4631718 3378304 2792138
6504B792138l72611m45970M00432J900352K109955J2908k801419l818736k459590
$$ 2792138 2419527 1973557 2373989 4274341 6384296 6397204 3595785 -222951 -2682541
6495b682541m99477K90085J72002O18503J825710K061072Q2458k523412k766441
$$ -2682541 -3182018 -2891933 -2719931 -2101428 -275718 1785354 1867812 -655600 -3422041
6486c422041j31122K398144K054226j12391p77645J127963L185546K874595N21601
$$ -3422041 -3553163 -1155019 899207 786816 9171 1137134 4322680 7197275 7718876
6477G718876j805437k933820k953918j932852J42971K302649K946259J766213
$$ 7718876 5913439 2979619 25701 -1907151 -1764180 538469 3484728 5250941
6469E250941L04853j21103k51066j519642l261474k891743M71791L891690L603092
$$ 5250941 5555794 5434691 5183625 3663983 402509 -2489234 -2017443 1874247 5477339
6460E477339l14593l783895l380392J75147L465028L946661J524504k013357m157263
$$ 5477339 5162746 1378851 -2001541 -1826394 1638634 5585295 7109799 5096442 939179
6451I39179l487962j409799q81140k274004k131420J968136O806668O809869J478256
$$ 939179 -2548783 -3958582 -4839722 -7113726 -9245146 -7277010 -470342 6339527 7817783
6442G817783l736128m490927k317734r67203r34432j07611J968696L354978K733931
$$ 7817783 4081655 -409272 -2727006 -3694209 -4628641 -4736252 -2767556 587422 3321353
6433C321353R22492o62163j442477j489343j143195r63289j148844j029201P8010
$$ 3321353 4243845 3581682 2139205 649862 -493333 -1456622 -2605466 -3634667 -3556657
6424c556657J632167K316791J690865P02733N10045J212626J733660Q57628j261026
$$ -3556657 -1924490 392301 2083166 2785899 3295944 4508570 6242230 7099858 5838832
6415E838832k705613j803615M00227J059443n84973j949042q87032J063615J165341
$$ 5838832 3133219 1329604 1729831 2789274 2204301 255259 -631773 431842 1597183
6406A597183k31356n21626P30010J192112j45638j142905P7407K126816K393855
$$ 1597183 1365827 844201 1574211 2766323 2620685 1477780 1555187 3682003 6075858
6397F075858N79468j507012k684797l158858k975516j546254Q07294K093616O12505
$$ 6075858 6655326 5148314 2463517 -695341 -3670857 -5217111 -4409817 -2316201 -1703696
6388a703696k470243l626597q64889L456701N099052L203776J193630J636311
$$ -1703696 -4173939 -7800536 -8665425 -5208724 -109672 3094104 4287734 5924045
6380E924045K502227O59893k782621l905154j943990j24010k95265n57698N56169
$$ 5924045 8426272 9086165 6303544 2398390 454400 330390 35125 -522573 33596
6371C3596J247704N503j234783m09922Q15067n6625j652852q68921J603736K182152
$$ 33596 1281300 1286803 52020 -357902 457165 400540 -1252312 -2121233 -517497 1664655
6361A664655L75106n73457N78507J159613k65484j152068L00761J549209N3037
$$ 1664655 2039761 1466304 2044811 3204424 2938940 1786872 2087633 3636842 3689879
6352C689879j948339j000361J479645J241074j773863l203645j177411J106375
$$ 3689879 1741540 741179 2220824 3461898 1688035 -1515610 -2693021 -1586646
6344a586646Q67126l16800j02769N82106j09542j189129n93571R96883J220397
$$ -1586646 -719520 -1036320 -1139089 -556983 -666525 -1855654 -2449225 -1452342 -231945
6335b31945j32072j239527j447301j467002r29390J159494L554172L506910Q99217
$$ -231945 -364017 -1603544 -3050845 -4517847 -5447237 -4287743 -733571 2773339 3672556
6326C672556j274361j336373r42766j549773j864430o39937O58202L22415o07561
$$ 3672556 2398195 1061822 119056 -1430717 -3295147 -3935084 -3276882 -2954467 -3562028
6317c562028l52103M27613K10104j37602J190321L169037K903124J63591k054616
$$ -3562028 -3914131 -3486518 -3276414 -3414016 -2223695 945342 3848466 4012057 1957441
6308A957441j787964k75405N97059O49209N47349N58301P27949P29553m42695
$$ 1957441 169477 -105928 491131 1140340 1687689 2245990 2973939 3703492 3260797
6299C260797k783889l760108j187214K583652K825395o80883k807222o40371K120360
$$ 3260797 476908 -3283200 -4470414 -1886762 938633 257750 -2549472 -3189843 -1069483
6290a069483J091504j961633k128262J106973L674108L236211J494779K52905
$$ -1069483 22021 -1939612 -4067874 -2960901 713207 3949418 5444197 5697102
6282E697102r06754k151068j924615L74031K431552J538642j998338n175001n414395
$$ 5697102 4790348 2639280 714665 1088696 3520248 5058890 3060552 -2114449 -7528844
6273g528844k753750N44647K217414K138047K021316K689029K666284O05668k077958
$$ -7528844 -10282594 -9737947 -7520533 -5382486 -3361170 -672141 1994143 2599811 521853
6264E21853k946333k148428j893980k587547k203405N4739K151564K337849J538453
$$ 521853 -2424480 -4572908 -6466888 -9054435 -11257840 -11203101 -9051537 -6713688 -5175235
6255e175235J261794J219376O70626K45588M59639P2382j688073k554337J85183
$$ -5175235 -3913441 -2694065 -2023439 -1777851 -1318212 -1245830 -2933903 -5488240 -5303057
6246e303057M923433O635445L185323j863240l987304l061009k095135k271409
$$ -5303057 -379624 6255821 9441144 7577904 3590600 529591 -1565544 -3836953
6238c836953j915034r1812J444335R03951p19536j011619N55863K147777K081995
$$ -3836953 -5751987 -5843799 -4399464 -3495513 -4215049 -5226668 -4670805 -2523028 -441033
6229d41033O17046o72994l96750J472614K958834J328517l421865o995374n165937
$$ -441033 176013 -496981 -893731 578883 3537717 4866234 1444369 -5551005 -10716942
6220a0716942L51042L442315J716520n01440Q14135L231312K359737o25771j113682
$$ -10716942 -10365900 -6923585 -5207065 -5708505 -4894370 -1663058 696679 70908 -1042774
6211a042774R25374R78514j852675k785308P01787M306370L487926J57468j237107
$$ -1042774 -117400 861114 -991561 -3776869 -3075082 1231288 4719214 4876682 3639575
6202C639575p86295j539269l192129k509025P81560L228201K960881J798751J552881
$$ 3639575 2853280 1314011 -1878118 -4387143 -3605583 -377382 2583499 4382250 5935131
6193E935131J724684J616118J552381J126109q14478l454280m157655k405207
$$ 5935131 7659815 9275933 10828314 11954423 11139945 7685665 3528010 1122803
6185A122803p08052m12251J83593J777438J660040j702055m710064l223104Q83826
$$ 1122803 414751 2500 186093 1963531 3623571 1921516 -2788548 -6011652 -5127826
6176e127826K231143R4030p55157K220362N428001M800216J443469j082261k108406
$$ -5127826 -2896683 -2802653 -3557810 -1337448 4090553 8890769 10334238 9251977 7143571
6167G143571l104091l618957j862216J373571L050962K391431J775032K383868
$$ 7143571 4039480 420523 -1441693 -68122 2982840 5374271 7149303 9533171
6159I533171K148226l56390k810149k449718m56714p9959j547293k086748p22836
$$ 9533171 11681397 11325007 8514858 6065140 5608426 5528467 3981174 1894426 1171590
6150A171590K90689m67623j144087J78703K219103K560310J328422N05048N90617
$$ 1171590 1462279 994656 -149431 29272 2248375 4808685 6137107 6642155 7232772
6141G232772L35951n87761r26930p1528R08892R63815M06170N6534J22829K95786
$$ 7232772 7568723 6980962 6054032 5982504 6891396 7855211 8261381 8317915 8440744 8736530
6131H736530O4361j117661k929057l624694j949973L47753j894l052748m550398
$$ 8736530 8800891 7683230 4754173 1129479 -820494 -472741 -474635 -3527383 -8077781
6122h077781j249617M275516O349138L002631k066165m195262k451496O93479
$$ -8077781 -9327398 -5051882 1297256 4299887 2233722 -1961540 -4413036 -3719557
6114c719557K580088K296824N21723j369724k220790j770193o04133M64951Q39744
$$ -3719557 -1139469 1157355 1679078 309354 -1911436 -3681629 -4285762 -3820811 -2981067
6105b981067L46830m37455l56424J064463K645982K691826J117374m31777p10410
$$ -2981067 -2634237 -3071692 -3428116 -2363653 282329 2974155 4091529 3659752 2949342
6096B949342j67097K03440K73194L34982K4727j276446l142480m063383k999552
$$ 2949342 2782245 2985685 3258879 3593861 3618588 2342142 -800338 -4863721 -7863273
6087g863273o86253Q77603M07993j138725j352303R30180M052291N339503M173464
$$ -7863273 -8549526 -7671923 -7263930 -8402655 -9754958 -8824778 -4772487 567016 4740480
6078D740480K280867J126704M46099l01352o35931k52679j96277j367915k720463
$$ 4740480 7021347 8148051 8594150 8292798 7656867 7404188 7207911 5839996 3119533
6069C119533k600433j428829j251892k574966l393390k015128M69649J488331
$$ 3119533 519100 -909729 -2161621 -4736587 -8129977 -10145105 -9675456 -8187125
6061h187125N0252k300868l263557j934535O67514K850830L883829M231014M209209
$$ -8187125 -8136873 -10437741 -13701298 -15635833 -14968319 -12117489 -8233660 -4002646 206563
6052B06563L173333P32097j876707k840181k020788r29334m77264j58039K85436
$$ 206563 3379896 4111993 2235286 -604895 -2625683 -3555017 -4032281 -4190320 -3904884
6043c904884J8017j162239j658055j16284K109379K219348k80197k567254j977880
$$ -3904884 -3886867 -5049106 -6707161 -6823445 -4714066 -2494718 -2774915 -5342169 -7320049
6034g320049M73041J365138m01789j778602K60518L866792M225530N42034k053312
$$ -7320049 -6847008 -5481870 -5883659 -7662261 -7401743 -3534951 690579 1232613 -820699
6025h20699M20884M644439M498396j9939l020517j593634O21016P5172j393257
$$ -820699 -399815 4244624 8743020 8723081 5702564 4108930 4729946 4805118 3411861
6016C411861p72132O99981J89151j640643k418004k722083m375706n585637k828697
$$ 3411861 2639729 3339710 3528861 1888218 -529786 -3251869 -7627575 -13213212 -16041909
6007a6041909K735310N671308L795991Q75986N26858J536317J267113J29652m5033
$$ -16041909 -13306599 -7635291 -3839300 -2963314 -2436456 -900139 366974 496626 451593
5998D51593M96739L74805j96121j70821J0741q15692k177797k394246j086590
$$ 451593 948332 1323137 1127016 956195 966936 151244 -2026553 -4420799 -5507389
5989e507389L25537O52218L42632O14099J648889K031744M61205j901735k085839
$$ -5507389 -5181852 -4529634 -4187002 -3572903 -1924014 107730 568935 -1332800 -3418639
5980c418639O46536K973504J802463j037625j379186J011614K497143J519746
$$ -3418639 -2772103 201401 2003864 966239 -412947 598667 3095810 4615556
5972D615556J68934m91501j805010l094231j195757L221809M292053m17543m924290
$$ 4615556 4784490 4292989 2487979 -606252 -1802009 1419800 5711853 5294310 370020
5963C70020l285090J377416K136303j039737k652043j345403p22936j365307K81328
$$ 370020 -2915070 -1537654 598649 -441088 -3093131 -4438534 -5161470 -6526777 -6245449
5954f245449M272964N586393K155482j768890k726157k636126l336224k368288
$$ -6245449 -1972485 3613908 5769390 4000500 1274343 -1361783 -4698007 -7066295
5946g066295J603418M214995J472012l248496l773514k46017J906134O81476m94018
$$ -7066295 -5462877 -1247882 224130 -3024366 -6797880 -7043897 -5137763 -4456287 -4950305
5937d950305N84789J593985M67775p12739R15886M282272N586175L211107m77071
$$ -4950305 -4365516 -2771531 -2303756 -3016495 -2100609 2181663 7767838 10978945 10501874
5928A0501874k130833j076718M39940K99641r31849j093862M19022J912927J860572
$$ 10501874 8371041 7294323 7734263 8033904 7102055 6008193 6427215 8340142 10200714
5919A0200714N85970r48813k390970l263700k693487j008223o5506p18300j409698
$$ 10200714 10786684 9837871 7446901 4183201 1489714 481491 415985 -302315 -1712013
5910a712013n97846R56113J789843K042182K460844K655480K218559K071563K640039
$$ -1712013 -2309859 -1353746 436097 2478279 4939123 7594603 9813162 11884725 14524764
5901A4524764K270581r6420k171486j172625J592025K145045o44360l966145n241018
$$ 14524764 16795345 16698925 14527439 13354814 14946839 17091884 16447524 12481379 7240361
5892G240361m482311k643849n97482J55721j264921k859297j628743J916442M046934
$$ 7240361 2758050 114201 -483281 -327560 -1592481 -4451778 -6080521 -4164079 -117145
5883a17145L009089Q58079l66553q66541o84193J135002L484785L055824o47263
$$ -117145 2891944 3750023 3383470 2516929 1832736 2967738 6452523 9508347 8861084
5874H861084l635710l171688j655964j916448k283288k83846J943250Q41069k070918
$$ 8861084 5225374 2053686 397722 -1518726 -3802014 -4085860 -2142610 -1301541 -3372459
5865c372459k204650O03568J933414R0078j540489l46187J853401K480897J656062
$$ -3372459 -5577109 -4973541 -3040127 -2950049 -4490538 -4836725 -2983324 -502427 1153635
5856A153635L53406j447050l106448l003407j481194j024680j995384j627258
$$ 1153635 1507041 59991 -3046457 -6049864 -7531058 -8555738 -10551122 -12178380
5848a2178380R58572K630087J662532J235228L952727O635384N185400J577495
$$ -12178380 -11219808 -8589721 -6927189 -5691961 -1739234 4896150 10081550 11659045
5840A1659045N58182J595214L24623l043423l574509l74138J313101j107010l002219
$$ 11659045 12217227 13812441 14137064 11093641 7519132 7144994 8458095 7351085 4348866
5831D348866l31411L316253K342543k073779m224186k549098o52007p03520r80217
$$ 4348866 4017455 7333708 9676251 7602472 3378286 829188 177181 -526339 -1506556
5822a506556j11672O74370M66684L14208Q74206J235724R78992Q11294M04863
$$ -1506556 -1618228 -943858 -477174 -162966 711240 1946964 2925956 3737250 4142113
5813D142113j628713m568739n206192k198903J662143L314259L221089L213438
$$ 4142113 2513400 -2055339 -7261531 -9460434 -7798291 -4484032 -1262943 1950495
5805A950495K842406Q28791j433396j288295Q13147J782284R18125R50737K909653
$$ 1950495 4792901 5621692 4188296 2900001 3713148 5495432 6413557 7364294 10273947
5796A0273947L429802k32555n100913o072012l359167k098580m258886n423891
$$ 10273947 13703749 13471194 8370281 2298269 -1060898 -3159478 -7418364 -12842255
5788a2842255j791250L469613M627983J673259m37419L40802J194070O44994J162537
$$ -12842255 -14633505 -11163892 -6535909 -4862650 -5300069 -4959267 -3765197 -3120203 -1957666
5779a957666L526923L719498q43131n915269n811489j416287J975420K665967
$$ -1957666 1569257 5288755 4445624 -1469645 -7281134 -8697421 -6722001 -4056034
5771d056034L058046L480939J532231k187375l421525p84022J914745J619320
$$ -4056034 -997988 2482951 4015182 1827807 -1593718 -2377740 -462995 1156325
5763A156325o5500p32082n82724P4666K228054M450121K466259l966646q090067
$$ 1156325 1090825 358743 -223981 -149315 2078739 6528860 8995119 5028473 -3061594
5754c061594m626400K250250M446012P09015l444698m401824l241184j062654
$$ -3061594 -7687994 -5437744 -991732 -282717 -3727415 -8129239 -11370423 -12433077
5746a2433077K379835N233021M273814R6761k990411l123310k550080k401360
$$ -12433077 -10053242 -4820221 -546407 -449646 -3440057 -6563367 -9113447 -11514807
5738a1514807p03458K802220M698308L230789J341408J460064J273245j631693
$$ -11514807 -12218265 -9416045 -4717737 -1486948 -145540 1314524 2587769 956076
5730I56076m334201k453493K523874M601349J506450k612793l268005r90401P19916
$$ 956076 -3378125 -5831618 -3307744 1293605 2800055 187262 -3080743 -4071144 -3351228
5721c351228L71706n12353l53787L58412L42761n7186Q19810K829046K967805
$$ -3351228 -2979522 -3491875 -3845662 -3487250 -3144489 -3201675 -2381865 447181 3414986
5712C414986n53953m361434l294255K119886N268133K067302l455094m819833
$$ 3414986 2861033 -1500401 -4794656 -2674770 2593363 4660665 1205571 -3614262
5704c614262j495784J823871K333316J403039N78732n01057j705295j482154M48394
$$ -3614262 -5110046 -3286175 -952859 450180 1028912 527855 -1177440 -2659594 -2211200
5695b211200K128923K321541K164014K642760K644887J181034l88945m78648k51706
$$ -2211200 -82277 2239264 4403278 7046038 9690925 10871959 10483014 10004366 9752660
5686I752660j978037m937723n557613k209570K156150L473342J476086m16387
$$ 9752660 7774623 2836900 -2720713 -4930283 -2774133 699209 2175295 1758908
5678A758908K55732K113570K252619K06221j670428j427783K11152J236156J010853
$$ 1758908 2014640 4128210 6380829 6587050 4916622 3488839 3699991 4936147 5947000
5669E947000O32955J033239J766276J969776J734367J701491J537715k4302k970879
$$ 5947000 6579955 7613194 9379470 11349246 13083613 14785104 16322819 16298517 13327638
5660A3327638m836251l300268K95484J986952K63130k034281k172907j556014
$$ 13327638 8491387 5191119 5486603 7473555 7736685 5702404 3529497 1973483
5652A973483k750940m365220k709032J906245M716919L248436N84950J0778M0724
$$ 1973483 -777457 -5142677 -7851709 -5945464 -1228545 2019891 2604841 2615619 2656343
5643B656343k066008m566965l181850K112905O068540M490557r77978n159317
$$ 2656343 590335 -3976630 -7158480 -5045575 1022965 5513522 4535544 -623773
5635f23773m781992j084248J933417J622879m46589l95840K624618M727522K620185
$$ -623773 -5405765 -6490013 -4556596 -2933717 -3380306 -3776146 -1151528 3575994 6196179
5626F196179j240627j851076J048084K678326M02697k686647k828651r19452l07138
$$ 6196179 4955552 3104476 4152560 6830886 7233583 4546936 1718285 798833 491695
5617D91695j509759k034436m98473J626442K305714J195578n25570j392977p12280
$$ 491695 -1018064 -3052500 -3550973 -1924531 381183 1576761 1051191 -341786 -1054066
5608a054066P13908J072534l95989k082965j742121O08858K590357K386980P45953
$$ -1054066 -340158 732376 336387 -1746578 -3488699 -2879841 -289484 2097496 2843449
5599B843449l55311j29041O97655J351899J671558J351116j38896k123034k320118
$$ 2843449 2488138 2359097 3056752 4408651 6080209 7431325 7292429 5169395 2849277
5590B849277N42341M071701M186478L78904k922214j767873J986722K985360o38002
$$ 2849277 3391618 7463319 11649797 12028701 9106487 7338614 9325336 12310696 11672694
5581A1672694n065621n894431l118689O3749J566817J777047J578149J006528
$$ 11672694 6607073 712642 -2406047 -2342298 -775481 1001566 2579715 3586243
5573C586243K9863p09316o00399O9803N15164M82557M13215N80412N41102k52481
$$ 3586243 3616106 2906790 2306391 2376194 2891358 3373915 3787130 4367542 4908644 4656163
5563D656163j622436k887191l614463l532813k099497O54358K916698K395883
$$ 4656163 3033727 146536 -3467927 -7000740 -9100237 -8445879 -5529181 -3133298
5555c133298m86284k287105o79201K396182L302970J442639m87014m40316P61998
$$ -3133298 -3619582 -5906687 -6585888 -4189706 -886736 555903 68889 -371427 390571
5546C90571J216492K84271j151553j644149l47094J840300K624580R08672j527882
$$ 390571 1607063 1891334 739781 -904368 -1251462 588838 3213418 4122090 2594208
5537B594208k288688j596691j511248k501599k908495j588694R52391L825571
$$ 2594208 305520 -1291171 -2802419 -5304018 -8212513 -9801207 -8848816 -5023245
5529e023245O018939N806188K526060j200661j939120j85592N13870p12022j126694
$$ -5023245 995694 6801882 9327942 8127281 6188161 6002569 6516439 5804417 4677723
5520D677723J02386L6057k453898l819528j656961Q04495J07856j236804Q66313
$$ 4677723 4780109 4816166 2362268 -1457260 -3114221 -2309726 -2201870 -3438674 -2572361
5511b572361M251333L166766k272045n591032l499409j90332k44348k117857j673535
$$ -2572361 1678972 4845738 2573693 -3017339 -6516748 -6707080 -6951428 -9069285 -10742820
5502a0742820J270201L306844K508473L08198q56099O9517K146590L115384J360181
$$ -10742820 -9472619 -6165775 -3657302 -3349104 -4205203 -4135686 -1989096 1126288 2486469
5493B486469k091507m314502l587229q23833K047016L735663L702366K417063
$$ 2486469 394962 -3919540 -7506769 -8330602 -6283586 -2547923 1154443 3571506
5485C571506J622619K418798L045755R39172k817358m080736j591628Q64642K8453
$$ 3571506 5194125 7612923 10658678 11597850 8780492 4699756 3108128 3972770 4001223
5476D001223k050894j408212J896334M246283L548006R79727j580996l239245
$$ 4001223 1950329 542117 2438451 6684734 10232740 11212467 9631471 6392226
5468F392226l434850j850881P96194L153711M219307L195317l93038n019162p039629
$$ 6392226 2957376 1106495 1902689 5056400 9275707 12471024 12077986 7058824 19195
5459A9195m449674J06797K294666J437208O24318J833435L392102K669621n51808
$$ 19195 -4430479 -4323682 -2029016 -591808 32510 1865945 5258047 7927668 7375860
5450G375860l939901m783339k303659J368248L062079K183413J213363J563945
$$ 7375860 3435959 -1347380 -3651039 -2282791 779288 2962701 4176064 5740009
5442E740009J120360j860469m736680l923470o90567Q04875L38001J468555M550070
$$ 5740009 6860369 4999900 263220 -3660250 -4350817 -3545942 -3207941 -1739386 2810684
5433B810684N380932K245724r63460j129805n89372k120939l609448j953028J085597
$$ 2810684 8191616 10437340 9473880 8344075 7754703 5633764 2024316 71288 1156885
5424A156885J589518l80731j942035k640717l712631l685111j48610M566538M971274
$$ 1156885 2746403 2365672 423637 -2217080 -5929711 -9614822 -9763432 -5196894 -225620
5415b25620M03555l405956k094037K199683M948394M503104J464230l217194o983720
$$ -225620 177935 -3228021 -5322058 -3122375 1826019 6329123 7793353 4576159 -2407561
5406b407561o101021o14896L837873K675655j264981j811098J562295L266887
$$ -2407561 -8508582 -9123478 -5285605 -2609950 -3874931 -5686029 -4123734 -856847
5398h56847J61884l758905l131744J297909L904557J851669j406475j123201K217295
$$ -856847 -694963 -4453868 -7585612 -6287703 -2383146 -531477 -1937952 -3061153 -843858
5389h43858L575996L67441l622557k948028K283634O380138N087975K13506l486409
$$ -843858 2732138 3099579 -522978 -3471006 -1187372 5192766 10280741 10494247 7007838
5380G007838l905227k679514k165153l060003m476157m996045l663431o73512
$$ 7007838 3102611 423097 -1742056 -4802059 -9278216 -14274261 -17937692 -18611204
5372a8611204K739978N074258N136645K653447p00351j742121Q72646M152793
$$ -18611204 -15871226 -10796968 -5660323 -3006876 -3707227 -5449348 -4576702 -423909
5364d23909L927684M75288j725892l07180K129066K718568K456066L155902L360115
$$ -423909 3503775 3979063 2253171 1945991 4075057 6793625 9249691 12405593 15765708
5355A5765708Q96468k394511k553685M70898K405962N16749l246832n634660n901880
$$ 15765708 16662176 14267665 11713980 12184878 14590840 15107589 11860757 6226097 324217
5346C24217n136892l985933k559378j337737q23957p87156n89635R165O99300
$$ 324217 -4812675 -8798608 -11357986 -12695723 -13519680 -14306836 -14896471 -14887306 -14188006
5337a4188006J096548J289003J771516K415530J902064m80140k568730j084049
$$ -14188006 -13091458 -11802455 -10030939 -7615409 -5713345 -6193485 -8762215 -9846264
5329i846264L498887O286461L960187p55097k959810j924292n92531l25892K24451
$$ -9846264 -6347377 -60916 3899271 3144174 184364 -1739928 -2332459 -2658351 -2433900
5320b433900J601259K463404K187950J581309Q11937o06745j714336r29538P88671
$$ -2433900 -832641 1630763 3818713 5400022 6211959 5605214 3890878 2961340 3750011
5311C750011O68052j459794k528680q60956J518557K257596J579460O00282n68867
$$ 3750011 4418063 2958269 429589 -431367 1087190 3344786 4924246 5524528 4955661
5302D955661j630085j491880l29384M9690p41220p21796P88885J234527j199068
$$ 4955661 3325576 1833696 1504312 1554002 812782 90986 879871 2114398 915330
5293I15330l898789k883650J666234N372877M666572K66995l840430m007200l31078
$$ 915330 -2983459 -5867109 -4200875 1172002 5838574 6105569 2265139 -1742061 -2073139
5284b073139L057421K378080j054217k573955p45132J036214M74839m6342J711920
$$ -2073139 984282 3362362 2308145 -265810 -1010942 25272 500111 453769 2165689
5275B165689L159742R01560l116944l993133j147939J216182P06951l76856M72039
$$ 2165689 5325431 6226991 3110047 -883086 -2031025 -814843 -107892 -484748 -12709
5266a2709K123156K088368L68266p76681R1953J922190K380990M93552j893108
$$ -12709 2110447 4198815 4567081 3790400 3882353 5804543 8185533 8679085 6785977
5257F785977j924562O41378K808764K139783k77956j951420k470270k907197l043552
$$ 6785977 4861415 5502793 8311557 10451340 10173384 8221964 5751694 2844497 -199055
5248a99055j729826N07003J625482Q56162n89863j576386j991412j603020J64923
$$ -199055 -1928881 -1421878 203604 1059766 469903 -1106483 -3097895 -4700915 -4535992
5239d535992K801771M440204L718878J266281j002077j773684j534902j841234
$$ -4535992 -1734221 2705983 6424861 7691142 6689065 4915381 3380479 1539245
5231A539245l005477l081438n40535K582217K758460L84367j41889K969219N707280
$$ 1539245 -1466232 -4547670 -5088205 -2505988 252472 636839 494950 3464169 9171449
5222I171449M080295p3382k323104j985897j406267j081751J43858J434803R93005
$$ 9171449 13251744 13178362 10855258 8869361 7463094 6381343 6525201 7960004 8953009
5213H953009o9163O84352K038701M03738l833454n986945l941550q54028K89015
$$ 8953009 8883846 9568198 11606899 12010637 8177183 2190238 -1751312 -2605340 -2316325
5204b316325M27938R10400M85755j443702k141126M98263L775371L474552j03332
$$ -2316325 -1888387 -977987 -492232 -1935934 -4077060 -3578797 196574 3671126 3567794
5195C567794k582855j427515J215116J718251p09151l344791k930689P45314M307687
$$ 3567794 984939 -442576 772540 2490791 1781640 -1563151 -4493840 -3748526 559161
5186E59161M422935J637131o74575q84591o58684j658015k940494k739941j094702
$$ 559161 4982096 6619227 5944652 5060061 4401377 2743362 -197132 -2937073 -4031775
5177d031775O17440J549862J645761J032505K20645J55784J156333K242957K063641
$$ -4031775 -3414335 -1864473 -218712 813793 1034438 1190222 2346555 4589512 6653153
5168F653153J68129k690231m997130n386456l813302j643139n4624J045192J980421
$$ 6653153 6821282 4131051 -866079 -6252535 -10065837 -11708976 -11763600 -10718408 -8737987
5159h737987K418358K521712L379580M720217M055878M22627k874515k366174
$$ -8737987 -6319629 -3797917 -418337 4301880 8357758 8780385 5905870 3539696
5151C539696K15063L95637k177444l549975j904450K33106Q32150J135036K232709
$$ 3539696 3754759 4150396 1972952 -1577023 -3481473 -3248367 -2416217 -1281181 951528
5142I51528K587151Q05004j926582l660804l599735j438070K455848N585507N146315
$$ 951528 3538679 4343683 2417101 -1243703 -4843438 -6281508 -3825660 1759847 6906162
5133F906162K069095J20754M02962L60431j048309j483446L4902Q78945n59811
$$ 6906162 8975257 9096011 9498973 9859404 8811095 7327649 7362551 8241496 7681685
5124G681685k041799j710064j261368k137223k285051P1843K693114K682972P88808
$$ 7681685 5639886 3929822 2668454 531231 -1753820 -1681977 1011137 3694109 4482917
5115D482917p80105k027107l446910l416031q93101J573229J107835j092509j881893
$$ 4482917 3702812 1675705 -1771205 -5187236 -6080337 -4507108 -3399273 -4491782 -6373675
5106f373675q55598K48260J065595K326865L511488L651026L134693K384940N31754
$$ -6373675 -7229273 -6981013 -5915418 -3588553 -77065 3573961 6708654 9093594 9625348
5097I625348k337856l860626k816634j405229j426742r59767J964577N119688
$$ 9625348 7287492 3426866 610232 -794997 -2221739 -3181506 -1216929 3902759
5089C902759N198841K801731N74641j314966l851461n449680l878931m03440J926142
$$ 3902759 9101600 11903331 12477972 11163006 7311545 1861865 -2017066 -2420506 -494364
5080d94364K635899K868850K046829m17468j990775j18413L015341L260518O91428
$$ -494364 2141535 5010385 7057214 6639746 4648971 4530558 7545899 10806417 11497845
5071A1497845j338406j851377k329489k588480j545249q71262k583241l965384
$$ 11497845 10159439 8308062 5978573 3390093 1844844 973582 -1609659 -5575043
5063e575043o68719N434452P462340L155602k309333m175217l390449k443145
$$ -5575043 -6243762 -809310 6653030 9808632 7499299 3324082 -66367 -2509512
5055b509512j010847J675324L991592M147979K792212J571783J019503Q69140
$$ -2509512 -3520359 -1845035 2146557 6294536 9086748 10658531 11678034 12547174
5047A2547174O96785j41307j585757k278545j606886j103475j636843j208885
$$ 12547174 13243959 13102652 11516895 9238350 7631464 6527989 4891146 3682261
5039C682261J388895L076596P57745l027873l544503j181373l1020o63861k06204
$$ 3682261 5071156 8147752 8905497 5877624 2333121 1151748 1120728 456867 250663
5030B50663J378948J370210K20580R87593K788629J377720l152930n690109m053595
$$ 250663 1629611 2999821 3220401 4207994 6996623 8374343 5221413 -468696 -4522291
5021d522291j436643m8944J268553K180234M95550j986770m24250M454377N994221
$$ -4522291 -5958934 -6007878 -4739325 -2559091 -2063541 -4050311 -4474561 -20184 5974037
5012E974037K125414j340277o80687M54114o37483m20474K809819L567438j644207
$$ 5974037 8099451 6759174 6078487 6532601 5895118 5474644 8284463 11851901 10207694
5003A0207694o728477m909079M70053J774376r78857k080176n49164l61137k184722
$$ 10207694 3479217 -1429862 -959809 814567 -164290 -2244466 -2793630 -3154767 -5339489
4994e339489k527653m46532J335054J698348K040765K328251J246009j40144L83676
$$ -5339489 -7867142 -8313674 -6978620 -5280272 -3239507 -911256 334753 194609 578285
4985E78285J645578M09725k800455l651830m17231L312844L506331O50517j415598
$$ 578285 2223863 2633588 -166867 -3818697 -4235928 -923084 2583247 3233764 1818166
4976A818166k80969K289342K381682j050980m116872k791301J220833K837529
$$ 1818166 1537197 3826539 6208221 5157241 1040369 -1750932 -530099 2307430
4968B307430J287656P22400K654026L352749O72906k079937j967507q96374r80094
$$ 2307430 3595086 4317486 6971512 10324261 10997167 8917230 6949723 6053349 5073255
4959E073255n67717J302605J593452j167350k881869l98722K534061J333215j548385
$$ 5073255 4505538 5808143 7401595 6234245 3352376 2953654 5487715 6820930 5272545
4950E272545r29043K245890K814520K4722j868688n18059K175563L914784M016770
$$ 5272545 4343502 6589392 9403912 9428634 7559946 7041887 9217450 13132234 17149004
4941A7149004K322936n73839k928043l932820m515286m571757k470041J084921
$$ 17149004 19471940 18898101 15970058 12037238 7521952 2950195 480154 1565075
4933A565075K679252J602053J088466K253214K236488N48460P57043L053906K507780
$$ 1565075 4244327 5846380 6934846 9188060 11424548 11973008 12730051 15783957 18291737
4924A8291737j667131l221651K19119K154352j177303l459348K99850M340763
$$ 18291737 16624606 13402955 13622074 15776426 14599123 11139775 11439625 15780388
4916A5780388K553063p73673j0814R98183k307397m546494l12769L747760j32563
$$ 15780388 18333451 17559778 17548964 18547147 16239750 11693256 11380487 15128247 14995684
4907A4995684n694099k720739M697331N257514j5570j212360K149278K357283
$$ 14995684 9301585 6580846 11278177 16535691 16520121 15307761 17457039 19814322
4899A9814322n89129j40861K826179K408495N24485K393177L943000n08243m151481
$$ 19814322 19225193 19084332 21910511 24319006 24843491 27236668 31179668 30671425 26519944
4890B6519944J268583P645396L674177k475372K980492J1518670N977123n618989
$$ 26519944 27788527 35433923 39108100 36632728 39613220 51131890 57109013 51490024
4882E1490024k259199J0160020Q582699j494634O059986K4528436K0940142L026252
$$ 51490024 49230825 59390845 67973544 66478910 72538896 97067332 118007474 121033726
4874A21033726J6653707N3856194L3804236p5176726j75565286j54083212l6547967
$$ 121033726 137687433 191543627 225347863 150171137 -25394149 -179477361 -216025328
4867b16025328M9019059M3411076P800961O367535K2471231J7013258j72722j54998
$$ -216025328 -167006269 -123595193 -115794232 -109426697 -86955466 -69942208 -70114930 -70269928
4859g0269928J0701826R659974Q74596K029709R041015O728841j273207j545041
$$ -70269928 -59568102 -49908128 -49033532 -47003823 -37962808 -31233967 -32507174 -34052215
4851c4052215L118323J585479k858926j69270N764464M794324K58480J749481
$$ -34052215 -30933892 -29348413 -32207339 -32376609 -26612145 -21817821 -21559341 -19809860
4843a9809860O015422L528831k851106l517418k78455j720561n710941l412272
$$ -19809860 -13794438 -10265607 -13116713 -16634131 -16912586 -18633147 -24344088 -27756360
4835b7756360L275749M582296L65925o13674K944046L714805k7050k360827j485257
$$ -27756360 -24480611 -19898315 -19532390 -20146064 -17202018 -13487213 -13514263 -15875090 -17360347
4826a7360347j376814k061689L15649M006776L229942q91791j522947J716329
$$ -17360347 -18737161 -20798850 -20483201 -16476425 -13246483 -14138274 -15661221 -13944892
4818a3944892K177112j657604l541087m22584L112627L257411J855955J018205
$$ -13944892 -11767780 -13425384 -16966471 -17389055 -14276428 -11019017 -9163062 -8144857
4810h144857j48459j822315k460869k385920l085868l242345r20231J438704L18704
$$ -8144857 -8293316 -10115631 -12576500 -14962420 -18048288 -21290633 -22210864 -20772160 -20453456
4801b0453456k066972j006535K266752K757981Q51169J117897L074314K049713
$$ -20453456 -22520428 -23526963 -21260211 -18502230 -17651061 -16533164 -13458850 -11409137
4793a1409137j014267k02667M028486L964251k463868p202648m265004J867505
$$ -11409137 -12423404 -12626071 -8597585 -4633334 -7097202 -14299850 -18564854 -16697349
4785a6697349M431959L603593K612370J149172j803917l621038j921970R34093
$$ -16697349 -12265390 -8661797 -6049427 -4900255 -6704172 -10325210 -12247180 -11313087
4777a1313087J717627J229313J430386J328635j68752p06019J821682M791043
$$ -11313087 -9595460 -8366147 -6935761 -5607126 -5775878 -6481897 -4660215 130828
4769A30828M425376J638240Q0891J22094q83327l221985l877640j235416K371960
$$ 130828 4556204 6194444 6275335 6397429 5514102 2292117 -1585523 -2820939 -448979
4760d48979L643413J979524n06465j632155j302388j189091k299320l468701l175837
$$ -448979 3194434 5173958 4667493 3035338 1732950 543859 -1755461 -5224162 -8399999
4751h399999k088817j994731k574421j577108J513946M254713M385335K373614
$$ -8399999 -10488816 -12483547 -15057968 -16635076 -15121130 -10866417 -6481082 -4107468
4743d107468K18707o46365J05501J578867J865675O7913j943872j731907M703
$$ -4107468 -3888761 -4535126 -4429625 -2850758 -985083 -917170 -2861042 -4592949 -4588246
4734d588246L61903j217652k163249r26962R74372J859946K084997K250398J694026
$$ -4588246 -4226343 -5443995 -7607244 -8534206 -7559834 -5699888 -3614891 -1364493 329533
4725C29533P3042j533091k167161j943194r45462Q03021J976514J053354p49610
$$ 329533 402575 -1130516 -3297677 -5240871 -6186333 -5383312 -3406798 -2353444 -3103054
4716c103054m86030J822015K626251K64923k283606j998161k10976J24136q22897
$$ -3103054 -3589084 -1767069 859182 1124105 -1159501 -3157662 -3368638 -3244502 -4067399
4707d067399o39726J250088L112449L559894K437961o2528l051620m481216l244226
$$ -4067399 -4707125 -3457037 -344588 3215306 5653267 5590739 2539119 -1942097 -5186323
4698e186323j302715j571210l728703m260594j263492K608204L388518J052155
$$ -5186323 -6489038 -8060248 -11788951 -16049545 -17313037 -14704833 -11316315 -10264160
4690a0264160l96718J550675M194512L295929o52496k886545j379403K51405j226254
$$ -10264160 -10660878 -9110203 -4915691 -1619762 -2272258 -5158803 -6538206 -6286801 -7513055
4681g513055l239883j573118K621965M483046K733622N68090j95174q97686j790142
$$ -7513055 -10752938 -12326056 -9704091 -5221045 -2487423 -1919333 -2114507 -3012193 -4802335
4672d802335j105048N65855l9379l003064l871912o04721K708750K266341M66484
$$ -4802335 -5907383 -5341528 -5380907 -8383971 -12255883 -12860604 -10151854 -7885513 -7419029
4663g419029J367076L711211L258350j20993k486727j961547n62461j74428l21344
$$ -7419029 -6051953 -2340742 917608 796615 -1690112 -3651659 -4214120 -4388548 -4709892
4654d709892j80968K6156L7936p2057n18668j239120j255509j88884N08355l69901
$$ -4709892 -4890860 -4864704 -4826768 -4898825 -5417493 -6656613 -7912122 -8101006 -7592651 -7962552
4644g962552j575429j361813m91824p70035j460312n7051L592313O654513P040073
$$ -7962552 -9537981 -10899794 -11391618 -12161653 -13621965 -13679016 -10086703 -3432190 3607883
4635C607883N461707L417860J256078j061169k892634l463456k662996j052923
$$ 3607883 9069590 12487450 13743528 12682359 9789725 6326269 3663273 2610350
4627B610350L17936M05914p36255j774694j678998q04521J44789R68152J046554
$$ 2610350 2928286 3334200 2597945 823251 -855747 -1660268 -1515479 -547327 499227
4618D99227n66760k833939k758997J82313J997232m10195l907220l260896Q17162
$$ 499227 -67533 -2901472 -5660469 -5478156 -3480924 -3891119 -7798339 -11059235 -10242073
4609a0242073K648913L42155j809108q48642L13319j217271k548525L62579N205255
$$ -10242073 -7593160 -7251005 -9060113 -9908755 -9595436 -10812707 -13361232 -12998653 -7793398
4600g793398N732593R23528l206655j935153K005584K819407m89830l687739l653491
$$ -7793398 -2060805 -1137277 -4343932 -6279085 -4273501 -1454094 -1943924 -5631663 -9285154
4591i285154j916677j239734j367545k89653J658173J784533o77000k822568j858736
$$ -9285154 -11201831 -12441565 -13809110 -14098763 -12440590 -10656057 -11333057 -14155625 -16014361
4582a6014361J243827L521387L984284L817265L620271K729570R90349p76543
$$ -16014361 -14770534 -11249147 -7264863 -3447598 172673 2902243 3892592 3116049
4574C116049k008151k482868j582621O27456K050255O75220k067951k693416o11120
$$ 3116049 1107898 -1374970 -2957591 -2330135 -279880 395340 -1672611 -4366027 -4977147
4565d977147J164215Q56541K70643R35694J222187l01448j505661L7010K439080
$$ -4977147 -3812932 -2956391 -2685748 -1750054 -527867 -829315 -2334976 -2297966 141114
4556A41114J936533j007759j929948J108214M644901M496279P21735l319620m910306
$$ 141114 2077647 1069888 -860060 248154 4893055 9389334 10111069 6791449 1881143
4547A881143l743011j254974O16004R21310N58831Q16716J202166L11832j291479
$$ 1881143 -1861868 -3116842 -2500838 -1579528 -1020697 -203981 998185 1310017 18538
4538A8538j487521l20881m23580k434817l078669j92038L078281K487284q58873
$$ 18538 -1468983 -1789864 -2213444 -4648261 -7726930 -7918968 -4840687 -2353403 -3212276
4529c212276k266733n79167R06352N38979N92425K272846L019530J244084j32163
$$ -3212276 -5479009 -6058176 -5151824 -4612845 -4020420 -1747574 1271956 2516040 2383877
4520B383877J675752M077084K651176j827026m307275k823804n99875l11117m13036
$$ 2383877 4059629 8136713 10787889 8960863 4653588 1829784 1229909 918792 505756
4511E05756R88892K007742k03420m226333n356959j895152K221211K376932p47157
$$ 505756 1494648 3502390 3298970 -927363 -6284322 -8179474 -5958263 -3581331 -4328488
4502d328488k240856L40772L796723L964186J403865k05037j063m49617j867372
$$ -4328488 -6569344 -6228572 -2431849 1532337 2936202 2731165 2730102 2280485 413113
4493D13113r89839L004368N293282J930912l557822m710107j318808R67833n76699
$$ 413113 -576726 2427642 7720924 9651836 6094014 1383907 65099 1032932 456233
4484D56233k696400k353782r43483o18820n89786N61408J916964J806233J54294
$$ 456233 -2240167 -4593949 -5537432 -6156252 -6746038 -6184630 -4267666 -2461433 -2307139
4475b307139k236803m533598n021792k186497K223781M276764L314010K878008
$$ -2307139 -4543942 -9077540 -14099332 -16285829 -14062048 -9785284 -6471274 -3593266
4467c593266M488816M542131L54775m445187m697766j312414L46515j726616m142909
$$ -3593266 895550 5437681 5792456 1347269 -3350497 -4662911 -4316396 -6043012 -10185921
4458a0185921l405357K31758M143570N965058M949246K546832J041167L73256
$$ -10185921 -13591278 -13359520 -9215950 -3250892 1698354 4245186 5286353 5659609
4450E659609j878172n711549o733770k055915M383813O392105L564198M49923
$$ 5659609 3781437 -1930112 -8663882 -10719797 -6335984 56121 3620319 4070242
4442D070242p80895j855488l249715k832417k84646J698068J658965R47242K59260
$$ 4070242 3289347 1433859 -1815856 -4648273 -4932919 -3234851 -1575886 -628644 -369384
4433c69384j384209l253887k650887N09995K733883K227214J377385K062822K312396
$$ -369384 -1753593 -5007480 -7658367 -7148372 -4414489 -2187275 -809890 1252932 3565328
4424C565328J75148k476260k947325j753878p39138L33836K183719L118435J180025
$$ 3565328 3740476 1264216 -1683109 -3436987 -4176125 -3842289 -1658570 1459865 2639890
4415B639890k060479l019625q76910J633557J832354l81830l097536l919042j617023
$$ 2639890 579411 -2440214 -3317124 -1683567 148787 -233043 -3330579 -7249621 -8866644
4406h866644K331937M552573L235861k2684k508539l060928j780855Q11513L058405
$$ -8866644 -6534707 -1982134 1253727 1231043 -1277496 -4338424 -6119279 -5307766 -2249361
4397b249361K774981J90600j760842j577631j117913j648967j149479J656939
$$ -2249361 525620 716220 -1044622 -2622253 -3740166 -5389133 -6538612 -4881673
4389d881673L771551K317850j61653N51245L260352L266423K49830j523622q18586
$$ -4881673 -1110122 1207728 1046075 1597320 4857672 8124095 8373925 6850303 6031717
4380F031717j166877l692375m187816k69213L587129K237506k417045m287967
$$ 6031717 4864840 1172465 -3015351 -3284564 302565 2540071 123026 -4164941
4372d164941j540986J929970K393277J14979k284251k530606J1750L601897N069475
$$ -4164941 -5705927 -3775957 -1382680 -1267701 -3551952 -6082558 -6070808 -2468911 2600564
4363B600564L249478O20889k69634n84539k771327n635675n422260j657421J725274
$$ 2600564 5850042 6470931 6201297 5616758 2845431 -2790244 -8212504 -9869925 -8144651
4354h144651J907619O21855O92665J963205K575999K095170J174554k51832k187087
$$ -8144651 -6237032 -5615177 -4922512 -2959307 -383308 1711862 2886416 2634584 447497
4345D47497l110258j562637J391612L265079L293903K632480J774320r5227k944411
$$ 447497 -2662761 -4225398 -2833786 431293 3725196 6357676 8131996 8036769 5092358
4336E092358n018399m867627k974912p40016J061595K186453K292232J269572
$$ 5092358 73959 -4793668 -7768580 -8508596 -7447001 -5260548 -2968316 -1698744
4328a698744k32604j190153r88708J99519J488759J884651J282256N72377K51139
$$ -1698744 -1931348 -3121501 -4110209 -3910690 -2421931 -537280 744976 1317353 1568492
4319A568492l88724j716085k251171l66185K897869M630570L686721J629412o8038
$$ 1568492 1179768 -536317 -2787488 -3153673 -255804 4374766 8061487 9690899 9622861
4310I622861j590349l065749l564783k770355j618871l33431J942364M378245
$$ 9622861 8032512 4966763 1401980 -1368375 -2987246 -3320677 -1378313 2999932
4302B999932L972757j13844m065725l916200q41863Q79665j00403j290692p63917
$$ 2999932 6972689 6858845 2793120 -1123080 -1964943 -1085278 -1185681 -2476373 -3240290
4293c240290O27514J422012J283934L00806j277122k343987j828949l69632N30796
$$ -3240290 -2612776 -1190764 93170 393976 -883146 -3227133 -5056082 -5425714 -4894918
4284d894918P59045J237860J758891J245072j04454j036779j351843j673703j549874
$$ -4894918 -4135873 -2898013 -1139122 105950 1496 -1035283 -2387126 -4060829 -5610703
4275e610703k20792J090483M88646j061337n96941K060038L535674J832511r01561
$$ -5610703 -5831495 -4741012 -4252366 -5313703 -5910644 -3850606 -314932 1517579 616018
4266F16018j821045j057441n15318j100346k416729l396037k391095J261912N048317
$$ 616018 -1205027 -2262468 -2777786 -3878132 -6294861 -9690898 -12081993 -10820081 -5771764
4257e771764N140123J482031j597430j143268P81596Q89145o14482j373877p32064
$$ -5771764 -631641 850390 -747040 -1890308 -1108712 -219567 -834049 -2207926 -2939990
4248b939990K20100P42264L42462j789879m918559n864205k631949K074810L639415
$$ -2939990 -2719890 -1977626 -1635164 -3425043 -8343602 -14207807 -16839756 -14764946 -11125531
4239a1125531J369433r21010j72584K316019L222592J571134m41991n99887M87694
$$ -11125531 -9756098 -10677108 -10849692 -8533673 -5311081 -3739947 -4181938 -4781825 -4294131
4230d294131N45467p60646j179842L49679J452858o886j957968j131827J302477
$$ -4294131 -3748664 -4509310 -5689152 -5339473 -3886615 -3893501 -5851469 -6983296 -5680819
4221e680819J310527j241661k086168N85508L427215L464485J872607M31737j414363
$$ -5680819 -4370292 -5611953 -7698121 -7112613 -3685398 -220913 1651694 2083431 669068
4212F69068l617426l783749j195255J011570M49822j045016j015733N1652J145582
$$ 669068 -2948358 -6732107 -7927362 -6915792 -6465970 -7510986 -8526719 -8475067 -7329485
4203g329485K804778M217031K558700j825476m195912k650206j456620l254464
$$ -7329485 -4524707 -307676 2251024 425548 -3770364 -6420570 -7877190 -11131654
4195a1131654l724963O27616N096000L925708j14534r48968L40996j146379l761913
$$ -11131654 -14856617 -14229001 -9133001 -5207293 -5321827 -6270795 -5929799 -7076178 -10838091
4186a0838091j854524L164988M123062J17425k170702R4056K149509Q68610p67507
$$ -10838091 -12692615 -9527627 -5404565 -5287140 -7457842 -7363786 -5214277 -4345667 -5113174
4177e113174p29326j526561l783877l491093P80860M158210K626586j289698l237469
$$ -5113174 -5842500 -7369061 -11152938 -14644031 -13863171 -9704961 -7078375 -8368073 -11605542
4168a1605542k734524j301618P34132K828951L253309J652173l23014j630626
$$ -11605542 -14340066 -15641684 -14907552 -12078601 -8825292 -7173119 -7496133 -9126759
4160i126759k063203o54589K174781K665883r91240l983369j855658J267714l70331
$$ -9126759 -11189962 -11844551 -9669770 -7003887 -7995127 -11978496 -13834154 -12566440 -12936771
4151a2936771l184908r82783J820227k208527p022529l030215q98839j9611889
$$ -12936771 -16121679 -17104462 -15284235 -17492762 -24515291 -27545506 -28444345 -48056234
4143d8056234m6341723l8956825J4552287O6364874O4906132K1360434j0340755
$$ -48056234 -94397957 -133354782 -118802495 -52437621 12468511 33828945 23488190
4136B3488190p037635N100204J619689p638906n799585J868061K497095j580826
$$ 23488190 16450555 21550759 23170448 15531542 9731957 11600018 14097113 12516287
4128A2516287j665568L761k745466o119901l283717K535463L775615J082698k17478
$$ 12516287 10850719 10854480 8109014 1989113 -1294604 1240859 5016474 6099172 5881694
4119E881694l96440k423454l998377j696684J388102O94562j275864L28184L427795
$$ 5881694 5485254 3061800 -936577 -2633261 -1245159 -550597 -1826461 -1498277 1929518
4110A929518K678877r74276k442001j258820m84763L13128L063494M715154J130035
$$ 1929518 4608395 3634119 1192118 -66702 -551465 -238337 2825157 7540311 8670346
4101H670346m247069m128745R41167L088675m65268l714308k028909J598770K963442
$$ 8670346 4423277 294532 1235699 4324374 3859106 144798 -1884111 -285341 2678101
4092B678101K677106K526975J253172k234300n341681n084598k260953L66930
$$ 2678101 5355207 7882182 9135354 6901054 1559373 -3525225 -5786178 -5419248
4084e419248J699642J795830J20397k976435m628203k152831K963209N921358
$$ -5419248 -3719606 -1923776 -1803379 -4779814 -9408017 -11560848 -8597639 -2676281
4076b676281L951635k96671j564857J859396N743481M804899n01061m245645k560812
$$ -2676281 1275354 978683 -586174 1273222 7016703 11821602 11320541 7074896 4514084
4067D514084J681410L304845J445367q72572j868461k338052k612333j578064
$$ 4514084 6195494 9500339 10945706 10073134 8204673 5866621 3254288 1676224
4059A676224Q23688K644692K391733R76311M93594J765709L387968L118245N77314
$$ 1676224 2499912 5144604 7536337 8512648 9006242 10771951 14159919 17278164 17855478
4050A7855478j804932j885522j359124l541384p394267p516405j857023M230378
$$ 17855478 16050546 14165024 12805900 9264516 1870249 -5646156 -7503179 -3272801
4042c272801M628285K56744l123516k516139M30577L024808L254012k24018n786153
$$ -3272801 1355484 1612228 -1511288 -4027427 -3596850 -572042 2681970 2457952 -3328201
4033c328201q088101l881133K521558L942518k53564l875216k628620J411994
$$ -3328201 -11416302 -15297435 -12775877 -8833359 -9086923 -12962139 -15590759 -14178765
4025a4178765M250337M551092L039116J042504M50125K026956L443573J970274
$$ -14178765 -9928428 -5377336 -2338220 -1295716 -845591 1181365 4624938 6595212
4017F595212j122440k302597j442222j602988l309077l664458j684618J34352
$$ 6595212 5472772 3170175 1727953 124965 -3184112 -6848570 -8533188 -8398836
4009h398836N15737J156666K628330L022314K057530K011352L001027K023618
$$ -8398836 -7883099 -6726433 -4098103 -1075789 981741 2993093 5994120 8017738
4001H017738j400687l426919k048019k71055m84774o24147P88500Q76340k081588
$$ 8017738 6617051 3190132 1142113 871058 386284 -237863 550637 1426977 -654611
3992f54611m077487j392551K793772L411217J791354K736904N614138N047997
$$ -654611 -4732098 -6124649 -3330877 80340 1871694 4608598 10222736 15270733
3984A5270733j94407n107271n638062l050977n62902J88641j086097l286784l428111
$$ 15270733 15076326 9969055 4330993 1280016 717114 905755 -180342 -3467126 -6895237
3975f895237J93620M359263M205172P2645k936490k299902n36705J87043J059739
$$ -6895237 -6701617 -2342354 1862818 1935463 -1001027 -3300929 -3837634 -3650591 -2590852
3966b590852K623687K335983j157644m723654m644676j472186J499658K615292
$$ -2590852 32835 2368818 1211174 -3512480 -8157156 -9629342 -8129684 -5514392
3958e514392K427883J602500N04224k63983o43291j386549k288607j605122J259016
$$ -5514392 -3086509 -1484009 -979785 -1243768 -1887059 -3273608 -5562215 -7167337 -5908321
3949e908321L870109L364593P7260k947736l456118j784177K47385J138630P62785
$$ -5908321 -2038212 1326381 1403641 -1544095 -5000213 -6784390 -6537005 -5398375 -4635590
3940d635590L32976J024476K443435L116704K463821J224097k7452j366966k414589
$$ -4635590 -4302614 -3278138 -834703 2282001 4745822 5969919 5942467 4575501 2160912
3931B160912k382435j569458j148308j098476k15754J325084J588921K4695j138396
$$ 2160912 -221523 -1790981 -2939289 -4037765 -4253519 -2928435 -1339514 -1314819 -2453215
3922b453215m4531K018154K511844Q38451j718060l726291l915550j383922K814519
$$ -2453215 -2497746 -479592 2032252 2870703 1152643 -2573648 -6489198 -7873120 -5058601
3913e058601N642689N288909L196655J513385J82794j598924k819349k132297
$$ -5058601 584088 5872997 9069652 10583037 10765831 9166907 6347558 4215261
3905D215261p55859j106319k995061l718564j890312R41579K532088K007958j44388
$$ 4215261 3459402 2353083 -641978 -4360542 -6250854 -5309275 -2777187 -769229 -913617
3896i13617k386513k626929k28676K608803L177984J683561M87230L45121k46075
$$ -913617 -3300130 -5927059 -6155735 -3546932 -368948 1314613 1801843 2146964 1900889
3887A900889j879297k914056k082874l96875N48865O68558Q73167J582225K410104
$$ 1900889 21592 -2892464 -4975338 -5372213 -4823348 -4154790 -3281623 -1699398 710706
3878G10706K511811J098177j400489k866505j586239J281694K836569J928001
$$ 710706 3222517 4320694 2920205 53700 -1532539 -250845 2585724 4513725
3870D513725p0961j669544k403282j769045N03739K844499K998455J301139L33271
$$ 4513725 4442764 2773220 369938 -1399107 -895368 1949131 4947586 6248725 6581996
3861F581996Q39399Q46198l96703q94030K34666P33901p92455k010195o96325
$$ 6581996 7421395 8267593 7870890 6976860 7211526 7945427 7152972 5142777 4446452
3852D446452J387111J623480R80432J628008K277153K08925l370887m567083k959567
$$ 4446452 5833563 7457043 8437475 10065483 12342636 12551561 9180674 4613591 1654024
3843A654024k102659l551387m557650k769657L20712K039245J857854Q18440m4654
$$ 1654024 -448635 -4000022 -8557672 -11327329 -11006617 -8967372 -7109518 -6291078 -6335732
3834f335732J91035J645381K572016J290261p61092p74534O70564L19067j899678
$$ -6335732 -6144697 -4499316 -1927300 -637039 -1398131 -2172665 -1502101 -1183034 -3082712
3825c082712k186446O21098K628700J361105p8210J225868K512459K06937l389050
$$ -3082712 -5269158 -4648060 -2019360 -658255 -736465 489403 3001862 3208799 -180251
3816a80251l676661j377717p32947j828412r69475J929939K767237O58293k62043
$$ -180251 -3856912 -5234629 -5967576 -7795988 -8765463 -6835524 -4068287 -3409994 -3672037
3807c672037J866046L261672J091383j652447j391132O0247j111372m287538n622864
$$ -3672037 -1805991 1455681 2547064 894617 -496515 -436268 -1547640 -5835178 -11458042
3798a1458042l879408j248992N27442J538969J986025K015292K672487M399124
$$ -11458042 -15337450 -16586442 -16059000 -14520031 -12534006 -10518714 -7846227 -3447103
3790c447103N178818K799213j406574l607010k231841M47791J477194R2173k404192
$$ -3447103 1731715 4530928 3124354 -482656 -2714497 -2266706 -789512 -697339 -3101531
3781c101531l828449k409257J282441L925406K789147p77731l032637k585762
$$ -3101531 -6929980 -9339237 -8056796 -4131390 -1342243 -2119974 -5152611 -7738373
3773g738373j281358o29659K4448J399577K786995L453812L544676K893515R23659
$$ -7738373 -9019731 -9649390 -9624942 -8225365 -5438370 -1984558 1560118 4453633 5377292
3764E377292j505159k233857q69336K43575n57753j714345j037469P24411J084435
$$ 5377292 3872133 1638276 768940 1012515 454762 -1259583 -2297052 -1572641 -488206
3755d88206k68340j039124J54148J720214J287335j138736l185322l004064j281935
$$ -488206 -756546 -1795670 -1641522 78692 1366027 227291 -2958031 -5962095 -7244030
3746g244030N6835N43419J371786K807203L019095O89731k482589l611186k106685
$$ -7244030 -7187195 -6643776 -5271990 -2464787 554308 1244039 -1238550 -4849736 -6956421
3737f956421M73798L107362N420392N862601K965833j378186l112844j335710
$$ -6956421 -6482623 -3375261 2045131 7907732 10873565 9495379 6382535 5046825
3729E046825N29553j12902j820246k474179k562100k927442k282810K27804K449794
$$ 5046825 5576378 5463476 3643230 1169051 -1393049 -4320491 -6603301 -6375497 -3925703
3720c925703K183304O65585J42904M7987j076915j787768J85201L300633L701497
$$ -3925703 -1742399 -1076814 -933910 -885923 -1962838 -3750606 -3565405 -264772 3436725
3711C436725Q02578k317594l652251l709276k662739j15745K239965J835877l70126
$$ 3436725 4239303 1921709 -1730542 -5439818 -8102557 -8218302 -5978337 -4142460 -4512586
3702d512586o29782J737338L191033J692736m51081r16337n73028n11054K92501
$$ -4512586 -5142368 -3405030 -213997 1478739 1027658 111321 -461707 -972761 -680260
3693f80260J988631K104132m64912k797582k190447l40929l33802j869745k506003
$$ -680260 1308371 3412503 2947591 150009 -2040438 -2381367 -2715169 -4584914 -7090917
3684g090917j583946r9148J384582K125413P49018j952702k346940Q67059L599072
$$ -7090917 -8674863 -8774011 -7389429 -5264016 -4514998 -6467700 -8814640 -7947581 -4348509
3675d348509K160324p31150l59613K013323J265934k724224m445391j267666K967356
$$ -4348509 -2188185 -2919335 -3278948 -1265625 309 -2723915 -7169306 -8436972 -5469616
3666e469616M096050K613260R19904k34084o80082L04485K171947K890748J854201
$$ -5469616 -1373566 1239694 2159598 1925514 1245432 1549917 3721864 6612612 8466813
3657H466813M05620j110817l509494n374736l629526J062252L636406J555383
$$ 8466813 8872433 7761616 4252122 -1122614 -4752140 -3689888 -53482 1501901
3649A501901j470292j260408J051393K099769J687720J365217M58447k246858
$$ 1501901 31609 -1228799 -177406 1922363 3610083 4975300 5433747 3186889
3641C186889m731614l854315k91198K210632J860611M3484j696118k842831k748177
$$ 3186889 -1544725 -5399040 -5690238 -3479606 -1618995 -1575511 -3271629 -6114460 -8862637
3632h862637j253707J1344l09962o00820J469183M595656M994559J823969j640406
$$ -8862637 -10116344 -10105000 -10414962 -11015782 -9546599 -4950943 43616 1867585 227179
3623B27179k497614j088378R10669K484809K851854J592638j27995o45491m15221
$$ 227179 -2270435 -3358813 -2448144 36665 2888519 4481157 4353162 3707671 3292450
3614C292450j207962k561338k008686M36381J243896j511377m704129m127909
$$ 3292450 2084488 -476850 -2485536 -2049155 -805259 -2316636 -7020765 -11148674
3606a1148674m4025L652355M669490M273687M228076L911755J486886k727695
$$ -11148674 -11192699 -7540344 -2870854 1402833 5630909 9542664 11029550 8301855
3598H301855n236999k838767K777163N606291K074841m092728o158359k743749
$$ 8301855 3064856 226089 3003252 8609543 10684384 6591656 433297 -2310452
3590b310452J137061J339229p16910j679279j071260k39484P51183K331830L313809
$$ -2310452 -1173391 165838 -551072 -2230351 -3301611 -3541095 -2789912 -458082 2855727
3581B855727K392120O97009K89037Q74254M88484j032740j791146j074860n50215
$$ 2855727 5247847 5944856 6233893 7108147 7596631 6563891 4772745 3697885 3147670
3572C147670j583106l110913l100890j154632J090731J799018Q96675K22285J346320
$$ 3147670 1564564 -1546349 -4647239 -5801871 -4711140 -2912122 -2015447 -1793162 -446842
3563d46842L211182L032230J37794k481257j818754J050506K367433O25993j857085
$$ -446842 2764340 5796570 5934364 3453107 1634353 2684859 5052292 5678285 3821200
3554C821200k310574o50699J172103J554048L23388j614637l058759l277223k235626
$$ 3821200 1510626 859927 2032030 3586078 3909466 2294829 -763930 -4041153 -6276779
3545f276779j53887K483529M202109L149663l77095l151970k450020N29652K446701
$$ -6276779 -6430666 -3947137 254972 3404635 3027540 -124430 -2574450 -2044798 401903
3536D01903K157941J015117l96778k710359m857587m105007k51520L075952L025159
$$ 401903 2559844 3574961 3178183 467824 -4389763 -8494770 -8746290 -5670338 -2645179
3527b645179R87271l58824r80864j981983k294748j34293L324263M878098L575984
$$ -2645179 -1657908 -2016732 -2997596 -4979579 -7274327 -7408620 -4084357 793741 4369725
3518D369725J433931J93009m9013P16652K438375L420381J735464j317129k255960
$$ 4369725 5803656 5996665 5947652 6664304 9102679 12523060 14258524 12941395 10685435
3509A0685435p26540m11756l107231n301290l251093J321996L812686K948221
$$ 10685435 9958895 9547139 6439908 1138618 -2112475 -790479 3022207 5970428
3501E970428R48669r88026l397079n353155m667146j796511l3888p47304j453379
$$ 5970428 6919097 5931071 2533992 -2819163 -7486309 -9282820 -9316708 -10064012 -11517391
3492a1517391N3893K362032K904476J638404N57637J085292L168867N380399N110833
$$ -11517391 -11463498 -9101466 -6196990 -4558586 -4000949 -2915657 253210 5633609 10744442
3483A0744442Q99645m353557n308604j186294K092300l96947n439542o145328
$$ 10744442 11644087 7290530 1981926 795632 2887932 2490985 -2948557 -9093885
3475i093885j688580K148226J658383m94841o50003O11977Q47430J15685J74978
$$ -9093885 -10782465 -8634239 -6975856 -7470697 -8120700 -7508723 -6661293 -6545608 -6370630
3466f370630J237466J999254J752137N78938j467691l641010m036463j793371
$$ -6370630 -5133164 -3133910 -1381773 -802835 -2270526 -5911536 -9947999 -11741370
3458a1741370R72002J448187L7278n3146K568631N094370L850345r50845n131829
$$ -11741370 -10769368 -9321181 -9283903 -9337049 -6768418 -1674048 2176297 1225452 -3906377
3449c906377n213745k094542N97784J112747J082752K200025L174262J597569
$$ -3906377 -9120122 -11214664 -10616880 -9504133 -8421381 -6221356 -3047094 -1449525
3441a449525k125284m803183m325066j569663J761443N064894P610432P355085
$$ -1449525 -3574809 -8377992 -12703058 -14272721 -12511278 -7446384 164048 7519133
3433G519133K996671l355180p256100o105803j692857J677747J514649n27002
$$ 7519133 10515804 7160624 -95476 -6201279 -7894136 -6216389 -4701740 -5228742
3425e228742r58221J030945K578697J339112r84791j159934Q00537K078439J640656
$$ -5228742 -6186963 -5156018 -2577321 -1238209 -2223000 -3382934 -2582397 -503958 1136698
3416A136698J149513J131204j86723l019403m393138k437120M56899J178958K91660
$$ 1136698 2286211 3417415 3230692 211289 -4181849 -6618969 -6162070 -4983112 -4691452
3407d691452K39336J161776J480321J199642J472029J746005M76192j642302k067923
$$ -4691452 -4452116 -3290340 -1810019 -610377 861652 2607657 3083849 1441547 -626376
3398f26376k06371J664469J630057K67984p87585o93013L58685J221217L13604
$$ -626376 -832747 831722 2461779 2729763 1942178 1249165 1607850 2829067 3142671
3389C142671k244420l441968o23832M085876N268828R70380m350139n079070r85940
$$ 3142671 898251 -2543717 -3167549 918327 6187155 7157535 2807396 -2271674 -3257614
3380c257614L198246L712853J384093o38665j105910j438122k628165k992743
$$ -3257614 -59368 3653485 5037578 4398913 3293003 1854881 -773284 -3766027
3372c766027m52460L571351M854684J764113k148792k629207j73314J226948k44294
$$ -3766027 -4218487 -647136 4207548 5971661 3822869 1193662 1020348 2247296 2003002
3363B003002k397773k712507j445673m59924n42802p00819M86995K997930M702366
$$ 2003002 -394771 -3107278 -4552951 -5012875 -5555677 -6256496 -5769501 -2771571 1930795
3354A930795L347967l47480k922398k387454n65892J11321J38120J105509K207362
$$ 1930795 5278762 4931282 2008884 -378570 -944462 -833141 -695021 410488 2617850
3345B617850J495137n41119j623743j138844j13041J408260L873503N793309N075182
$$ 2617850 4112987 3571868 1948125 809281 696240 2104500 5978003 11771312 16846494
3336A6846494K397155P6922j838811m752347p278259o098722j418166K503475
$$ 16846494 19243649 19320571 17481760 12729413 5451154 -647568 -2065734 437741
3328D37741L028028J661745L74655o48844r68668J30052P66148j863654n847311
$$ 437741 3465769 5127514 5502169 4853325 3884657 4014709 4780857 2917203 -2930108
3319b930108n671281p07650K828358J028502k050344j425974J363173K383285
$$ -2930108 -8601389 -9309039 -6480681 -5452179 -7502523 -8928497 -7565324 -5182039
3311e182039K177461L129102L750786J455856j764066k261097j139318j899250
$$ -5182039 -3004578 124524 3875310 5331166 3567100 1306003 166685 -1732565
3303a732565l478365j909246J977675K934764l15896k986914j705206J033483
$$ -1732565 -5210930 -7120176 -5142501 -2207737 -2523633 -5510547 -7215753 -6182270
3295f182270J605014K17447p98259l86954J204093L216076M058907K482504k74349
$$ -6182270 -4577256 -4359809 -5158068 -5545022 -4340929 -1124853 2934054 5416558 5142209
3286E142209j654919j226426o51457n56600k19941l588q95268j827024q84572
$$ 5142209 3487290 2260864 1609407 1052807 832866 829278 -65990 -1893014 -2777586
3277b777586Q22571J25076l056179n049778l414372O07504M655605O831474N103544
$$ -2777586 -1955015 -1829939 -4886118 -9935896 -13350268 -12742764 -8087159 -1255685 3847859
3268C847859n29660n332911m213075P70864K610522j86749j557804J840295N101332
$$ 3847859 3318199 -2014712 -6227787 -5456923 -2846401 -3033150 -4590954 -2750659 2350673
3259B350673L413332l85964j562496j362527l139561m904704k526860K331116
$$ 2350673 5764005 5378041 3815545 2453018 -686543 -5591247 -8118107 -5786991
3251e786991M177084K119126J70892P1206j69238q68692J62469K432247K281121
$$ -5786991 -1609907 509219 680111 751317 582079 -286613 -124144 2308103 4589224
3242D589224j005492l346035j885190J111930K157917R03012j030949k437068
$$ 4589224 3583732 237697 -1647493 -535563 1622354 2525366 1494417 -942651
3234i42651k230992K27160L040967K915173j96365k557873k170893j416586k207150
$$ -942651 -3173643 -2946483 94484 3009657 2813292 255419 -1915474 -3332060 -5539210
3225e539210k181403J039803M730788M251090j84181l805242l744355j722573
$$ -5539210 -7720613 -6680810 -1950022 2301068 2116887 -1688355 -5432710 -7155283
3217g155283l16426L01329J188600K533453L631036L578585J729881j241938k939107
$$ -7155283 -7471709 -7170380 -5981780 -3448327 182709 3761294 5491175 4249237 1310130
3208A310130j640055R58983J388635r89869l137147k640990o38030O37405J033604
$$ 1310130 -329925 629058 2017693 1027824 -2109323 -4750313 -5388343 -4750938 -3717334
3199c717334J449928J395279o0623j817381j651225N57878K547268K724412J664407
$$ -3717334 -2267406 -872127 -932750 -2750131 -4401356 -3843478 -1296210 1428202 3092609
3190C092609L76479r54420j916018j519970o450O50867n39473j701117n95198
$$ 3092609 3469088 2514668 598650 -921320 -927770 -276903 -816376 -2517493 -3112691
3181c112691J971296L145783J935052J46048n63242o65174j243263k044108k025529
$$ -3112691 -1141395 2004388 3939440 4085488 3522246 2857072 1613809 -430299 -2455828
3172b455828r59124M15380J369796J644415J220284K58788o83827p59778M64329
$$ -2455828 -3414952 -2999572 -1629776 14639 1234923 1493711 809884 50106 514435
3163E14435K224103K851943J557949k01549k26278J312276J674900o85219l612349
$$ 514435 2738538 5590481 7148430 6946881 6720603 8032879 9707779 9022560 5410211
3154E410211l969164j755850L23439P13989M22922P80444J653011K073061J309773
$$ 5410211 1441047 -314803 8636 722625 1145547 1925991 3579002 5652063 6961836
3145F961836o35399k498724k334280q7161J302741n87785l855238m533753k164856
$$ 6961836 6326437 3827713 1493433 1406272 2709013 2121228 -1734010 -6267763 -8432619
3136h432619j26158m09225j251354n69014J230055K747383L223140J941920j192235
$$ -8432619 -8558777 -8968002 -10219356 -10788370 -9558315 -6810932 -3587792 -1645872 -2838107
3127b838107l863351l297328p10514j10009j686142r37055L638502O939184M786317
$$ -2838107 -6701458 -9998786 -10709300 -10819309 -12505451 -13442506 -9804004 -2864820 1921497
3118A921497N19877m75817R89193O13593j340651r69675J699863K407646l6853
$$ 1921497 2441374 1965557 2954750 3568343 2227692 1258017 2957880 5365526 5328673
3109E328673j921354j087620j67578j684704m047483m426764k561314k3580J872783
$$ 5328673 3407319 2319699 2152121 467417 -3580066 -8006830 -10568144 -10591724 -8718941
3100h718941K289274J202044K06204Q34432J956464J338328m82028j053366n38874
$$ -8718941 -6429667 -5227623 -5021419 -4186987 -2230523 -892195 -1374223 -2427589 -2966463
3091b966463j508247l879133m339839j872276M10087M97382L18918J337705J641682
$$ -2966463 -4474710 -8353843 -12693682 -14565958 -14155871 -13658489 -13339571 -12001866 -10360184
3082a0360184K11003l5652K898767N633211M009684m07960k753852j921180q23735
$$ -10360184 -10149181 -10184833 -7286066 -1652855 2356829 1948869 -804983 -2726163 -3549898
3073c549898p64709q4K182598L827178L382308J600381j34448j160123j064064
$$ -3549898 -4314607 -4314691 -2132093 1695085 5077393 6677774 6543326 5383203 4319139
3064D319139O4252Q51436k719j715016k526944k299308j920979q50075J917947
$$ 4319139 4383391 5234827 5232108 3517092 990148 -1309160 -3230139 -4080214 -2162267
3055b162267M589030L574004j293835n417315n002715j802978k40974j334531
$$ -2162267 2426763 6000767 4706932 -710383 -5713098 -7516076 -7757050 -9091581
3047i091581k016032n8378K870165L911688K942740K085441K146830J744127K33449
$$ -9091581 -11107613 -11165991 -8295826 -4384138 -1441398 644043 2790873 4535000 4768449
3038D768449q30161n24588o76091k694281m033070j382449L387997M785547J616218
$$ 4768449 3938288 3413700 2737609 43328 -3989742 -5372191 -1984194 2801353 4417571
3029D417571j234957n13814O26599j484434m693111m869101k771333j920832j782924
$$ 4417571 3182614 2668800 3295399 1810965 -2882146 -7751247 -10522580 -12443412 -14226336
3020a4226336J207896O480675Q767006N462731j7435l400470m171812l782709
$$ -14226336 -13018440 -6537765 2229241 7691972 7674537 4274067 102255 -3680454
3012c680454k867145j887820j606507j402285L26033K991420L848798K323933
$$ -3680454 -6547599 -8435419 -10041926 -11444211 -11118178 -8126758 -4277960 -1954027
3004a954027J230520K102585K459760k4998l349763l910282j479779J178404K270304
$$ -1954027 -723507 1379078 3838838 3813840 464077 -3446205 -4925984 -3747580 -1477276
2995a477276K096623J275861J48672n99202m81047M9584N01563J108789J737799
$$ -1477276 619347 1895208 2043880 1444678 963631 1013215 1514778 2623567 4361366
2986D361366J376662q2108j044493o56481n03378k099468m066645l845109j215448
$$ 4361366 5738028 5655920 4611427 3954946 3451568 1352100 -2714545 -6559654 -7775102
2977g775102J788010L580267L820574K439506j37813k399241l090079k555715
$$ -7775102 -5987092 -2406825 1413749 3853255 3715442 1316201 -1773878 -4329593
2969d329593j434417P13429L676406M991884K660686j451751l587616k862953
$$ -4329593 -5764010 -5050581 -1374175 3617709 6278395 4826644 1239028 -1623925
2961a623925j458152p20487j32499J40914q62418k028038n99100L339312N820038
$$ -1623925 -3082077 -3802564 -3935063 -3794149 -4656567 -6684605 -7283705 -3944393 1875645
2952A875645M056527O0409k502883k814620k328243j711267p44582l6349n26221
$$ 1875645 5932172 5992581 3489698 675078 -1653165 -3364432 -4109014 -4145363 -4671584
2943d671584j758109k306002j582673j39222J222332J775008J251606P32430J821573
$$ -4671584 -6429693 -8735695 -10318368 -10457590 -9235258 -7460250 -6208644 -5476214 -3654641
2934c654641L911750M016604R76463j985171j352149J407956J689205j725228
$$ -3654641 257109 4273713 5250176 3265005 1912856 3320812 5010017 3284789
2926C284789n189281n436518l226483r36825O59164J775350K065924J446709Q41372
$$ 3284789 -1904492 -7341010 -10567493 -11504318 -10845154 -9069804 -7003880 -5557171 -4715799
2917d715799O09492k35558j833810k300289n89824J225815R65665J05727J440389
$$ -4715799 -4106307 -4341865 -6175675 -8475964 -9065788 -7839973 -6874308 -6768581 -5328192
2908e328192L914296L567306j49649k899247j710254Q07854Q92563o73392o27177
$$ -5328192 -1413896 2153410 2003761 -895486 -2605740 -1797886 -905323 -1578715 -2205892
2899b205892R86023J104560q73498j936764m66532J109714K62709j762121k061968
$$ -2205892 -1219869 -115309 -988807 -2925571 -3392103 -2282389 -2019680 -3781801 -5843769
2890e843769j32494K271554L817062M016333K298316q69679k796200j251835J880470
$$ -5843769 -5976263 -3704709 112353 4128686 6427002 5557323 2761123 1509288 3389758
2881C389758K424699k84809k269580o65468K091084J863576j391987m023012l770012
$$ 3389758 5814457 5529648 3260068 2594600 4685684 6549260 5157273 1134261 -2635751
2872b635751j727707M24173K287269L252863J828027j845954m574287l428981
$$ -2635751 -4363458 -3939285 -1652016 1600847 3428874 1582920 -2991367 -6420348
2864f420348K05667K007697J32821k664824k893086n89140J482396J678727Q34851
$$ -6420348 -6214681 -4206984 -4074163 -6738987 -9632073 -10221213 -8738817 -7060090 -6225239
2855f225239K55014J87862O17673J958622L968006M999592L628773O90855j385942
$$ -6225239 -5970225 -5782363 -5164690 -3206068 761938 5761530 9390303 10081158 8695216
2846H695216j313614k18900m6613j306848k701591k719312j393705l84438j073116
$$ 8695216 7381602 7162702 7116089 5809241 3107650 388338 -1005367 -1389805 -2462921
2837b462921k708227l214013k049956j078005j693610k336844o20469K743039
$$ -2462921 -5171148 -8385161 -10435117 -11513122 -13206732 -15543576 -16164045 -13421006
2829a3421006M389379K802970J62986r67561o50668j05652P04244K157889L178732
$$ -13421006 -9031627 -6228657 -6065671 -7033232 -7683900 -7789552 -7085308 -4927419 -1748687
2820a748687K549696J089984L63572l3698j485109l093955k272771R85855L190806
$$ -1748687 801009 1890993 2254565 2220867 735758 -2358197 -4630968 -3645113 -454307
2811d54307J948171p28920j317189P03097K995096L709039K769932P81169j262695
$$ -454307 1493864 764944 -552245 150852 3145948 6854987 9624919 10406088 9143393
2802I143393j608717P67269M086580M967447K313086j311032k864343k295833
$$ 9143393 7534676 8301945 12388525 17355972 19669058 18358026 15493683 13197850
2794A3197850j885835k805438l550306k122779Q40584K074528n35694m667332
$$ 13197850 11312015 8506577 4956271 2833492 3674076 5748604 5212910 545578
2786E45578n507921j499395L342991M121794Q17310k497984l200782k208294p55248
$$ 545578 -4962343 -6461738 -3118747 1003047 1820357 -677627 -3878409 -6086703 -6841951
2777f841951J624366M647941N687425K986403j254810l412369k882172j657015
$$ -6841951 -5217585 -569644 5117781 8104184 6849374 3437005 554833 -1102182
2769a102182n91040R86390K397724J668316r65800k568767j680581l19111k84172
$$ -1102182 -1693222 -706832 1690892 3359208 2393408 -175359 -1855940 -2175051 -2459223
2760b459223j36253J766287L461026J892240j900304l593890j524574J396041
$$ -2459223 -2595476 -829189 2631837 4524077 2623773 -970117 -2494691 -1098650
2752a098650K290205J774979J476408Q53359j195932l333407l057561l67529K110359
$$ -1098650 1191555 2966534 4442942 5296301 4100369 766962 -2290599 -2658128 -547769
2743e47769K608826J952643J555143J381032O77682m18913j034541q52872m24079
$$ -547769 2061057 4013700 5568843 6949875 7627557 7208644 6174103 5321231 4897152
2734D897152k22002k6104M42263O62232j54757j527865j684216M9870J702208
$$ 4897152 4675150 4649046 5091309 5753541 5598784 4070919 2386703 2436573 4138781
2725D138781J062415q78283j092209P80416J610115k87348k266556j568266J10268
$$ 4138781 5201196 4322913 3230704 4011120 5621235 5333887 3067331 1499065 1609333
2716A609333n72782k973955l468667j353344K69342k45440p86097M72974K121937
$$ 1609333 1036551 -1937404 -5406071 -6759415 -6490073 -6735513 -7521610 -7048636 -4926699
2707d926699K215923J147745J36562p43668j406664r27954N08326J104425M28057
$$ -4926699 -2710776 -1563031 -1426469 -2170137 -3576801 -4504755 -3996429 -2892004 -2463947
2698b463947L58445J386677J059228j438250k440073Q20961M739544L840517r14384
$$ -2463947 -2105502 -718825 340403 -1097847 -3537920 -2716959 2022585 5863102 4948718
2689D948718l335820j028334J771977J017586j989802l802745l537046k347804
$$ 4948718 1612898 584564 2356541 3374127 1384325 -2418420 -5955466 -8303270
2681h303270q85287O09650J323890O25121j072815k759291l188624j140252K944211
$$ -8303270 -9188557 -8578907 -7255017 -6629896 -7702711 -10462002 -13650626 -14790878 -11846667
2672a1846667O014131N342414K119171k39257p69573r81886r21075P46776K674886
$$ -11846667 -5832536 -490122 1629049 1389792 620219 -361667 -1282742 -535966 2138920
2663B138920J486929k437754m371046k146618P67667J242238Q94405J619996J463286
$$ 2138920 3625849 1188095 -3182951 -5329569 -4561902 -3319664 -2425259 -805263 658023
2654F58023r26373j926061J715156O200299N152776r10865n228535m245353j087770
$$ 658023 -268350 -2194411 -479255 5721044 10873820 9962955 4734420 489067 -598703
2645e98703N40402R16651J607705K240454J612665n37332l752488o740982p032505
$$ -598703 -58301 858350 2466055 4706509 6319174 5781842 2029354 -4711628 -11744133
2636a1744133l336279J717579L892666K541562Q89505J165593K340748K925558
$$ -11744133 -15080412 -13362833 -9470167 -6928605 -6039100 -4873507 -2532759 392799
2628C92799L025483K916838K115980O12940r22483k339452l521744l235093r38451
$$ 392799 3418282 6335120 8451100 9064040 8141557 5802105 2280361 -954732 -1893183
2619a893183R61075k20600l027490l626262j641173k26465k93777P87203L878841
$$ -1893183 -932108 -1152708 -4180198 -7806460 -9447633 -9674098 -9967875 -9180672 -5301831
2610e301831O032255N334045L602281K393357M33657k682946m183848k348388
$$ -5301831 730424 6064469 9666750 12060107 12493764 9810818 5626970 3278582
2602C278582K47072N27994r43776k157813k915877l289492k031518N27899J206659
$$ 3278582 3525654 4053648 3109872 952059 -1963818 -5253310 -7284828 -6756929 -5550270
2593e550270j105160k402783P63294N478291O561376L942403J294649n93464l775846
$$ -5550270 -6655430 -9058213 -8294919 -2816628 3744748 7687151 8981800 8388336 4612490
2584D612490p471256p783091l524698J856651M835032N024237L595061J602773
$$ 4612490 -2858766 -10641857 -14166555 -12309904 -7474872 -2450635 1144426 2747199
2576B747199K40401J22912J77355o63197j365797p24606l8280q33891j414811
$$ 2747199 2987600 3110512 3287867 2624670 1258873 534267 495987 -337904 -1752715
2567a752715N09490K994041K141690j424346l142973j506498L85499N94321N96823
$$ -1752715 -1243225 1750816 3892506 2468160 -674813 -2181311 -1795812 -1201491 -604668
2558f04668R03293l33556k708033k683689L92852K256335M83664j398756p722
$$ -604668 298625 -34931 -2742964 -5426653 -5033801 -2777466 -2293802 -3692558 -3700280
2549c700280K079845Q61677k332933l340210j738050j70674Q51757K618361M052373
$$ -3700280 -1620435 -758758 -3091691 -6431901 -8169951 -8340625 -7488868 -4870507 -818134
2540h18134K799935l2123q30380P50329J218253r89634l101640k480466j79731
$$ -818134 1981801 1949678 1119298 1869627 3087880 2098246 -1003394 -3483860 -3663591
2531c663591J321200J242727J01982j442864k159127q68694J278283J276683j638353
$$ -3663591 -2342391 -1099664 -997682 -2440546 -4599673 -5468367 -4190084 -2913401 -4551754
2522d551754m341447l792527q90002J368744J988508K135112K280319J585798
$$ -4551754 -8893201 -12685728 -13575730 -12206986 -10218478 -8083366 -5803047 -4217249
2514d217249k8809j227217j066128n0346J071346K369374L883936M548960K972281
$$ -4217249 -4246058 -5473275 -6539403 -6589749 -5518403 -3149029 734907 5283867 8256148
2505H256148p24097m394962n535409l598511o91478L29912j156810k647462j230722
$$ 8256148 7532051 3137089 -2398320 -5996831 -6688309 -6358397 -7515207 -10162669 -11393391
2496a1393391K758053N668239M659720J121259j056773j90096J588862J519262
$$ -11393391 -8635338 -2967099 1692621 2813880 1757107 1567011 3155873 4675135
2488D675135m69597k334201k597985j412559J97447J068627N85482l45669J31440
$$ 4675135 4205538 1871337 -726648 -2139207 -1941760 -873133 -287651 -633320 -501880
2479e01880K075866K699327q5440m030832n002034k640388n88991q04867j064189
$$ -501880 1573986 4273313 4187873 157041 -4844993 -7485381 -8074372 -8879239 -9943428
2470i943428N06511J815234M00659j927052j581709J018286J944955j49580k055387
$$ -9943428 -9436917 -7621683 -7221024 -9148076 -10729785 -9711499 -7766544 -7916124 -9971511
2461i971511j014895J338669J802176K33211q11006j4562J174353Q73949p84607
$$ -9971511 -10986406 -9647737 -7845561 -7612350 -8423356 -8437918 -7263565 -6389616 -7174223
2452g174223j905772r44673J594409L461341K949377R72035J74046J595055L120278
$$ -7174223 -9079995 -10024668 -8430259 -4968918 -2019541 -1047506 -873460 721595 3841873
2443C841873K187553o59713k345302j257823Q81762J624886Q08317p6985l52763
$$ 3841873 6029426 5369713 3024411 1766588 2648350 4273236 5081553 5004568 4651805
2434D651805m28063k42034P27922J876492J663205o8433j469020j132909J62398
$$ 4651805 4223742 3981708 4709630 6586122 8249327 8180894 6711874 5578965 5741363
2425E741363J006837J273514J366349Q76227n35359j926782k288217k112454k267187
$$ 5741363 6748200 8021714 9388063 10264290 9728931 7802149 5513932 3401478 1134291
2416A134291k265910j349206k41221J78538Q51250K681458L734568J542911k244480
$$ 1134291 -1131619 -2480825 -2722046 -2543508 -1692258 989200 4723768 6266679 4022199
2407D022199l286884r90014M46131j357850l263201j786299J452675K433369L50180
$$ 4022199 735315 -254699 191432 -1166418 -4429619 -6215918 -4763243 -2329874 -1979694
2398a979694k486151m265580m200702j451965L034638N206405K218939k820098
$$ -1979694 -4465845 -8731425 -12932127 -14384092 -11349454 -6143049 -3924110 -6744208
2390f744208m151954q82581K580815L296128K697089K237558P57674j866456k488460
$$ -6744208 -10896162 -11778743 -9197928 -5901800 -3204711 -967153 -209479 -2075935 -4564395
2381d564395Q13391M816880N123606K252712L79502J048720J652182P4118k440032
$$ -4564395 -3751004 1065876 6189482 8442194 8821696 9870416 11522598 11596716 9156684
2372I156684l854535m034169l502102j797994R40676K410696P30575k065270j892110
$$ 9156684 5302149 1267980 -2234122 -4032116 -3091440 -680744 49831 -2015439 -3907549
2363c907549J640057L985852J586033l099221m760245k182845P42650P30975j017327
$$ -3907549 -2267492 1718360 3304393 205172 -4555073 -6737918 -5995268 -5264293 -6281620
2354f281620j526628l31053O27504J39332q58012o28161J483085M213579N187477
$$ -6281620 -7808248 -8139301 -7511797 -7372465 -8230477 -8858638 -7375553 -3161974 2025503
2345B025503L328424N82517k3888J680714K662588R10593j876650l068976k780012
$$ 2025503 5353927 5936444 5912556 7593270 10255858 11166451 9289801 6220825 3440813
2336C440813k919227l794421l722071j613510J548492L630973L043677K85450
$$ 3440813 521586 -3272835 -6994906 -8608416 -7059924 -3428951 -385274 -99824
2328i9824j697963k00322L362002M233035M02770m272257n108010k587535n40256
$$ -99824 -1797787 -1998109 1363893 5596928 5999698 1727441 -3380569 -5968104 -6508360
2319f508360k46118P7458J041930J269231O60053Q86170K214138K894970K108477
$$ -6508360 -6754478 -6677020 -5635090 -4365859 -3705806 -2819636 -605498 2289472 4397949
2310D397949O59512j403097m589454o987742n225715K39337M198854L033202p67299
$$ 4397949 5057461 3654364 -935090 -7922832 -13148547 -12909210 -8710356 -5677154 -6444453
2301f444453k441834q60271J617487L030682L080728K022343O56132M36354J662072
$$ -6444453 -8886287 -9746558 -8129071 -5098389 -2017661 4682 660814 1097168 2759240
2292B759240K473979J289510q24425j853938j737482j669239j577002n73177O50588
$$ 2759240 5233219 6522729 5698304 3844366 2106884 437645 -1139357 -1712534 -1061946
2283a061946L29412j302146j648031O56497L382568L307321M45124j853849j272756
$$ -1061946 -732534 -2034680 -3682711 -3026214 356354 3663675 4108799 2254950 982194
2274I82194M01734p5863k426340k881636J06425K828606J314077k596689l687838
$$ 982194 1383928 1308065 -1118275 -3999911 -3893486 -1064880 249197 -2347492 -6035330
$$ [...]
##END NTUPLES=NMR SPECTRUM
##END=
