##TITLE=31Pdec_DE-43EA_D2O
 D2O, 64 sc
 12.7.2024
##JCAMPDX= 6.0         $$ Bruker NMR JCAMP-DX V2.0
##DATA TYPE= NMR SPECTRUM
##DATA CLASS= NTUPLES
##ORIGIN= UXNMR, Bruker Analytische Messtechnik GmbH
##OWNER= root
$$ XWIN-NMR		Version 3.5
$$ Fri Jul 12 14:00:02 2024 Russian Standard Time (UT+4h)  she@DPX200
##.OBSERVE FREQUENCY= 81.013821
##.OBSERVE NUCLEUS= ^31P
##.ACQUISITION MODE= SIMULTANEOUS
##.ACQUISITION SCHEME= undefined
##.AVERAGES= 64
##.DIGITISER RES= 17
##SPECTROMETER/DATA SYSTEM= spect
##.PULSE SEQUENCE= zgpg30
##.SOLVENT NAME= CDCl3
##.SHIFT REFERENCE= (INTERNAL, CDCl3, 0, 198.062)
##AUDIT TRAIL= $$ (NUMBER, WHEN, WHO, WHERE, WHAT)
$$ ##TITLE= Audit trail, XWIN-NMR		Version 3.5
$$ ##JCAMPDX= 5.01
$$ ##ORIGIN= Bruker BioSpin GmbH
$$ ##OWNER= she
$$ F:/spectra/data/she/nmr/P31/2/pdata/1/auditp.txt
$$ ##AUDIT TRAIL=  $$ (NUMBER, WHEN, WHO, WHERE, WHAT)
(   1,<2024-07-12 13:59:05.04 +0400>,<she>,<DPX200>,
      <created by zg, POWCHK disabled, PULCHK disabled
       configuration hash MD5:
       00 E9 B6 7A A2 85 ED C7 34 08 36 98 17 FE 4E 26
       data hash MD5: 32K
       24 F1 60 59 46 3A 9D 37 30 A0 04 CB 19 80 15 8E>)
(   2,<2024-07-12 13:59:07.42 +0400>,<she>,<DPX200>,
      <Start of raw data processing
       efp BC_mod = 2 LB = 1.5 FT_mod = 6 PKNL = 1 PHC0 = 2707.28 PHC1 = 208.287 SI = 64K 
       data hash MD5: 64K
       17 03 9D 8A E1 92 27 3F B3 A9 BA 95 DB BF 57 8D>)
(   3,<2024-07-12 13:59:21.73 +0400>,<she>,<DPX200>,
      <pk PHC0 = -114.9535 PHC1 = 0 
       data hash MD5: 64K
       58 18 6C D7 E1 27 DB DF D7 08 2C 94 BD E5 DD 18>)
(   4,<2024-07-12 13:59:24.92 +0400>,<she>,<DPX200>,
      <abs ABSG = 5 
       data hash MD5: 64K
       46 C3 CD F1 14 5B 5B 79 E2 F8 10 C1 AC 5F CB 28>)
$$ ##END=
$$ 
$$ hash MD5
$$ E9 AA 16 76 B7 4B F7 E1 30 E6 CA AE 14 92 6A AC
##$RELAX= 
##$RELAX= 
##$RELAX= 
##$RELAX= 
##$RELAX= 
##$RELAX= 
##$RELAX= 
##$RELAX= 
$$ Bruker specific parameters
$$ --------------------------
##$DU= <F:/spectra>
##$EXPNO= 2
##$NAME= <P31>
##$PROCNO= 1
##$TYPE= <nmr>
##$USER= <she>
##$AMP= (0..31)
100 100 100 100 100 100 100 100 100 100 100 100 100 100 100 100 100 100 
100 100 100 100 100 100 100 100 100 100 100 100 100 100 
##$AQSEQ= 0
##$AQ_mod= 1
##$AUNM= <au_zg>
##$AUTOPOS= <>
##$BF1= 81.014009
##$BF2= 200.13
##$BF3= 200.13
##$BF4= 200.13
##$BF5= 200.13
##$BF6= 200.13
##$BF7= 200.13
##$BF8= 200.13
##$BYTORDA= 1
##$CFDGTYP= 0
##$CFRGTYP= 5
##$CHEMSTR= <none>
##$CNST= (0..31)
1 1 145 1 1 1 1 1 1 1 1 1 1 1 1 1 1 1 1 1 1 1 1 1 1 1 1 1 1 1 1 1 
##$CPDPRG= <waltz16>
##$CPDPRG1= <>
##$CPDPRG2= <waltz16>
##$CPDPRG3= <>
##$CPDPRG4= <mlev>
##$CPDPRG5= <mlev>
##$CPDPRG6= <mlev>
##$CPDPRG7= <mlev>
##$CPDPRG8= <mlev>
##$CPDPRGB= <>
##$CPDPRGT= <>
##$D= (0..31)
0 1 0 0 0 0 0 0 0 0.06 0 0.03 2e-05 3e-06 0 0 0.0002 0 0 0 0 0 0 0 0 0 
0 0 0 0 0 0 
##$DATE= 1720778344
##$DBL= (0..7)
120 120 120 11 120 120 24 19 
##$DBP= (0..7)
150 150 150 150 150 150 150 150 
##$DBP07= 0
##$DBPNAM0= <>
##$DBPNAM1= <>
$$ [...]
##$SUBNAM3= <"">
##$SUBNAM4= <"">
##$SUBNAM5= <"">
##$SUBNAM6= <"">
##$SUBNAM7= <"">
##$SUBNAM8= <"">
##$SUBNAM9= <"">
##$SW= 400.765351723535
##$SWIBOX= (0..15)
0 1 3 0 0 0 0 0 0 0 0 0 0 0 0 0 
##$SW_h= 32467.5324675325
##$TD= 32768
##$TD0= 1
##$TE= 0
##$TE2= 300
##$TE3= 300
##$TEG= 300
##$TL= (0..7)
0 120 53 12 22 120 120 120 
##$TP= (0..7)
150 150 150 150 150 150 150 150 
##$TP07= 0
##$TPNAME0= <>
##$TPNAME1= <>
##$TPNAME2= <>
##$TPNAME3= <>
##$TPNAME4= <>
##$TPNAME5= <>
##$TPNAME6= <>
##$TPNAME7= <>
##$TPOAL= (0..7)
0.5 0.5 0.5 0.5 0.5 0.5 0.5 0.5 
##$TPOFFS= (0..7)
0 0 0 0 0 0 0 0 
##$TUNHIN= 0
##$TUNHOUT= 0
##$TUNXOUT= 0
##$USERA1= <user>
##$USERA2= <user>
##$USERA3= <user>
##$USERA4= <user>
##$USERA5= <user>
##$V9= 5
##$VALIST= <valist>
##$VCLIST= <CCCCCCCCCCCCCCC>
##$VD= 0
##$VDLIST= <DDDDDDDDDDDDDDD>
##$VPLIST= <PPPPPPPPPPPPPPP>
##$VTLIST= <TTTTTTTTTTTTTTT>
##$WBST= 1024
##$WBSW= 4
##$XGAIN= (0..3)
0 0 0 0 
##$XL= 0
##$YL= 0
##$YMAX_a= 4574
##$YMIN_a= -19266
##$ZGOPTNS= <>
##$ZL1= 120
##$ZL2= 120
##$ZL3= 120
##$ZL4= 120
##$ABSF1= 198.0616
##$ABSF2= -202.7028
##$ABSG= 5
##$ABSL= 3
##$ALPHA= 0
##$AQORDER= 0
##$ASSFAC= 0
##$ASSFACI= 0
##$ASSFACX= 0
##$ASSWID= 0
##$AUNMP= <proc_1d>
##$AZFE= 0.1
##$AZFW= 0.5
##$BCFW= 0
##$BC_mod= 2
##$BYTORDP= 0
##$COROFFS= 0
##$CY= -3
##$DATMOD= 1
##$DC= 0
##$DFILT= <>
##$DTYPP= 0
##$F1P= 0
##$F2P= 0
##$FCOR= 1
##$FTSIZE= 65536
##$FT_mod= 6
##$GAMMA= 0
##$GB= 0
##$INTBC= 1
##$INTSCL= 9.790993e-09
##$ISEN= 30
##$LB= 1.5
##$LEV0= 0
##$LPBIN= 0
##$MAXI= 10000
##$MC2= 0
##$MEAN= 0
##$ME_mod= 0
##$MI= 50
##$NCOEF= 0
##$NC_proc= -8
##$NLEV= 6
##$NOISF1= 182.463
##$NOISF2= 159.3651
##$NSP= 0
##$NTH_PI= 0
##$NZP= 0
##$OFFSET= 198.0616
##$PC= 4
##$PHC0= 2592.326
##$PHC1= 208.287
##$PH_mod= 1
##$PKNL= yes
##$PPARMOD= 0
##$PSCAL= 0
##$PSIGN= 0
##$REVERSE= no
##$SF= 81.0140089999434
##$SI= 65536
##$SIGF1= 159.3651
##$SIGF2= -187.1042
##$SINO= 113.3802
##$SIOLD= 16384
##$SREGLST= <1H.CDCl3>
##$SSB= 0
##$STSI= 65536
##$STSR= 0
##$SW_p= 32467.5324675325
##$SYMM= 0
##$S_DEV= 0
##$TDeff= 32768
##$TDoff= 0
##$TI= <>
##$TILT= no
##$TM1= 0
##$TM2= 0
##$TOPLEV= 0
##$USERP1= <user>
##$USERP2= <user>
##$USERP3= <user>
##$USERP4= <user>
##$USERP5= <user>
##$WDW= 1
##$XDIM= 65536
##$YMAX_p= 310504958
##$YMIN_p= -29200640
$$ End of Bruker specific parameters
$$ ---------------------------------
##NTUPLES= NMR SPECTRUM
##VAR_NAME=  FREQUENCY,     SPECTRUM/REAL,   SPECTRUM/IMAG
##SYMBOL=    X,             R,               I
##VAR_TYPE=  INDEPENDENT,   DEPENDENT,       DEPENDENT
##VAR_FORM=  AFFN,          ASDF,            ASDF
##VAR_DIM=   65536,         65536,           65536
##UNITS=     HZ,            ARBITRARY UNITS, ARBITRARY UNITS
##FACTOR=    0.49542278885378, 1,            1
##FIRST=     16045.7642231865, 0,            0
##LAST=      -16421.768244346, 0,            0
##MIN=       -16421.768244346, -29200640,    0
##MAX=       16045.7642231865, 310504958,    0
$$ Real data points
##PAGE= N=1
##DATA TABLE= (X++(R..R)), XYDATA
$$ [...]
45250 -6906722 -4121947 -1758652 -1205331 -1813761 -2033442 -996663 716152 1727584 1394407
45241 1394407 325296 -934447 -2880014 -5797804 -8429628 -9357663 -9114821 -9189361 -9395503
45232 -9395503 -8332416 -6287287 -5216064 -5467697 -5104183 -3381862 -2347719 -3475261
45224 -3475261 -4992912 -4505402 -2438666 -762414 180381 1254951 2148438 1945589 1463889
45215 1463889 2485918 4624085 5088143 2137558 -2543283 -5365219 -4125033 50522
45207 50522 3575830 3837702 2150875 2122115 4640627 6580463 5749384 4599506 6492504
45198 6492504 10327310 12146064 10682322 7705421 3825602 -1812911 -7621504 -9628967
45190 -9628967 -6614483 -1794131 1730600 3957590 5306323 4645678 2104397 726850
45182 726850 2668250 5894408 6971210 5293086 2649203 677760 658599 3400913 6950169
45173 6950169 6860811 1717788 -3744967 -4341714 -1371393 -144153 -2134633 -3946454 -3355277
45164 -3355277 -1724915 -130991 2380593 5448417 6362245 4248571 1900548 1318610
45156 1318610 489272 -2843415 -6816012 -7914450 -6036636 -4027472 -3317330 -3021759 -2665133
45147 -2665133 -2683615 -2274704 171248 3743256 4805495 1558421 -3179526 -5430619 -4790465
45138 -4790465 -3738466 -3270850 -1732106 1924818 6049016 8477650 9098602 8795511 7175983
45129 7175983 3434293 -1012295 -3061467 -1641899 860843 1671732 572775 -1166122
45121 -1166122 -3178666 -5749639 -8285847 -9778346 -10141375 -9592732 -7516149 -3754947
45113 -3754947 -292664 663610 21897 752688 3329903 4883367 3672188 1725951 1533072
45104 1533072 2482870 2723957 2647659 3805490 5455089 5186282 2951999 1768265 3583186
45095 3583186 6473221 7181266 5127755 2546913 1320521 1010970 56750 -2024696 -4101356
45086 -4101356 -4750084 -3626447 -1479216 699245 2067591 1815056 -423800 -3709079
45078 -3709079 -6029561 -5981591 -3978148 -1519827 378565 1754919 3011248 3876710 2967509
45069 2967509 -1121145 -7449039 -12012720 -11159612 -5952605 -1239272 243618 566801
45061 566801 2135335 3277400 1236411 -2322730 -2889264 -4217 1425250 -2110777
45053 -2110777 -7910116 -10834081 -9289666 -5279068 -743655 3254764 5069366 3523859
45045 3523859 537349 50354 3475732 7913646 9694917 8364647 6264527 5243046
45037 5243046 5000418 4332988 2923463 1567744 1109636 1649121 2815601 4302643 5621576
45028 5621576 5681615 3652037 495423 -1399134 -831512 749765 1264690 733913 777309
45019 777309 1807883 2190396 377966 -3292855 -7323824 -10574735 -12502357 -12713524 -11204105
45010 -11204105 -8909694 -7387827 -7659971 -9365534 -11152154 -12073406 -12495973 -13131326 -13219518
45001 -13219518 -10787681 -5433762 203408 3111730 3427153 3693116 4922327 5337243
44993 5337243 3326988 -273102 -3704142 -6425843 -8565464 -9622538 -9188713 -7977721
44985 -7977721 -6669814 -4554077 -961053 2510975 3047763 -76687 -4738683 -8555278
44977 -8555278 -10739262 -11250371 -9952089 -7548937 -5977981 -6505842 -8054561 -8549859 -7599997
44968 -7599997 -6806641 -7463318 -8841415 -9074626 -7301979 -4634845 -3074161 -3468813 -4468711
44959 -4468711 -3668670 -35797 4845071 8104832 8086057 5400147 1817084 -1313545 -3417181
44950 -3417181 -4143568 -3299879 -1444713 134751 611459 554850 1163975 2663709 3959632
44941 3959632 3832505 1968199 -1085546 -4276918 -6389452 -6950950 -7033095 -8185826 -10218166
44932 -10218166 -11158069 -10045430 -8498659 -8380630 -9014744 -8271267 -5709695 -2949120 -1292556
44923 -1292556 -663353 -652851 -786647 240001 3574760 8014913 10670473 10478294 9287524
44914 9287524 8710666 7891232 5638818 2822960 767470 -1203333 -4266737 -7007915
44906 -7007915 -6427609 -2248999 1811747 1861459 -2151085 -6673699 -8031067 -5464247 -1390987
44897 -1390987 1149013 1547511 1797020 3424691 5384279 5942430 5383740 5077821 4798080
44888 4798080 3357006 1576412 1787123 3760532 3978129 600410 -3122899 -2795268 1176567
44879 1176567 4252493 3824532 1826024 905817 702700 -444486 -1881671 -1161449 2154973
44870 2154973 5387185 6075159 4845788 3812898 3286629 1769666 -1195773 -4056735
44862 -4056735 -5443807 -5638177 -5073519 -2979969 1100102 5597525 8398643 9443166
44854 9443166 10299511 11626085 12650537 12758654 11768090 8868404 3517922 -2288889 -5007569
44845 -5007569 -3866492 -2248558 -3329392 -5972721 -6748345 -4789469 -2425759 -1381814
44837 -1381814 -530228 1968524 5654692 7870779 6554288 2421329 -1747364 -3940118
44829 -3940118 -4718501 -5836562 -7559361 -8427850 -7589318 -5981872 -4876738 -4642352 -5428573
44820 -5428573 -7397625 -9365182 -9014624 -5964011 -3047166 -2714152 -3616047 -3038021 -1423260
44811 -1423260 -1458852 -3195438 -3489665 -917594 1774169 1450779 -1534406 -4745939 -6919430
44802 -6919430 -8006266 -7545251 -5065658 -1362051 2213145 5099792 6964344 6819405
44794 6819405 4366572 1400919 -79577 -736236 -2739771 -5744731 -6357203 -2589296
44786 -2589296 2954209 5826337 4646642 1834286 174642 345717 1688029 3521545
44778 3521545 4885717 4451386 2245741 808464 2828664 7474444 10750071 10211460
44770 10211460 7779921 6657714 6939775 6391554 4805093 4900616 8448789 13735681 17822460
44761 17822460 19404204 18223167 13619794 5819952 -2288256 -6779450 -6014811 -1210209
44753 -1210209 5521062 12058738 15972515 15706326 12422693 8975865 6730285 4884700
44745 4884700 2953640 1799076 1540549 574688 -1985562 -4538449 -5148024 -4076010 -2575665
44736 -2575665 -591444 2207344 4237321 3678541 2123828 3493527 8362314 11992993
44728 11992993 9857561 3328503 -2313289 -4434501 -5110680 -6865723 -8975130 -9095352
44720 -9095352 -6843543 -4109842 -2443764 -1554837 -404283 1238109 2592404 2589312 582187
44711 582187 -3080067 -6835912 -8706156 -7852481 -5339280 -3127405 -2390531 -2939675 -3979515
44702 -3979515 -4931820 -5519039 -5554996 -5022317 -4244687 -3731504 -3774534 -4177171 -4335129 -3714710
44692 -3714710 -2544015 -2030821 -3410072 -6374946 -8747804 -8393125 -5655112 -3373753
44684 -3373753 -3962526 -6623131 -8012233 -5833064 -1322362 2210201 2990910 2251862 2054039
44675 2054039 2512406 1984985 -297865 -2866112 -3739252 -2921529 -2445228 -3946669 -6672320
44666 -6672320 -8150258 -6824260 -3901967 -2257516 -3178401 -4610301 -3594804 -460370
44658 -460370 869320 -2325325 -7718008 -10535632 -9195559 -6179646 -3558243 -535939
44650 -535939 3483779 6201395 5309401 2432578 1205613 2028758 1769005 -1096812 -4030353
44641 -4030353 -4233613 -2336245 -499483 1160798 3903145 7216957 8772012 7292664
44633 7292664 3608971 -1036378 -5862931 -9522510 -10071352 -6983790 -2281774 1110418
44625 1110418 1747277 307774 -1352521 -1552941 42818 2178758 3232598 2640270 773009
44616 773009 -1955695 -4852422 -6436992 -5773094 -4067257 -3104680 -2149438 1229765 6684507
44607 6684507 10153972 8993205 5678894 4163585 4472905 3757622 1411159 -120291
44599 -120291 755195 3099490 5696537 8019150 8636311 5824866 817301 -2448424 -2337121
44590 -2337121 -1758202 -3700221 -6918287 -8132069 -6369337 -2819178 1558679 5481310
44582 5481310 6240646 2612898 -2161440 -3793879 -2732338 -2942156 -5340416 -6753257
44574 -6753257 -5960651 -6101822 -9043805 -11528309 -10099506 -6662608 -5317682 -5859684 -4632918
44565 -4632918 -777650 2569853 3260502 2452287 1219776 -1619951 -6563536 -10841065
44557 -10841065 -10973439 -6772466 -1369438 1875860 1580399 -1410277 -4752164 -6204677
44549 -6204677 -5457577 -4139241 -3864480 -5021819 -7407775 -10528622 -12772924 -11991369 -8060640
44540 -8060640 -3568271 -726351 1093067 3243598 4599406 2827574 -1582472 -5021708
44532 -5021708 -4974283 -2612040 -428385 998531 2622378 4548361 5709760 5583531 4849909
44523 4849909 4266513 4000490 4348792 6006125 8813978 10937377 10361576 7078551 2913422
44514 2913422 -722265 -3836483 -6523592 -8016681 -7786648 -6378315 -4186451 -665181
44506 -665181 3850739 6873747 6513935 4672803 4788601 6636081 6517530 3219393 397582
44497 397582 1352709 4490127 6463041 7129831 7992930 7755810 3881969 -1899612 -4218268
44488 -4218268 -1334429 1994598 1039563 -2385439 -2777491 1330771 5551914 5244176 424554
44479 424554 -5352035 -8996046 -9631573 -7704966 -4192074 -715499 1050099 1005143 914684
44470 914684 2046931 3040683 1480257 -2590168 -6357378 -7644956 -6821276 -4843772 -1755377
44461 -1755377 1452114 1813965 -2214840 -7680790 -10068932 -8578829 -6138231 -4989728
44453 -4989728 -4881210 -4989408 -4728194 -2972231 475799 2786846 824331 -3821017 -6122979
44444 -6122979 -4612521 -3230719 -4979215 -7881011 -9459778 -11132016 -14710500 -17814979
44436 -17814979 -16960702 -13135258 -10112578 -8535224 -5842845 -1490288 1836104 2430195
44428 2430195 1453482 -1301 -2575239 -6298412 -9144367 -9338986 -7539618 -5772917
44420 -5772917 -5357575 -6257762 -7284917 -6800839 -4416863 -1802463 -454564 727072 3587647
44411 3587647 6835570 6713305 2126487 -3267023 -5230051 -3562274 -1557720 -2157235
44403 -2157235 -5439515 -8850888 -9347696 -6201951 -1829999 1078393 2742686 5000709
44395 5000709 7547461 8125641 6513857 5268013 5598271 5534794 3809965 2713863 4641815
44386 4641815 7973386 9248154 7992162 6357938 4809294 1507721 -3691779 -7598338
44378 -7598338 -7405189 -4224793 -1454651 -809039 -1546051 -2941355 -5471832 -8931628 -11051375
44369 -11051375 -9805038 -6618119 -5217304 -6864682 -8839282 -8759503 -8055765 -8867261 -9585398
44360 -9585398 -7089050 -2418198 59222 -567254 -189674 3603244 7389139 7100089 3903240
44351 3903240 1585272 778920 -350115 -1530600 -728554 1706003 3243432 3554467 5079265
44342 5079265 8666849 11859591 12512340 11419789 10216912 9065389 7736446 6871509
44334 6871509 6574914 5357865 2106310 -1974693 -4707427 -5334736 -4495292 -2864288 -1189188
44325 -1189188 -926964 -3240463 -7324001 -10733060 -11546250 -9754717 -6803440 -4495874
44317 -4495874 -4224247 -6300994 -9415525 -11078940 -9441729 -5191499 -1353899 -523105
44309 -523105 -2288315 -4162307 -5075381 -6581035 -9756758 -12267940 -10392140 -3720717
44301 -3720717 3825319 7989274 8026776 6325235 5360314 5572919 5452721 3187872 -1301252
44292 -1301252 -5775275 -7678220 -6793636 -5150073 -4149348 -2826126 311926 4378502
44284 4378502 6195291 3644088 -1615380 -5575356 -6243218 -5747262 -7171432 -10050514
44276 -10050514 -10972571 -8740956 -6312852 -6130120 -5979748 -2378064 3274438 5459359
44268 5459359 1628706 -4507294 -7717738 -6869115 -4551657 -3066921 -2495137 -1762492 -262148
44259 -262148 1275804 1116298 -1604679 -5192644 -6569839 -4309324 372948 5197315
44251 5197315 7809904 5871324 -939968 -8483416 -10716048 -6238662 57145 3366061
44243 3366061 4352254 6052138 8213368 8228805 6101997 4581701 4688536 4604552 3372395
44234 3372395 2629156 3771716 5844613 7247228 7563492 6863938 5131619 3296305 2938675
44225 2938675 3875978 3846662 1826713 -201498 -438095 -451004 -2802381 -6537943 -7787415
44216 -7787415 -4893775 -596261 1482384 554374 -2032438 -5329451 -8859801 -11185861
44208 -11185861 -10596175 -7483720 -4427958 -3074765 -2000192 1126134 5746710 8287393
44200 8287393 6311448 1754786 -1048050 -241912 1786627 1796266 -264269 -1696208 -1103268
44191 -1103268 -413344 -2067425 -5286960 -6728345 -4799116 -1781507 -964917 -2822543
44183 -2822543 -5100306 -5849697 -4944489 -2979923 -350148 2236438 3709731 3829885 3439138
44174 3439138 2785494 609118 -3844912 -8429283 -9371147 -5557633 -524917 992983
44166 992983 -1638818 -4268042 -3113657 460178 1767980 -1063224 -4891015 -6053712
44158 -6053712 -4819829 -3702404 -3281783 -2364511 -1156175 -1025333 -1259986 560524 4218893
44149 4218893 6128108 4454509 2067677 2266491 4103231 4719640 4420730 6097149 10369235
44140 10369235 14406732 15672696 14450227 12360453 10297074 8237304 5753686 2573656
44132 2573656 -457005 -1559667 -360664 981178 721051 454119 2700562 6513728
44124 6513728 8544520 8086016 7566712 7707445 6035877 1714865 -1637966 -465459 3825009
44115 3825009 7084187 7745779 7302995 6850898 6015138 4769386 3759339 2804286 1088688
44106 1088688 -1017362 -2033606 -1548305 -973985 -1765209 -3757046 -5409265 -5129898 -2669937
44097 -2669937 141222 672762 -1530738 -3661376 -2654264 1327906 5636743 8557410
44089 8557410 10189791 10378356 8046296 3125731 -2547770 -6989156 -9515831 -10106109
44081 -10106109 -8838919 -6684909 -5404361 -5546907 -5537623 -3784477 -870845 1375415 2278188
44072 2278188 2663791 3315923 4209412 5056836 5606841 5399210 3972569 1382034 -1843297
44063 -1843297 -4908076 -6500585 -5172206 -1149400 2695946 3275073 934704 -665776
44055 -665776 1116099 4831961 6892893 5508187 1684091 -2758506 -6688076 -9496975
44047 -9496975 -10887694 -11131513 -10694773 -9513895 -7432060 -5238642 -4119647 -3917714 -3182592
44038 -3182592 -1316259 710580 2400227 4796480 8117673 9831385 7387202 2315051
44030 2315051 -816293 247095 3284752 5311442 6145184 6998273 7586119 6811876 5202231
44021 5202231 4325259 4112587 2933274 561810 -887452 222867 2706051 3929180
44013 3929180 2589231 -584651 -3923411 -5795152 -5412140 -3685352 -2594031 -2720811
44005 -2720811 -2162114 858318 4984762 7059961 6246258 4913615 5127890 6224669 6703152
43996 6703152 6583367 6396534 5494236 3456813 2072344 3401115 6243222 7116473 5018890
43987 5018890 2730516 2587374 3331440 2530780 107033 -2327152 -4072774 -5330601 -5788788
43978 -5788788 -5269994 -4922913 -5794476 -7010556 -7405270 -7980848 -10053529 -11566553 -8697600
43969 -8697600 -1733161 3887335 3869263 -129377 -3596964 -4671620 -4464257 -4014207 -3711913
43960 -3711913 -4563563 -7206365 -10053797 -10817847 -9704273 -8841500 -8572455 -6770238 -2447742
43951 -2447742 2133590 4080160 3046547 771354 -1142698 -1758064 -386291 2608372
43943 2608372 5038632 4558271 1407253 -1429392 -1184517 1971991 5259747 5973592 3818195
43934 3818195 900790 -443613 223623 1637108 2887398 4391585 6392282 7556928
43926 7556928 6448685 4050183 3127476 4584951 5981616 4811819 2048381 646327
43918 646327 1098196 736770 -2031438 -4870261 -4376672 -569628 3257169 4700898 4587922
43909 4587922 5082672 6916792 9020523 9961219 9196032 7448102 6147822 6047768 6329685
43900 6329685 5673478 4164052 3237849 3516834 3660974 2002408 -1259991 -4142351 -4926571
43891 -4926571 -3725665 -2064399 -1060926 -180006 1760425 4290726 5135047 3346680
43883 3346680 1531475 3070775 7504791 10824464 10557768 8335784 6720800 5874336
43875 5874336 4884673 4310638 5047633 5774905 4051292 -70604 -3393544 -2970136 865579
43866 865579 5002089 6351737 4229484 622706 -1871469 -2517775 -2435343 -2318399 -1572360
43857 -1572360 -149989 552810 -131364 -676628 266308 1457879 1095358 71984 658906
43848 658906 2521778 2812696 401407 -2469651 -3377019 -2483014 -1317069 -577739 -120666
43839 -120666 244494 885080 2223300 3731141 3953757 2184466 -572682 -2644331 -2965101
43830 -2965101 -1283466 1783294 4584511 5380823 3976987 1798473 192846 -750391
43822 -750391 -1869849 -4173377 -7979479 -11864300 -13182704 -11031735 -7890856 -6471776
43814 -6471776 -5859420 -3442436 -58519 452675 -2606332 -5027422 -4007283 -2749109
43806 -2749109 -5657687 -11338301 -14137055 -11709721 -7517521 -5601646 -5805144 -5269174
43798 -5269174 -2795598 -230601 41401 -1856570 -3111160 -1339315 2394314 4687768
43790 4687768 4033793 2493094 2486281 3502368 3287314 1047616 -2044742 -4559365 -5480391
43781 -5480391 -4121849 -1197366 634107 -779243 -4225033 -6333937 -5519756 -3191477
43773 -3191477 -1241071 -162743 98922 -666904 -1931325 -1878305 826117 5009833 7599731
43764 7599731 6519084 2916129 356769 1406268 4833727 6667915 4326606 -790527
43756 -790527 -5070934 -6305687 -5114250 -3665736 -3772726 -5590602 -7418547 -7297799 -5321799
43747 -5321799 -3577058 -3293995 -3240336 -1803218 640821 2691208 4041567 5099091 5561870
43738 5561870 5137284 4796002 5421418 5990520 5180699 4080886 4786134 6553991 6177337
43729 6177337 2705645 -792309 -1256165 738835 2777046 4222278 6163122 8664402
43721 8664402 9913283 8190443 3783682 -1134235 -4082325 -3800489 -647506 4097039
43713 4097039 8883954 11981183 12084238 9703692 7119006 5876424 5076444 3375816
43705 3375816 1783497 2585124 5838388 8860905 9264893 6908933 3014585 -742826
43697 -742826 -2286197 -563476 2417214 2892210 -451266 -5040903 -7715438 -7773440 -6186538
43688 -6186538 -3857715 -1906586 -1903529 -4046959 -6077566 -5600239 -3062336 -1257836 -2053597
43679 -2053597 -4380393 -5498141 -4032360 -1655992 -1141879 -2392022 -1795791 2985140
43671 2985140 9035411 11571426 10355251 9244281 9428730 7331012 753801 -6653377
43663 -6653377 -9732089 -8033830 -5072440 -3414307 -3098908 -3241359 -2632083 -89144 3493542
43654 3493542 4892247 2677921 34095 771185 3879278 4998638 2325328 -1933030
43646 -1933030 -5193394 -6455721 -5173963 -1591536 1618690 1205831 -2440021 -5361571
43638 -5361571 -4851921 -1985850 897391 2739779 3281041 2497751 1395978 1401229 2369212
43629 2369212 3057829 3675164 5466274 7444134 6563460 2270164 -1957246 -3144208 -2296420
43620 -2296420 -1618781 -981749 393286 1101715 -379692 -2233865 -1327752 1768438 3021592
43611 3021592 599236 -2460630 -2367215 556074 2540548 906147 -3294456 -6806674
43603 -6806674 -7505795 -6136468 -5082496 -5703734 -7252769 -8469831 -9446760 -11035494 -12753211
43594 -12753211 -12545285 -9204385 -4242945 -333659 1986428 4805283 9290390 12833149
43586 12833149 11743957 6760475 3337726 4986126 8379458 7541743 1628427 -4425517
43578 -4425517 -6505422 -5313831 -3528212 -2392592 -2353717 -3952599 -6106188 -6032608 -3106348
43569 -3106348 -589556 -1118199 -2577433 -1388442 1896754 3786461 3478132 3401203 4437020
43560 4437020 4611983 3200572 2329895 2987308 2717885 -527281 -4776306 -6690592 -6001885
43551 -6001885 -4971740 -4970713 -6034892 -8476570 -12024074 -14040338 -11750843 -6500957 -2935218
43542 -2935218 -3066617 -3735710 -1438933 2582595 4404639 3258624 2565839 5117108 9495393
43533 9495393 12168844 11648563 9405110 7498909 6552415 5890311 4673819 2616400 148367
43524 148367 -1730811 -2001582 -466318 1806852 3128077 2641473 1137854 8706 -624200
43515 -624200 -1919619 -3985839 -4655912 -2094103 1867226 3022438 -137049 -4468559
43507 -4468559 -6147696 -4843459 -2716815 -1116002 -280546 -926588 -3583649 -7003904
43499 -7003904 -9593422 -11779356 -14261255 -14576185 -9233816 79264 6381998 5496965
43491 5496965 1109955 -707006 839073 2198462 1621293 232387 -1844545 -5992665
43483 -5992665 -11398984 -14581308 -13728010 -10702981 -7707079 -4648751 -1186647 1172872
43475 1172872 1026585 -604681 -1792607 -2181908 -2188704 -1085732 1841601 4901382 5102594
43466 5102594 1864874 -2062639 -3738259 -2775428 -674870 1194495 2202588 2102279
43458 2102279 1209163 624138 1309728 2793446 3440201 2339901 407008 -982164 -2070062
43449 -2070062 -4402662 -8274399 -11697517 -12765290 -12041049 -11261333 -10418621 -8066924 -4406500
43440 -4406500 -1752704 -1094972 -359139 2156513 4288332 2613030 -1899180 -3724331
43432 -3724331 663435 8125759 12513167 11774775 9168499 7669755 5987105 1654073
43424 1654073 -4092949 -7616527 -8595687 -10874228 -16173599 -20020423 -16927247 -7962481
43416 -7962481 237367 3343416 2749589 1243140 -611208 -2409280 -2094370 1012635
43408 1012635 3924770 3648538 1319003 -51399 -163035 -604086 -936682 604831 3168592
43399 3168592 3952576 2870722 2703376 4049785 4183105 2342506 2139763 6082222 10908462
43390 10908462 11704675 8582830 5964467 6630612 9690442 13419135 16654154 17685808
43382 17685808 15245412 11217896 9455337 10830221 11838980 9310298 4348915 76849
43374 76849 -2691339 -5491930 -9046310 -12210657 -13875045 -14195368 -13682536 -12295162 -9916261
43365 -9916261 -7018148 -4429006 -2748770 -2076527 -1936859 -1443837 15227 2118581 3948316
43356 3948316 4987059 5277494 4550956 2116656 -1648042 -4430275 -4028387 -1339740 159121
43347 159121 -1369138 -3705824 -3565868 -926662 1346338 1551804 707534 85301 -515451
43338 -515451 -1333495 -1536358 -677171 429044 1437158 3293707 5845917 6497182 3448719
43329 3448719 -1019253 -2905049 -1314447 1327901 3075748 3849096 3499431 1488386
43321 1488386 -1071913 -1617011 738444 4000188 5679777 4865779 2103814 -760499
43313 -760499 -955184 2347639 5655486 4809282 1184201 389174 3841143 6034199 2477182
43304 2477182 -3815460 -7150858 -6896613 -6095204 -5142249 -2154275 1542208 1740787 -2214598
43295 -2214598 -5683340 -4793093 -1054282 1522533 1452941 442056 655795 2519018 4489994
43286 4489994 4872903 4439482 6126616 10617366 13845872 11644250 5663761 1226611
43278 1226611 21896 -975204 -3344711 -4693832 -3611123 -2727364 -4342297 -6468299
43270 -6468299 -6139955 -4037349 -2836299 -2898289 -2479471 -922328 815161 1797980 1357892
43261 1357892 -1078665 -4591464 -6567211 -5785072 -4328111 -4560040 -5791623 -6091943 -5677016
43252 -5677016 -5720981 -5169177 -2064769 2427952 4573308 2966632 228697 -812092 -383186
43243 -383186 -315811 -1052107 -1267056 243133 2910430 4482974 3115838 -226484 -2346520
43234 -2346520 -1611348 -2073 -27538 -842989 436440 4157834 7213939 6950333 4149610
43225 4149610 1502213 314331 -571791 -3042443 -7229816 -10934166 -11985335 -10788380
43217 -10788380 -9193830 -7264486 -3741510 -48139 -188788 -4703637 -8290263 -6746615
43209 -6746615 -3308241 -3826701 -7873460 -9693864 -6872300 -2648956 356017 3262053
43201 3262053 6591222 7794825 5360077 1584486 -1006572 -2828262 -4745951 -5529664
43193 -5529664 -4265885 -2795721 -3239277 -4943814 -5940678 -5693772 -4633386 -2787739 -651927
43184 -651927 304625 -347027 -1158476 -1405537 -2486657 -4964851 -6249784 -3543243 2099979
43175 2099979 6535224 6597681 2514093 -2385600 -3740461 32896 5207070 6373731
43167 6373731 3334537 1221363 2580607 3430866 -178453 -5662531 -7910963 -6762156
43159 -6762156 -5913977 -6480017 -6516446 -5890159 -6726662 -8915461 -9370402 -6604134 -2986991
43150 -2986991 -1735978 -3822001 -7823374 -10727170 -9426714 -3871454 1817975 3742252
43142 3742252 2799638 2243558 2047086 -672007 -6391710 -12292720 -16407588 -18806472 -18738512
43133 -18738512 -14887650 -9193144 -6316848 -7873070 -10418268 -10286604 -7324332 -3007310
43125 -3007310 1635103 5024778 5463473 4059557 3997837 5512278 5075848 1257192 -2328378
43116 -2328378 -2217902 175577 1686841 2087859 2680850 3052541 2584650 2949412 5675691
43107 5675691 8869607 9484903 7489091 4986336 2674502 24816 -2385283 -3612180
43099 -3612180 -4290665 -5250678 -5535498 -4393634 -3533161 -4284339 -4269820 -754693 3932085
43090 3932085 4687090 939728 -2675866 -3155414 -2295304 -2201610 -1977617 -725505 -80744
43081 -80744 -1135631 -1617718 989766 5300345 7656342 6796417 4568537 2732303 1337325
43072 1337325 256788 433585 2785610 6503437 8998210 7823530 3053037 -2288715
43064 -2288715 -4762214 -3611167 -962738 659774 99775 -2697206 -6967199 -10666237
43056 -10666237 -11258844 -8149960 -3733075 -1185249 -1455059 -2756339 -2649990 -427066
43048 -427066 2130065 2256760 -1059568 -5875409 -9306919 -10493065 -10832209 -11646425 -12736974
43039 -12736974 -13152899 -12175226 -9417055 -5102902 -482929 3042564 5315063 6864034
43031 6864034 7064371 4439674 -833897 -6329738 -9944327 -11563510 -11425252 -8749763
43023 -8749763 -3746812 388027 39976 -4134071 -7042959 -4597925 1727757 6718269
43015 6718269 7223414 5015790 3774733 4481960 4985811 3534591 806510 -2111453 -5675295
43006 -5675295 -9970911 -12297542 -9476990 -2502871 3708425 5852417 5283393 4644463
42998 4644463 3891908 1616127 -1372728 -2384636 -496251 2171424 3267228 3100444
42990 3100444 4058453 7444546 11260230 11632357 7107741 1155084 -1043782 1458014
42982 1458014 4273946 3240881 -764040 -3931860 -4629326 -4115849 -3284896 -1547905 957061
42973 957061 2555846 2311933 1457387 1762928 3749225 6978041 10510396 12282324 9874882
42964 9874882 3661120 -1939589 -2508812 1249102 4366130 3880819 2257566 3398897
42956 3398897 6923057 8605916 6025484 1337585 -2216772 -4355302 -6596616 -8569072
42948 -8569072 -7992890 -4172478 697122 4187661 5853376 6225148 5378742 3553449 1788537
42939 1788537 785098 227260 117764 1337998 3694528 5061773 4201769 2847628 2709252
42930 2709252 1931031 -2224584 -7873335 -9556743 -5403801 355073 3436527 4604528
42922 4604528 6349961 7582448 5382820 494545 -2917093 -2888240 -1688272 -1764583 -2713533
42913 -2713533 -3334301 -3868092 -4349218 -2950577 1470286 6280658 7189971 3576620 -238333
42904 -238333 310493 5165872 10016545 10809058 7426994 3276241 1619640 2464657 3270116
42895 3270116 2418710 857906 -48240 -638705 -1439438 -935409 2553466 7098547 8162196
42886 8162196 4195291 -1185314 -3855950 -3777354 -3247121 -2774393 -1304519 830546 2152565
42877 2152565 2768341 4141853 6127748 6737800 5193604 2937275 1197969 -133941
42869 -133941 -637448 1085498 4809570 7912354 8666457 8248119 7881665 6273766 2317244
42860 2317244 -1497493 -1559439 1708027 4254748 3985674 3104183 4296555 7151261 9577454
42851 9577454 10716826 10794783 9505796 6507726 3005641 1108126 1442713 2605114 3258746
42842 3258746 3648446 4311752 4276365 2069408 -1554028 -3635538 -2666455 -746700 -535001
42833 -535001 -1286686 -318968 2218737 3144084 1188084 -1132786 -1836294 -2300284 -3570670
42824 -3570670 -3199603 701342 4858273 4795603 1926075 1722015 5208714 7539701 5866776
42815 5866776 3351662 3141749 3135753 262087 -3672538 -4649785 -2699426 -1297936 -1775408
42806 -1775408 -2304805 -1978023 -2158011 -3453977 -4425427 -4005003 -2901693 -2063249 -1700994
42797 -1700994 -2056356 -3078218 -3210726 -857246 2571781 3650807 1850477 894251 3761435
42788 3761435 8613993 11562202 11457427 9546414 6010632 72625 -6832753 -11195053
42780 -11195053 -11604947 -10434355 -10095781 -9563841 -6397570 -860748 4255335 7418374
42772 7418374 9468503 10517542 8378987 2084579 -4637410 -6288593 -2058662 3088174
42764 3088174 4573509 3288055 3071936 4995036 6522448 5567904 2858603 112328
42756 112328 -1963988 -3095397 -2542722 42225 3689775 6783416 8067199 6844283
42748 6844283 3401183 -287172 -1726440 -789419 -227445 -2125571 -5053000 -6271304
42740 -6271304 -5579973 -4720532 -3668354 -524138 4370919 7243817 5756618 2976941
42732 2976941 3839506 8629177 12797623 13216614 11787323 11793480 13012039 12460289 8839359
42723 8839359 4178335 1258520 851180 1491602 935622 -1982629 -5917500 -7770608 -6133598
42714 -6133598 -3629085 -4185626 -8033649 -11305729 -10988476 -8274411 -6141910 -5561121 -5459672
42705 -5459672 -4798969 -3079406 -173630 2695383 3236543 1220594 -250043 943768
42697 943768 1911419 -1499425 -7714666 -10367258 -6755321 -1310492 899981 297614 -100014
42688 -100014 -305592 -2361346 -5734216 -7759973 -8018670 -8648542 -10276950 -10996984 -10090383
42679 -10090383 -9721555 -11406895 -13001095 -11086825 -5224315 1643848 6263236 7391374
42671 7391374 5777053 3173374 1299877 815046 973084 541109 -874461 -2450234 -2960007
42662 -2960007 -1892071 203546 2480876 4692620 6881261 8401648 8273795 6704656
42654 6704656 4970197 3236166 145432 -4222137 -6778754 -4961701 -572138 2457922
42646 2457922 3254581 4085873 5867528 7064047 7205006 7746027 8527273 7221941 3955629
42637 3955629 2528762 4381597 5069465 593181 -5631504 -6787765 -2007441 3078891
42629 3078891 4483757 3785282 3649325 4063930 4405236 5410662 7156138 7925434 6862886
42620 6862886 5398539 4631245 3682979 1962604 441876 -871315 -3917350 -8936862
42612 -8936862 -12482111 -11720659 -8574929 -6741143 -6451216 -5372589 -3327360 -2621074 -4161631
42603 -4161631 -6319213 -7533294 -7470282 -5846167 -2747501 -46862 105131 -1656091 -2663344
42594 -2663344 -1943726 -702052 721589 3297105 6284942 6921105 4238657 585075
42586 585075 -1781370 -3089286 -3949892 -3617785 -1976182 -757945 -914270 -959266 277351
42577 277351 1614351 2283114 4120708 8160094 11308478 10025552 5916788 3906299
42569 3906299 5490762 7484591 7366481 6210530 5689779 5514763 5119598 5236901 6319612
42560 6319612 7358006 7478626 7030892 6190547 4355415 1955798 965338 2335817 4646681
42551 4646681 6623345 9145577 12927761 15830840 15017186 11207373 8400207 9021386
42543 9021386 11033773 10550242 6327438 949951 -2047360 -1648206 149032 920773 173888
42534 173888 -1177154 -2667806 -4362199 -5629382 -5553671 -4630853 -4428182 -5287126 -5956683
42525 -5956683 -5752544 -5218043 -4273974 -2002543 889531 1910259 494771 -683729 -90160
42516 -90160 -358741 -4006299 -8341866 -8603222 -5143478 -3288648 -5820377 -9413436 -9644674
42507 -9644674 -6373073 -2501627 151891 1720629 2487060 2157938 698160 -894093
42499 -894093 -641558 3024799 8928472 12932008 11827510 7101139 3078609 1985803
42491 1985803 3058014 5484957 8669929 9851662 5926694 -1236366 -5565701 -4732102
42483 -4732102 -3145499 -4541997 -6128540 -4133775 -1183785 -2508254 -7054934 -8441923
42475 -8441923 -4221506 1353863 4181142 4768510 4753447 3830543 2242250 2292604 4705891
42466 4705891 6478528 4976450 1780248 -96257 -838677 -3018839 -7372716 -11685930
42458 -11685930 -13232693 -10844255 -5511495 -280850 1527335 -594782 -3787549 -5072856
42450 -5072856 -3841231 -629268 4130769 8628212 9548762 6113899 2472809 3102175
42442 3102175 6970694 9235111 7836656 5112452 3180782 1335205 -1208061 -3135863
42434 -3135863 -3216712 -2480914 -2512824 -2928024 -1997760 1060580 5390740 9309586 11126086
42425 11126086 10101879 7421623 5434011 5122912 4951359 2966400 -483808 -2989679
42417 -2989679 -2856223 -873101 979106 2193236 4323934 8408292 12541008 13584014
42409 13584014 11342842 8965768 8244101 6895775 2694421 -1810002 -2162768 1352516
42401 1352516 3868009 2899441 1179236 1380767 1976051 806102 -418088 1427468 5806267
42392 5806267 9303100 10514926 11013754 11841607 12110615 11394276 10799242 10736218 9722455
42383 9722455 6669884 2976851 1005368 1124169 1296835 -537678 -4189338 -7254324
42375 -7254324 -7241333 -3757199 1300577 5485313 7365675 6719584 4397795 2358371 2453940
42366 2453940 4149328 4558531 2079023 -979585 -1099988 1724516 3930978 2937807 -206224
42357 -206224 -3079790 -4910679 -6323411 -7312298 -6744590 -3637798 1590113 6977248 10189232
42348 10189232 10436634 9217390 8524880 8490310 7650800 5334383 2585716 663568 -150127
42339 -150127 -30723 796668 1490854 852153 -1195487 -3392223 -4979331 -6616614 -8719019
42330 -8719019 -10079752 -9358084 -7179152 -5516343 -5383992 -6163100 -6821964 -6694498 -5228900
42321 -5228900 -2135025 1906940 5364401 6986933 6580193 4814514 2818837 1955371
42313 1955371 3323521 6955088 11434960 14470734 14191852 10421034 4907565 68826
42305 68826 -2694828 -3396436 -2472109 -62620 3567187 7499704 10432575 11220401 9208252
42296 9208252 4741843 -436641 -4089598 -5292810 -4842911 -3623359 -1462006 1783052
42288 1783052 4973110 6697250 7100939 7537956 8460444 8705589 7162253 4460180 2633770
42279 2633770 3319543 6224840 9054683 9162931 5864898 1198397 -1958425 -2551571 -1979750
42270 -1979750 -2350524 -4470661 -7249847 -8555512 -6865980 -2688099 1709455 4449721
42262 4449721 5791091 7159508 8642622 8397545 4962408 -417632 -4390743 -4456325 -1160627
42253 -1160627 2658656 4725399 5210306 5548323 5802849 4363816 757763 -2455589 -2078066
42244 -2078066 1771218 5630513 6849260 6326443 6417750 7427581 7541771 5631441 2559516
42235 2559516 -471654 -3517600 -6978553 -9868639 -10326488 -8124034 -5737117 -6042742
42227 -6042742 -9120421 -12100235 -12338375 -10073180 -7546351 -6129243 -5148134 -3413130
42219 -3413130 -1058112 526469 222340 -1736273 -4151627 -6066920 -7325447 -7820569
42211 -7820569 -6624495 -2792590 2625896 6369190 5941405 2568195 -46200 -126461 205871
42202 205871 -1918922 -5984324 -8406731 -6804076 -2681815 632226 1839641 2490170
42194 2490170 4223192 6367741 6933744 5368532 3325721 2681441 3709155 5592827
42186 5592827 7834896 10226675 11919258 11789581 9980290 8161600 7764221 8529764 9240973
42177 9240973 9264557 8702701 7532247 5647673 3788940 3380769 4821703 6500639 6322616
42168 6322616 4143388 2042109 2001748 3779647 5362758 5213223 3681001 2310616 2137583
42159 2137583 2816412 3276551 2994846 2400542 2025335 1675654 867523 -231456 -1015769
42150 -1015769 -1472635 -2025260 -2227533 -919840 1621685 3024041 1635753 -977911 -2042503
42141 -2042503 -1396204 -1235962 -2289019 -2753760 -1745987 -1382583 -3763803 -7512031 -9357648
42132 -9357648 -8398385 -6863599 -6809030 -7685568 -7494337 -5174914 -1283845 3011987 6857227
42123 6857227 9526013 9840726 6795323 1427322 -2804204 -3078424 -566829 801830
42115 801830 -1014104 -4502848 -7674669 -10351843 -12470287 -12710710 -10720166 -8661837
42107 -8661837 -8407286 -8926943 -8689381 -8711695 -10247097 -10992658 -7285644 425873 7717568
42098 7717568 11646198 12835408 12281334 9854303 6649249 5211283 6112926 7319262
42090 7319262 8051352 9990316 13226132 14638758 12630238 10145715 9978190 9943774 6458204
42081 6458204 897623 -1748997 246903 3583892 4855466 3872679 1824857 -717992
42073 -717992 -3038116 -3916550 -3168207 -1967618 -1046125 -73924 782217 409452 -1426094
42064 -1426094 -3192637 -3266508 -1502405 1165882 3490989 4062230 2241386 -444180 -1338767
42055 -1338767 1463 860966 -1013454 -3972858 -4353156 -1373972 1672412 1614304 -582352
42046 -582352 -1126036 1834012 6075695 8148256 7125376 4609622 1924220 -1018063
42038 -1018063 -4068797 -5869012 -5436340 -3558982 -1539334 609919 3561921 6849084
42030 6849084 8884801 8688181 6694073 3950033 1277509 -774009 -1727557 -1157081 951573
42021 951573 3361824 3495001 -379382 -6482378 -10627789 -10889065 -9640764 -9714930 -10253792
42012 -10253792 -8531424 -4728128 -2105760 -2449852 -3824898 -3601633 -1839577 -526263
42004 -526263 -594238 -908296 77881 2447720 4867121 6363911 7489765 8984753 9770841
41995 9770841 7961462 4163773 1762602 2870185 5911910 8587835 10986452 13601013
41987 13601013 14502633 11765767 7369748 5117946 5291780 4933314 3180390 2425287 3619050
41978 3619050 4252611 2452914 -66758 -893443 -228896 350604 287205 -299810 -1285479
41969 -1285479 -1470172 994478 5469969 8141687 6359291 2101797 -600359 -280378
41961 -280378 1503888 2909572 3322865 3148084 3393548 4594666 5536171 4555150 2613410
41952 2613410 2791984 5720364 8167306 7886395 7179552 9140283 12537218 13411650 10440616
41943 10440616 6020996 2952511 2285443 3445134 4400370 2799390 -1136166 -4182904
41935 -4182904 -4346398 -3488817 -3454497 -2191773 2688077 8645761 11003030 9756761 8791089
41926 8791089 8820460 6419122 807980 -3548721 -3141277 -67189 1852433 2075998 1883394
41917 1883394 1069482 -743613 -1691123 220638 3819739 6243748 6728714 6489818 5649408
41908 5649408 2944082 -1487188 -5216856 -6082829 -4405045 -2178309 -854658 -353979
41900 -353979 126276 774807 941323 313667 -296200 -29223 692115 948029 943530 1417369
41890 1417369 1740963 440899 -2191870 -3866132 -3282036 -1791075 -1348905 -2178084 -3197291
41881 -3197291 -3586970 -3279045 -2874722 -3358842 -4802670 -5487682 -3991942 -2034304 -2956928
41872 -2956928 -7034925 -10840555 -12037263 -12033922 -12517221 -12159830 -8924007 -3416811 2306755
41863 2306755 7300057 10772622 10740651 6725013 2308430 1633349 4066954 5415241 3825124
41854 3825124 1212254 -848241 -2893557 -4587558 -3625382 534240 4479004 4610708
41846 4610708 1519059 -1306955 -1889149 -949258 469679 2372823 4537387 5395565 3169949
41837 3169949 -2061004 -7805687 -10906771 -10157727 -7275213 -5046195 -4549317 -4624290 -4053534
41828 -4053534 -3454522 -4337082 -6601804 -7914253 -6106944 -1852077 1759474 2316727 4345
41819 4345 -3702164 -7919189 -11893051 -13919796 -12766390 -9793934 -7547226 -6230801 -3911411
41810 -3911411 -541624 1056866 -506064 -2604433 -2371595 -841889 -799235 -2223261 -2755304
41801 -2755304 -1591776 4223 1424961 3074110 4279724 3654680 1645753 196181
41793 196181 -287074 -1122588 -2294173 -1937477 369519 2330820 2081694 533068 -583027
41784 -583027 -1150577 -1921326 -2896480 -3651626 -4032068 -3635396 -1872150 703072 2422853
41775 2422853 2472676 1428205 -499821 -3765566 -7372230 -8843718 -7705111 -6803657 -8289433
41766 -8289433 -10151404 -8996870 -4866648 -851278 1177316 1976279 2454455 2139651 415452
41757 415452 -2345484 -5154590 -6763304 -5791097 -1890542 3083563 6262225 6436032 4844143
41748 4844143 3361878 2706210 2403153 1744117 586415 -496707 -987220 -1387056 -2751601
41739 -2751601 -5045296 -6953652 -7836291 -8692106 -10294126 -11478782 -10485543 -7192477 -2943344
41730 -2943344 1007161 3813850 4819651 4319096 3660509 3335399 2013278 -1135931 -4447486
41721 -4447486 -5922188 -6163039 -6963699 -8080187 -8041521 -7320923 -7571349 -7980804 -5787015
41712 -5787015 -919657 3080606 3773650 2535045 1388381 134654 -1569205 -2081072
41704 -2081072 -293873 1671928 1009610 -1713436 -3459772 -2890223 -1454272 -893339 -1658576
41695 -1658576 -3440406 -5449149 -6350414 -5445419 -3772145 -2912227 -3251396 -4552415 -7180330
41686 -7180330 -10925767 -13488189 -12532465 -9100744 -6691348 -6715104 -6989656 -5185386 -1680921
41677 -1680921 1729570 3933350 4203531 1732326 -2793605 -6348264 -6197315 -3021099
41669 -3021099 -31377 783221 250030 -87819 -261689 -1349608 -3406207 -4994846 -4993660
41660 -4993660 -4101784 -3720636 -3658243 -2310215 438115 2083523 715561 -1806526 -1919643
41651 -1919643 1025561 4554024 7170731 9670131 11735028 10630560 5447662 45996
41643 45996 -1220904 779785 1497804 -1028352 -4603763 -7155222 -9069684 -10599833 -10150180
41634 -10150180 -6842236 -2633764 -138572 199899 -608327 -2083569 -3897134 -4815844
41626 -4815844 -3998598 -2719804 -3093861 -5385630 -7896778 -9081279 -8480257 -6148273 -2834997
41617 -2834997 -528277 -1029650 -3620330 -5462814 -4712276 -2188823 205865 1503368
41609 1503368 1762733 1433387 1325721 2273800 4076283 5397668 5273692 4143006 2965382
41600 2965382 1945631 558952 -1726178 -5012328 -8523161 -10400199 -9074996 -5416347
41592 -5416347 -2350344 -1441777 -954226 1448982 5037626 6749403 5161372 1889972
41584 1889972 -1132174 -4025571 -7788066 -11950519 -14580825 -14323687 -11733121 -8609336
41576 -8609336 -6290718 -4579344 -2397656 411350 2424579 2396506 1256435 1274524 3214767
41567 3214767 5399963 5865036 4373064 1882937 -801172 -3030624 -3987506 -3538607 -2838212
41558 -2838212 -2927281 -3093823 -1803667 882942 3033364 3163365 1837953 668891 605041
41549 605041 1595883 3084717 4188685 3983303 2356586 340655 -977562 -1738054 -3021311
41540 -3021311 -5344602 -7889749 -9322168 -9062455 -7532048 -5303598 -2458217 829562
41532 829562 3317164 3257706 535136 -2468873 -3187928 -1711355 -106726 847439 2449006
41523 2449006 5145074 6921079 6207232 4833408 5734416 8352801 8920896 5628130 1115246
41514 1115246 -1233724 -1520264 -2249313 -4419583 -6733060 -8164686 -9268724 -10570160
41506 -10570160 -11197101 -10013277 -7350693 -4728818 -3056270 -1793659 -41358 2025337
41498 2025337 3280385 3078188 1937222 598941 -823344 -2106795 -2115956 12932 3242281
41489 3242281 5617947 6767489 7801915 8742781 8247135 6563624 6320394 8793143 11536067
41480 11536067 11888396 10969986 11380050 12299172 10383129 5211010 298145 -1973403 -3311221
41471 -3311221 -6134887 -9813536 -11944601 -11591737 -9731128 -7773796 -6733292 -6631126
41463 -6631126 -6032403 -3650255 -837398 -393691 -2287261 -3307683 -2274151 -2443101 -6297410
41454 -6297410 -10800115 -11327708 -8391389 -6515222 -7466587 -8683183 -8256941 -7438806 -7426876
41445 -7426876 -7244811 -6209136 -5511060 -5567055 -4229575 245435 6058385 9679734 9833703
41436 9833703 8094291 6254517 4544563 2198056 -1108911 -4287251 -5200591 -2723658
41428 -2723658 1477246 4263454 4306884 2903265 1492509 150851 -894561 -295346 2386213
41419 2386213 5032218 5027410 2258543 -1280531 -4226017 -6687062 -8514317 -8180926 -4238910
41410 -4238910 2222633 7184843 6851338 1884927 -2545639 -2438328 205554 442244 -2372450
41401 -2372450 -3761604 -1091229 2443282 2907358 1475961 1998748 4936869 7438889
41393 7438889 8356653 9442460 11587527 13096963 12336612 9697914 6364241 3116488
41385 3116488 741954 -276774 -781966 -1761075 -1997191 799854 5884159 8860280 6614024
41376 6614024 1327648 -1819877 -59678 4743393 8369069 7998414 4465553 1290987
41368 1290987 914660 2054337 1855333 68127 -1057034 -992885 -2179425 -5867092 -9260714
41359 -9260714 -8784700 -4436885 1039069 5702778 8979035 10199989 9393582 8803796 10753496
41350 10753496 13987593 14727580 11747904 8003441 6492450 6803395 6988339 6815364 7273157
41341 7273157 8054551 7533013 4952087 1285046 -1883806 -3346900 -2603479 -393836 1414693
41332 1414693 1714455 1662818 2895367 4494571 3777781 585268 -1498930 212316 3419552
41323 3419552 3739743 785703 -1350136 300688 4160611 7126865 8612257 9923757
41315 9923757 11318536 11731943 10594688 8083734 4042370 -1569910 -7155962 -9892218
41307 -9892218 -8108437 -2693187 3676400 8170125 9363081 8152044 6630882 5326209
41299 5326209 2606819 -2028871 -5610015 -4865447 -791602 2609017 3727992 4519496
41291 4519496 6139575 6760104 4994649 2651473 2127451 3102047 3789549 3840747 3956270
41282 3956270 3867399 2843353 1547630 1491423 2788714 3750425 2683090 -480380 -3844439
41273 -3844439 -4551693 -1218953 4099738 7593305 7762514 6278658 4575872 2181296
41265 2181296 -512923 -948085 1732874 4144129 3127945 769756 1369715 4799304
41257 4799304 6809986 5354549 2639055 779207 -792632 -2830120 -4480425 -5036846
41249 -5036846 -4792878 -3409317 -192583 3284186 3871405 1265291 -1209902 -1577918 -1971071
41240 -1971071 -4630909 -7967628 -8871655 -6717052 -2945497 1111344 3727145 2418414
41232 2418414 -2967127 -8387869 -9732683 -7666582 -5756109 -5096167 -3922822 -1719033
41224 -1719033 -219448 -161467 -22348 1292591 2754575 2944556 1809339 214060 -858926
41215 -858926 -487029 1460529 3716727 4886177 4927230 4183357 2054859 -1304445 -3105156
41206 -3105156 -748639 3906243 6410925 5863564 5450547 6280806 5098756 210863 -4518658
41197 -4518658 -5144396 -3946604 -5857042 -10516394 -12744820 -10313104 -6355862 -3440625
41189 -3440625 -22308 5102596 8840393 7721612 3364175 404386 195286 44918
41181 44918 -1743349 -3698018 -4637018 -5863345 -8134527 -9170784 -6917734 -3713484 -4022802
41172 -4022802 -8228803 -11542457 -9844763 -4405890 373931 2143090 1928618 1525013
41164 1525013 1576259 2119090 3404738 5482907 7466238 7669384 4782335 -614023 -5770175
41155 -5770175 -7901057 -6924637 -5257688 -4745653 -5166965 -6205360 -8816973 -13035778 -16209217
41146 -16209217 -15880382 -13414907 -12059079 -11884434 -9677001 -4116451 1975882 5624615
41138 5624615 7253626 8655415 9722867 9391293 8234686 7651208 7179605 4900002 511106
41129 511106 -3693899 -5236449 -3824916 -1272335 110919 -880421 -3482652 -5530855
41121 -5530855 -5291482 -2726223 994610 4453880 6201566 5244745 2409729 445265
41113 445265 1478135 4602349 6968280 7093585 6292220 6948717 9951004 13632493 14967245
41104 14967245 12394232 7776086 4662201 4178772 3934703 1829292 -649392 -536963
41096 -536963 2418363 5691793 7428734 7953449 8185428 8460284 8804685 8722185 6988567
41087 6988567 3389416 179355 -336147 689786 100890 -2403203 -3893686 -3159021 -2572723
41078 -2572723 -3556725 -3619533 -607721 2830865 2699342 99296 195532 4686774 8943706
41069 8943706 8061030 3272433 276575 2269603 6594208 8427525 6496054 4139620
41061 4139620 4849530 7893978 9413120 7313756 3382385 275322 -1643482 -3247756
41053 -3247756 -4016562 -2310764 2460832 9482914 17558530 24835109 28401393 26546760
41045 26546760 21394372 17091988 15015065 12732482 8204603 2869138 -507984 -1219494
41037 -1219494 -433497 912236 2318015 2785114 1567389 -339557 -959825 287631 2043405
41028 2043405 2911706 2875052 2515914 1745996 33696 -2395636 -4283163 -4644459 -4231632
41019 -4231632 -5085948 -8070971 -11186272 -11316042 -7795409 -3194923 -103285 1691281
41011 1691281 3795508 6018722 6313150 3782767 184461 -2000159 -1888946 -241018
41003 -241018 1656796 2565311 1931024 887156 1616594 4499384 6730670 5377796 1325510
40994 1325510 -1746903 -2256389 -2223895 -3114688 -2765064 1274073 6943173 9240440 6356231
40985 6356231 1558941 -1370694 -1923946 -1172184 871360 4018991 6077718 5215576 3340531
40976 3340531 4119305 7482981 8941949 5509136 105423 -1758722 1520931 6320841
40968 6320841 8420642 7092363 4374454 2003564 277306 -848707 -1153699 -958854
40960 -958854 -1286664 -2294171 -2441979 -592295 1665038 1755162 217093 608305 4279219
40951 4279219 7711688 7138083 3743962 1361381 516646 -1347405 -4082504 -3705470 1508197
40942 1508197 7457240 9158808 6689834 3684359 2071146 1240173 878916 1255742 1183047
40933 1183047 -1121401 -4770766 -6307422 -3708029 1610738 7167715 11683726 14199236
40925 14199236 13105156 7887619 967239 -3747560 -4149376 -1263046 2292975 4636053
40917 4636053 5755448 6852711 8582370 10041887 9825255 7810430 5186726 2837145
40909 2837145 672236 -1211860 -1735885 15807 3180774 5258375 4088509 -111702
40901 -111702 -4539628 -6037101 -4022975 -951519 479332 -79860 -1402065 -2910625
40893 -2910625 -4605945 -5497144 -4243835 -1470795 572534 1174797 2071696 4403968 6694704
40884 6694704 7098212 5910984 4242933 1802657 -1828526 -4846739 -4792511 -2236628 -363233
40875 -363233 -451298 -174428 2406090 5159593 4312895 -168128 -3751281 -2424542 2644156
40866 2644156 6477057 5832246 2363361 59897 485320 1595403 1094908 -362756 -126175
40857 -126175 3033810 7503394 10612657 10883081 8496909 4609888 772379 -1618188
40849 -1618188 -2091014 -1321640 -250332 899653 2423101 4160704 5333136 5588883 5775953
40840 5775953 7093360 9442336 11048103 9945805 5697009 -302288 -5760792 -8712098
40832 -8712098 -8635627 -6977393 -5973610 -6182078 -5651531 -2447880 2479484 6220836 7442305
40823 7442305 7409550 7298139 6304261 3394756 -494861 -3374369 -4437297 -4107318 -2602001
40814 -2602001 -6683 2473845 2949799 1067042 -1084251 -909155 2045483 5629306
40806 5629306 7293608 6746492 6108701 7062746 8439591 7802780 5121705 3063567 3273660
40797 3273660 4374921 4635742 4578626 5332071 6218649 6053413 5345961 4951436 3952167
40788 3952167 1487509 -687532 -666611 -290811 -2669816 -6295813 -6195823 -1559088 2502170
40779 2502170 2480097 1175147 2166430 3828407 2798407 222585 -32564 2508944 5022573
40770 5022573 6348616 7563563 8349601 7154959 4819799 3821596 3741734 1866992 -1028019
40761 -1028019 -266594 5486665 10928871 11008551 7742963 6805764 9832120 13668782 15549671
40752 15549671 15388159 13771168 11020887 8171528 6310127 5001102 3454697 2817073
40744 2817073 4928385 9059213 12360296 13590028 13958096 14092067 12845550 9932434
40736 9932434 7342746 6872745 8070550 9792756 12054704 14968515 17345432 17942226
40728 17942226 17135530 16059955 14969680 13680969 12837845 13527266 16232344 21046474
40720 21046474 28009393 36130496 43002151 46750567 47801206 47619892 46515301 44002287
40712 44002287 40554651 37418923 35130283 33540864 32666533 32033248 30014498 25740317
40704 25740317 21036827 18321029 17110909 15168393 12744688 12462428 14537105 15617311
40696 15617311 13851272 11903680 12704501 14943248 15610091 14826778 14824943 15534314 14729644
40687 14729644 12020199 9412179 8014737 7297314 7744883 10923671 15986890 19087382
40679 19087382 17807807 14036013 11144119 10335434 11031589 12640360 14114691 13608229
40671 13608229 10722179 7893479 7638854 9449538 11213657 12624324 15047582 18651693
40663 18651693 21757657 22869824 21812387 19300865 16906704 16717951 19111044 21410039
40655 21410039 20851167 18422095 17385347 18301782 18447073 16565444 15068209 16121781
40647 16121781 18262700 19038506 19130120 21417787 26788134 32787466 36077036 35115587 31217014
40638 31217014 28054248 29106431 34373461 40655983 46156659 53067909 63725772 76048070
40630 76048070 85821915 92556350 99636384 108830527 118317278 126950647 136846520 149837862
40622 149837862 164350650 178334746 192973667 210460145 229633928 247148557 262287070
40615 262287070 277229615 292313350 304222967 310038076 310504958 307590787 300739989 287820534
40607 287820534 268993494 247658167 227574892 210317985 195452358 181868435 168570975
40600 168570975 155175275 142427365 132040790 125578961 123311276 123995240 125671213 126947348
40592 126947348 127897578 129683196 133059990 137325289 140940853 143046333 144007089 144413556
40584 144413556 143766560 140363135 132719965 121364307 109043623 98527423 89960093 80956959
40576 80956959 69716909 57464776 47231946 40804819 37723584 36708914 36634071 36047838
40568 36047838 33378561 28634037 24086656 22271105 23611849 26545969 29252820 30292364
40560 30292364 28200144 22192054 13834394 6907935 4539878 6476416 9516493 10556448
40552 10556448 9138722 7288168 7036665 8086863 8183880 6162765 4117218 5347695
40544 5347695 9970956 13918050 13250578 8598052 4189716 3177090 5299355 8634938
40536 8634938 11636605 13040504 11711782 7948324 3978802 1965934 2027857 2936556 3835898
40527 3835898 4279309 3677413 2289047 1952663 3884822 6179986 5743660 2761730 787020
40518 787020 1763689 3595015 4041424 4372070 6589893 8991953 7995360 3813282 763278
40509 763278 1283129 2760814 1864117 -482706 -763912 1989965 5336780 7264877 8422900
40500 8422900 9941548 11006967 10087770 7735051 6546236 8137929 11287245 13737331
40492 13737331 15009081 16264911 17782517 18236415 16965038 15314995 14532028 13680016
40484 13680016 11404690 8722067 7724672 7972217 6905846 4165562 2573220 3555793
40476 3555793 4295670 1636760 -3161287 -6253268 -6539935 -6193323 -6274373 -4979614 -1111712
40467 -1111712 3129452 4460792 2436349 -379758 -1704188 -1893164 -2890537 -5408735
40459 -5408735 -7760121 -7892285 -6225514 -5292797 -6194631 -6846513 -4914953 -1310115 856273
40450 856273 -73939 -3422001 -7923230 -11862516 -12053858 -6082016 3495637 10033929 9610040
40441 9610040 5033086 1609328 1036924 1591808 2461047 4718416 8348193 11128145 11268007
40432 11268007 9484457 7641928 6393349 4962417 2802264 860627 941085 3544222
40424 3544222 6545524 6971025 4390334 1428126 324028 400354 93138 -25869 1680471
40415 1680471 4631402 6162708 4948214 2287719 -207139 -2191005 -3285803 -2217689
40407 -2217689 1423344 5736503 8117076 7830313 6283853 5266377 5454221 6201567 6449092
40398 6449092 6120039 6323128 7388159 7363866 4274190 -273280 -2158071 -169147 2159610
40389 2159610 1694285 254157 1501451 5159602 7694547 7891892 7997042 9026345 8747109
40380 8747109 5905869 3216434 3439078 4621262 2490782 -3239338 -8073039 -8427470
40372 -8427470 -5509761 -2723289 -1432887 -730598 128750 852894 1064392 685095 -373492
40363 -373492 -1742637 -2061382 -214754 2761200 4221933 2823777 -39602 -2187654
40355 -2187654 -3068513 -3492421 -3916021 -4227562 -4721769 -5846153 -6998610 -6973945 -5923229
40346 -5923229 -5508698 -6458103 -7276158 -6434513 -4666334 -3602415 -3071834 -1793641 -367717
40337 -367717 -1086751 -4161751 -6478034 -5568397 -3008696 -1943685 -2616303 -2759536 -1689101
40328 -1689101 -1237397 -2411254 -3705998 -3683547 -3132639 -3422639 -4450061 -5620643 -7295461
40319 -7295461 -9567445 -10902023 -9936293 -7699210 -6058943 -4764646 -2316884 682669
40311 682669 1684017 20706 -1715128 -860241 2540771 6622647 9441590 9335052 5822786
40302 5822786 1162328 -1134236 -493190 228109 -372869 140017 3240626 5422263 2939534
40293 2939534 -1558085 -2132337 1343541 2605578 -1470099 -5986503 -5325049 -948391
40285 -948391 2021820 2887298 5087397 9048785 10324241 5771338 -1945391 -7559524
40277 -7559524 -8710740 -7064248 -5725805 -6670314 -9313931 -10643663 -7949897 -2169570
40269 -2169570 2744890 4385236 4216565 4526185 5024942 4117858 1867534 -485527 -2716583
40260 -2716583 -4830128 -4997393 -1397946 3876334 6008190 3546843 466163 573556
40252 573556 2434775 2085600 -1270166 -5000990 -7092062 -7501831 -6269073 -3415461 -753157
40243 -753157 -856176 -3614089 -6215308 -7107355 -7486478 -8149569 -7724566 -5560786 -3803871
40234 -3803871 -4398840 -5909757 -5637038 -3494375 -1479547 -417911 355356 777277 -116616
40225 -116616 -2365364 -4934198 -7110209 -8520088 -8472252 -7072026 -6184308 -7218317 -8732240
40216 -8732240 -8541662 -7376981 -7631115 -9048677 -8990975 -7012144 -5612943 -5723250 -4939770
40207 -4939770 -1646251 2233330 4292405 4674032 4289212 2740358 52854 -2104256
40199 -2104256 -3128850 -4849240 -7742344 -8572249 -5078132 -615829 -73704 -2680487
40191 -2680487 -3229098 138304 3701548 4004168 1981922 312706 4404 857811 2409303
40182 2409303 2967124 236571 -5437592 -10416048 -11840099 -10667279 -9370426 -8499703
40174 -8499703 -7279620 -6117340 -6330439 -7815905 -8611264 -6886724 -2684747 2118843
40166 2118843 5186041 5452505 3820695 1860257 44182 -2055553 -4284029 -5822969
40158 -5822969 -6300208 -5612872 -3047208 1543600 5798771 6316159 2519177 -2833250 -7175641
40149 -7175641 -9851127 -10118100 -6723363 -877177 3373133 3880163 3009374 3309178 3312411
40140 3312411 792827 -2160535 -1552774 2039585 3726643 1264717 -2088989 -2692845
40132 -2692845 -1207325 -521445 -1502751 -2788437 -3169078 -2253707 269768 4208546 7859702
40123 7859702 8753058 5968725 1585098 -489658 2190297 7997767 12519269 13112835
40115 13112835 11390804 10308024 10086019 8810062 5972318 2842054 -243901 -3991859
40107 -3991859 -7320297 -7653306 -5226444 -4046710 -6475537 -9324101 -8053668 -3210720
40099 -3210720 299929 -429759 -3540859 -5827869 -6197414 -5139623 -3068385 -489267
40091 -489267 1481083 1979404 1237292 -29882 -1434907 -2574942 -2536804 -606669 2569539
40082 2569539 5067793 5227534 3201181 962192 603372 2504155 5223457 7007968
40074 7007968 7015838 5359042 2937056 1348007 1714722 2998537 2726904 320205 -1648738
40065 -1648738 -945202 874657 642615 -1577088 -2461266 -275709 2892450 4399537 4014213
40056 4014213 2477058 -409783 -4316579 -6954898 -6497966 -4228758 -2527340 -1300706
40048 -1300706 1037846 3834100 4515591 2764292 1446876 2571706 4755207 5697439
40040 5697439 4936892 3045091 387989 -1861246 -1824533 -57205 -417168 -5087952 -10322774
40031 -10322774 -10344288 -4761498 1052593 2826267 1525646 219022 -190540 -850506 -2679343
40022 -2679343 -5407859 -7540799 -6946957 -3307672 -44518 -1178928 -5690094 -8022430
40014 -8022430 -5447723 -1731867 -1503615 -4172069 -6301884 -7158840 -8120595 -8636142 -7056933
40005 -7056933 -4447617 -3440218 -3890560 -3810945 -4208171 -8217019 -14873891 -18707672 -17239258
39996 -17239258 -14356212 -13762852 -13308873 -9301392 -3040809 1113677 1943395 1454794 300906
39987 300906 -2539597 -6079204 -7487347 -6357949 -5430971 -6392827 -7865744 -8294051 -8026073
39978 -8026073 -7470734 -5755317 -2709219 -187575 162149 -970339 -1906344 -2055131 -1439311
39969 -1439311 316174 2817517 3822042 1349846 -3339808 -6489216 -5793637 -2601818
39961 -2601818 -7333 382447 -587202 -1275378 -1218449 -1291766 -2134239 -2921974 -2144918 562543
39951 562543 3847916 5879086 5826936 4339014 3049628 3408478 5397237 7557587 8714734
39942 8714734 9090830 8984572 7360482 3450151 -780988 -2035623 134541 2681550
39934 2681550 3290092 3106146 4105296 5924362 7162555 8003391 9093681 9023892 5768916
39925 5768916 338035 -3680467 -4540160 -4019055 -4161749 -4613637 -4265656 -3548646 -3435213
39916 -3435213 -3466480 -2585253 -1304723 -1360858 -3228767 -5201676 -5130191 -2346494 2092474
39907 2092474 6272069 8416302 7749562 4856454 1227740 -1439908 -1669632 1064809
39899 1064809 5205245 7391076 5249200 10125 -4613447 -6136582 -4822486 -1732969
39891 -1732969 2700864 7274950 9225957 7023166 3053097 1260426 2371449 3699191
39883 3699191 3729446 4178193 6417458 8409059 7343904 3751310 657760 -404619 -317656
39874 -317656 -78146 -107045 -1506621 -5149543 -9038357 -9231798 -4503384 2037132 7004809
39865 7004809 10160053 12370216 12639733 9734142 5309890 2706715 3164641 5378657
39857 5378657 8146030 11057486 12884047 11893149 8224770 3961347 502447 -2198333
39849 -2198333 -3608039 -2336339 1129396 3665350 3073670 848163 -98367 867157 2122562
39840 2122562 2239702 839096 -1817455 -4324364 -4272695 -926264 2972151 4154939 2942071
39831 2942071 2035174 1806017 47717 -3177952 -4164621 -1073576 2190387 843209 -3743704
39822 -3743704 -5516863 -1822756 3535766 5928431 5253111 3985452 2656901 123236
39814 123236 -2982132 -4086635 -2096756 1156502 3364886 4090554 4253916 4722690 5986327
39805 5986327 7895354 8920332 6870434 1533451 -4044318 -6029478 -3431608 1227607
39797 1227607 4447402 4505559 2369892 648921 1293020 3789920 5982263 6830294 7373226
39788 7373226 8458989 8943513 7454697 4839927 3136848 2773387 2564264 1979705 1417322
39779 1417322 471053 -1819650 -4793779 -6494471 -6682837 -7221917 -8604749 -8585382 -5829093
39770 -5829093 -2656626 -1910384 -2778165 -2347857 -242349 1138252 651826 -123139 130047
39761 130047 470136 -316676 -1545276 -1662504 -331007 1479419 2662232 2563840 1245864
39752 1245864 -211672 -485696 301811 510442 -733146 -2069806 -1655189 359355 2230614
39743 2230614 3031484 3289019 3202194 1683915 -1936681 -6038717 -7773888 -6150388 -3217229
39734 -3217229 -1727218 -2277010 -3509253 -4540109 -5699695 -6695589 -5812547 -2239025 1943207
39725 1943207 3855440 3457401 3290308 4659359 6073349 6067403 5634308 6472805 8124896
39716 8124896 8559366 7077042 5182125 4722802 6287265 9249907 12216816 13431419
39708 13431419 11993991 9088760 7058198 6754378 6556338 4571924 1170610 -1394153
39700 -1394153 -1506517 385213 2654623 4049292 4305266 3887633 3379278 2668222 613825
39691 613825 -3733282 -9087359 -11958322 -9972361 -5001947 -1684162 -2505972 -5515886
39683 -5515886 -7324972 -6849880 -4944824 -1863759 2642410 7202544 9348262 8789783
39675 8789783 8172739 9573446 11942949 13273039 13625408 14156036 14426470 13152249 11119613
39666 11119613 10614044 11508631 10611767 6401093 2255286 2522375 6343677 8109298 4365640
39657 4365640 -1966939 -5320874 -3788972 -196344 2131081 2785779 3461246 5232163
39649 5232163 7313686 7929537 6176500 3494823 3047981 6598512 11954086 14796445
39641 14796445 13483011 10752088 9964624 11045700 11401974 9756581 7420389 6235938
39633 6235938 6671986 7647802 7135804 3585339 -1891759 -5513629 -4739978 -1545149 182855
39624 182855 -236697 -396650 412902 25896 -2336914 -4162793 -3670422 -2669053 -3213393
39615 -3213393 -4102281 -3321748 -1640236 -806331 -187090 1433426 2380361 331993 -2926928
39606 -2926928 -3228592 -419432 1162397 -689563 -2951642 -2339975 237270 2274159
39598 2274159 3630347 5287700 6450947 5732372 3839748 2610341 2385327 2500737 3341609
39589 3341609 5495451 7427926 6431625 2062892 -3094828 -6238407 -6555596 -4764494
39581 -4764494 -2048187 270713 1319688 1477731 1819475 2520747 2541644 1127782 -973146
39572 -973146 -2105866 -1324589 582650 1617256 412455 -2338150 -4674192 -5486854 -5083723
39563 -5083723 -3850375 -1836777 10949 68403 -1443191 -1846202 539119 3767196 4873404
39554 4873404 3761855 2377272 1299416 -51740 -620756 1483997 5164308 6621163
39546 6621163 4621758 2678565 4267829 8048025 9796407 7550855 2912245 -1572639
39538 -1572639 -4326141 -4695915 -2867786 78953 2885251 4655940 4488950 1867226
39530 1867226 -1747114 -3269490 -1468924 1133742 1501873 -19269 -1036349 -1025103 -1083883
39521 -1083883 -524739 2716976 7756685 10324634 8319811 5060253 4809321 7191033
39513 7191033 8621051 7746387 6488830 6327818 6518599 6246369 6013962 6115089 5729701
39504 5729701 4525088 3621849 4011427 5300116 6859911 8831432 10906803 11496466 9627577
39495 9627577 6704123 4749357 3592168 1576543 -1331530 -3167466 -2916155 -1954202
39487 -1954202 -1806371 -2027266 -1454594 -419984 -247187 -1067619 -1631503 -1435857 -1804488
39478 -1804488 -4106930 -7493243 -9345060 -8135905 -5224668 -3334805 -3600861 -4776247
39470 -4776247 -5178352 -4427402 -3002934 -1199870 606660 1452047 718366 -690001 -1088972
39461 -1088972 144974 2121748 3501878 3418731 2011603 879751 2063638 5249095
39453 5249095 6949825 4338718 -813411 -4198432 -4391372 -3547157 -2960843 -1313169 1896023
39444 1896023 4470611 4619593 3136920 892870 -2858204 -7532414 -9625941 -7069809
39436 -7069809 -2729106 -277455 1228679 4884807 9853118 12165164 10801714 8605153
39428 8605153 7255825 5516193 2789347 396770 -1330531 -3306181 -4207720 -934401
39420 -934401 5895481 10908049 10688322 8144293 7801148 9952857 12202771 13777104 14912536
39411 14912536 14193773 10115004 4121281 -768010 -3317567 -3817357 -2220699 655845
39403 655845 1793974 -686089 -3854047 -3157811 1213505 4618910 4524597 3251810 3562274
39394 3562274 4750275 4561057 2692745 752908 -53361 -70945 -537835 -1955074 -2742746
39385 -2742746 -471001 4473329 7961010 7014985 4243912 4337410 7065783 7654911 4151013
39376 4151013 82391 -1467625 -2186473 -4374519 -6065915 -4146147 -314508 310010
39368 310010 -3620067 -7343903 -5893639 -161831 4377492 4057880 761485 -870153
39360 -870153 945158 3473341 3632555 2256929 2591620 5518131 8698488 10331382 11033037
39351 11033037 11347666 10215290 7433403 5168293 4880772 4677502 2171711 -1482141
39343 -1482141 -3168228 -2601371 -2660316 -4924027 -7433357 -7585338 -5398331 -3031155 -2263023
39334 -2263023 -3134146 -4235910 -3905640 -1862204 18152 -778683 -4718395 -9406540 -11708228
39325 -11708228 -10604096 -8003097 -6712399 -7364732 -7679652 -5582105 -2655394 -2750875 -6809855
39316 -6809855 -11152969 -12133468 -10526245 -9398110 -9327820 -8400688 -6034133 -3884627 -2960830
39307 -2960830 -2404159 -1556121 -1028001 -1115504 -1089140 -733996 -843005 -1496562 -1528892 -427519
39297 -427519 879919 1863708 3198480 4694457 4314668 945674 -3204562 -4918833 -4004058
39288 -4004058 -3270167 -4741683 -7354875 -8460256 -6596362 -2850186 -344823 -2146871
39280 -2146871 -8543994 -16155058 -20476921 -19603945 -15169962 -9986725 -5718624 -3020250
39272 -3020250 -2740975 -5609215 -10552261 -14420128 -14515671 -11356878 -7986714 -6362009 -5530947
39263 -5530947 -3867172 -1614882 143785 1778787 4240523 6486782 6208614 3275874
39255 3275874 207848 -1231501 -1682684 -1831006 -893033 1351320 3423765 4680153 6683468
39246 6683468 9987953 11804645 9674560 5723526 3929743 4218525 2959842 -883332
39238 -883332 -3977743 -3958684 -3250627 -5662086 -11218785 -16195530 -17142688 -13732189 -8610032
39229 -8610032 -5168515 -4450511 -3926764 -655490 4324320 6842265 5281129 2831400
39221 2831400 2792896 4188070 4190852 2843908 2566396 4132032 5944056 6840452 7041095
39212 7041095 6348775 3845881 -57020 -3089589 -3351146 -993663 2436786 5144226
39204 5144226 5700163 4106762 2413623 2684124 3988299 3029044 -1564454 -6983042 -9176378
39195 -9176378 -7025051 -2811683 508080 1632021 1238868 906411 1474431 2161545 1713219
39186 1713219 397491 -79752 1112187 2772061 3349738 2822318 2222165 2107816 2229458
39177 2229458 2112662 1420737 352011 81686 1947194 5552269 8415389 8181313 4685851
39168 4685851 -405372 -5027108 -7407390 -6696654 -3889128 -1156287 573640 2331652
39160 2331652 4683067 6176538 5614767 4363321 4404820 5184200 4671534 2876742 1807143
39151 1807143 2103512 2226744 1268663 161464 -560068 -1859224 -3886243 -4552744 -2065311
39142 -2065311 2307399 5461400 5738198 3980547 2101053 1546679 2470024 3552020 3275669
39133 3275669 2011557 1903465 3789310 5201354 2806463 -3440465 -9619030 -11336562
39125 -11336562 -7502173 -1076775 3389456 3442867 592359 -1686495 -1855712 -1439368 -2128685
39116 -2128685 -3216612 -2963884 -1449600 -551980 -1377431 -2883421 -3112443 -1167257 1903028
39107 1903028 3769484 2732609 -644209 -4171076 -6316692 -7001079 -6196992 -3480478
39099 -3480478 279386 2582094 2094815 479355 56327 1110137 3059250 6320445
39091 6320445 10352898 11480361 6447502 -2128684 -7646930 -7557514 -6021688 -7223208
39083 -7223208 -9479284 -8498589 -3883588 874456 3565603 5140202 6586485 6842663
39075 6842663 4783705 1492872 -708847 -792604 283612 1178865 1838445 3222421 5414067
39066 5414067 6655158 5177197 1881377 -54494 1249688 4280842 6344646 6792772
39058 6792772 6938811 7639507 8416010 8579606 7813927 5792184 2647627 -77622 -446956
39049 -446956 1358601 2796020 2034215 228872 -329580 511257 839548 -250609 -1363359
39040 -1363359 -1112705 -311274 -672626 -2134074 -2882465 -1833446 251448 2252141 3996670
39031 3996670 5587093 6540750 6379154 5306256 3650793 1445398 -726130 -1395312 205427
39022 205427 2856666 4695058 5299258 5431534 5336249 4552330 3039200 1305820 -314878
39013 -314878 -1582513 -2101939 -2190901 -3155812 -5324117 -6729364 -5570116 -3189850 -2449112
39004 -2449112 -3667957 -4545950 -3779786 -2205158 -480031 1600418 3375112 3820378 4031209
38995 4031209 5999535 8488325 7899281 4313584 2443624 4471543 6180705 3490414
38987 3490414 -879620 -1552095 1424283 3461604 2917835 2917934 6051400 11351925 16617141
38978 16617141 20122947 19869952 14698027 6947545 1202838 -390911 530909 1884935
38970 1884935 3325078 4995251 6625278 8206411 9532977 9291239 6818164 4133504
38962 4133504 3493687 3669024 1975704 -656789 -739711 1739236 2859388 1004663 -1055409
38953 -1055409 -1530775 -2252299 -3972958 -3873640 -793520 1308903 -1160921 -5875785 -8232949
38944 -8232949 -7539069 -5758123 -3055346 959943 3841681 2926001 -42920 -1285680
38936 -1285680 -771001 -1216827 -2397229 -1351460 2006876 4387205 4669184 5292162 7089885
38927 7089885 7197514 3899287 -207135 -1997839 -1674128 -772787 800813 3376629 5505073
38918 5505073 5913881 5910867 7553354 10511532 12582696 12330414 9677383 5030304 -442410
38909 -442410 -4504394 -5546603 -4229807 -2297829 -395397 1723822 3490314 3585310 1731993
38900 1731993 -690988 -2093274 -2148600 -1677224 -1435762 -1288375 -615978 690451 2167573
38891 2167573 3684302 5441117 6760872 6316353 4453191 3537291 4345527 3984937 -18876
38882 -18876 -5221938 -7366644 -6905138 -8107142 -11863194 -14276210 -13334528 -11817161 -11424666
38873 -11424666 -9263578 -3912798 -431112 -4033808 -11551049 -14711554 -10652801 -4150170
38865 -4150170 -62937 1492939 2309494 3111024 4470570 6989847 9394770 9385142 7084124
38856 7084124 4822060 3258303 1067542 -1196168 -900375 1989545 4084662 3958027
38848 3958027 4218713 6110285 6436886 3132987 -111915 869446 3907607 3887964 804562
38839 804562 -914634 37249 615750 -228215 358012 3286996 4904620 2776160 -6745
38830 -6745 497338 3166115 4018580 2156911 -15751 -1172805 -2202805 -3455828 -3894687
38821 -3894687 -3123495 -1883226 -340116 2053344 4778451 6218522 5669289 3744985
38813 3744985 834685 -2829690 -5490309 -4791309 -1295151 1237966 475177 -1592207
38805 -1592207 -2027445 -1221571 -1396656 -2343639 -1777214 461663 1820830 1430987 2226460
38796 2226460 6798051 12899669 15384196 12090679 5942953 1196350 -693882 -758627
38788 -758627 567612 4395696 10820160 16683071 17644073 12970659 7063708 5062808
38780 5062808 7542131 10809969 11903470 11383171 11033887 11008351 10518534 9782813 9548026
38771 9548026 9467945 8490548 6310932 3069887 -1681238 -7902489 -13339004 -15054040 -13067879
38762 -13067879 -10580235 -9919907 -10086145 -9254937 -7793938 -7041516 -6531497 -4815329 -2565772
38753 -2565772 -2394283 -5036550 -7669023 -7182445 -3944158 -1049994 -469293 -1147592 -822592
38744 -822592 1185737 3159653 2538032 -1585998 -7078669 -10165050 -8918776 -5232322
38736 -5232322 -2589093 -2097721 -1893035 -521197 797363 349593 -1063885 -1205669 141810
38727 141810 971931 440013 244858 1714132 3453036 3500926 2486225 2694716 4662902
38718 4662902 6570302 6789091 5395691 3341579 1859565 2588009 6168802 10257527
38710 10257527 11057974 7872246 4253638 3303886 3683821 2290727 -596784 -1619168
38702 -1619168 623625 3605459 4558044 3888710 3758902 4916071 6484270 7954137 9712263
38693 9712263 11682805 12674620 11509099 8313396 4383610 874724 -2186590 -5353404
38685 -5353404 -8204039 -9046255 -7019759 -4039102 -3173497 -4821454 -5984205 -4139267
38677 -4139267 -481581 1871844 1645098 -292327 -3297698 -7192346 -10368297 -10443161 -7750669
38668 -7750669 -5871301 -7082160 -9031596 -7930022 -3788948 -145808 780932 120928
38660 120928 -506575 -1304817 -2827719 -4262542 -4590170 -4064951 -3221544 -1680949 553876
38651 553876 1785328 566695 -1682642 -2126602 -456069 773295 148359 -440782 1116490
38642 1116490 3557141 3586246 230302 -3746340 -4857688 -2354562 1427404 3498696
38634 3498696 2946976 1704483 2465413 5451837 7733846 6592355 3177960 1546481
38626 1546481 3865644 7829981 9459019 7338647 3074507 -1429756 -5376133 -8025498
38618 -8025498 -8366558 -6750475 -5351365 -5604185 -6118007 -4649113 -1464884 1072968 1964124
38609 1964124 2469654 3288915 3146684 1279971 -656395 -761880 546835 1820776 3023676
38600 3023676 4732463 6069912 5602403 3400146 183537 -4203467 -8759313 -9427658
38592 -9427658 -3513173 4526529 6786835 2425709 -610793 3378829 10061714 12021411
38584 12021411 9175716 7053604 7430765 6555007 1873704 -4748833 -10733014 -15228111
38576 -15228111 -17368297 -16205059 -13231043 -11360848 -10637600 -8478919 -4804693 -2896030
38568 -2896030 -3983727 -5137232 -4351494 -3676472 -4878399 -5894390 -4731022 -3439034
38560 -3439034 -4519049 -6231252 -5571090 -3707850 -4101749 -6682782 -8332142 -8355843 -9044710
38551 -9044710 -10842235 -11224089 -9175616 -7139973 -7234721 -8384218 -8512424 -7317338 -5749150
38542 -5749150 -4654294 -4844723 -6756731 -9221414 -10072107 -8568842 -5986095 -3807598
38534 -3807598 -2921585 -4308423 -8290765 -12958543 -15560018 -15757916 -15446083 -15361369 -14397757
38525 -14397757 -12352952 -10359715 -8128810 -4085628 741237 2471927 -194835 -3444151
38517 -3444151 -3402898 -908809 1094647 2053014 2751719 2286129 -391017 -3561508 -4850712
38508 -4850712 -5081354 -6695559 -9269552 -10092737 -8807315 -8001840 -8910612 -9502259 -7448566
38499 -7448566 -2641889 3634995 9818790 13956189 14622016 12567982 9943485 7815503
38491 7815503 6007846 4913068 5198703 5859243 4997928 2721953 967861 370990 -175522
38482 -175522 -733202 -60632 1270975 693896 -2092837 -3563790 -889161 4329318 8647869
38473 8647869 10890909 11687471 10986613 8480639 5173867 2385644 198642 -1504978
38465 -1504978 -1918308 -1009167 -684114 -2014799 -2816298 -617280 3169019 4992262 4333083
38456 4333083 4032519 5742036 8227081 10463288 13217197 16530663 18396630 17416287
38448 17416287 14627408 11258611 6750289 871762 -3912207 -4605401 -1569672 1739102
38440 1739102 2742033 1888055 948432 687293 523345 -649676 -3716252 -8476690 -13002802
38431 -13002802 -14647505 -12591419 -9193934 -8000500 -10095800 -12876275 -12910645 -9809102
38423 -9809102 -6612060 -6244931 -8338787 -10075297 -9507003 -7095345 -4316067 -2024555
38415 -2024555 -476446 189057 261180 539944 1247043 1284557 -506098 -3508672 -5668437
38406 -5668437 -5749685 -4383365 -2581882 -213326 3163834 6600707 8240498 7579296 5972944
38397 5972944 4339403 1624424 -3141579 -8018527 -9272945 -5654657 -79964 3741110
38389 3741110 5232890 6457305 8556236 10236080 9860072 7851792 6366185 6922448
38381 6922448 8737419 9418632 7358566 3459427 201483 -1060926 -1282888 -1875026 -2498297
38372 -2498297 -1733745 437745 2162110 2021223 749044 -9264 95901 15867 -968156
38363 -968156 -2370383 -3408853 -3915571 -3892655 -2846414 -460567 2204211 3168122 1658316
38354 1658316 -813264 -2078340 -1651470 -868632 -1013674 -2015462 -2884419 -2756683 -1465611
38345 -1465611 410213 2022999 3015032 3506069 3197914 1511191 -668659 -805178 2015121
38336 2015121 4790608 4098970 1231084 643546 3186063 4680389 2599527 270020
38328 270020 1639517 5120703 6552513 6078853 7385702 10819975 12088764 8733699
38320 8733699 3975918 2298083 3966280 5889630 5958540 4597857 3205701 2672671 2919294
38311 2919294 3042701 2391209 1647147 1888301 2597880 2049109 -134225 -2397117 -3578681
38302 -3578681 -4114969 -4420811 -3932267 -2635555 -1829191 -2240236 -2785508 -2235778 -770834
38293 -770834 1048932 3310962 5551805 6050042 3899387 726426 -1173248 -1606525 -2005433
38284 -2005433 -2848574 -2944832 -1083748 2401834 5472634 5625440 2250473 -2001172 -3536170
38275 -3536170 -1941224 -269294 -772420 -2389654 -3357270 -3896625 -4601880 -4353105 -2163147
38266 -2163147 479717 1481849 1137649 1041403 1230878 754260 -24958 -120187 104512
38257 104512 137272 1379593 5119281 9289670 10361957 7963434 4554139 1172856 -2789439
38248 -2789439 -5830143 -4773894 -12190 3688670 3352499 1371204 1052844 1930343 1965676
38239 1965676 1492824 1932242 2683316 2335322 1481356 1545466 2122850 2250833 3057622 5943306
38229 5943306 8844462 7837975 2788897 -1698625 -1942899 677997 2459492 2089038
38221 2089038 935293 171083 -245051 -218603 805152 2294873 2142159 -1176339 -6440617
38212 -6440617 -10735398 -12532402 -12586235 -11651485 -9049466 -4700264 -976353 -260124 -1422102
38203 -1422102 -1346375 313847 1053505 622998 2404268 7671104 11952726 10572389 5487543
38194 5487543 2516062 2954350 2410400 -1953207 -7349999 -9778648 -8779007 -5847604 -1372731
38185 -1372731 4041835 7590580 7053138 4520963 4169343 6625720 8498518 7683693 6109996
38176 6109996 6107685 6753444 5902690 4038148 3498702 4615391 5161840 3749989 1564789
38167 1564789 175512 -415572 -735409 -823433 -1498647 -4625230 -10024854 -13646673 -11572848
38158 -11572848 -5262172 -102571 1092400 325305 24788 -175163 -949239 -803467 1396115
38149 1396115 3641513 3426400 1801284 1845700 3843910 5011531 4045044 3080332 4275475
38140 4275475 6666693 7757059 6900782 5806508 6222036 8009328 9507963 9560391 8930671
38131 8930671 9105548 9719459 8654659 5549778 3412085 4765758 7526986 7355523 3453008
38122 3453008 -869407 -3194421 -4276751 -4764709 -3186013 926178 4628673 4768107
38114 4768107 1982305 -545696 -937919 669322 3772752 7539080 10172562 10527083
38106 10527083 9755045 9383401 8565974 5605553 1643978 54982 1891293 4359807
38098 4359807 4448466 2019253 -1330226 -4401593 -6433347 -6854822 -6165381 -5557529 -4719029
38089 -4719029 -1841315 2802666 5259606 2239882 -4006288 -7718324 -6332289 -2921151
38081 -2921151 -1757102 -3591852 -6124408 -7365905 -7167648 -6272453 -5060493 -3119759
38073 -3119759 306458 5076005 9317689 10734124 9117353 6742869 5806222 6258411
38065 6258411 6586957 5760237 3825604 1640964 700555 1963589 3919125 3403508 -39891
38056 -39891 -2204773 879516 7136256 10651538 9413817 7286737 7576978 8471620 6997944
38047 6997944 4244480 3353478 4385049 4793821 3954742 3603162 4048707 3471207 1443385
38038 1443385 -99381 -439759 -1675613 -5144840 -8741810 -9818872 -8856651 -8063345 -7815457
38029 -7815457 -6920398 -5460291 -4747659 -4636824 -3319154 -267745 2602265 3554923 3278828
38020 3278828 3449708 4181777 4244749 3360332 3030392 4840633 8543012 12077818 13307105
38011 13307105 11777394 9089924 7568687 8249573 10005410 10777150 9676225 7573594
38003 7573594 5565083 3518722 819078 -1858328 -2651076 -647807 2974584 6334602
37995 6334602 8465501 9074943 7874365 5247474 2718581 1426921 734692 -296319
37987 -296319 -736959 1030607 4230436 5930805 4777129 2635045 1886903 2797604 4283047
37978 4283047 5495563 5566759 3476053 -321497 -3392368 -3975318 -3168238 -3061331 -3684659
37969 -3684659 -3462956 -1976620 -458804 219165 448296 637482 245642 -1620485 -5060670
37960 -5060670 -8639983 -9742387 -6774721 -1537993 2111095 3008991 4340780 8820014
37952 8820014 14004955 15146236 11644409 7481003 5390121 3823647 417043 -4354420
37944 -4354420 -8315159 -10330211 -10589722 -9729682 -8823185 -8967796 -9965334 -10516063 -10177280
37935 -10177280 -9654892 -8762700 -6078510 -1528840 2627781 4613442 5173112 5558651 5373762
37926 5373762 4101421 3035457 3576043 4780922 4629332 2814160 485247 -1730225
37918 -1730225 -3463079 -3401380 -750698 2607023 3658614 1728890 -1452956 -4485220
37910 -4485220 -6797217 -7110672 -4439009 -720914 663852 -254404 287427 3926433 6936320
37901 6936320 5081063 -473348 -4761622 -5265170 -3917557 -3368136 -3680345 -3132202 -756848
37892 -756848 2455878 4275092 3259527 560315 -947883 -89403 940681 -528831
37884 -528831 -3947724 -6298239 -5963578 -4052598 -2078913 -240555 1688139 3478128
37876 3478128 5110236 6966639 8686231 8981847 7263814 4442724 1567254 -1265174
37868 -1265174 -4077708 -6307773 -7694149 -8670698 -8992224 -7297362 -3311764 728247
37860 728247 2475106 2363775 2355708 2673045 2034896 739997 906565 3210375 5699455
37851 5699455 6649212 6443830 5542527 2782268 -2486597 -8193848 -11531174 -12109707 -11271677
37842 -11271677 -9280882 -5472594 -702935 2741838 3896934 3908651 3828548 3339398 2000857
37833 2000857 143308 -1873782 -3820012 -4788651 -3965195 -2603023 -3334001 -6736993 -10333237
37824 -10333237 -11811698 -11405975 -10110772 -7723859 -4315453 -1683656 -1157566 -1365779
37816 -1365779 -414349 964079 892392 -63744 346339 2144294 2874595 1441894 -420500
37807 -420500 -961748 -338679 753315 2056246 2786843 2076522 1101598 2279011 5354062
37798 5354062 6963919 5556536 3981751 4992201 6649469 5167937 641121 -3316393
37790 -3316393 -4792206 -5293696 -6394348 -7458732 -7105962 -4860544 -1112512 2757748
37782 2757748 4293534 2077608 -1925158 -4144699 -3686136 -2793666 -2953803 -3052377 -2085462
37773 -2085462 -1175252 -1536984 -2402291 -2425930 -1668256 -967311 -718212 -1202400 -2517317
37764 -2517317 -3375984 -2158786 -351664 -2209996 -8760282 -14687297 -14419408 -9468377
37756 -9468377 -5926057 -5836343 -5532421 -2579145 427040 736338 125630 1723977 4703294
37747 4703294 5430472 2743430 -832760 -2806456 -3261509 -3477662 -3882384 -4050129 -3710486
37738 -3710486 -3142231 -2873253 -3091656 -3285853 -2864415 -2259122 -2640495 -4173443 -5517467
37729 -5517467 -5675414 -5255216 -4992576 -4233869 -2350751 -727234 -1433350 -4210393 -6567818
37720 -6567818 -6950511 -6253878 -6074600 -7008848 -8864476 -10826920 -10941238 -7308218 -848179
37711 -848179 4705349 6895762 7272895 8462791 9789247 8122674 2670697 -3520183
37703 -3520183 -7276025 -8349177 -7842727 -5751962 -2106276 730333 -357319 -5109878
37695 -5109878 -9541312 -10629375 -9642786 -9480567 -10219931 -9436139 -6281915 -2784077 -725488
37686 -725488 549736 2211951 3749670 4296704 4702533 6204900 7806932 7223325 4401419
37677 4401419 2059240 2272045 4201760 5772453 5975962 4724090 2069807 -1049825
37669 -1049825 -2515212 -1201667 1092102 1567505 191329 -110173 2459901 5692537
37661 5692537 5843945 2393164 -1237014 -2136524 -1636575 -3011718 -6114564 -6799806 -2631862
37652 -2631862 3156919 5654972 4677804 4159173 5803337 6989137 5590628 3223063
37644 3223063 1961600 1092486 -349342 -711627 1200176 2409031 -645395 -5854362
37636 -5854362 -7247133 -3215065 1215053 1306995 -1888435 -4444040 -4548859 -2519528 1186759
37627 1186759 5263674 7004287 5291362 2800519 2794154 4928467 6588197 7099725 7776242
37618 7776242 8499100 7302746 3536635 -1026714 -4625459 -7017137 -8296878 -8286286 -7607722
37609 -7607722 -7455904 -7608965 -6345891 -3105236 264402 1731179 1354952 706903 1156270
37600 1156270 3137161 5745501 6622820 3894178 -983332 -3932242 -2880436 -200175
37592 -200175 609535 -932535 -2991336 -4629172 -5997019 -6235675 -3939606 -16521 2115751
37583 2115751 193474 -4262309 -7824323 -8822335 -8290186 -7721486 -6857654 -4207093 378226
37574 378226 4433616 5138703 2745640 551978 1050738 3324303 4972033 5298149 5355007
37565 5355007 5872350 6631329 7242801 7237575 6028804 3937909 2275858 1110737 -1520270
37556 -1520270 -6109218 -9083381 -6957874 -2059672 -59710 -1828317 -2258255 1682469
37548 1682469 6464063 8151629 8707647 11992398 16519018 17281730 13542312 9809660
37540 9809660 8910995 8484994 5527306 863018 -2684645 -4055207 -4090939 -3675344 -3277969
37531 -3277969 -3144218 -2844829 -1662046 -42066 601526 40448 -294808 453364 1511543
37522 1511543 2276165 3249873 4232988 3704910 1537894 328447 1915772 4143225 3568116
37513 3568116 367380 -2108804 -2162494 -1369447 -1307119 -1444008 -1162090 -1473288 -3151770
37504 -3151770 -4799181 -4593405 -3100288 -2616286 -3978719 -5533702 -5515985 -4342725 -3967740
37495 -3967740 -5537305 -8264664 -10434896 -11083201 -10653009 -10279337 -10576629 -11088515 -10917596
37486 -10917596 -9888252 -8816286 -8306102 -7617370 -5615371 -2921141 -1824636 -3200642
37478 -3200642 -4710607 -3659197 -892923 214105 -1480786 -3440476 -3246074 -1511633
37470 -1511633 100871 1540240 3248995 4169580 3050436 550817 -2041416 -5036939
37462 -5036939 -8937580 -11865489 -11345283 -8261660 -5971828 -5363523 -4027940 -1073134
37454 -1073134 657273 -1042145 -4043053 -5078574 -4491809 -4819345 -5918617 -4797356
37446 -4797356 -285795 4905456 7604149 7695664 7158170 6966106 6391971 4987302 3976803
37437 3976803 5075537 8271364 11547126 13110377 13174456 12762619 11586553 8761306 5278827
37428 5278827 3468290 3455462 2591227 -243687 -2110591 -7702 4400652 6791434 5813501
37419 5813501 3849808 2852568 2536326 2599624 3498753 4430925 3555350 1174694 -158189
37410 -158189 99770 -913453 -4824335 -8837932 -9623869 -7953295 -6614561 -5854948 -4369879
37401 -4369879 -3241441 -4737301 -7609256 -7701953 -3816668 646269 2864702 3962563
37393 3962563 5727632 7291170 7401016 7366702 8927395 10903258 10727963 8307107 5972297
37384 5972297 5282191 5818450 6411715 5831749 3253630 -207462 -1739007 -613163 -17494
37375 -17494 -2420987 -5037646 -3784871 -309982 -9186 -3318346 -4765099 -1967770 388314
37366 388314 -1501859 -4220544 -3299821 -1122631 -2659858 -6333130 -5966941 -815556 3123077
37357 3123077 2457824 899100 2418619 5171639 5297748 2906352 920922 559824 981057
37348 981057 1590640 2166172 2062466 1206266 531911 161665 -884265 -1991015 -798299
37339 -798299 2317792 2792473 -2039008 -8154338 -9962136 -8084262 -7714359 -10680548 -13907527
37330 -13907527 -15144626 -15185052 -14076853 -10263653 -4962551 -2649577 -4716982 -6592429
37322 -6592429 -4131888 417041 2152788 458103 -1559327 -2483191 -3221582 -3314029 -1058596
37313 -1058596 2414647 3115214 -545715 -5414801 -7882766 -7977683 -7545110 -6650755 -4223579
37304 -4223579 -1022016 612029 -177026 -1895193 -3112551 -4024589 -5009228 -5238674 -4130411
37295 -4130411 -3290172 -5071038 -8860578 -10436119 -6347667 1677419 8022525 8777839
37287 8777839 4923860 -7470 -3873336 -6776275 -9304420 -11369882 -12481900 -12200817
37279 -12200817 -10519872 -8413145 -7385344 -7515489 -6633924 -2927473 1986834 4458131
37271 4458131 3528281 2294031 3602093 6220687 7035493 5777617 5193337 6763428 8658237
37262 8658237 8700118 7448292 6929079 7471476 7472093 5930823 3769744 2519581 2745212
37253 2745212 3938303 5029835 4777429 2669885 59653 -435017 2326576 6067342
37245 6067342 6815367 2919915 -3005663 -6471066 -5399209 -1885640 278517 -571578
37237 -571578 -3102302 -5568059 -7882292 -10336888 -11621070 -10107719 -6799622 -4767433
37229 -4767433 -5097410 -5444333 -3677260 -981000 367933 596680 1463990 2829501 2979621
37220 2979621 2062588 2340531 4476173 6031388 4728563 1364521 -1545560 -2457699 -1333107
37211 -1333107 668994 937302 -3131188 -10582650 -16282056 -15874918 -10479871 -4740420
37203 -4740420 -1373323 189093 831243 499007 -11501 1070687 3788837 5762998 5350255
37194 5350255 3726440 2613053 1678727 -133843 -2090260 -2571827 -1817502 -1666788 -2643302
37185 -2643302 -3161204 -1950090 345925 2518490 4236269 5323445 5040126 3437874
37177 3437874 2431173 3779773 6324416 6993508 4861349 2634497 3259247 6198841
37169 6198841 8245185 7400575 4706018 2326603 966832 -337439 -2421348 -4644840
37161 -4644840 -5595050 -5016981 -4392334 -4811334 -4651534 -975916 6133064 12205741 12856099
37152 12856099 8731555 4388054 2867468 3266532 3396358 2617919 1460423 227277
37144 227277 -1014692 -2087001 -2918716 -3272216 -2300924 207486 2276071 1580257 -735346
37135 -735346 -591484 3534068 8160857 9627865 8944353 9300963 10785937 10903988 9202563
37126 9202563 7694000 6746097 4070032 -1293722 -6783214 -9417548 -9057832 -7427202
37118 -7427202 -5728726 -4542179 -4553175 -5858236 -7344195 -7774528 -6858781 -4779824 -1736257
37109 -1736257 1451638 3479877 4115638 4590444 5729235 6805162 7021233 6846204 6788748
37100 6788748 6059380 3913576 1469346 541153 1012970 905018 -859531 -2964699 -3324450
37091 -3324450 -1454304 1100899 2339893 1676152 429484 432690 2116314 4169552 4984225
37082 4984225 3998932 1861535 125778 641045 3866525 7339978 7194599 2223151 -4375427
37073 -4375427 -8135568 -7490715 -4210257 -839562 1139927 1483317 971230 785748 1170306
37064 1170306 1088441 -92661 -1375239 -1536016 -796190 232999 2279978 6166335 10345716
37055 10345716 11932489 10440342 8526052 8396090 9248894 9261396 8536891 8497813 9132945
37046 9132945 8559652 5540920 1347870 -1565709 -2411060 -2878275 -4809675 -7596712 -8765101
37037 -8765101 -7062689 -3787739 -663177 2217862 5288795 7604417 7650747 5370377
37029 5370377 1867876 -2191720 -6186923 -8399990 -7693385 -6018765 -6557655 -9156282
37021 -9156282 -10441047 -9023355 -7283374 -6569232 -4223165 1716672 7719963 8626651
37013 8626651 4756435 1057983 -76800 -668137 -1586633 -115060 4720801 8535210
37005 8535210 7073152 2925008 2562022 7442056 12011805 11051963 5679062 741574
36997 741574 -991187 38521 2867452 6961740 10829111 12097906 9785235 5397543
36989 5397543 1344789 -930932 -1133887 398087 2702263 4409217 4713758 3940809 2952694
36980 2952694 2482713 3179209 5434958 8633402 11311796 12707657 13385994 13615888 12162841
36971 12162841 8059406 2850971 -741717 -2286502 -3913116 -6780515 -9122967 -8718636
36963 -8718636 -5731731 -1859537 1999361 5564123 7589915 6550777 2939574 -719614
36955 -719614 -2463310 -2267425 -713844 2110398 5604460 7946507 7824253 6289516 5573513
36946 5573513 6251951 6820129 6160327 5141337 5155605 6039645 6367026 5264981 3053276
36937 3053276 515718 -1429543 -1670428 88008 2119722 1968276 -461859 -2493511
36929 -2493511 -2241395 -1118657 -1356545 -2441929 -2315815 -1394593 -2539372 -6552930 -10292493
36920 -10292493 -10643176 -8603885 -7870415 -10491964 -15242479 -19255657 -19915227 -16087907
36912 -16087907 -9188551 -2759725 300385 158592 -703754 92670 3702190 9888443
36904 9888443 16409462 19541771 17224259 11593160 7012298 5771382 6772931 7656158
36896 7656158 6589069 2764062 -2602911 -5958060 -4468014 202364 3158070 1788370
36888 1788370 -1768925 -3940904 -3411109 -1018784 1716099 2960231 1525835 -1321528
36880 -1321528 -2745871 -1971154 -1027157 -951464 55040 2915481 4951019 3759206 1671808
36871 1671808 2771903 6609417 8573635 6285703 2224149 -310226 -674446 465303
36863 465303 3029462 6508832 9011719 8933131 6630988 3709815 1623393 1224823 2302845
36854 2302845 3217726 2398477 467531 -566190 -251921 5754 -342556 -293019 259453
36845 259453 -13925 -940739 -25165 3782444 7796882 9040283 7950148 6503916 4607408
36836 4607408 1094654 -3007734 -5164748 -4733462 -3163974 -1198004 1730164 5466659
36828 5466659 8767872 11018552 12441080 12739596 11468050 9565378 8468220 7780320
36820 7780320 5913608 2963258 673587 -452694 -1427174 -1875487 172004 4475908
36812 4475908 7279661 5619178 1072029 -2475259 -3289177 -2536740 -2047683 -2883184 -4910912
36803 -4910912 -6437992 -5511104 -2813797 -1709700 -3847481 -6336423 -5283184 -781876
36795 -781876 3801675 6283390 6840242 5668334 2545390 -1209285 -3124593 -2659269 -1848251
36786 -1848251 -2254008 -3149594 -3399527 -3320727 -3706305 -4409648 -4817945 -4635881 -3547494
36777 -3547494 -1213403 1838713 4435718 6243082 7681308 8081389 5922115 1934056
36769 1934056 -44201 2775661 8282227 11650306 10643443 7036411 3499428 1174731
36761 1174731 184984 326947 515463 -934564 -4434853 -8238256 -10063685 -9161175 -6560678
36752 -6560678 -3978175 -2776087 -3239358 -4304659 -4447332 -3319438 -2205233 -2447575 -3644326
36743 -3644326 -3828759 -1509630 2583111 5870688 6179115 3643338 147929 -2970796
36735 -2970796 -5838450 -8417982 -9328663 -7672232 -5224642 -4815387 -6477286 -7186228 -5074021
36726 -5074021 -2060735 -1134870 -2577270 -4477760 -5837311 -7197297 -8645790 -9012330
36718 -9012330 -7134791 -2828238 2979371 7811416 8226855 3122980 -3673081 -6589976
36710 -6589976 -4594078 -1949975 -2073473 -3543241 -3869052 -4153578 -6749153 -10207339 -10659560
36701 -10659560 -7857371 -5813678 -6566986 -6966081 -3683232 1408489 3727893 2233762
36693 2233762 95948 -414307 -735232 -2967708 -6247451 -7771726 -6504522 -4291909
36685 -4291909 -3234103 -3042340 -1729643 1393560 4316664 4398978 1325795 -2753489 -5687898
36676 -5687898 -6772544 -5760290 -2170404 3220852 7354132 7252428 3484262 -76082
36668 -76082 -276247 2531345 5964132 8538147 10168236 10690416 9452792 6485397 2909884
36659 2909884 -298848 -3105653 -5388618 -6076257 -4543235 -2367761 -2017628 -3524208
36651 -3524208 -4138232 -2164695 441018 854294 -429798 -327792 2322242 5225864 5895004
36642 5895004 4404451 2142104 -355012 -3029864 -5025454 -5259793 -3836199 -1947850
36634 -1947850 -661772 -252994 -299202 -234482 -393944 -2259568 -6383459 -10244075 -10238644
36625 -10238644 -6392045 -2904731 -2858709 -4522611 -4582771 -2935446 -1836414 -1843249 -1526168
36616 -1526168 -539180 -147230 -687505 -941619 -431300 -394022 -1935256 -4603177 -7122547
36607 -7122547 -8486914 -8370095 -7424716 -6779059 -6274321 -4087521 576218 5567770 8287702
36598 8287702 8760415 8019039 5016438 -1545194 -9171881 -13137518 -12126247 -8938700
36590 -8938700 -5695127 -2314040 -60765 -1795718 -6835023 -9799934 -7279944 -2323878
36582 -2323878 330446 292660 -162965 -694132 -2056578 -2934216 -1576619 713857 1332737
36573 1332737 715664 1627058 4706025 7690635 8636508 7373382 4531251 1713658 1614906
36564 1614906 4950137 8154349 7457929 4540042 4344741 7500909 9144069 6056699
36556 6056699 940091 -2081224 -2761127 -3333170 -4549245 -5676496 -6664088 -7936144 -9103090
36547 -9103090 -9743429 -10547356 -12024293 -12851440 -11129664 -6901233 -2199799 1023642 1981426
36538 1981426 580303 -2678224 -6098829 -7209897 -4707278 74488 4252575 6271977
36530 6271977 7146938 8231988 8703851 7104006 4991450 6081530 10666528 13953064
36522 13953064 12267019 8204928 6397865 6541665 4986236 1725638 513300 2089483
36514 2089483 2751386 962711 254743 3131258 6603948 7056582 5797421 5911816 6562392
36505 6562392 4856643 1538972 191939 1287141 1196004 -2325813 -6855627 -8483848
36497 -8483848 -6143293 -1991158 976456 1161296 -615655 -2004035 -1711378 -877880 -1158075
36488 -1158075 -2332271 -3066634 -3138786 -3279362 -3455186 -3062256 -2434360 -2439467 -2740002 -2004942
36478 -2004942 181518 2850718 4840422 5331099 3788124 829544 -1361425 -1143842
36470 -1143842 322799 460577 -1352789 -3308944 -3748700 -2569147 -278609 2595824
36462 2595824 5104764 6428070 6936732 7497191 8030596 8105569 8279467 8973751 8672161
36453 8672161 5690460 1519331 -315774 987423 2594965 2429241 1580535 1276647 476638
36444 476638 -1561319 -2850088 -1359584 1598234 3273229 3586489 4730897 7343043
36436 7343043 9644139 10300850 9845687 8932885 7180209 4503004 2164684 1541151 2504825
36427 2504825 3600422 3476606 2016132 410905 29904 901767 1757559 2017852 2834701
36418 2834701 5058046 7023335 6205170 2899357 253029 206563 1395288 2067914 3120385
36409 3120385 6310711 10663638 13028463 12047485 9463559 7146125 4837869 1851961
36401 1851961 -689116 -1021164 612708 2104767 2124214 1358070 1125093 1853437 2994855
36392 2994855 3415499 1828372 -1952962 -5918947 -7318313 -5848588 -4260641 -4954694
36384 -4954694 -7033944 -7842070 -6511247 -4504688 -3111697 -2073428 -859643 158834
36376 158834 523361 782709 1937981 4049813 5846737 5604413 2337433 -3393158 -9370401
36367 -9370401 -12627160 -11234533 -5855382 466040 4642287 6092025 6682759 7892915
36359 7892915 8754885 7415702 3969247 227682 -2977959 -6284257 -9304020 -9901585
36351 -9901585 -7197326 -3544012 -1909101 -2553129 -3817765 -4877777 -5827561 -6126024 -5141107
36342 -5141107 -3648351 -2787629 -2091424 -593903 746153 208041 -1423349 -1521927 213628
36333 213628 1018402 -798216 -3543746 -4969130 -4916521 -3847471 -1256182 2418483 4259687
36324 4259687 1740940 -3788361 -8427678 -9829722 -8440194 -5659266 -2746344 -989848
36316 -989848 -947155 -1505412 -1193899 -323198 -346185 -1162586 -727194 2173002 6019179 8160633
36306 8160633 7605951 5681522 4388180 4549818 5358076 5446515 4381825 3035768 2509040
36297 2509040 3038291 4129892 5316078 6378358 7138007 7463532 7369150 6920968 6283860
36288 6283860 5932637 6347591 7282857 7796748 7285971 6140397 5238314 5172844 5919595
36279 5919595 6667147 6084751 3607632 410413 -1898921 -3426108 -5390935 -7346208
36271 -7346208 -7077362 -4186485 -1716336 -2415031 -4796040 -5003518 -1788363 2435140 5008612
36262 5008612 5357318 3988090 1422317 -1203616 -2265610 -1431577 -142859 609056 1905915
36253 1905915 5071607 8899148 10254731 7678756 3284656 428469 165823 913497
36245 913497 1240630 1555182 2451176 2728483 649693 -3175995 -5737675 -4766741 -911451
36236 -911451 3318382 5641019 5030564 2244881 -128771 425391 3672789 7022933 9001573
36227 9001573 10582816 12255097 11976550 8047909 2586097 -230693 1099373 4265426
36219 4265426 6364656 6538664 5602155 4676635 4372190 4310543 3520994 1924131 727040
36210 727040 542605 239203 -1084215 -2222045 -1677325 -222744 381928 207195 339206
36201 339206 183833 -1527654 -3503131 -2898571 180089 2290059 1439668 -683719 -2123169
36192 -2123169 -3186883 -4256697 -4214689 -3018289 -2918945 -4629361 -5007796 -1754031 1873158
36183 1873158 1020958 -3414371 -5830707 -4080636 -2034622 -2992996 -4952531 -4915197 -4332695
36174 -4332695 -6504717 -10556386 -12196235 -10129262 -7881281 -8368666 -9876575 -9266129
36166 -9266129 -6841924 -5599300 -6827359 -8774266 -9229237 -7510247 -4154085 -485809
36158 -485809 1546419 942213 -673313 -496137 2151564 5524778 8431903 11377111 14298520
36149 14298520 15522943 14078608 11061217 7571404 3380197 -1007668 -3282828 -2347386
36141 -2347386 -478193 -263265 -1067629 -833858 328778 1002506 1352576 2232893 2730454
36132 2730454 1726697 705904 1561646 2635793 884093 -2550140 -3224371 -84876
36124 -84876 2887818 2443589 -401498 -3432899 -5908707 -7047729 -5858739 -4042177 -5232515
36115 -5232515 -9594675 -12930912 -12879526 -11727171 -10831392 -7188860 670015 7785805 8784922
36106 8784922 5723492 4753625 7177459 9072120 8272580 6277960 3877717 290005
36098 290005 -3064528 -2958076 338349 2314542 192454 -3788839 -6304602 -6952624 -6950060
36089 -6950060 -6715197 -6311315 -5997547 -5044980 -2040251 2688986 7016955 10041882 12752143
36080 12752143 14959798 14489201 10931893 7559348 7369708 9068918 8987187 5642893 745005
36071 745005 -3086542 -4105679 -2204896 563478 1230446 -975145 -3568937 -3773571 -1458163
36062 -1458163 1570218 3582019 3239513 -101604 -4692101 -6738716 -4614229 -1437743
36054 -1437743 -1225858 -3576630 -4704320 -3004460 -709954 -20685 -409419 -550822 -626517
36045 -626517 -1515084 -3302981 -5679698 -8471798 -10803663 -11071905 -8966634 -6433333 -5393459
36036 -5393459 -5541113 -5780152 -6672992 -9286333 -12137770 -12015782 -8550509 -5634614 -6760516
36027 -6760516 -10557641 -12780579 -11623863 -9033941 -7369146 -6953742 -6929409 -6473367 -4757245
36018 -4757245 -1478661 1981068 3473430 2685845 1334275 425377 -773783 -2522356
36010 -2522356 -3703913 -4178223 -5507718 -7734924 -8157866 -5820178 -4642080 -8393857
36002 -8393857 -14110690 -14781019 -8437828 -726469 2192371 18701 -3291435 -4511223
35994 -4511223 -3160779 -821600 228637 -749708 -1544698 406656 3951086 5291876
35986 5291876 3401732 1215470 544531 -646593 -4015227 -7237478 -7366770 -5165869
35978 -5165869 -3139137 -1584986 18451 -254757 -4444417 -10021607 -11889013 -9286377
35970 -9286377 -6765396 -7374966 -8584565 -6812731 -2892129 -312363 6702 168308 1333444
35961 1333444 2205762 1792575 1328753 2291299 3961765 4437767 3424357 2620282 3456808
35952 3456808 5676219 8217539 10194652 10646106 8818964 5596246 3252186 2553911
35944 2553911 1518477 -1233515 -3341263 -1538897 3137376 6024059 4778710 1707926
$$ [...]
##END NTUPLES=NMR SPECTRUM
##END=
