##TITLE=31Pdec_DE-42rm2h
 
 24 sc
 1.4.2024
##JCAMPDX= 6.0         $$ Bruker NMR JCAMP-DX V2.0
##DATA TYPE= NMR SPECTRUM
##DATA CLASS= NTUPLES
##ORIGIN= UXNMR, Bruker Analytische Messtechnik GmbH
##OWNER= root
$$ XWIN-NMR		Version 3.5
$$ Mon Apr  1 13:49:56 2024 Russian Standard Time (UT+4h)  she@DPX200
##.OBSERVE FREQUENCY= 81.013821
##.OBSERVE NUCLEUS= ^31P
##.ACQUISITION MODE= SIMULTANEOUS
##.ACQUISITION SCHEME= undefined
##.AVERAGES= 24
##.DIGITISER RES= 16
##SPECTROMETER/DATA SYSTEM= spect
##.PULSE SEQUENCE= zgpg30
##.SOLVENT NAME= CDCl3
##.SHIFT REFERENCE= (INTERNAL, CDCl3, 0, 248.564)
##AUDIT TRAIL= $$ (NUMBER, WHEN, WHO, WHERE, WHAT)
$$ ##TITLE= Audit trail, XWIN-NMR		Version 3.5
$$ ##JCAMPDX= 5.01
$$ ##ORIGIN= Bruker BioSpin GmbH
$$ ##OWNER= she
$$ F:/spectra/data/she/nmr/P31/1/pdata/1/auditp.txt
$$ ##AUDIT TRAIL=  $$ (NUMBER, WHEN, WHO, WHERE, WHAT)
(   1,<2024-04-01 13:48:22.14 +0400>,<she>,<DPX200>,
      <created by zg, POWCHK disabled, PULCHK disabled
       configuration hash MD5:
       00 E9 B6 7A A2 85 ED C7 34 08 36 98 17 FE 4E 26
       data hash MD5: 32K
       DF 34 3D 98 DE BC C4 B2 07 C8 42 8F 53 B8 87 5F>)
(   2,<2024-04-01 13:48:46.43 +0400>,<she>,<DPX200>,
      <Start of raw data processing
       efp BC_mod = 2 LB = 10 FT_mod = 6 PKNL = 1 PHC0 = -12773.25 PHC1 = -173.5165 SI = 64K 
       data hash MD5: 64K
       2C D7 6F DE 2E CB 54 9A AE F5 95 36 20 0F 59 D2>)
(   3,<2024-04-01 13:49:10.31 +0400>,<she>,<DPX200>,
      <pk PHC0 = -105.8468 PHC1 = 298.9998 
       data hash MD5: 64K
       1E 47 7A 71 B8 79 FD 6C 03 2C 9B 80 9A 2A E4 95>)
$$ ##END=
$$ 
$$ hash MD5
$$ E2 88 1B C8 A3 F4 C8 DC 3E 7E 8D AE FC 50 37 89
##$RELAX= 
##$RELAX= 
##$RELAX= 
##$RELAX= 
##$RELAX= 
##$RELAX= 
##$RELAX= 
##$RELAX= 
##$RELAX= 
$$ Bruker specific parameters
$$ --------------------------
##$DU= <F:/spectra>
##$EXPNO= 1
##$NAME= <P31>
##$PROCNO= 1
##$TYPE= <nmr>
##$USER= <she>
##$AMP= (0..31)
100 100 100 100 100 100 100 100 100 100 100 100 100 100 100 100 100 100 
100 100 100 100 100 100 100 100 100 100 100 100 100 100 
##$AQSEQ= 0
##$AQ_mod= 1
##$AUNM= <au_zg>
##$AUTOPOS= <>
##$BF1= 81.014009
##$BF2= 200.13
##$BF3= 200.13
##$BF4= 200.13
##$BF5= 200.13
##$BF6= 200.13
##$BF7= 200.13
##$BF8= 200.13
##$BYTORDA= 1
##$CFDGTYP= 0
##$CFRGTYP= 5
##$CHEMSTR= <none>
##$CNST= (0..31)
1 1 145 1 1 1 1 1 1 1 1 1 1 1 1 1 1 1 1 1 1 1 1 1 1 1 1 1 1 1 1 1 
##$CPDPRG= <waltz16>
##$CPDPRG1= <>
##$CPDPRG2= <waltz16>
##$CPDPRG3= <>
##$CPDPRG4= <mlev>
##$CPDPRG5= <mlev>
##$CPDPRG6= <mlev>
##$CPDPRG7= <mlev>
##$CPDPRG8= <mlev>
##$CPDPRGB= <>
##$CPDPRGT= <>
##$D= (0..31)
0 1 0 0 0 0 0 0 0 0 0 0.03 2e-05 3e-06 0 0 0 0 0 0 0 0 0 0 0 0 0 0 0 0 
0 0 
##$DATE= 1711964901
##$DBL= (0..7)
120 120 120 11 120 120 24 19 
##$DBP= (0..7)
150 150 150 150 150 150 150 150 
##$DBP07= 0
##$DBPNAM0= <>
##$DBPNAM1= <>
##$DBPNAM2= <>
##$DBPNAM3= <>
##$DBPNAM4= <>
##$DBPNAM5= <>
##$DBPNAM6= <>
##$DBPNAM7= <>
##$DBPOAL= (0..7)
0.5 0.5 0.5 0.5 0.5 0.5 0.5 0.5 
##$DBPOFFS= (0..7)
$$ [...]
##$SUBNAM2= <"">
##$SUBNAM3= <"">
##$SUBNAM4= <"">
##$SUBNAM5= <"">
##$SUBNAM6= <"">
##$SUBNAM7= <"">
##$SUBNAM8= <"">
##$SUBNAM9= <"">
##$SW= 501.771253377433
##$SWIBOX= (0..15)
0 1 3 0 0 0 0 0 0 0 0 0 0 0 0 0 
##$SW_h= 40650.406504065
##$TD= 32768
##$TD0= 1
##$TE= 0
##$TE2= 300
##$TE3= 300
##$TEG= 300
##$TL= (0..7)
0 120 53 12 22 120 120 120 
##$TP= (0..7)
150 150 150 150 150 150 150 150 
##$TP07= 0
##$TPNAME0= <>
##$TPNAME1= <>
##$TPNAME2= <>
##$TPNAME3= <>
##$TPNAME4= <>
##$TPNAME5= <>
##$TPNAME6= <>
##$TPNAME7= <>
##$TPOAL= (0..7)
0.5 0.5 0.5 0.5 0.5 0.5 0.5 0.5 
##$TPOFFS= (0..7)
0 0 0 0 0 0 0 0 
##$TUNHIN= 0
##$TUNHOUT= 0
##$TUNXOUT= 0
##$USERA1= <user>
##$USERA2= <user>
##$USERA3= <user>
##$USERA4= <user>
##$USERA5= <user>
##$V9= 5
##$VALIST= <valist>
##$VCLIST= <CCCCCCCCCCCCCCC>
##$VD= 0
##$VDLIST= <DDDDDDDDDDDDDDD>
##$VPLIST= <PPPPPPPPPPPPPPP>
##$VTLIST= <TTTTTTTTTTTTTTT>
##$WBST= 1024
##$WBSW= 4
##$XGAIN= (0..3)
0 0 0 0 
##$XL= 0
##$YL= 0
##$YMAX_a= 15244
##$YMIN_a= -11227
##$ZGOPTNS= <>
##$ZL1= 120
##$ZL2= 120
##$ZL3= 120
##$ZL4= 120
##$ABSF1= 0
##$ABSF2= 0
##$ABSG= 0
##$ABSL= 0
##$ALPHA= 0
##$AQORDER= 0
##$ASSFAC= 0
##$ASSFACI= 0
##$ASSFACX= 0
##$ASSWID= 0
##$AUNMP= <proc_1d>
##$AZFE= 0.1
##$AZFW= 0.5
##$BCFW= 0
##$BC_mod= 2
##$BYTORDP= 0
##$COROFFS= 0
##$CY= -3
##$DATMOD= 1
##$DC= 0
##$DFILT= <>
##$DTYPP= 0
##$F1P= 0
##$F2P= 0
##$FCOR= 1
##$FTSIZE= 65536
##$FT_mod= 6
##$GAMMA= 0
##$GB= 0
##$INTBC= 1
##$INTSCL= 6.047779e-11
##$ISEN= 30
##$LB= 10
##$LEV0= 0
##$LPBIN= 0
##$MAXI= 10000
##$MC2= 0
##$MEAN= 0
##$ME_mod= 0
##$MI= 50
##$NCOEF= 0
##$NC_proc= -6
##$NLEV= 6
##$NOISF1= 182.463
##$NOISF2= 159.3651
##$NSP= 0
##$NTH_PI= 0
##$NZP= 0
##$OFFSET= 248.5645
##$PC= 4
##$PHC0= -12879.1
##$PHC1= 125.4833
##$PH_mod= 1
##$PKNL= yes
##$PPARMOD= 0
##$PSCAL= 0
##$PSIGN= 0
##$REVERSE= no
##$SF= 81.0140089999694
##$SI= 65536
##$SIGF1= 159.3651
##$SIGF2= -187.1042
##$SINO= 113.3802
##$SIOLD= 16384
##$SREGLST= <1H.CDCl3>
##$SSB= 0
##$STSI= 65536
##$STSR= 0
##$SW_p= 40650.406504065
##$SYMM= 0
##$S_DEV= 0
##$TDeff= 32768
##$TDoff= 0
##$TI= <>
##$TILT= no
##$TM1= 0
##$TM2= 0
##$TOPLEV= 0
##$USERP1= <user>
##$USERP2= <user>
##$USERP3= <user>
##$USERP4= <user>
##$USERP5= <user>
##$WDW= 1
##$XDIM= 65536
##$YMAX_p= 349402305
##$YMIN_p= -5204424
$$ End of Bruker specific parameters
$$ ---------------------------------
##NTUPLES= NMR SPECTRUM
##VAR_NAME=  FREQUENCY,     SPECTRUM/REAL,   SPECTRUM/IMAG
##SYMBOL=    X,             R,               I
##VAR_TYPE=  INDEPENDENT,   DEPENDENT,       DEPENDENT
##VAR_FORM=  AFFN,          ASDF,            ASDF
##VAR_DIM=   65536,         65536,           65536
##UNITS=     HZ,            ARBITRARY UNITS, ARBITRARY UNITS
##FACTOR=    0.620285442955139, 1,           1
##FIRST=     20137.2065510682, 0,            0
##LAST=      -20513.1999529968, 0,           0
##MIN=       -20513.1999529968, -5204424,    0
##MAX=       20137.2065510682, 349402305,    0
$$ Real data points
##PAGE= N=1
##DATA TABLE= (X++(R..R)), XYDATA
$$ [...]
$$ plain form
37536 5526368 5939654 6398746 6907123 7465166 8069677 8713805 9387192 10076005 10762435
37527 10762435 11423551 12030005 12545949 12931883 13151105 13178330 13007052 12652153 12146340
37518 12146340 11532006 10851984 10142551 9430330 8732765 8060592 7420589 6817483 6254770
37509 6254770 5734844 5258892 4826795 4437112 4087168 3773346 3491678 3238616 3011739
37500 3011739 2810038 2633587 2482725 2357103 2255047 2173502 2108574 2056364 2013699 1978508
37490 1978508 1949735 1927017 1910272 1899360 1893906 1893249 1896462 1902363 1909630 1917055 1923912 1930150 1936170
37477 1936170 1942243 1947893 1951583 1950928 1943342 1926880 1900868 1866111 1824686 1779503 1733727 1690112
37465 1690112 1650395 1615062 1583643 1555225 1528676 1502460 1474437 1442185 1403805 1358780 1308323
$$ packed form
37536E526368M13286M59092N08377N58043O04511O44128O73387O88813O86430
37527A0762435O61116O06454N15944L85934K19222K7225j71278l54899n05813
37518A2146340o14334o80022p09433p12221o97565o72173o40003o03106n62713
37509F254770n19926m75952m32097l89683l49944l13822k81668k53062k26877
37500C011739k01701j76451j50862j25622j02056q1545o4928n2210m2665l5191
37490A978508k8773k2718j6745j0912n454o57L213N901P267P425O857O238O020
37477A936170O073N650L690o55p586j6462k6012l4757m1425m5183m5776m3615
37465A690112l9717l5333l1419k8418k6549k6216k8023l2252l8380m5025n0457
$$ plain form
37454 1308323 1255041 1202039 1151832 1105463 1062136 1019464 974118 922543 861503 788436 701757
37443 701757 601264 488644 367758 244231 124201 12677 -87649 -176568 -255547 -326531
37433 -326531 -390904 -448902 -499520 -540854 -570746 -587571 -590894 -581768 -562551 -536369 -506516 -476070
37421 -476070 -447737 -423753 -405642 -393849 -387596 -385259 -385244 -386837 -390366 -396419 -404555 -412420 -415897 -410402
37407 -410402 -392591 -361579 -318929 -267453 -209577 -146225 -76790 -39 84760 177098 275107
37396 275107 375825 475545 570124 655348 727426 783619 822826 845960 855870 856643 852397 846046
37384 846046 838600 829396 817088 800921 781643 761611 744066 731916 726655 727904 733759 741651 749189
37371 749189 754510 756127 752670 742943 726332 703215 675018 643884 612155 581941 554898 532192
$$ packed form
37454A308323n3282n3002n0207m6369m3327m2672m5346n1575o1040p3067q6679
37443G01757j00493j12620j20886j23527j20030j11524j00326q8919p8979p0984
37433c26531o4373n7998n0618m1334k9892j6825l323R126J9217K6182K9853L0446
37421d76070K8333K3984J8111J1793O253K337J5j593l529o053q136p865l477N495
37407d10402J7811L1012M2650N1476N7876O3352O9435P6751Q4799R2338R8009
37396B75107J00718R9720R4579Q5224P2078N6193L9207K3134R910P73m246o351
37384H46046p446r204j2308j6167j9278k0032j7545j2150n261J249N855P892P538
37371G49189N321J617l457r727j6611k3117k8197l1134l1729l0214k7043k2706
$$ plain form
37359 532192 514417 501349 491543 482111 469060 448335 417293 375980 327487 277023 230105 190794
37347 190794 160866 140090 127159 120621 119438 123121 131501 144304 160727 179181 197299 212176
37335 212176 220833 220779 210445 189262 157431 115682 65320 8486 -51766 -111866 -168408 -218725
37323 -218725 -261053 -294383 -318156 -331999 -335656 -329218 -313566 -290600 -262870 -232734 -201542 -169266
37311 -169266 -134694 -96037 -51731 -1152 55042 115038 176256 235781 290804 339120 379564
37300 379564 412129 437671 457384 472353 483208 489873 491434 486337 473018 450808 420627 385081
37288 385081 347813 312360 280970 253824 228972 203004 172237 133984 87590 34949 -19712
37277 -19712 -70919 -113628 -144837 -164317 -174151 -177451 -176973 -174329 -170044 -164199 -157090 -149497 -142624 -138017
$$ packed form
37359E32192j7775j3068r806r432j3051k0725l1042m1313m8493n0464m6918l9311
37347A90794k9928k0776j2931o538j183L683Q380J2803J6423J8454J8118J4877
37335B12176Q657n4j0334k1183l1831m1749n0362n6834o0252o0100n6542n0317
37323b18725m2328l3330k3773j3843l657O438J5652K2966K7730L0136L1192L2276
37311a69266L4572L8657M4306N0579N6194N9996O1218N9525N5023M8316M0444
37300C79564L2565K5542J9713J4969J0855O665J561n097j3319k2210l0181l5546
37288C85081l7268l5453l1390k7146k4852k5968l0767l8253m6394n2641n4661
37277a9712n1207m2709l1209j9480r834l300M78K644M285N845P109P593O873M607
$$ plain form
37263 -138017 -137606 -143675 -158492 -183580 -218910 -262470 -310500 -358379 -401670 -436862 -461644 -475051
37251 -475051 -477710 -472018 -461843 -451590 -444926 -443750 -447840 -455306 -463491 -469748 -471751 -467451 -455097
37238 -455097 -433483 -402231 -361833 -313436 -258538 -198691 -135222 -69071 -911 68386 137168
37227 137168 202766 261933 311760 350540 378048 395213 403575 404981 401656 396434 392760 394214 403645
37214 403645 422292 449355 482212 517215 550797 580569 606001 628423 650356 674536 702986
37203 702986 736313 773232 810465 843308 866892 877688 874529 858698 833193 801731 768013 735520
37191 735520 707696 688144 680472 687608 710807 748846 797942 852646 907403 958119 1003041 1042624
37179 1042624 1078674 1113312 1148165 1183837 1219537 1252951 1280603 1298716 1304229 1295446 1272126 1235181
$$ packed form
37263a38017M11o069j4817k5088l5330m3560m8030m7879m3291l5192k4782j3407
37251d75051k659N692J0175J0253O664J176m090p466q185o257k003M300J2354
37238d55097K1614L1252M0398M8397N4898N9847O3469O6151O8160O9297O8782
37227A37168O5598N9167M9827L8780K7508J7165Q362J406l325n222l674J454R431
37214D03645J8647K7063L2857L5003L3582K9772K5432K2422K1933K4180K8450
37203G02986L3327L6919L7233L2843K3584J0796l159j5831k5505l1462l3718l2493
37191G35520k7824j9552p672P136K3199L8039M9096N4704N4757N0716M4922L9583
37179A042624L6050L4638L4853L5672L5700L3414K7652J8113N513q783k3320l6945
$$ plain form
37167 1235181 1186254 1127250 1059788 984674 901676 809821 708231 597150 478663 356783
37157 356783 236864 124579 24854 -58916 -125189 -174126 -207187 -226710 -235626 -237210 -234697 -230770
37145 -230770 -227121 -224323 -221948 -218770 -212936 -202249 -184636 -158681 -123965 -81123 -31714 21919
37133 21919 76776 129417 176338 214449 241521 256419 259085 250360 231817 205679 174741 142214
37121 142214 111453 85633 67398 58524 59760 70974 91618 121233 159685 206978 262785 325989
37109 325989 394497 465399 535410 601449 661211 713609 758894 798402 833926 867015 898489
37098 898489 928440 956584 982684 1006727 1028844 1049169 1067903 1085491 1102608 1119647 1135994
37087 1135994 1149696 1158064 1158963 1151895 1138092 1119693 1098797 1077140 1056308 1037867 1022920 1011336
$$ packed form
37167A235181m8927n9004o7462p5114q2998r1855j01590j11081j18487j21880
37157C56783j19919j12285r9725q3770o6273m8937l3061j9523q916j584K513L927
37145b30770L649K798K375L178N834J0687J7613K5955L4716M2842M9409N3633
37133B1919N4857N2641M6921L8111K7072J4898K666q725j8543k6138l0938l2527
37121A42214l0761k5820j8235q874J236J1214K0644K9615L8452M7293N5807O3204
37109C25989O8508P0902P0011O6039N9762N2398M5285L9508L5524L3089L1474
37098H98489K9951K8144K6100K4043K2117K0325J8734J7588J7117J7039J6347
37087A135994J3702Q368Q99p068j3803j8399k0896k1657k0832j8441j4947j1584
$$ plain form
37075 1011336 1001292 989696 973275 949691 918005 878394 831510 778016 718562 654081 586145
37064 586145 517183 450432 389586 338141 298570 271704 256684 251561 254181 262806 276200 293297
37052 293297 312736 332517 349920 361788 365083 357456 337514 304833 259876 204004 139486 69414
37040 69414 -2480 -72108 -135502 -189510 -232431 -264194 -285904 -299033 -304774 -303884 -297008 -285168
37028 -285168 -270025 -253706 -238246 -224984 -214262 -205567 -197916 -190178 -181135 -169343 -153123 -130917
37016 -130917 -102019 -67242 -28929 9968 47369 83170 119244 158238 201843 249454 297854
37005 297854 341999 376464 396898 400978 388639 361781 323645 278082 228831 178988 130797 85744
36993 85744 44810 8637 -22462 -48619 -70475 -89105 -105764 -121535 -137007 -152086 -166110 -178343
$$ packed form
37075A011336j0044j1596j6421k3584l1686l9611m6884n3494n9454o4481o7936
37064E86145o8962o6751o0846n1445l9571k6866j5020n123K620Q625J3394J7097
37052B93297J9439J9781J7403J1868L295p627j9942l2681m4957n5872o4518p0072
37040F9414p1894o9628o3394n4008m2921l1763k1710j3129n741Q90O876J1840
37028b85168J5143J6319J5460J3262J0722Q695P651P738R043J1792J6220K2206
37016a30917K8898L4777L8313L8897L7401L5801L6074L8994M3605M7611M8400
37005B97854M4145L4465K0434M080j2339k6858l8136m5563m9251m9843m8191m5053
36993H5744m0934l6173l1099k6157k1856j8630j6659j5771j5472j5079j4024j2233
$$ plain form
36981 -178343 -188693 -198252 -209211 -224109 -244840 -271995 -304817 -341604 -380214 -418435 -454281 -486310
36969 -486310 -513874 -537084 -556290 -571249 -580418 -580876 -569103 -542359 -500005 -444035 -378505 -308233
36957 -308233 -237505 -169380 -105695 -47409 5187 52490 95614 135985 174505 210821 243350
36946 243350 270142 289867 302124 306930 304021 292678 272227 242752 205396 162107 115152 66906
36934 66906 19994 -22661 -58181 -84303 -99611 -103322 -95064 -75114 -44960 -7621 32610 70899
36922 70899 102721 124597 134575 132431 119612 98978 74284 49437 27797 11888 3631 4660
36910 4660 16232 38594 70266 107812 146340 180624 206402 221247 224598 217036 199461 172876
36898 172876 138877 100301 61374 27114 2320 -9469 -6777 9415 35847 67849 100725 131098
$$ packed form
36981a78343j0350r559j0959j4898k0731k7155l2822l6787l8610l8221l5846l2029
36969d86310k7564k3210j9206j4959r169m58J1773K6744M2354N5970O5530P0272
36957c08233P0728O8125O3685N8286N2596M7303M3124M0371L8520L6316L2529
36946B43350K6792J9725J2257M806k909j1343k0451k9475l7356m3289m6955m8246
36934F6906m6912m2655l5520k6122j5308l711Q258J9950L0154L7339M0231L8289
36922G0899L1822K1876R978k144j2819k0634k4694k4847k1640j5909q257J029
36910D660J1572K2362L1672L7546L8528L4284K5778J4845L351p562j7575k6585
36898A72876l3999l8576l8927l4260k4794j1789K692J6192K6432L2002L2876L0373
$$ plain form
36886 131098 157671 181109 203142 225285 247595 267858 281498 282420 264768 225071 163813 85503
36874 85503 -2846 -93969 -182078 -263420 -335931 -398655 -451383 -494423 -528291 -553305 -569369 -576119
36862 -576119 -573337 -561327 -541070 -514190 -482701 -448526 -412949 -376419 -338946 -300764 -262602 -225355
36850 -225355 -189652 -155896 -124798 -97883 -77462 -65958 -64880 -73917 -90678 -111315 -131753 -148815
36838 -148815 -160680 -166649 -166650 -160934 -150221 -136157 -121725 -111187 -109316 -120066 -145129 -183019 -229120
36825 -229120 -276752 -318823 -349289 -363936 -360488 -338353 -298289 -242132 -172673 -93670 -9768 73970
36813 73970 152910 223688 284629 335651 377846 412848 442116 466353 485399 498675 505909 507709
36801 507709 505702 502253 499931 500990 507163 519777 539994 568801 606672 653115 706505 764425
$$ packed form
36886A31098K6573K3438K2033K2143K2310K0263J3640R22j7652l9697o1258p8310
36874H5503q8349r1123q8109q1342p2511o2724n2728m3040l3868k5014j6064o750
36862e76119K782J2010K0257K6880L1489L4175L5577L6530L7473L8182L8162L7247
36850b25355L5703L3756L1098K6915K0421J1504J078r037j6761k0637k0438j7062
36838a48815j1865n969jN716J0713J4064J4432J0538J871j0750k5063l7890m6101
36825b29120m7632m2071l0466j4647L448K2135M0064N6157O9459P9003Q3902Q3738
36813G3970P8940P0778O0941N1022M2195L5002K9268K4237J9046J3276P234J800
36801E07709k007l449k322J059O173J2614K0217K8807L7871M6443N3390N7920
$$ plain form
36789 764425 824351 884275 942889 999363 1053017 1103217 1149406 1191014 1227107 1256007 1275195
36778 1275195 1281593 1272114 1244246 1196580 1129202 1043925 944329 835538 723652 614907 514714
36767 514714 426966 353805 295873 252759 223276 205402 196049 191037 185583 175240 156948 129744
36755 129744 94942 55847 17106 -16205 -39744 -50989 -49878 -38685 -21278 -2167 14365 24998
36743 24998 27868 22655 10110 -8646 -32622 -60973 -92724 -126463 -160187 -191375 -217398 -236230
36731 -236230 -247140 -250860 -249025 -243119 -233573 -219489 -199108 -170800 -134120 -90550 -43594 1875
36719 1875 40808 69265 85312 89228 82978 69232 50378 28050 3287 -22967 -49464 -74544
36707 -74544 -96295 -112917 -123219 -127095 -125610 -120577 -113893 -107083 -101249 -97243 -95815 -97675 -103578 -114401
$$ packed form
36789G64425N9926N9924N8614N6474N3654N0200M6189M1608L6093K8900J9188
36778A275195O398r479k7868m7666o7378q5277r9596j08791j11886j08745j00193
36767E14714q7748p3161n7932m3114k9483j7874r353n012n454j0343j8292k7204
36755A29744l4802l9095l8741l3311k3539j1245J111J1193J7407J9111J6532J0633
36743B4998K870n213j2545j8756k3976k8351l1751l3739l3724l1188k6023j8832
36731b36230j0910l720J835N906R546J4084K0381K8308L6680M3570M6956M5469
36719A875L8933K8457J6047L916o250j3746j8854k2328k4763k6254k6497k5080
36707g4544k1751j6622j0302l876J485N033O684O810N834M006J428j860n903j0823
$$ plain form
36693 -114401 -130980 -153575 -181239 -211697 -242033 -269801 -293788 -314032 -331279 -346352 -359685
36682 -359685 -371080 -379750 -384689 -385187 -381179 -373212 -362194 -349179 -335309 -321758 -309473 -298670 -288389
36669 -288389 -276551 -260670 -238897 -210806 -177633 -142020 -107552 -78143 -57251 -47021 -47698 -57634
36657 -57634 -73961 -93670 -114644 -136249 -159308 -185561 -216896 -254690 -299465 -350811 -407433 -467177
36645 -467177 -527113 -583826 -634004 -675172 -706213 -727302 -739270 -742762 -737736 -723540 -699376 -664759
36633 -664759 -619699 -564608 -500117 -427010 -346460 -260524 -172600 -87445 -10554 53014 99940
36622 99940 129467 143356 145071 138688 128029 116080 104557 93697 82593 70145 56131 41799
36610 41799 29585 22216 21735 28984 43713 65028 91681 122026 153863 184490 211009 230657
$$ packed form
36693a14401j6579k2595k7664l0458l0336k7768k3987k0244j7247j5073j3333
36682c59685j1395q670m939m98M008P967J1018J3015J3870J3551J2285J0803J0281
36669b88389J1838J5881K1773K8091L3173L5613L4468K9409K0892J0230o77r936
36657e7634j6327j9709k0974k1605k3059k6253l1335l7794m4775n1346n6622n9744
36645d67177n9936n6713n0178m1168l1041k1089j1968l492N026J4196K4164L4617
36633f64759M5060N5091O4491P3107Q0550Q5936Q7924Q5155P6891O3568M6926
36622I9940K9527J3889J715o383j0659j1949j1523j0860j1104j2448j4014j4332
36610D1799j2214p369m81P249J4729K1315K6653L0345L1837L0627K6519J9648
$$ plain form
36598 230657 241037 240265 227105 201117 162924 114589 59840 3758 -48157 -91150 -121996 -139262
36586 -139262 -143141 -135108 -117496 -93064 -64583 -34436 -4190 25678 55621 86275 117470 147581
36574 147581 173602 191902 199246 193618 174499 142556 99037 45371 -16705 -84594 -154290 -220363
36562 -220363 -276695 -317768 -340026 -342682 -327695 -299029 -261596 -220209 -178701 -139449 -103419 -70737
36550 -70737 -41368 -15480 6617 24716 38794 48833 54487 54829 48360 33434 9033 -24409
36538 -24409 -64688 -108264 -151298 -190702 -224720 -252926 -275901 -294758 -310540 -323520 -332611 -335245
36526 -335245 -328051 -308196 -274814 -229652 -176587 -120430 -65930 -17403 21362 47432 59407 57902
36514 57902 45397 25502 1987 -22074 -44829 -65762 -85459 -105213 -126694 -151801 -182532 -220705
$$ packed form
36598B30657J0380p72j3160k5988l8193m8335n4749n6082n1915m2993l0846j7266
36586a39262l879Q033J7612K4432K8481L0147L0246K9868K9943L0654L1195L0111
36574A47581K6021J8300P344n628j9119l1943m3519n3666o2076o7889o9696o6073
36562b20363n6332m1073k2258k656J4987K8666L7433M1387M1508L9252L6030L2682
36550g0737K9369K5888K2097J8099J4078J0039N654L42o469j4926k4401l3442
36538b4409m0279m3576m3034l9404l4018k8206k2975j8857j5782j2980r091k634
36526c35245P194J9855L3382M5162N3065N6157N4500M8527L8765K6070J1975j505
36514E7902j2505j9895k3515k4061k2755k0933j9697j9754k1481k5107l0731l8173
$$ plain form
36502 -220705 -267490 -322963 -385900 -453972 -524247 -593772 -659906 -720233 -772209 -813096 -840531
36491 -840531 -853498 -853005 -841957 -824426 -804887 -787770 -777162 -776361 -787208 -809426 -840374 -875491
36479 -875491 -909430 -937433 -956398 -965285 -964900 -957339 -945316 -931564 -918411 -907620 -900400 -897399 -898596
36466 -898596 -903157 -909494 -915660 -920000 -921732 -921058 -918751 -915527 -911718 -907491 -903329 -900233 -899429 -901822 -907631
36451 -907631 -916304 -926492 -935974 -941704 -940243 -928473 -904272 -866871 -816910 -756278 -687672 -613873
36439 -613873 -537029 -458370 -378579 -298567 -220051 -145576 -78137 -20762 23662 52471 63426
36428 63426 55231 28192 -15199 -70134 -130012 -187601 -236563 -272840 -295455 -306381 -309502 -309151
36416 -309151 -308901 -311015 -316410 -324690 -334146 -341887 -344345 -338051 -320396 -290133 -247490 -193905 -131576
$$ packed form
36502b20705m6785n5473o2937o8072p0275o9525o6134o0327n1976m0887k7435
36491h40531j2967M93J1048J7531J9539J7117J0608Q01j0847k2218l0948l5117
36479h75491l3939k8003j8965q887L85P561J2023J3752J3153J0791P220L001j197
36466h98596m561o337o166m340j732O74K307L224L809M227M162L096Q04k393n809
36451i07631q673j0188r482n730J461J1770K4201L7401M9961O0632O8606P3799
36439f13873P6844P8659P9791Q0012P8516P4475O7439N7375M4424K8809J0955
36428F3426q195k7039m3391n4935n9878n7589m8962l6277k2615j0926l121L51
36416c09151K50k114n395q280r456p741k458O294J7655L0263M2643N3585O2329
$$ plain form
36403 -131576 -63054 8858 80930 149256 209252 256131 285813 295960 286657 260434 221645 175540
36391 175540 127382 81938 43300 14810 -1188 -3725 6635 28080 58099 93891 132407 170233
36379 170233 203815 230129 247507 256016 257056 252425 243436 230583 213743 192580 166799 136139
36367 136139 100304 59134 13173 -35702 -84148 -128101 -164024 -189936 -205680 -212575 -212874 -209281
36355 -209281 -204415 -200191 -197419 -195939 -195289 -195315 -196259 -198314 -201155 -203820 -204892 -202730 -195679 -182344 -161943
36340 -161943 -134606 -101511 -64855 -27683 6521 34578 54514 66282 71900 74854 78862 86572
36328 86572 98833 114894 133228 152270 170676 187316 201423 212948 222764 232415 243533 257202
36316 257202 273504 291314 308497 322508 331150 333121 328169 317020 301248 283013 264554 247556
$$ packed form
36403a31576O8522P1912P2072O8326N9996M6879K9682J0147r303k6223l8789m6105
36391A75540m8158m5444l8638k8490j5998k537J0360K1445L0019L5792L8516L7826
36379A70233L3582K6314J7378Q509J040m631q989j2853j6840k1163k5781l0660
36367A36139l5835m1170m5961m8875m8446m3953l5923k5912j5744o895k99L593
36355b09281M866M224K772J480O50k6r44k055k841k665j072K162P051J3335K0401
36340a61943K7337L3095L6656L7172L4204K8057J9936J1768N618K954M008P710
36328H6572J2261J6061J8334J9042J8406J6640J4107J1525R816R651J1118J3669
36316B57202J6302J7810J7183J4011Q642J971m952j1149j5772j8235j8459j6998
$$ plain form
36304 247556 232736 219939 208669 198642 189894 182313 175000 166186 154045 137965 119302 100970
36292 100970 86066 76389 71662 69860 68397 65666 62220 61134 67434 86916 124814 184687 267652
36279 267652 371939 492836 623213 754725 879577 992332 1091103 1177591 1255924 1330852
36269 1330852 1406132 1483722 1563817 1645290 1726026 1802954 1871872 1927443 1963745 1975508 1959687
36258 1959687 1916581 1849835 1765273 1669301 1567804 1465814 1367569 1276317 1193878 1120485 1055265
36247 1055265 997075 944987 898188 855684 816322 779227 744279 712316 685002 664513 653154
36236 653154 653010 665596 691460 729656 777230 829107 878750 919600 946751 958079 954279 937860
36224 937860 911737 878258 839199 796514 753050 712528 678691 654139 639476 633018 631025 628358
$$ packed form
36304B47556j4820j2797j1270j0027q748p581p313q814j2141j6080j8663j8332
36292A00970j4904r677m727j802j463k731l446j086O300J9482L7898N9873Q2965
36279B67652J04287J20897J30377J31512J24852J12755R8771Q6488P8333P4928
36269A330852P5280P7590Q0095Q1473Q0736P6928O8918N5571L6302J1763j5821
36258A959687m3106o6746q4562r5972j01497j01990r8245r1252q2439p3393o5220
36247A055265n8190n2088m6799m2504l9362l7095l4948l1963k7314k0489j1359
36236F53154j44J2586K5864L8196M7574N1877M9643M0850K7151J1328l800j6419
36224I37860k6123l3479l9059m2685m3464m0522l3837k4552j4663o458j993k667
$$ plain form
36212 628358 619540 600066 567585 522374 466813 404068 336793 266632 194645 122120 51113 -15559
36200 -15559 -74722 -123440 -159734 -183164 -195089 -198497 -197510 -196660 -199920 -209655 -225916 -246417 -267259
36187 -267259 -283978 -292519 -289884 -274430 -245880 -205120 -153752 -93483 -25583 49234 130467 217319
36175 217319 308490 402317 497061 591131 683290 772969 860519 947206 1034779 1124777 1217874
36164 1217874 1313609 1410607 1507019 1600771 1689478 1770286 1840002 1895516 1934202 1954156 1954396 1935201
36152 1935201 1898388 1847163 1785398 1716691 1643731 1568329 1491941 1416201 1342987 1273907 1209518
36141 1209518 1148815 1089445 1028632 964483 897117 829103 764964 709846 667856 640791 627847
36130 627847 626285 632522 642926 654131 663128 667512 665894 658113 644978 627640 606985 583422 557106
$$ packed form
36212F28358q818j9474l2481m5211n5561o2745o7275p0161p1987p2525p1007o6672
36200a5559n9163m8718l6294k3430j1925l408R87Q50l260r735j6261k0501k0842
36187b67259j6719q541K635J5454K8550M0760N1368O0269O7900P4817Q1233Q6852
36175B17319R1171R3827R4744R4070R2159Q9679Q7550Q6687Q7573Q9998R3097
36164A217874R5735R6998R6412R3752Q8707Q0808O9716N5514L8686J9954K40j9195
36152A935201l6813n1225o1765o8707p2960p5402p6388p5740p3214o9080o4389
36141A209518o0703n9370o0813o4149o7366o8014o4139n5118m1990k7065j2944
36130F27847j562O237J0404J1205Q997M384j618p781j3135j7338k0655k3563k6316
$$ plain form
36117 557106 528454 498625 469800 445064 427851 421063 426193 442850 468939 501408 537274 574519
36105 574519 612465 651469 692037 733777 774742 811556 840296 857646 861753 852498 831384 801333
36093 801333 766390 731171 700003 676098 661035 654599 654862 658544 661679 660474 652072 635059 609619
36080 609619 577388 540988 503401 467403 435170 408123 387054 372511 365185 365867 374875 391424
36068 391424 413573 438917 465636 493328 523330 558526 602760 659909 732749 821800 924541
36057 924541 1035230 1145340 1244398 1321122 1364916 1367817 1326531 1243859 1128625 993760 853119
36046 853119 718349 597090 492825 405782 334059 274601 224075 179603 139200 101883 67523
36035 67523 36568 9715 -12351 -29040 -39826 -44374 -42829 -36084 -25714 -13602 -1448 9548
$$ packed form
36117E57106k8652k9829k8825k4736j7213o788N130J6657K6089L2469L5866L7245
36105E74519L7946L9004M0568M1740M0965L6814K8740J7350M107r255k1114l0051
36093H01333l4943l5219l1168k3905j5063o436K63L682L135j205q402j7013k5440
36080F09619l2231l6400l7587l5998l2233k7047k1069j4543p326O82R008J6549
36068C91424K2149K5344K6719K7692L0002L5196M4234N7149P2840Q9051J02741
36057I24541J10689J10110R9058P6724M3794K901m1286q2672j15234j34865j40641
36046H53119j34770j21259j04265q7043p1723n9458n0526m4472m0403l7317l4360
36035F7523l0955k6853k2066j6689j0786m548J545O745J0370J2112J2154J0996
$$ plain form
36023 9548 18697 25496 29236 28825 23055 11241 -6129 -27163 -48973 -68634 -84137 -94827 -101131
36010 -101131 -103938 -104133 -102522 -100009 -97684 -96534 -96726 -96872 -93909 -84003 -64105 -33355 6328 50528
35996 50528 93189 127834 148942 153170 139876 110681 68465 16466 -42070 -103823 -165362 -223401
35984 -223401 -275233 -319170 -354803 -382977 -405420 -424067 -440333 -454535 -465592 -470946 -466739 -448363
35972 -448363 -411458 -353272 -273914 -176898 -68548 43579 152586 253668 344650 425597 497763
35961 497763 562362 619757 669414 710405 741926 763449 774667 775620 766986 750295 727767 701840
35949 701840 674680 647861 622224 597857 574165 550026 524040 494776 461022 422071 378109
35938 378109 330578 282234 236662 197302 166360 144080 128699 117096 105845 92254 74988
$$ packed form
36023I548R149O799L740m11n770j1814j7370k1034k1810j9661j5503j0690o304
36010a01131k807j95J611K513K325J150j92j46K963R906J9898L0750L9683M4200
35996E0528M2661L4645K1108M228j3294k9195m2216n1999n8536o1753o1539n8039
35984b23401n1832m3937l5633k8174k2443j8647j6266j4202j1057n354M207J8376
35972d48363L6905N8186P9358R7016J08350J12127J09007J01082R0982Q0947P2166
35961D97763O4599N7395M9657M0991L1521K1523J1218R53q634j6691k2528k5927
35949G01840k7160k6819k5637k4367k3692k4139k5986k9264l3754l8951m3962
35938C78109m7531m8344m5572l9360l0942k2280j5381j1603j1251j3591j7266
$$ plain form
35927 74988 54171 31073 7600 -14218 -32619 -46310 -54606 -57651 -56711 -54167 -52932 -55524 -63340
35914 -63340 -76542 -94394 -115637 -138689 -161681 -182443 -198507 -207186 -205867 -192548 -166539 -129078
35902 -129078 -83511 -34713 12238 53659 88351 117586 143937 169483 194327 216269 231832
35891 231832 237959 233322 218590 195786 167394 135687 102451 68982 36229 4912 -24414 -51368
35879 -51368 -75694 -97122 -115116 -128596 -135796 -134457 -122465 -98808 -64545 -23394 18444 53333
35867 53333 73904 74854 54269 14118 -40186 -101108 -160858 -213147 -254072 -281966 -296730 -299424
35855 -299424 -292269 -278577 -262038 -245526 -230127 -215035 -198332 -178133 -153497 -124757 -93169 -60169
35843 -60169 -26726 6788 40264 73398 105540 135816 163268 186861 205413 217652 222484 219357
$$ packed form
35927G4988k0817k3098k3473k1818j8401j3691q296l045R40K544J235k592p816
35914f3340j3202j7852k1243k3052k2992k0762j6064q679J319J3319K6009L7461
35902a29078M5567M8798M6951M1421L4692K9235K6351K5546K4844K1942J5563
35891B31832O127m637j4732k2804k8392l1707l3236l3469l2753l1317k9326k6954
35879e1368k4326k1428j7994j3480p200J339J1992K3657L4263M1151M1838L4889
35867E3333K0571R50k0585m0151n4304o0922n9750n2289m0925k7894j4764k694
35855b99424P155J3692J6539J6512J5399J5092J6703K0199K4636K8740L1588L3000
35843f0169L3443L3514L3476L3134L2142L0276K7452K3593J8552J2239M832l127
$$ plain form
35831 219357 208500 190976 168592 143816 119650 99346 85885 81404 86766 101437 123617 150587
35819 150587 179217 206582 230656 250844 268001 283718 299064 313616 325409 331868 331040 322359
35807 322359 306684 285733 261258 234258 204489 170496 130189 81814 24940 -38976 -106786
35796 -106786 -174624 -239175 -298490 -351853 -398960 -439167 -471386 -494634 -508750 -514835 -515244 -513179
35784 -513179 -511936 -513981 -520179 -529499 -539415 -546882 -549447 -545876 -535995 -520022 -498032 -469923 -435736
35771 -435736 -395996 -351963 -305883 -261119 -221850 -192230 -175334 -172500 -183400 -206712 -240840 -284200
35759 -284200 -334995 -390944 -449401 -507899 -564728 -619110 -670949 -720399 -767528 -812204 -854115
35748 -854115 -892831 -927833 -958509 -984088 -1003509 -1015287 -1017592 -1008641 -987246 -953239 -907587 -852309
$$ packed form
35831B19357j0857j7524k2384k4776k4166k0304j3461m481N362J4671K2180K6970
35819A50587K8630K7365K4074K0188J7157J5717J5346J4552J1793O459q28q681
35807C22359j5675k0951k4475k7000k9769l3993m0307m8375n6874o3916o7810
35796a06786o7838o4551n9315n3363m7107m0207l2219k3248j4116o085m09K065
35784e13179J243k045o198r320r916p467k565L571R881J5973K1990K8109L4187
35771d35736L9740M4033M6080M4764L9269K9620J6896K834j0900k3312l4128m3360
35759b84200n0795n5949n8457n8498n6829n4382n1839m9450m7129m4676m1911
35748h54115l8716l5002l0676k5579j9421j1778k305Q951K1395L4007M5652N5278
$$ plain form
35736 -852309 -790190 -724328 -657480 -591452 -526849 -463407 -400870 -339940 -282677 -231908 -189968
35725 -189968 -157648 -133991 -116801 -103284 -90434 -75350 -55730 -30462 63 34263 70219
35714 70219 106580 142928 179343 215555 250422 282254 309833 333498 355644 380319 412104 454678
35702 454678 509644 576078 651050 730897 812612 894653 976896 1059991 1144591 1230785 1317882
35691 1317882 1404580 1489435 1571377 1649899 1724846 1796045 1863109 1925519 1982840 2034978 2082428
35680 2082428 2126399 2168581 2210530 2253054 2296065 2338948 2380951 2421075 2457506 2487158 2505836
35669 2505836 2509006 2492727 2454368 2393009 2309658 2207361 2091097 1967324 1843108 1725057
35659 1725057 1618469 1527052 1453231 1398538 1363522 1347087 1345983 1355283 1369996 1386801 1404737
$$ packed form
35736h52309O2119O5862O6848O6028O4603O3442O2537O0930N7263N0769M1940
35725a89968L2320K3657J7190J3517J2850J5084J9620K5268L0525L4200L5956
35714G0219L6361L6348L6415L6212L4867L1832K7579K3665K2146K4675L1785M2574
35702D54678N4966O6434P4972P9847Q1715Q2041Q2243Q3095Q4600Q6194Q7097
35691A317882Q6698Q4855Q1942P8522P4947P1199O7064O2410N7321N2138M7450
35680B082428M3971M2182M1949M2524M3011M2883M2003M0124L6431K9652J8678
35669B505836L170j6279l8359o1359q3351j02297j16264j23773j24216j18051
35659A725057j06588r1417p3821n4693l5016j6435j104R300J4713J6805J7936
$$ plain form
35648 1404737 1424494 1447134 1473267 1503118 1537061 1576028 1621424 1674615 1736338 1806384 1883626
35637 1883626 1966114 2050995 2134197 2210178 2271955 2311633 2321560 2296046 2233070 2135173 2009060
35626 2009060 1864130 1710545 1557329 1410905 1274413 1148083 1030394 919373 813468
35617 813468 711855 614318 520823 430938 343420 256339 167800 76921 -15451 -106584 -192216
35606 -192216 -267181 -326081 -363988 -377227 -364184 -325769 -265193 -186958 -95455 6273 117040
35595 117040 237156 367376 507682 656334 809382 960614 1101894 1223956 1317714 1375903
35585 1375903 1394686 1374754 1321559 1244466 1154990 1064668 983260 917826 872674 849816 849475 870467
35573 870467 910515 966575 1035014 1111512 1190807 1266739 1332982 1384331 1417973 1434111 1435597 1426732
$$ packed form
35648A404737J9757K2640K6133K9851L3943L8967M5396N3191O1723P0046P7242
35637A883626Q2488Q4881Q3202P5981O1777L9678R927k5514o2976r7897j26113
35626B009060j44930j53585j53216j46424j36492j26330j17689j11021j05905
35617H13468j01613r7537r3495q9885q7518q7081q8539r0879r2372r1133q5632
35606a92216p4965n8900l7907j3239J3043L8415O0576P8235R1503J01728J10767
35595A17040J20116J30220J40306J48652J53048J51232J41280J22062R3758N8189
35585A375903J8783j9932n3195p7093q9476r0322q1408o5434m5152k2858l41K0992
35573H70467M0048N6060O8439P6498P9295P5932O6243N1349L3642J6138J486q865
$$ plain form
35561 1426732 1411741 1393600 1373750 1352705 1331090 1310473 1293538 1283639 1283969 1296641 1321850 1357313
35549 1357313 1398256 1438182 1470365 1489603 1493588 1483453 1463343 1439251 1417505 1403262 1399275 1405093
35537 1405093 1416966 1428768 1433905 1427538 1408132 1377616 1340295 1301160 1264338 1232090 1204502 1179841
35525 1179841 1155364 1128175 1095744 1056066 1007752 950294 884383 811957 735754 658590 582775
35514 582775 509895 441003 377016 319018 268251 225775 191983 166265 146954 131667 117998
35503 117998 104399 90794 78596 70124 67828 73653 88659 112887 145512 185200 230449 279709
35491 279709 331378 383886 436019 487362 538574 591266 647372 708306 774371 844774 918061
35480 918061 992500 1066130 1136674 1201664 1258944 1307311 1346957 1379522 1407680 1434386 1462077
$$ packed form
35561A426732j4991j8141j9850k1045k1615k0617j6935r899L30J2672K5209L5463
35549A357313M0943L9926L2183J9238L985j0135k0110k4092k1746j4243l987N818
35537A405093J1873J1802N137o367j9406l0516l7321l9135l6822l2248k7588k4661
35525A179841k4477k7189l2431l9678m8314n7458o5911p2426p6203p7164p5815
35514E82775p2880o8892o3987n7998n0767m2476l3792k5718j9311j5287j3669
35503A17998j3599j3605j2198q472k296N825J5006K4228L2625L9688M5249M9260
35491B79709N1669N2508N2133N1343N1212N2692N6106O0934O6065P0403P3287
35480I18061P4439P3630P0544O4990N7280M8367L9646L2565K8158K6706K7691
$$ plain form
35469 1462077 1492205 1525296 1561482 1601052 1644629 1692701 1744763 1798555 1849981 1893876 1925265
35458 1925265 1940504 1937921 1917939 1882791 1835793 1780260 1718479 1651420 1579406 1503244 1425033
35447 1425033 1348130 1276428 1213367 1161137 1120263 1089561 1066415 1047392 1029261 1010223 990805
35436 990805 973845 963471 963654 977060 1004632 1045727 1098495 1160208 1227478 1296392 1362694 1422071
35424 1422071 1470481 1504313 1520317 1515580 1488016 1437435 1366513 1280811 1187582 1094026 1005895
35413 1005895 926958 859246 803727 760914 730971 713310 706148 706625 711533 718126 724595 730279 735823
35400 735823 743150 754799 772500 795585 820251 840343 849467 843309 820905 784322 737301 683889
35388 683889 627583 570893 515142 460612 407193 355247 306136 262077 225529 198597 182795
$$ packed form
35469A462077L0128L3091L6186L9570M3577M8072N2062N3792N1426M3895L1389
35458A925265J5239k583j9982l5148m6998n5533o1781o7059p2014p6162p8211
35447A425033p6903p1702o3061n2230m0874l0702k3146j9023j8131j9038j9418
35436I90805j6960j0374J83J3406K7572M1095N2768O1713O7270O8914O6302N9377
35424A422071M8410L3832J6004m737k7564n0581p0922q5702r3229r3556q8131
35413A005895p8937o7712n5519m2813k9943j7661p162M77M908O593O469N684N544
35400G35823P327J1649J7701K3085K4666K0092R124o158k2404l6583m7021n3412
35388F83889n6306n6690n5751n4530n3419n1946m9111m4059l6548k6932j5802
$$ plain form
35377 182795 179176 188483 210943 245616 289742 338727 387014 429434 462346 484109 494863 495916
35365 495916 489107 476416 459858 441478 423286 407003 393641 383080 373935 364058 351529 335483
35353 335483 316250 294930 273005 252303 235028 223441 219310 223433 235456 253880 276263 299727
35341 299727 321788 341175 358149 374094 390633 408877 429226 451730 476477 503545 532525
35330 532525 562039 589761 613011 629632 638612 640076 634744 623221 605604 581590 550976 514323
35318 514323 473501 431833 393668 363446 344586 338643 345027 361315 383952 409026 432935 452934
35306 452934 467515 476505 480797 481814 480999 479437 477595 475099 470723 462754 449668 430787 406590
35293 406590 378580 348810 319326 291692 266734 244622 225241 208693 195560 186664 182385 182011
$$ packed form
35377A82795l619R307K2460L4673M4126M8985M8287M2420L2912K1763J0754J053
35365D95916o809j2691j6558j8380j8192j6283j3362j0561r145r877j2529j6046
35353C35483j9233k1320k1925k0702j7275j1587m131M123J2023J8424K2383K3464
35341B99727K2061J9387J6974J5945J6539J8244K0349K2504K4747K7068K8980
35330E32525K9514K7722K3250J6621Q980J464n332j1523j7617k4014l0614l6653
35318E14323m0822m1668l8165l0222j8860n943O384J6288K2637K5074K3909J9999
35306D52934J4581Q990M292J017q15j562j842k496m376p969j3086j8881k4197
35293D06590k8010k9770k9484k7634k4958k2112j9381j6548j3133q896m279l74
$$ plain form
35281 182011 183635 184810 183666 179879 174963 171664 172800 180174 194240 214563 240526 271531 306537
35268 306537 343528 379560 411452 436536 453054 460353 459255 452487 444569 440796 445594 461064 486379
35255 486379 518254 552244 584353 612261 635626 655476 673118 689218 703383 714197 719445 716346
35243 716346 701885 673363 629098 568909 494078 406834 309765 205468 96513 -14387 -124071
35232 -124071 -228572 -322982 -401756 -459498 -492006 -497257 -475995 -431734 -370079 -297640 -220905
35221 -220905 -145345 -74882 -11780 43022 89334 127203 156655 177577 189676 192552 185949 169937
35209 169937 144873 111234 69712 21573 -31030 -85094 -137024 -182889 -218622 -240387 -245235 -231812
35197 -231812 -200702 -154133 -95123 -26573 49148 129906 213047 294695 369573 431615 475343
$$ packed form
35281A82011J624J175j144l787m916l299J136P374J4066K0323K5963L1005L5006
35268C06537L6991L6032L1892K5084J6518P299j098o768p918l773M798J5470K5315
35255D86379L1875L3990L2109K7908K3365J9850J7642J6100J4165J0814N248l099
35243G16346j4461k8522m4265o0189p4831q7244r7069j04297j08955j10900j09684
35232a24071j04501r4410p8774n7742l2508n251K1262M4261O1655P2439P6735
35221b20905P5560P0463O3102N4802M6312L7869K9452K0922J2099K876o603j6012
35209A69937k5064l3639m1522m8139n2603n4064n1930m5865l5733k1765m848J3423
35197b31812L1110M6569N9010O8550P5721Q0758Q3141Q1648P4878O2042M3728
$$ plain form
35186 475343 497595 498912 483865 460009 435725 417806 409727 411234 419080 428354 433832 431075 417183
35173 417183 391075 353352 305912 251522 193361 134585 78031 26160 -18909 -55520 -82804
35162 -82804 -101112 -112345 -119983 -128587 -142639 -165119 -196516 -234715 -275701 -314625 -346919 -369361
35150 -369361 -380918 -383010 -378875 -372237 -365962 -361446 -358944 -358345 -359759 -363657 -370773 -382010 -398301 -420226
35136 -420226 -447393 -478003 -509043 -537146 -559626 -575123 -583630 -586131 -584138 -579287 -573011 -566309 -559516
35123 -559516 -552052 -542316 -528016 -506985 -478021 -441164 -397310 -347516 -292537 -232801 -168681 -100681
35111 -100681 -29254 45539 123995 206051 290342 373727 451554 518334 568601 598060 604992 591269
35099 591269 562202 525078 487046 453289 426042 404606 386188 367084 343779 313695 275571
$$ packed form
35186D75343K2252J317j5047k3856k4284j7919q079J507P846R274N478k757j3892
35173D17183k6108l7723m7440n4390n8161n8776n6554n1871m5069l6611k7284
35162h2804j8308j1233p638q604j4052k2480l1397l8199m0986l8924l2294k2442
35150c69361j1557k092M135O638O275M516K502N99j414l898p116j1237j6291k1925
35136d20226k7167l0610l1040k8103k2480j5497q507k501J993M851O276O702O793
35123e59516P464R736J4300K1031K8964L6857M3854M9794N4979N9736O4120O8000
35111a00681P1427P4793P8456Q2056Q4291Q3385P7827O6780N0267K9459O932j3723
35099E91269k9067l7124l8032l3757k7247k1436j8418j9104k3305l0084l8124
$$ plain form
35088 275571 229518 176684 118558 56275 -9607 -78677 -149867 -220980 -288927 -350556 -403459
35077 -403459 -446234 -478208 -499079 -508975 -508954 -501543 -490833 -481988 -480362 -490497 -515243 -555172 -608463
35064 -608463 -671295 -738612 -804982 -865321 -915389 -952030 -973241 -978238 -967543 -942995 -907510 -864677
35052 -864677 -818423 -772774 -731522 -697637 -672614 -656195 -646638 -641342 -637464 -632323 -623639 -609758
35040 -609758 -589881 -564132 -533356 -498804 -462007 -424861 -389679 -358875 -334390 -317159 -306964
35029 -306964 -302641 -302477 -304664 -307733 -310894 -314130 -317912 -322637 -328109 -333455 -337471 -339086 -337623 -332862
35015 -332862 -325108 -315406 -305698 -298686 -297329 -304118 -320343 -345550 -377259 -411078 -441243 -461577 -466678
35002 -466678 -453100 -420219 -370571 -309455 -243880 -181135 -127494 -87437 -63473 -56321 -65173 -87841
$$ packed form
35088B75571m6053n2834n8126o2283o5882o9070p1190p1113o7947o1629n2903
35077d03459m2775l1974k0871r896K1P411J0710Q845J626j0135k4746l9929n3291
35064f08463o2832o7317o6370o0339n0068l6641k1211m997J0695K4548L5485M2833
35052h64677M6254M5649M1252L3885K5023J6419R557N296L878N141Q684J3881
35040f09758J9877K5749L0776L4552L6797L7146L5182L0804K4485J7231J0195
35029c06964M323J64k187l069l161l236l782m725n472n346m016j615J463M761
35015c32862P754R702R708P012J357o789j6225k5207l1709l3819l0165k0334n101
35002d66678J3578L2881M9648O1116O5575O2745N3641M0057K3964P152q852k2668
$$ plain form
34990 -87841 -120912 -160015 -200377 -237575 -268352 -291205 -306474 -315827 -321442 -325458 -329998 -337492 -350675
34977 -350675 -371933 -402322 -440835 -484379 -528530 -568877 -602462 -628693 -649351 -667680 -687028
34966 -687028 -709560 -735536 -763322 -790034 -812443 -827774 -834274 -831462 -820014 -801244 -776496 -746869
34954 -746869 -713437 -677637 -641332 -606462 -574625 -546899 -523929 -506111 -493778 -487328 -487175 -493381
34942 -493381 -505088 -520208 -535686 -548273 -555413 -555908 -550163 -539893 -527263 -513722 -499061 -481216
34930 -481216 -456966 -423330 -379077 -325656 -267014 -208430 -154984 -110434 -76782 -54475 -42911
34919 -42911 -41038 -47841 -62534 -84356 -112012 -143055 -173790 -200033 -218474 -227765 -228684 -223349 -214147
34906 -214147 -202896 -190483 -177008 -162391 -147240 -133521 -124513 -123911 -134370 -156178 -186750 -221265
$$ packed form
34990h7841l3071l9103m0362l7198l0777k2853j5269r353n615m016m540p494j3183
34977c50675k1258l0389l8513m3544m4151m0347l3585k6231k0658j8329j9348
34966f87028k2532k5976k7786k6712k2409j5331o500K812J1448J8770K4748K9627
34954g46869L3432L5800L6305L4870L1837K7726K2970J7818J2333O450J53o206
34942d93381j1707j5120j5478j2587p140m95N745J0270J2630J3541J4661J7845
34930d81216K4250L3636M4253N3421N8642N8584N3446M4550L3652K2307J1564
34919d2911J873o803j4693k1822k7656l1043l0735k6243j8441r291r19N335R202
34906b14147J1251J2413J3475J4617J5151J3719R008O02j0459k1808l0572l4515
$$ plain form
34894 -221265 -254162 -280740 -298150 -305437 -302869 -291017 -270106 -239958 -200529 -152657 -98448 -40884
34882 -40884 17206 74138 129705 184706 240110 296350 352995 408709 461334 508056 545769 571857
34870 571857 585351 588001 584498 581526 586010 603464 637125 687873 754503 833929 921346 1010702
34858 1010702 1095808 1171916 1237111 1292743 1342592 1391088 1441379 1494085 1547186 1596984 1639532
34847 1639532 1671777 1691972 1699432 1694106 1676287 1646518 1605547 1554359 1494474 1428507 1360540 1295805
34835 1295805 1239634 1196196 1167589 1153436 1150969 1155489 1161158 1161948 1152517 1128905 1089009 1032809
34823 1032809 962298 881241 794795 708946 629620 561686 508158 469847 445449 432038 425891
34812 425891 423482 422275 420957 419154 416939 414554 412472 411602 413234 418585 428112 441123 455943 470491
$$ packed form
34894b21265l2897k6578j7410p287K568J1852K0911L0148L9429M7872N4209N7564
34882d0884N8090N6932N5567N5001N5404N6240N6645N5714N2625M6722L7713K6088
34870E71857J3494K650l503k972M484J7454L3661N0748O6630P9426Q7417Q9356
34858A010702Q5106P6108O5195N5632M9849M8496N0291N2706N3101M9798M2548
34847A639532L2245K0195P460n326j7819k9769m0971n1188n9885o5967o7967o4735
34835A295805n6171m3438k8607j4153k467M520N669P90r431k3612l9896n6200
34823A032809p0511q1057q6446q5849p9326o7934n3528l8311k4398j3411o147
34812D25891k409j207j318j803k215k385k082q70J632N351R527J3011J4820J4548
$$ plain form
34798 470491 482889 491858 496969 498946 500029 504019 515579 538746 575326 624144 681599 743062
34786 743062 804113 860942 910126 948495 973570 984416 982277 970515 953812 937091 924668 919914
34774 919914 925318 942582 972405 1014019 1064876 1120860 1176996 1228296 1270338 1299394 1312248 1305997
34762 1305997 1278180 1227354 1153866 1060428 952097 835630 718376 607066 506889 421167
34752 421167 351639 299125 264153 247190 248418 267252 301950 349599 406490 468772 533152 597380
34740 597380 660291 721428 780547 837384 891758 943802 994086 1043563 1093320 1144089 1195570
34729 1195570 1245895 1291689 1328851 1353713 1363932 1358769 1338897 1306100 1263020 1212882 1159074
34718 1159074 1104700 1052336 1004030 961416 925725 897691 877446 864443 857384 854156 851990 848070
$$ packed form
34798D70491J2398Q969N111J977J083L990J1560K3167L6580M8818N7455O1463
34786G43062O1051N6829M9184L8369K5075J0846k139j1762j6703j6721j2423m754
34774I19914N404J7264K9823M1614N0857N5984N6136N1300M2042K9056J2854o251
34762A305997k7817n0826p3488r3438j08331j16467j17254j11310j00177q5722
34752D21167o9528n2514l4972j6963J228J8834L4698M7649N6891O2282O4380O4228
34740E97380O2911O1137N9119N6837N4374N2044N0284M9477M9757N0769N1481
34729A195570N0325M5794L7162K4862J0219n163j9872l2797m3080n0138n3808
34718A159074n4374n2364m8306m2614l5691k8034k0245j3003p059l228k166l920
$$ plain form
34706 848070 840556 829575 817607 808995 808788 821280 848720 890583 943608 1002558 1061328 1114085
34694 1114085 1156151 1184470 1197558 1195181 1178082 1147898 1106967 1057776 1002170 940730 872693
34683 872693 796599 711582 618822 522324 428425 344261 276066 228034 201898 197006 210698 238744
34671 238744 275714 315304 350947 376948 389937 389956 380560 367759 358203 357304 367961 390235 421998
34658 421998 460207 502321 547334 596110 650950 714589 789012 874564 969637 1070973 1174303
34647 1174303 1275134 1369526 1454660 1528993 1592002 1643899 1685625 1718981 1746395 1770040 1790597
34636 1790597 1806482 1814199 1809850 1791038 1758002 1713421 1661284 1605730 1550412 1498325 1451728 1411953
34624 1411953 1379110 1351913 1327900 1304145 1278212 1248915 1216633 1183167 1151285 1124133 1104692
$$ packed form
34706H48070p514j0981j1968q612k07J2492K7440M1863N3025N8950N8770N2757
34694A114085M2066K8319J3088k377j7099l0184m0931m9191n5606o1440o8037
34683H72693p6094q5017r2760r6498r3899q4164o8195m8032k6136m892J3692K8046
34671B38744L6970L9590L5643K6001J2989J9r396j2801r556q99J0657K2274L1763
34658D21998L8209M2114M5013M8776N4840O3639P4423Q5552R5073J01336J03330
34647A174303J00831R4392Q5134P4333O3009N1897M1726L3356K7414K3645K0557
34636A790597J5885P717m349j8812l3036m4581n2137n5554n5318n2087m6597l9775
34624A411953l2843k7197k4013k3755k5933k9297l2282l3466l1882k7152j9441
$$ plain form
34613 1104692 1095403 1097897 1112834 1139974 1178650 1228403 1289305 1361650 1445242 1538652 1638790
34602 1638790 1740953 1839428 1928418 2002914 2059248 2095406 2111327 2109117 2092904 2068138 2040572
34591 2040572 2015272 1996050 1985335 1984302 1992993 2010311 2033949 2060419 2085339 2104045 2112404 2107647
34579 2107647 2088898 2057275 2015439 1966698 1914059 1859724 1805230 1751901 1701078 1654058 1612065
34568 1612065 1576569 1549766 1534762 1535115 1553819 1592190 1649253 1721906 1805684 1895759 1987868 2078991
34556 2078991 2167506 2252589 2333050 2406149 2467061 2509464 2527311 2517214 2480346 2422771 2354116
34545 2354116 2285412 2227107 2187606 2172243 2182719 2217232 2271274 2338809 2413350 2488752 2559737
34534 2559737 2622233 2673471 2711811 2736425 2747115 2744423 2729767 2705269 2673165 2635174 2592311
$$ packed form
34613A104692r289K494J4937K7140L8676M9753O0902P2345Q3592R3410J00138
34602A638790J02163R8475Q8990P4496N6334L6158J5921k210j6213k4766k7566
34591B040572k5300j9222j0715j033Q691J7318K3638K6470K4920J8706Q359m757
34579B107647j8749l1623m1836m8741n2639n4335n4494n3329n0823m7020m1993
34568A612065l5496k6803j5004L53J8704L8371N7063P2653Q3778R0075R2109R1123
34556B078991Q8515Q5083Q0461P3099O0912M2403J7847j0097l6868n7575o8655
34545B354116o8704n8305l9501j5363J0476L4513N4042O7535P4541P5402P0985
34534B559737O2496N1238L8340K4614J0690k692j4656k4498l2104l7991m2863
$$ plain form
34523 2592311 2545354 2495745 2446383 2401826 2367703 2349618 2351883 2376433 2422313 2486042 2562840
34512 2562840 2648139 2738555 2831980 2926964 3021925 3114566 3201831 3280416 3347555 3401648 3442504
34501 3442504 3471138 3489210 3498285 3499404 3493298 3481104 3464865 3447392 3431619 3419928 3413810 3413910
34489 3413910 3420381 3433240 3452578 3478710 3512422 3555175 3608943 3675611 3756320 3851081 3958672
34478 3958672 4076728 4202099 4331507 4462301 4592964 4723168 4853359 4984039 5115054
34469 5115054 5245213 5372328 5493514 5605647 5705998 5792909 5866224 5927295 5978667 6023686
34459 6023686 6066180 6110251 6160152 6220030 6293447 6382894 6489725 6614527 6757478 6918318
34449 6918318 7096006 7288414 7492268 7703430 7917462 8130197 8337974 8537474 8725426
$$ packed form
34523B592311m6957m9609m9362m4557l4123j8085K265K4550M5880O3729P6798
34512B562840Q5299R0416R3425R4984R4961R2641Q7265P8585O7139N4093M0856
34501C442504K8634J8072R075J119o106j2194j6239j7473j5773j1691o118J00
34489C413910O471J2859J9338K6132L3712M2753N3768O6668Q0709R4761J07591
34478C958672J18056J25371J29408J30794J30663J30204J30191J30680J31015
34469E115054J30159J27115J21186J12133J00351Q6911P3315O1071N1372M5019
34459F023686M2494M4071M9901N9878P3417Q9447J06831J24802J42951J60840
34449F918318J77688J92408K03854K11162K14032K12735K07777J99500J87952
$$ plain form
34440 8725426 8898493 9053329 9186849 9296877 9383096 9447868 9496411 9536019 9574316 9617056
34430 9617056 9666487 9721295 9778127 9833659 9886056 9935501 9984014 10034890 10092058 10159760 10242686
34419 10242686 10346182 10476076 10638159 10837745 11079613 11368244 11708114 12103749 12559463
34410 12559463 13078982 13665338 14321103 15048784 15851142 16731296 17692337 18736145 19861385
34401 19861385 21061086 22320168 23612939 24900484 26128351 27226047 28111389 28702695
34393 28702695 28938066 28794693 28297995 27514897 26534830 25448406 24332372 23243661 22220273
34384 22220273 21285206 20450544 19720543 19093741 18564566 18124771 17764845 17475519 17249053
34375 17249053 17079681 16963030 16895186 16872162 16889850 16944204 17031619 17149499 17296640 17473065
$$ packed form
34440H725426J73067J54836J33520J10028Q6219O4772M8543L9608L8297M2740
34430I617056M9431N4808N6832N5532N2397M9445M8513N0876N7168O7702Q2926
34419A0242686J03496J29894J62083J99586K41868K88631L39870L95635M55714
34410A2559463N19519N86356O55765P27681Q02358Q80154R61041J043808J125240
34401A9861385J199701J259082J292771J287545J227867J097696Q85342N91306
34393B8702695K35371j43373m96698p83098r80067j086424j116034j088711j023388
34384B2220273r35067q34662p30001o26802n29175m39795l59926k89326k26466
34375A7249053j69372j16651o7844k3024J7688N4354Q7415J17880J47141J76425
$$ plain form
34365 17473065 17679545 17917268 18187698 18492458 18833248 19211889 19630227 20089737 20591212
34356 20591212 21135052 21722037 22354014 23034169 23766721 24556093 25405929 26318797 27296896
34347 27296896 28343170 29462153 30660535 31947717 33336096 34840827 36479292 38270533
34339 38270533 40234554 42391664 44762640 47369971 50239381 53400789 56888998 60744672
34331 60744672 65015334 69756044 75030125 80910008 87477186 94820513 103033615 112212490
34323 112212490 122453122 133848460 146484757 160436279 175755433 192455735 210487957
34316 210487957 229710751 249854547 270475837 290902542 310183226 327075486 340131299
34309 340131299 347925738 349402305 344204770 332823220 316464023 296710339 275146085
$$ packed form
34365A7473065K06480K37723K70430L04760L40790L78641M18338M59510N01475
34356B0591212N43840N86985O31977O80155P32552P89372Q49836R12868R78099
34347B7296896J046274J118983J198382J287182J388379J504731J638465J791241
34339C8270533J964021K157110K370976K607331K869410L161408L488209L855674
34331F0744672M270662M740710N274081N879883O567178P343327Q213102R178875
34323A12212490J0240632J1395338J2636297J3951522J5319154J6700302J8032222
34316B10487957J9222794K0143796K0621290K0426705J9280684J6892260J3055813
34309C40131299P794439J476567n197535j1381550j6359197j9753684k1564254
$$ plain form
34302 275146085 253095468 231524989 211063840 192074318 174726167 159057309 145019649
34295 145019649 132514273 121419268 111609890 102969775 95394747 88792852 83083172 78194095
34287 78194095 74061459 70627194 67838389 65646298 64005239 62871444 62200852 61944696
34279 61944696 62043038 62417471 62963899 63546383 63995749 64120073 63732796 62694921 60955008
34270 60955008 58565864 55667258 52443668 49078896 45725836 42495720 39460595 36661158
34262 36661158 34115207 31824535 29779699 27963346 26353178 24924717 23653426 22516064
34254 22516064 21491414 20560274 19704857 18908543 18156799 17438765 16748191 16083069 15444292
34245 15444292 14834035 14254443 13707226 13194161 12717621 12280223 11883705 11528052 11211402
$$ packed form
34302B75146085k2050617k1570479k0461149j8989522j7348151j5668858j4037660
34295A45019649j2505376j1095005r809378q640115p575028o601895n709680m889077
34287G8194095m132636l434265k788805k192091j641059j133795o70592k56156
34279F1944696R8342L74433N46428N82484M49366J24324l87277j037875j739913
34270F0955008k389144k898606l223590l364772l353060l230116l035125k799437
34262C6661158k545951k290672k044836j816353j610168j428461j271291j137362
34254B2516064j024650r31140q55417p96314p51744p18034o90574o65122o38777
34245A5444292o10257n79592n47217n13065m76540m37398l96518l55653l16650
$$ plain form
34236 11211402 10930580 10681828 10461488 10266351 10093586 9940552 9804826 9684345 9577326
34227 9577326 9482048 9396748 9319601 9248579 9181327 9115347 9048448 8979104 8906518 8830456 8750836
34216 8750836 8667119 8577900 8481155 8375089 8259070 8134102 8002584 7867427 7730958 7594364
34206 7594364 7458074 7322753 7190189 7063691 6947812 6847327 6765632 6703303 6657514 6622350
34196 6622350 6589529 6549480 6492902 6412683 6305406 6171764 6015704 5842617 5657294 5462598
34186 5462598 5259475 5048011 4828657 4603000 4374005 4145886 3923752 3713175 3519794
34177 3519794 3348866 3204598 3089378 3003279 2944070 2907702 2889186 2883635 2887087 2896688 2910374
34166 2910374 2926447 2943311 2959216 2972066 2979472 2979222 2969907 2951404 2925068 2893624 2860748 2830413
$$ packed form
34236A1211402k80822k48752k20340j95137j72765j53034j35726j20481j07019
34227I577326r5278q5300p7147p1022o7252o5980o6899o9344p2586p6062p9620
34216H750836q3717q9219r6745j06066j16019j24968j31518j35157j36469j36594
34206G594364j36290j35321j32564j26498j15879j00485q1695o2329m5789l5164
34196F622350l2821m0049n6578q0219j07277j33642j56060j73087j85323j94696
34186E462598k03123k11464k19354k25657k28995k28119k22134k10577j93381
34177C519794j70928j44268j15220q6099n9209l6368j8516n551L452R601J3686
34166B910374J6073J6864J5905J2850P406k50r315j8503k6336l1444l2876l0335
$$ plain form
34154 2830413 2806251 2791188 2787503 2797056 2821266 2860525 2913295 2975608 3041404 3103544 3155131 3190939
34142 3190939 3208764 3210101 3199485 3182651 3164438 3147380 3131399 3114472 3093906 3067549 3034421
34131 3034421 2994699 2949375 2899879 2847647 2793737 2738716 2682917 2626851 2571559 2518789 2471018
34120 2471018 2431164 2401916 2384806 2379404 2383119 2391888 2401434 2408365 2410433 2406111 2393990 2372427 2339480
34107 2339480 2293119 2231728 2154663 2062552 1957270 1841870 1720592 1598654 1481556 1374102
34097 1374102 1279640 1199904 1135388 1085849 1050582 1028358 1017293 1014905 1018319 1024417 1029983 1032065
34085 1032065 1028650 1019399 1006017 992041 981966 979862 987968 1005865 1030642 1058035 1084110 1106897
34073 1106897 1127221 1148199 1173515 1205326 1242897 1282661 1319614 1349261 1369092 1378887 1379955 1373915
$$ packed form
34154B830413k4162j5063l685R553K4210L9259N2770O2313O5796O2140N1587L5808
34142C190939J7825J337j0616j6834j8213j7058j5981j6927k0566k6357l3128
34131C034421l9722m5324m9496n2232n3910n5021n5799n6066n5292n2770m7771
34120B471018l9854k9248j7110n402L715Q769R546O931K068m322j2121k1563l2947
34107B339480m6361o1391p7065r2111j05282j15400j21278j21938j17098j07454
34097A374102r4462p9736o4516m9539l5267k2224j1065k388L414O098N566K082
34085A032065l415r251j3382j3976j0075k104Q106J7897K4777K7393K6075K2787
34073A106897K0324K0978K5316L1811L7571L9764L6953K9647J9831R795J068o040
$$ plain form
34061 1373915 1361779 1343699 1319408 1288992 1253487 1214871 1175566 1137869 1103577 1073795 1048715
34050 1048715 1027484 1008316 989012 967857 944578 920901 900302 886961 884319 893796 914218 942236
34038 942236 973663 1005042 1034596 1062187 1088604 1114741 1141119 1167773 1194318 1219898 1242932
34027 1242932 1260988 1271190 1271100 1259633 1237604 1207807 1174649 1143368 1118973 1105255 1104157 1115511
34015 1115511 1137049 1164800 1193888 1219632 1238646 1249630 1253529 1252871 1250532 1248517 1247303 1245861 1242137
34002 1242137 1233797 1219046 1197250 1169114 1136361 1101155 1065681 1032177 1003441 983413 977362 991349
33990 991349 1031078 1100453 1200406 1328519 1479597 1646676 1821621 1994984 2155606 2290831
33980 2290831 2387953 2436844 2432913 2378968 2284683 2163621 2029175 1891398 1755892 1624599
$$ packed form
34061A373915j2136j8080k4291l0416l5505l8616l9305l7697l4292k9782k5080
34050A048715k1231j9168j9304k1155k3279k3677k0599j3341k642R477K0422K8018
34038I42236L1427L1379K9554K7591K6417K6137K6378K6654K6545K5580K3034
34027A242932J8056J0202r0j1467k2029k9797l3158l1281k4395j3718j098J1354
34015A115511K1538K7751K9088K5744J9014J0984L899o58k339k015j214j442l724
34002A242137q340j4751k1796k8136l2753l5206l5474l3504k8736k0028o051J3987
33990I91349L9729O9375R9953J28113J51078J67079J74945J73363J60622J35225
33980B290831R7122M8891l931n3945r4285j21062j34446j37777j35506j31293
$$ plain form
33970 1624599 1497522 1374305 1255139 1141026 1033644 934920 846282 767874 698259 634911
33960 634911 575186 517143 459859 403309 348032 294785 244276 196956 152860 111549 72337
33949 72337 34827 -488 -31911 -56620 -71110 -71787 -55502 -19868 36578 114099 211308 324852
33937 324852 449640 579653 708927 832243 945297 1044451 1126397 1188085 1227011 1241679
33927 1241679 1231937 1199088 1145803 1075887 993996 905276 814868 727164 644991 569189 498971
33916 498971 432947 370312 311581 258530 213416 177980 152910 138070 133255 138866 156091 186456
33904 186456 230906 288878 357969 434447 514213 593451 668660 736375 793136 835959 863062
33893 863062 874475 872166 859580 840723 819111 796909 774553 750948 724092 691847 652712 606435
$$ packed form
33970A624599j27077j23217j19166j14113j07382r8724q8638p8408o9615o3348
33960F34911n9725n8043n7284n6550n5277n3247n0509m7320m4096m1311l9212
33949G2337l7510l5315l1423k4709j4490o77J6285L5634N6446P7521R7209J13544
33937C24852J24788J30013J29274J23316J13054R9154Q1946O1688L8926J4668
33927A241679r742l2849n3285o9916q1891q8720r0408q7704q2173p5802p0218
33916D98971o6024o2635n8731n3051m5114l5436k5070j4840m815N611J7225L0365
33904A86456M4450N7972O9091P6478P9766P9238P5209O7715N6761M2823K7103
33893H63062J1413k309j2586j8857k1612k2202k2356k3605k6856l2245l9135m6277
$$ plain form
33881 606435 554267 498524 441586 384963 329082 273835 219414 166860 118039 75063 39466
33870 39466 11645 -9061 -23839 -33890 -40289 -44028 -45962 -46563 -45710 -42783 -37191 -29025 -19463 -10643
33856 -10643 -5220 -5932 -15232 -34879 -65533 -106636 -156596 -212965 -272327 -330130 -380934 -419272
33844 -419272 -440812 -443377 -427495 -396419 -355673 -312235 -273482 -246038 -234772 -242190 -268337 -311169
33832 -311169 -367144 -431799 -500232 -567514 -629054 -680845 -719507 -742195 -746593 -731118 -695260 -639842
33820 -639842 -567028 -480005 -382446 -277938 -169584 -59821 49736 158452 266681 375455
33810 375455 486015 599525 717074 839773 968702 1104731 1248501 1400766 1562989 1737804
33800 1737804 1928912 2140372 2375617 2636675 2923793 3235414 3568310 3917653 4276780
$$ packed form
33881F06435n2168n5743n6938n6623n5881n5247n4421n2554m8821m2976l5597
33870C9466k7821k0706j4778j0051o399l739j934o01Q53K927N592Q166R562Q820
33856a0643N423p12r300j9647l0654m1103m9960n6369n9362n7803n0804l8338
33844d19272k1540k565J5882L1076M0746M3438L8753K7444J1266p418k6147m2832
33832c11169n5975o4655o8433o7282o1540n1791l8662k2688m398J5475L5858N5418
33820f39842P2814Q7023R7559J04508J08354J09763J09557J08716J08229J08774
33810C75455J10560J13510J17549J22699J28929J36029J43770J52265J62223J74815
33800A737804J91108K11460K35245K61058K87118L11621L32896L49343L59127
$$ plain form
33791 4276780 4636525 4984345 5303693 5574230 5773449 5880114 5879208 5766724 5551945 5255700
33781 5255700 4905334 4528824 4150462 3788915 3457064 3162566 2908528 2694255 2516183
33772 2516183 2368980 2246690 2143639 2054841 1975682 1901131 1825225 1741532 1644655 1531960
33762 1531960 1404477 1266414 1123564 981338 843273 710476 582037 456037 330662
33753 330662 205111 80148 -41794 -157041 -261540 -351797 -425503 -481686 -520580 -543485
33743 -543485 -552585 -550633 -540417 -524267 -503901 -480642 -455753 -430454 -405476 -380428 -353589 -322515
33731 -322515 -285191 -240903 -190267 -134695 -76061 -16982 38740 86241 120473 137359 134545 111499
33719 111499 69204 9834 -63368 -146067 -232897 -317877 -395252 -460509 -511005 -545864 -565284
$$ packed form
33791D276780L59745L47820L19348K70537J99219J06665r06j12484k14779k96245
33781E255700l50366l76510l78362l61547l31851k94498k54038k14273j78072
33772B516183j47203j22290j03051q8798p9159p4551p5906q3693r6877j12695
33762A531960j27483j38063j42850j42226j38065j32797j28439j26000j25375
33753C30662j25551j24963j21942j15247j04499r0257p3706n6183l8894k2905
33743e43485r100J952J0216J6150K0366K3259K4889K5299K4978K5048K6839L1074
33731c22515L7324M4288N0636N5572N8634N9079N5722M7501L4232J6886k814k3046
33719A11499m2295n9370p3202q2699q6830q4980p7375o5257n0496l4859j9420
$$ plain form
33708 -565284 -569889 -560533 -538468 -505454 -463559 -414756 -360617 -302369 -241406 -179950 -121423 -70038
33696 -70038 -29710 -2823 10489 12209 5621 -5677 -18562 -30792 -41113 -49089 -54684 -57772 -57889
33683 -57889 -54413 -47001 -35846 -21487 -4300 15829 39327 66314 96093 127214 158087 187639
33671 187639 215515 241839 266828 290549 312938 333967 353813 372710 390454 405895 416931
33660 416931 421098 416390 401872 377915 346259 309945 273088 240392 216383 204519 206464 221848
33648 221848 248657 284154 325993 373015 425344 483714 548423 618594 692178 766692 840239
33637 840239 912271 983602 1055571 1128644 1201185 1269113 1326824 1369081 1392882 1398266 1387624 1364077
33625 1364077 1329988 1286351 1233142 1170281 1098687 1020962 941339 864809 795755 736628 687229
$$ packed form
33708e65284m605R356K2065L3014M1895M8803N4139N8248O0963O1456N8527N1385
33696g0038M0328K6887J3312J720o588j1298j2885j2230j0321p976n595l088j17
33683e7889L476P412J1155J4359J7187K0129K3498K6987K9779L1121L0873K9552
33671A87639K7876K6324K4989K3721K2389K1029J9846J8897J7744J5441J1036
33660D16931M167m708j4518k3957l1656l6314l6857l2696k4009j1864J945J5384
33648B21848K6809L5497M1839M7022N2329N8370O4709P0171P3584P4514P3547
33637H40239P2032P1331P1969P3073P2541O7928N7711M2257K3801N384j0642k3547
33625A364077l4089m3637n3209o2861p1594p7725p9623p6530o9054n9127m9399
$$ plain form
33614 687229 644954 605851 565976 522403 473720 420089 362909 303997 244580 184717 123677
33603 123677 61064 -2072 -62860 -117100 -160338 -188929 -200658 -194785 -171752 -132820 -79745 -14541
33591 -14541 60635 143429 231250 321474 411842 500717 586930 669221 745645 813347 868974 909611
33579 909611 933745 941762 935755 918955 895240 868860 844167 825044 814092 812033 817755 828998
33567 828998 843207 858085 871730 882548 889145 890237 884597 871080 848815 817496 777661 730745
33555 730745 678852 624383 569716 517031 468139 424195 385438 351176 320120 290916 262676
33544 262676 235352 209862 187845 171057 160627 156540 157530 161324 165094 165994 161735 151061 133949
33531 133949 111400 84938 56007 25474 -6600 -40774 -77637 -117092 -157941 -197990 -234527
$$ packed form
33614F87229m2275l9103l9875m3573m8683n3631n7180n8912n9417n9863o1040
33603A23677o2613o3136o0788n4240m3238k8591j1729N873K3033L8932N3075O5204
33591a4541P5176Q2794Q7821R0224R0368Q8875Q6213Q2291P6424O7702N5627M0637
33579I09611K4134Q017o007j6800k3715k6380k4693j9123j0952k059N722J1243
33567H28998J4209J4878J3645J0818O597J092n640j3517k2265l1319l9835m6916
33555G30745n1893n4469n4667n2685m8892m3944l8757l4262l1056k9204k8240
33544B62676k7324k5490k2017j6788j0430m087R90L794L770R00m259j0674j7112
33531A33949k2549k6462k8931l0533l2074l4174l6863l9455m0849m0049l6537
$$ plain form
33520 -234527 -264842 -286533 -297529 -295903 -279759 -247484 -198416 -133549 -55743 30726 120946 210079
33508 210079 293926 369416 435051 490974 538473 579052 613560 641821 662841 675303 677987 669995
33496 669995 650874 620789 580745 532737 479618 424601 370561 319504 272567 230522 194423
33485 194423 165928 147095 139799 145057 162519 190340 225503 264543 304394 342994 379380 413231
33473 413231 444098 470802 491409 503838 506733 500061 485178 464405 440373 415366 390885 367544
33461 367544 345242 323453 301529 278998 255810 232366 209292 187100 165922 145348 124316
33450 124316 101134 73778 40438 116 -46862 -98449 -150732 -198326 -235363 -256793 -259497 -242871
33438 -242871 -208800 -161074 -104450 -43745 16783 73748 124831 169027 206814 239997 271093
$$ packed form
33520b34527l0315k1691j0996J626J6144L2275M9068O4867P7806Q6469R0220Q9133
33508B10079Q3847P5490O5635N5923M7499M0579L4508K8261K1020J2462K684p992
33496F69995j9121l0085m0044m8008n3119n5017n4040n1057m6937m2045l6099
33485A94423k8495j8833p296N258J7462K7821L5163L9040L9851L8600L6386L3851
33473D13231L0867K6704K0607J2429K895o672j4883k0773k4032k5007k4481k3341
33461C67544k2302k1789k1924k2531k3188k3444k3074k2192k1178k0574k1032
33450A24316k3182k7356l3340m0322m6978n1587n2283m7594l7037k1430k704J6626
33438b42871L4071M7726N6624O0705O0528N6965N1083M4196L7787L3183L1096
$$ plain form
33427 271093 302442 335371 369834 404608 437841 467485 491392 507191 512328 504468 482181 445489
33415 445489 396064 337007 272414 206969 145666 93548 55235 34034 30915 43895 68328 98059
33403 98059 126998 150516 166221 173894 174777 170777 164189 157838 155016 158724 170488 189591 213246
33390 213246 237599 259013 275081 285082 289849 291208 291209 291341 291997 292396 291096 286798 278945 267830
33376 267830 254350 239808 225929 214871 208864 209534 217309 231289 249457 268933 286212 297776
33364 297776 301239 296531 286317 275206 268190 269185 280287 301658 331686 367192 403897 437320
33352 437320 463876 481609 490231 490595 484030 471768 454442 431679 401939 362785 311646 246895
33340 246895 168887 80482 -13283 -106304 -192753 -268009 -328829 -372991 -398983 -406213 -395632 -370202
$$ packed form
33427B71093L1349L2929L4463L4774L3233K9644K3907J5799N137p860k2287l6692
33415D45489m9425n9057o4593o5445o1303n2118l8313k1201l119J2980K4433K9731
33403I8059K8939K3518J5705P673Q83m000o588o351k822L708J1764J9103K3655
33390B13246K4353K1414J6068J0001M767J359JJ32O56L99j300m298p853j1115
33376B67830j3480j4542j3879j1058o007O70P775J3980J8168J9476J7279J1564
33364B97776L463m708j0214j1111p016R95J1102K1371L0028L5506L6705L3423
33352D37320K6556J7733Q622L64o565j2262j7326k2763k9740l9154n1139o4751
33340B46895p8008q8405r3765r3021q6449p5256o0820m4162k5992p230J0581K5430
$$ plain form
33328 -370202 -334476 -293158 -249251 -202957 -152169 -94395 -28970 41797 113076 179078 234706
33317 234706 276574 303255 315010 313374 300822 280573 256412 232495 213008 201652 200961 211663
33305 211663 232450 260402 291874 323462 352702 378465 401146 422680 446213 475322 512875
33294 512875 559992 615701 677607 743291 811603 883024 958874 1039860 1124891 1210784 1292865
33283 1292865 1366051 1425985 1469842 1496627 1506934 1502508 1485971 1460733 1430703 1399586 1370006
33272 1370006 1343003 1318195 1294521 1271226 1248705 1228881 1214951 1210664 1219408 1243456 1283683 1339865
33260 1339865 1411426 1498226 1600961 1721105 1860548 2021163 2204598 2412490 2647131 2912114
33250 2912114 3212378 3553345 3939499 4373117 4853719 5378391 5942659 6541422 7169495
$$ packed form
33328c70202L5726M1318M3907M6294N0788N7774O5425P0767P1279O6002N5628
33317B34706M1868K6681J1755j636j2552k0249k4161k3917j9487j1356o91J0702
33305B11663K0787K7952L1472L1588K9240K5763K2681K1534K3533K9109L7553
33294E12875M7117N5709O1906O5684O8312P1421P5850Q0986Q5031Q5893Q2081
33283A292865P3186N9934M3857K6785J0307m426j6537k5238l0030l1117k9580
33272A370006k7003k4808k3674k3295k2521j9824j3930m287Q744K4048M0227N6182
33260A339865P1561Q6800J02735J20144J39443J60615J83435K07892K34641K64983
33250B912114L00264L40967L86154M33618M80602N24672N64268N98763O28073
$$ plain form
33241 7169495 7821459 8490599 9166933 9834796 10470807 11043081 11512526 11837009 11978769
33232 11978769 11913841 11640007 11179248 10572840 9871152 9122703 8366626 7630181 6930279
33223 6930279 6276704 5674953 5127822 4635946 4197992 3810923 3470430 3171402 2908292
33214 2908292 2675354 2466827 2277296 2102363 1939343 1787487 1647434 1520130 1405939
33205 1405939 1304420 1214706 1135964 1067565 1009070 960240 920963 890832 868437 850864 833882
33194 833882 812724 783013 741493 686484 618198 538915 452943 366263 285724 217931 168014
33183 168014 138637 129532 137741 158639 187426 220445 255661 292175 329287 365810 399997 429911
33171 429911 453870 470809 480618 484473 484937 485628 490455 502632 523691 552691 586032 618243 643677
$$ packed form
33241G169495O51964O69140O76334O67863O36011N72274M69445L24483J41760
33232A1978769o4928k73834m60759o06408p01688p48449p56077p36445o99902
33223F930279o53575o01751n47131m91876m37954l87069l40493k99028k63110
33214B908292k32938k08527j89531j74933j63020j51856j40053j27304j14191
33205A405939j01519q9714p8742o8399n8495m8830l9277l0131k2395j7573j6982
33194H33882k1158k9711m1520n5009o8286p9283q5972q6680q0539o7793m9917
33183A68014k9377r105Q209K0898K8787L3019L5216L6514L7112L6523L4187K9914
33171D29911K3959J6939R809L855M64O91M827J2177K1059K9000L3341L2211K5434
$$ plain form
33158 643677 658352 660959 652521 634982 609643 576434 534459 483465 425201 363743 304528 252630
33146 252630 211131 180383 158547 143210 133237 129865 136412 156798 193698 247158 314157 389050
33134 389050 464566 532966 587178 621795 633868 623322 592847 547236 492355 433986 376959
33123 376959 324770 279651 242764 214309 193599 179365 170386 166107 166818 173285 186161 205636
33111 205636 231472 263223 300360 342184 387673 435426 483762 530983 575673 616998 654905
33100 654905 690169 724301 759397 798004 842956 896991 962217 1039688 1129446 1230901 1343145
33089 1343145 1464853 1593838 1726613 1858105 1981610 2089021 2171652 2221689 2233897 2206743
33079 2206743 2142428 2045942 1923843 1783239 1631057 1473544 1316096 1163428 1019834 889133
$$ packed form
33158F43677J4675K607q438j7539k5339l3209m1975n0994n8264o1458n9215n1898
33146B52630m1499l0748k1836j5337r973l372O547K0386L6900N3460O6999P4893
33134C89050P5516O8400N4212L4617J2073j0546l0475m5611n4881n8369n7027
33123C76959n2189m5119l6887k8455k0710j4234q979m279P11O467J2876J9475
33111B05636K5836L1751L7137M1824M5489M7753M8336M7221M4690M1325L7907
33100F54905L5264L4132L5096L8607M4952N4035O5226P7471Q9758J01455J12244
33089A343145J21708J28985J32775J31492J23505J07411Q2631N0037J2208k7154
33079B206743o4315r6486j22099j40604j52182j57513j57448j52668j43594j30701
$$ plain form
33069 889133 774305 677261 598978 539861 499961 479006 476441 491564 523647 571827 634722
33058 634722 709862 793154 878668 959021 1026450 1074377 1098948 1099975 1080907 1047915 1008546 970403
33046 970403 939989 921780 917586 926386 944750 967720 989909 1006498 1013910 1010129 994731 968674
33034 968674 933861 892515 846554 797213 745014 690072 632620 573450 513973 455738 399755
33023 399755 346195 294860 246165 201947 165425 140236 129078 132831 150588 180349 219785 266642
33011 266642 318759 373947 429879 484101 534174 577856 613221 638664 652854 654768 643804 619942
32999 619942 583800 536520 479468 413994 341467 263631 182973 102696 26173 -43765 -105290
32988 -105290 -157592 -200661 -235034 -261492 -280621 -292454 -296564 -292612 -280866 -262138 -237184 -206197
$$ packed form
33069H89133j14828r7044p8283n9117l9900k0955k565J5123L2083M8180O2895
33058F34722P5140Q3292Q5514Q0353O7429M7927K4571J027j9068l2992l9369l8143
33046I70403l0414j8209m194Q800J8364K2970K2189J6589P412l781j5398k6057
33034I68674l4813m1346m5961m9341n2199n4942n7452n9170n9477n8235n5983
33023C99755n3560n1335m8695m4218l6522k5189j1158L753J7757K9761L9436M6857
33011B66642N2117N5188N5932N4222N0073M3682L5365K5443J4190J914j0964k3862
32999F19942l6142m7280n7052o5474p2527p7836q0658q0277p6523o9938o1525
32988a05290n2302m3069l4373k6458j9129j1833m110L952J1746J8728K4954L0987
$$ plain form
32976 -206197 -168899 -125209 -75979 -23396 29085 77247 116955 145140 160587 164136 158268 146349
32964 146349 131909 118082 107185 100511 98415 100648 106661 115742 127207 140801 157159 177824
32952 177824 204611 238636 279567 325479 373247 419187 459613 491291 511909 520653 518732 509488
32940 509488 497855 489203 487923 496283 514066 539181 568953 601399 635834 672622 712391 755307
32928 755307 800798 847705 894526 939532 980789 1016283 1044087 1062509 1070167 1066155 1050394 1024015
32916 1024015 989477 950141 909320 869211 830293 791489 750894 706553 657047 601869 541649
32905 541649 478167 414080 352418 295884 245977 202291 162565 123755 83588 41554 -1242
32894 -1242 -42982 -81930 -116725 -146400 -170553 -189626 -204835 -217496 -228119 -235932 -239210 -236149
$$ packed form
32976b06197L7298M3690M9230N2583N2481M8162L9708K8185J5447L549n868j1919
32964A46349j4440j3827j0897o674k096K233O013R081J1465J3594J6358K0665
32952A77824K6787L4025M0931M5912M7768M5940M0426L1678K0618Q744j921r244
32940E09488j1633q652j280Q360J7783K5115K9772L2446L4435L6788L9769M2916
32928G55307M5491M6907M6821M5006M1257L5494K7804J8422P658m012j5761k6379
32916A024015l4538l9336m0821m0109l8918l8804m0595m4341m9506n5178o0220
32905E41649o3482o4087o1662n6534m9907m3686l9726l8810m0167m2034m2796
32894a242m1740l8948l4795k9675k4153j9073j5209j2661j0623p813l278L061
$$ plain form
32882 -236149 -225654 -207662 -182969 -152900 -119101 -83553 -48648 -17135 8186 25001 32167 30351
32870 30351 22251 12021 3938 952 3904 11839 23040 36101 50441 66197 83814 103628 125572
32857 125572 148945 172249 193212 209058 217044 215138 202637 180416 150614 115895 78779 41341
32845 41341 5192 -28556 -59411 -87343 -112156 -132635 -146142 -149133 -138397 -112305 -71477 -18740
32833 -18740 41262 102640 159133 205408 238328 257443 264323 261197 249825 231219 206097 175494
32821 175494 141000 104479 67466 30607 -6436 -44505 -84132 -124915 -165483 -204059 -239224
32810 -239224 -270329 -297199 -319232 -334501 -339673 -331105 -306675 -267291 -217307 -163744 -114818 -78279
32798 -78279 -59946 -62603 -85513 -124692 -173915 -226206 -275282 -316527 -347239 -366338 -373856 -370556
$$ packed form
32882b36149J0495J7992K4693L0069L3799L5548L4905L1513K5321J6815P166j816
32870C0351q100j0230q083k986K952P935J1201J3061J4340J5756J7617J9814K1944
32857A25572K3373K3304K0963J5846P986j906j2501k2221k9802l4719l7116l7438
32845D1341l6149l3748l0855k7932k4813k0479j3507k991J0736K6092M0828N2737
32833a8740O0002O1378N6493M6275L2920J9115O880l126j1372j8606k5122l0603
32821A75494l4494l6521l7013l6859l7043l8069l9627m0783m0568l8576l5165
32810b39224l1105k6870k2033j5269n172Q568K4430L9384M9984N3563M8926L6539
32798g8279J8333k657k2910l9179m9223n2291m9076m1245l0712j9099p518L300
$$ plain form
32786 -370556 -357842 -337869 -313685 -289163 -268654 -256393 -255785 -268715 -295153 -333320 -380448 -433710
32774 -433710 -490784 -549718 -608304 -663418 -710805 -745479 -762617 -758557 -731453 -681377 -609902 -519531
32762 -519531 -413303 -294815 -168478 -39641 85673 201379 302002 383202 442116 477529
32752 477529 489946 481586 456209 418570 373437 324523 273942 222493 170489 118549 67975 20647
32740 20647 -21439 -56772 -84707 -105429 -119540 -127636 -130122 -127286 -119509 -107555 -92791 -77167
32728 -77167 -62752 -50965 -41803 -33491 -22811 -6148 19018 52762 92158 131823 165328 186872
32716 186872 192656 181602 155424 118102 74904 31139 -9024 -43296 -71305 -94096 -113506 -131770
32704 -131770 -151439 -175351 -206305 -246240 -295144 -350380 -407140 -460065 -505163 -540909 -568025
$$ packed form
32786c70556J2714J9973K4184K4522K0509J2261O08j2930k6438l8167m7128n3262
32774d33710n7074n8934n8586n5114m7387l4674j7138M060K7104N0076P1475R0371
32762e19531J06228J18488J26337J28837J25314J15706J00623Q1200N8914L5413
32752D77529J2417q360k5377l7639m5133m8914n0581n1449n2004n1940n0574m7328
32740B0647m2086l5333k7935k0722j4111q096k486K836P777J1954J4764J5624
32728g7167J4415J1787R162Q312J0680J6663K5166L3744L9396L9665L3505K1544
32716A86872N784j1054k6178l7322m3198m3765m0163l4272k8009k2791j9410j8264
32704a31770j9669k3912l0954l9935m8904n5236n6760n2925m5098l5746k7116
$$ plain form
32693 -568025 -588440 -604292 -617489 -629735 -642656 -657757 -676228 -698715 -725139 -754568 -785112
32682 -785112 -813849 -836867 -849554 -847277 -826416 -785426 -725399 -649804 -563596 -472265 -381225 -295532
32670 -295532 -219615 -156841 -108995 -75907 -55418 -43753 -36279 -28505 -17012 73 23285 52459
32658 52459 87293 127328 171473 217643 263095 305415 343540 378137 411024 443949 477381 509850
32646 509850 538075 557693 564209 553879 524425 475592 409537 330951 246706 164903 93492 38807
32634 38807 4402 -9540 -6194 8530 27084 41685 45717 34754 7005 -36862 -94236 -161128
32622 -161128 -232669 -303550 -368477 -422645 -462166 -484363 -487861 -472451 -438882 -388786 -324877 -251202
32610 -251202 -173054 -96317 -26404 32757 79233 112937 134992 146928 150122 145667 134631 118355
$$ packed form
32693e68025k0415j5852j3197j2246j2921j5101j8471k2487k6424k9429l0544
32682g85112k8737k3018j2687K277K0861M0990O0027P5595Q6208R1331R1040Q5693
32670b95532P5917O2774M7846L3088K0489J1665P474P774J1493J7085K3212K9174
32658E2459L4834M0035M4145M6170M5452M2320L8125L4597L2887L2925L3432L2469
32646E09850K8225J9618O516j0330k9454m8833o6055p8586q4245q1803p1411n4685
32634C8807l4405j3942L346J4724J8554J4601M032j0963k7749m3867n7374o6892
32622a61128p1541p0881o4927n4168l9521k2197l498J5410L3569N0096O3909P3675
32610b51202P8148P6737O9913N9161M6476L3704K2055J1936L194m455j1036j6276
$$ plain form
32598 118355 98465 76533 53680 30474 7120 -16268 -39474 -61994 -82759 -99917 -110998
32587 -110998 -113587 -106159 -88598 -62159 -29096 7718 45139 80265 111251 138096 162862 189073
32575 189073 220627 260678 310833 370605 437021 504470 565174 610598 633555 630129 600511 548512
32563 548512 480240 402739 322920 246885 179440 123733 80889 49796 27320 9154 -8915
32552 -8915 -29863 -54898 -83668 -115009 -147801 -181526 -216294 -252444 -290090 -328870 -367893 -405793
32540 -405793 -440802 -470909 -494053 -508306 -512064 -504321 -485050 -455541 -418400 -377066 -335024 -295075
32528 -295075 -259046 -228040 -203060 -185556 -177391 -179985 -193051 -213847 -237534 -258459 -271511 -272952
32516 -272952 -260673 -234256 -195103 -146532 -93490 -41582 4466 42199 71929 96078 117810
$$ packed form
32598A18355j9890k1932k2853k3206k3354k3388k3206k2520k0765j7158j1081
32587a10998k589P428J7561K6439L3063L6814L7421L5126L0986K6845K4766K6211
32575A89073L1554M0051N0155N9772O6416O7449O0704M5424K2957l426k9618n1999
32563E48512o8272p7501p9819p6035o7445n5707m2844l1093k2476j8166j8069
32552h915k0948k5035k8770l1341l2792l3725l4768l6150l7646l8780l9023l7900
32540d05793l5009l0107k3144j4253l758P743J9271K9509L7141M1334M2042L9949
32528b95075L6029L1006K4980J7504Q165k594j3066k0796k3687k0925j3052j441
32516b72952J2279K6417L9153M8571N3042N1908M6048L7733K9730K4149K1732
$$ plain form
32505 117810 139793 163630 190077 219726 253634 293385 340522 395759 458523 527040 598804
32494 598804 671046 741037 806181 864037 912399 949468 974021 985457 983728 969303 943220 907120
32482 907120 863103 813425 760129 704772 648338 591409 534559 478752 425426 376056 331460
32471 331460 291279 254038 217717 180546 141601 100994 59609 18588 -21117 -58999 -95147
32460 -95147 -130444 -166645 -205972 -250206 -299669 -352746 -406224 -456306 -499907 -535699 -564519 -588921
32448 -588921 -612119 -636785 -664108 -693314 -721720 -745375 -760155 -762924 -752333 -729056 -695630 -656020
32436 -656020 -614890 -576580 -544037 -518187 -498044 -481424 -465873 -449409 -430958 -410451 -388679
32425 -388679 -367118 -347848 -333483 -326847 -330326 -345153 -371068 -406514 -449232 -496876 -547361 -598804
$$ packed form
32505A17810K1983K3837K6447K9649L3908L9751M7137N5237O2764O8517P1764
32494E98804P2242O9991O5144N7856M8362L7069K4553J1436j729j4425k6083l6100
32482I07120m4017m9678n3296n5357n6434n6929n6850n5807n3326m9370m4596
32471C31460m0181l7241l6321l7171l8945m0607m1385m1021l9705l7882l6148
32460i5147l5297l6201l9327m4234m9463n3077n3478n0082m3601l5792k8820k4402
32448e88921k3198k4666k7323k9206k8406k3655j4780k769J0591K3277L3426L9610
32436f56020M1130L8310L2543K5850K0143J6620J5551J6464J8451K0507K1772
32425c88679K1561J9270J4365O636l479j4827k5915l5446m2718m7644n0485n1443
$$ plain form
32413 -598804 -649282 -696677 -738844 -773927 -800467 -817174 -822625 -815299 -794013 -758519 -709884 -650515
32401 -650515 -583867 -513950 -444687 -379289 -319804 -267036 -220768 -180176 -144264 -112182 -83304
32390 -83304 -57108 -33047 -10706 9789 27473 40707 47814 47826 40945 28565 12973 -3085 -16831
32377 -16831 -25874 -28740 -25453 -17784 -8777 -1548 2022 1859 -790 -4528 -8855 -14484 -22912 -35602
32363 -35602 -53272 -75556 -101117 -128205 -155372 -181993 -208262 -234655 -261148 -286641 -308965 -325590
32351 -325590 -334704 -336040 -331031 -322423 -313831 -309437 -313534 -329702 -359801 -403369 -457684 -518363 -580162
32338 -580162 -637874 -687218 -725572 -752219 -768021 -774648 -773744 -766364 -752814 -732807 -705663 -670391
32326 -670391 -625803 -570923 -505762 -432006 -353042 -273063 -195714 -123093 -55648 7055 65254
$$ packed form
32413e98804n0478m7395m2167l5083k6540j6707n451P326K1286L5494M8635N9369
32401f50515O6648O9917O9263O5398N9485N2768M6268M0592L5912L2082K8878
32390h3304K6196K4061K2341K0495J7684J3234P107J2o881j2380j5592j6058j3746
32377a6831r043k866L287P669R007P229L570j63k649l738m327n629q428j2690
32363c5602j7670k2284k5561k7088k7167k6621k6269k6393k6493k5493k2324j6625
32351c25590r114j336N009Q608Q592M394m097j6168l0099m3568n4315o0679o1799
32338e80162n7712m9344l8354k6647j5802o627R04P380J3550K0007K7144L5272
32326f70391M4588N4880O5161P3756P8964P9979P7349P2621O7445O2703N8199
$$ plain form
32315 65254 118244 164322 201348 227489 241766 244194 235573 217100 190015 155511 114932 70033
32303 70033 22975 -24068 -69471 -112516 -153338 -192561 -230824 -268500 -305684 -342344 -378419 -413710
32291 -413710 -447636 -479064 -506374 -527851 -542233 -549061 -548508 -540766 -525392 -501076 -465926 -418122
32279 -418122 -356738 -282519 -198253 -108377 -17805 69460 151221 227092 297792 364279 427136
32268 427136 486383 541578 592091 637582 678572 716861 755426 797785 847124 905544 973558
32257 973558 1049830 1131355 1214213 1294748 1370710 1441884 1510133 1578920 1652530 1735245 1830774
32246 1830774 1942186 2072203 2223468 2398428 2598662 2823783 3070154 3329824 3590031
32237 3590031 3833474 4039394 4185663 4252050 4224383 4098358 3881246 3590460 3249567 2883561
$$ packed form
32315F5254N2990M6078L7026K6141J4277K428q621j8473k7085l4504m0579m4899
32303G0033m7058m7043m5403m3045m0822l9223l8263l7676l7184l6660l6075l5291
32291d13710l3926l1428k7310k1477j4382o828N53P742J5374K4316L5150M7804
32279d18122O1384P4219Q4266Q9876R0572Q7265Q1761P5871P0700O6487O2857
32268D27136N9247N5195N0513M5491M0990L8289L8565M2359M9339N8420O8014
32257I73558P6272Q1525Q2858Q0535P5962P1174O8249O8787P3610Q2715R5529
32246A830774J11412J30017J51265J74960K00234K25121K46371K59670K60207
32237C590031K43443K05920J46269O6387k7667j26025k17112k90786l40893l66006
$$ plain form
32227 2883561 2515155 2162763 1839762 1554387 1310026 1106073 939400 806038 702274
32218 702274 624745 569855 533274 509996 494805 482723 469321 451114 426070 393989 356421
32207 356421 316145 276462 240515 210643 187861 171673 160387 151778 143744 134642 123394 109581
32195 109581 93606 76738 60831 47788 38953 34662 34024 35080 35369 32664 25460 12967 -5122
32182 -5122 -28689 -56974 -88449 -121041 -152590 -181169 -205177 -223383 -235104 -240339 -239682 -233959 -223852
32169 -223852 -209747 -191848 -170388 -145774 -118448 -88379 -54383 -13779 37134 101701 181211
32158 181211 273739 374098 474838 567734 645236 701524 733150 739332 721990 685530 636331
32147 636331 581782 528900 482856 446002 417736 395114 373849 349453 318464 279607 234523
$$ packed form
32227B883561l68406l52392l23001k85375k44361k03953j66673j33362j03764
32218G02274p7529n4890l6581k3278j5191j2082j3402j8207k5044l2081l7568
32207C56421m0276l9683l5947k9872k2782j6188j1286q609q034r102j1248j3813
32195A09581j5975j6868j5907j3043q835m291o38J056K89k705p204j2493j8089
32182e122k3567k8285l1475l2592l1549k8579k4008j8206j1721n235O57N723J0107
32169b23852J4105J7899K1460K4614K7326L0069L3996M0604N0913O4567P9510
32158A81211R2528J00359J00740R2896P7502N6288L1626O182j7342l6460m9199
32147F36331n4549n2882m6044l6854k8266k2622k1265k4396l0989l8857m5084
$$ plain form
32136 234523 187674 145285 113539 96566 94961 105479 122098 137973 147500 147742 138799 123155
32124 123155 104380 85811 69753 57409 49364 46222 48931 58518 75336 98365 125018 151517
32112 151517 173569 187207 189790 180890 162538 138467 112717 88354 66772 47693 29686 11097
32100 11097 -8931 -29822 -49686 -66150 -77413 -82920 -83352 -80061 -74467 -67807 -61250 -55989 -53051
32087 -53051 -52984 -55788 -61282 -69717 -82236 -100826 -127652 -164042 -209664 -262334 -318435 -373563 -423102
32074 -423102 -462818 -489568 -501975 -500670 -487938 -466993 -441300 -414188 -388659 -367163 -351192 -340861
32062 -340861 -334825 -330776 -326275 -319331 -308356 -291717 -267522 -233965 -190072 -136404 -75362 -11029
32050 -11029 51342 106040 147619 171625 175320 158240 122293 71177 9324 -59093 -130685 -202846
$$ packed form
32136B34523m6849m2389l1746j6973j605J0518J6619J5875R527K42q943j5644
32124A23155j8775j8569j6058j2344q045l142K709R587J6818K3029K6653K6499
32112A51517K2052J3638K583q900j8352k4071k5750k4363k1582j9079j8007j8589
32100A1097k0028k0891j9864j6464j1263n507m32L291N594O660O557N261K938
32087e3051O7k804n494q435j2519j8590k6826l6390m5622n2670n6101n5128m9539
32074d23102l9716k6750j2407J305J2732K0945K5693K7112K5529K1496J5971J0331
32062c40861O036M049M501O944J0975J6639K4195L3557M3893N3668O1042O4333
32050a1029O2371N4698M1579K4006L695j7080l5947n1116o1853o8417p1592p2161
$$ plain form
32038 -202846 -273507 -340873 -403288 -459149 -506820 -544541 -570477 -582958 -580849 -563848 -532665 -489115
32026 -489115 -436086 -377201 -316061 -255364 -196421 -139421 -84237 -31239 18371 62814 100272
32015 100272 129347 149188 159401 160020 151723 136108 115536 92370 68038 42633 15340 -14746
32003 -14746 -48099 -84747 -124444 -166690 -210581 -254744 -297485 -337045 -371845 -400587 -422252 -436106
31991 -436106 -441854 -439962 -431901 -420031 -407029 -395075 -385167 -376857 -368564 -358362 -344836 -327558 -306972
31978 -306972 -283961 -259576 -235151 -212571 -194229 -182468 -178747 -183097 -194220 -210092 -228612 -248007
31966 -248007 -266904 -284236 -299046 -310354 -317259 -319314 -316858 -310950 -302866 -293580 -283674 -273790 -265295
31953 -265295 -260598 -262733 -274237 -295851 -325815 -360154 -393793 -421879 -440785 -448542 -444753 -430171
$$ packed form
32038b02846p0661o7366o2415n5861m7671l7721k5936j2481K109J7001L1183M3550
32026d89115N3029N8885O1140O0697N8943N7000N5184N2998M9610M4443L7458
32015A00272K9075J9841J0213O19q297j5615k0572k3166k4332k5405k7293l0086
32003a4746l3353l6648l9697m2246m3891m4163m2741l9560l4800k8742k1665j3854
31991d36106n748J892Q061J1870J3002J1954R908Q310Q293J0202J3526J7278K0586
31978c06972K3011K4385K4425K2580J8342J1761L721m350j1123j5872j8520j9395
31966b48007j8897j7332j4810j1308o905k055K456N908Q084R286R906R884Q495
31953b65295M697k135j1504k1614k9964l4339l3639k8086j8906p757L789J4582
$$ plain form
31941 -430171 -406172 -374338 -336255 -293558 -248142 -202298 -158567 -119357 -86622 -61794 -45825
31930 -45825 -39108 -41302 -51314 -67579 -88424 -112260 -137534 -162647 -186033 -206490 -223675 -238411
31918 -238411 -252451 -267641 -284978 -304224 -324370 -344555 -364730 -385603 -407969 -431883 -456144
31907 -456144 -478289 -495081 -503354 -500851 -486693 -461245 -425660 -381584 -331343 -278350 -227280 -183615
31895 -183615 -152615 -138073 -141415 -161569 -195624 -239861 -290678 -345145 -401150 -457215 -512055 -564163
31883 -564163 -611593 -651951 -682468 -700159 -702242 -686868 -653865 -605137 -544535 -477306 -409310 -346185
31871 -346185 -292548 -251252 -222730 -204794 -193304 -183718 -172875 -159989 -146323 -133926 -124347 -117945
31859 -117945 -113884 -110463 -105498 -96760 -82546 -62300 -36895 -8343 20976 49093 74865 98035
$$ packed form
31941d30171K3999L1834L8083M2697M5416M5844M3731L9210L2735K4828J5969
31930d5825O717k194j0012j6265k0845k3836k5274k5113k3386k0457j7185j4736
31918b38411j4040j5190j7337j9246k0146k0185k0175k0873k2366k3914k4261
31907d56144k2145j6792q273K503J4158K5448L5585M4076N0241N2993N1070M3665
31895a83615L1000J4542l342k0154l4055m4237n0817n4467n6005n6065n4840n2108
31883e64163m7430m0358l0517j7691k083J5374L3003M8728O0602O7229O7996O3125
31871c46185N3637M1296K8522J7936J1490R586J0843J2886J3666J2397R579O402
31859a17945M061L421M965Q738J4214K0246K5405K8552K9319K8117K5772K3170
$$ plain form
31847 98035 119136 139358 160389 184090 212020 244906 282269 322420 362851 400796 433655 459132
31835 459132 475261 480587 474557 457987 433336 404585 376629 354271 341089 338534 345572 358964
31823 358964 374183 386777 393789 394735 391755 388982 391412 403591 428353 465931 513827 567560 621914
31810 621914 672026 713896 744493 761821 765097 754885 733003 702243 666063 628295 592741 562613
31798 562613 539972 525403 518073 516113 517187 519096 520267 519962 518125 514893 510026 502616 491390 475562
31784 475562 455765 434412 415236 402275 398917 407346 428451 461939 506439 559400 616895 673699
31772 673699 724025 762860 787307 797200 794703 783230 766283 746743 726797 708313 693252 683743
31760 683743 681784 688762 705088 730004 761600 797096 833356 867422 896839 919680 934404 939742
$$ packed form
31847I8035K1101K0222K1031K3701K7930L2886L7363M0151M0431L7945L2859K5477
31835D59132J6129N326o030j6570k4651k8751k7956k2358j3182k555P038J3392
31823C58964J5219J2594P012R46k980k773K430J2179K4762L7578M7896N3733N4354
31810F21914N0112M1870L0597J7328L276j0212k1882l0760l6180l7768l5554l0128
31798E62613k2641j4569p330j960J074J909J171l05j837l232m867p410j1226j5828
31784D75562j9797k1353j9176j2961l358Q429K1105L3488M4500N2961N7495N6804
31772F73699N0326L8835K4447R893k497j1473j6947j9540j9946j8484j5061r509
31760F83743j959O978J6326K4916L1596L5496L6260L4066K9417K2841J4724N338
$$ plain form
31748 939742 934642 918315 890410 851304 802404 746259 686283 626085 568596 515387 466561 421252
31736 421252 378512 338176 301379 270463 248144 236221 234519 240749 251311 262414 270751 273552
31724 273552 268528 254185 230559 199701 165361 131928 103358 82726 72358 73963 88432 115528
31712 115528 153843 201028 253973 308845 361223 406615 441220 462490 469240 461408 439797 405953
31700 405953 362101 310993 255608 198779 142845 89469 39746 -5410 -44766 -76504 -98402
31689 -98402 -108479 -105822 -91214 -67187 -37326 -5112 27133 58597 89446 119911 149651 177852
31677 177852 203786 227180 248025 266034 280294 289377 291784 286373 272663 251061 223056 191314
31665 191314 159579 132304 114047 108768 119182 146360 189596 246604 313961 387677 463625 537679
$$ packed form
31748I39742n100j6327k7905l9106m8900n6145n9976o0198n7489n3209m8826m5309
31736D21252m2740m0336l6797l0916k2319j1923j702O230J0562J1103Q337K801
31724B73552n024j4343k3626l0858l4340l3433k8570k0632j0368J605J4469K7096
31712A15528L8315M7185N2945N4872N2378M5392L4605K1270O750p832k1611l3844
31700D05953m3852n1108n5385n6829n5934n3376m9723m5156l9356l1738k1898
31689i8402j0077K657J4608K4027K9861L2214L2245L1464L0849L0465K9740K8201
31677A77852K5934K3394K0845J8009J4260R083K407n411j3710k1602k8005l1742
31665A91314l1735k7275j8257n279J0414K7178M3236N7008O7357P3716P5948P4054
$$ plain form
31653 537679 605640 663280 706782 733549 743045 737082 719184 693229 662180 627599 590024 549610
31641 549610 506557 461328 414928 369198 326727 290120 260962 239154 223102 210620 200016
31630 200016 190704 183053 177573 173929 170428 164357 153029 134931 110330 81109 50073 20107 -6537
31617 -6537 -28705 -46443 -60711 -72828 -83895 -94367 -103803 -110880 -113783 -111021 -102386 -89567 -76030
31604 -76030 -66188 -64272 -73390 -95163 -130015 -177809 -238322 -311212 -395516 -488989 -587548 -685081
31592 -685081 -773877 -845925 -894841 -917643 -915539 -893379 -858201 -817561 -778211 -745284 -721845 -708618
31580 -708618 -703923 -704152 -704951 -702885 -696741 -687791 -678968 -673520 -673867 -680927 -693817 -709783 -724464 -732688
31566 -732688 -729678 -712172 -678940 -630571 -568905 -496619 -417140 -334758 -254557 -181941 -121695 -76832
$$ packed form
31653E37679O7961N7640M3502K6767R496n963j7898k5955l1049l4581l7575m0414
31641E49610m3053m5229m6400m5730m2471l6607k9158k1808j6052j2482j0604
31630B00016r312p651n480l644l501o071j1328j8098k4601k9221l1036k9966k6644
31617f537k2168j7738j4268j2117j1067j0472r436p077k903K762Q635J2819J3537
31604g6030R842J916r118k1773l4852m7794o0513p2890q4304r3473r8559r7533
31592f85081q8796p2048m8916k2802K104K2160L5178M0640L9350L2927K3439J3227
31580g08618M695k29p99K066O144Q950Q823N448l47p060j2890j5966j4681q224
31566g32688L010J7506L3232M8369O1666P2286P9479Q2382Q0201P2616O0246M4863
$$ plain form
31554 -76832 -47661 -31533 -23486 -17609 -8577 7229 31277 62968 100025 139078 176439 208925
31542 208925 234436 252036 261615 263373 257489 244132 223738 197195 165602 129593 88839 42323
31530 42323 -10557 -68798 -129336 -187713 -239523 -281904 -314409 -338775 -357682 -373233 -386120 -395918
31518 -395918 -401993 -404152 -402624 -397724 -389822 -379749 -369327 -361532 -360052 -368354 -388668 -421371 -465011
31505 -465011 -516837 -573536 -631890 -689273 -743938 -795065 -842546 -886540 -926905 -962805 -992801
31494 -992801 -1015580 -1030980 -1040621 -1047692 -1055982 -1068732 -1087869 -1113856 -1146013 -1183041 -1223499 -1266063
31482 -1266063 -1309398 -1351593 -1389465 -1418409 -1433327 -1430410 -1408741 -1370651 -1320621 -1263410 -1202458
31471 -1202458 -1139221 -1073457 -1004145 -930542 -853032 -773443 -694756 -620380 -553363 -495855 -448907
$$ packed form
31554g6832K9171J6128Q047N877R032J5806K4048L1691L7057L9053L7361L2486
31542B08925K5511J7600R579J758n884j3357k0394k6543l1593l6009m0754m6516
31530D2323n2880n8241o0538n8377n1810m2381l2505k4366j8907j5551j2887r798
31518c95918o075k159J528M900P902J0073J0422P795J480q302k0314l2703m3640
31505d65011n1826n6699n8354n7383n4665n1127m7481m3994m0365l5900k9996
31494i92801k2779j5400r641p071q290j2750j9137k5987l2157l7028m0458m2564
31482a266063m3335m2195l7872k8944j4918K917K1669L8090N0030N7211O0952
31471a202458O3237O5764O9312P3603P7510P9589P8687P4376O7017N7508M6948
$$ plain form
31460 -448907 -412557 -386184 -369049 -360824 -361764 -372394 -392852 -422154 -457673 -495213 -529857 -557406
31448 -557406 -575679 -585027 -587926 -588014 -588955 -593350 -601899 -613160 -624056 -630986 -631049 -622952 -607322 -586355
31434 -586355 -563010 -540116 -519788 -503277 -491086 -483143 -478912 -477490 -477823 -479124 -481486 -486345 -496266
31421 -496266 -513670 -538910 -568831 -596994 -615722 -618896 -604011 -572734 -530103 -482996 -438284 -400982
31409 -400982 -372861 -352132 -334492 -315164 -290936 -261360 -228805 -197665 -173220 -160435 -162846 -181685
31397 -181685 -215482 -260236 -310010 -357777 -396377 -419571 -423020 -404927 -366140 -309667 -239800 -161155
31385 -161155 -78044 5674 86447 160964 226423 280950 323863 355525 376896 388954 392259 386896
31373 386896 372925 351088 323192 291650 258329 223501 185759 143137 94772 42079 -11258
$$ packed form
31460d48907L6350K6373J7135Q225r40j0630k0458k9302l5519l7540l4644k7549
31448e57406j8273r348k899q8r41m395q549j1261j0896o930o3Q097J5630K0967
31434e86355K3345K2894K0328J6511J2191P943M231J422l33j301k362m859r921
31421d96266j7404k5240k9921k8163j8728l174J4885L1277M2631M7107M4712L7302
31409d00982K8121K0729J7640J9328K4228K9576L2555L1140K4445J2785k411j8839
31397a81685l3797m4754m9774m7767l8600k3194l449J8093L8787N6473O9867P8645
31385a61155Q3111Q3718Q0773P4517O5459N4527M2913L1662K1371J2058L305n363
31373C86896j3971k1837k7896l1542l3321l4828l7742m2622m8365n2693n3337
$$ plain form
31362 -11258 -60416 -100926 -129883 -146568 -152601 -151762 -149245 -150193 -157826 -172090 -189677 -205549 -215089
31349 -215089 -215726 -207375 -191843 -171810 -149907 -128081 -107405 -88294 -70956 -55656 -42550 -31292
31337 -31292 -20842 -9703 3591 20003 39676 61728 84139 103930 117747 122769 117563 102361
31325 102361 78687 48609 14168 -22711 -59963 -95104 -125238 -147360 -158826 -157789 -143500 -116471
31313 -116471 -78505 -32523 17864 69012 117836 162036 199905 229991 251050 262399 264417 258710
31301 258710 247785 234481 221630 212166 209476 217544 240588 282244 344724 428386 531908 652903
31289 652903 788645 936610 1094773 1261766 1437065 1621139 1815384 2021621 2241411 2475628
31279 2475628 2724657 2989187 3271361 3575886 3910605 4286097 4714219 5206151 5770735
$$ packed form
31362a1258m9158m0510k8957j6685o033Q39K517r48p633j4264j7587j5872r540
31349b15089o37Q351J5532K0033K1903K1826K0676J9111J7338J5300J3106J1258
31337c1292J0450J1139J3294J6412J9673K2052K2411J9791J3817N022n206j5202
31325A02361k3674l0078l4441l6879l7252l5141l0134k2122j1466J037J4289K7029
31313a16471L7966M5982N0387N1148M8824M4200L7869L0086K1059J1349K018n707
31301B58710j0925j3304j2851r464k690Q068K3044M1656O2480Q3662J03522J20995
31289F52903J35742J47965J58163J66993J75299J84074J94245K06237K19790K34217
31279B475628K49029K64530K82174L04525L34719L75492M28122M91932N64584
$$ plain form
31270 5770735 6413674 7137715 7943519 8830681 9798290 10844595 11965755 13153852 14394338
31261 14394338 15663034 16922833 18120442 19184527 20028490 20561759 20709983 20437530 19761110
31252 19761110 18746642 17491071 16098875 14663255 13256387 11927384 10704778 9600843
31244 9600843 8616186 7743668 6971550 6286246 5674907 5127480 4637616 4202226 3820082
31235 3820082 3490167 3210385 2976899 2784105 2625094 2492460 2379265 2279832 2190129 2107664
31225 2107664 2031101 1959718 1892761 1828757 1765078 1698153 1624457 1541853 1450453 1352419 1250836
31214 1250836 1148403 1046715 946383 847669 751169 658196 570799 491435 422489 365802 322303
31203 322303 291842 273297 265048 265717 274811 292867 320984 360049 410096 470034 537757 610490
$$ packed form
31270E770735O42939P24041Q05804Q87162R67609J046305J121160J188097J240486
31261A4394338J268696J259799J197609J064085Q43963N33269J48224k72453o76420
31252A9761110j014468j255571j392196j435620j406868j329003j222606j103935
31244I600843r84657q72518p72118o85304o11339n47427m89864m35390l82144
31235C820082l29915k79782k33486j92794j59011j32634j13195r9433q9703q2465
31225B107664p6563p1383o6957o4004o3679o6925p3696q2604r1400r8034j01583
31214A250836j02433j01688j00332r8714r6500r2973q7397p9364o8946n6687m3499
31203C22303l0461j8545q249O69R094J8056K8117L9065N0047N9938O7723P2733
$$ plain form
31191 610490 685379 760159 833594 905305 974979 1041434 1102136 1153591 1192438 1216738 1226780
31180 1226780 1224943 1214687 1199183 1180367 1158832 1134492 1107344 1077737 1045950 1011526 973022
31169 973022 928466 876259 816004 748912 677702 606041 537715 475793 422128 377354 341190
31158 341190 312802 291075 274882 263382 256206 253246 254084 257442 261179 262976 261311 256077 248486
31145 248486 240337 233048 226938 221125 214022 204070 190214 172016 149648 123988 96692 69939 45908
31132 45908 26258 11804 2304 -3666 -8504 -14782 -24126 -36428 -49963 -62311 -71574 -77209 -80138
31119 -80138 -82137 -84868 -89040 -94136 -98856 -102067 -103744 -105233 -108590 -115301 -125223 -136364 -145501 -149154
$$ packed form
31191F10490P4889P4780P3435P1711O9674O6455O0702N1455L8847K4300J0042
31180A226780j837j0256j5504j8816k1535k4340k7148k9607l1787l4424l8504
31169I73022m4556n2207o0255o7092p1210p1661o8326o1922n3665m4774l6164
31158C41190k8388k1727j6193j1500p176k960Q38L358L737J797j665n234p591
31145B48486q149p289o110n813p103r952j3856j8198k2368k5660k7296k6753k4031
31132D5908j9650j4454r500n970m838o278r344j2302j3535j2348r263n635k929
31119h0138j999k731m172n096m720l211j677j489l357o711r922j1141r137l653
$$ [...]
##END NTUPLES=NMR SPECTRUM
##END=
