##TITLE=31Pdec_DE-41spext
 D2O
 64 sc
 1.4.2024
##JCAMPDX= 6.0         $$ Bruker NMR JCAMP-DX V2.0
##DATA TYPE= NMR SPECTRUM
##DATA CLASS= NTUPLES
##ORIGIN= UXNMR, Bruker Analytische Messtechnik GmbH
##OWNER= root
$$ XWIN-NMR		Version 3.5
$$ Mon Apr  1 15:40:49 2024 Russian Standard Time (UT+4h)  she@DPX200
##.OBSERVE FREQUENCY= 81.013821
##.OBSERVE NUCLEUS= ^31P
##.ACQUISITION MODE= SIMULTANEOUS
##.ACQUISITION SCHEME= undefined
##.AVERAGES= 64
##.DIGITISER RES= 16
##SPECTROMETER/DATA SYSTEM= spect
##.PULSE SEQUENCE= zgpg30
##.SOLVENT NAME= D2O
##.SHIFT REFERENCE= (INTERNAL, D2O, 0, 248.564)
##AUDIT TRAIL= $$ (NUMBER, WHEN, WHO, WHERE, WHAT)
$$ ##TITLE= Audit trail, XWIN-NMR		Version 3.5
$$ ##JCAMPDX= 5.01
$$ ##ORIGIN= Bruker BioSpin GmbH
$$ ##OWNER= she
$$ F:/spectra/data/she/nmr/P31/1/pdata/1/auditp.txt
$$ ##AUDIT TRAIL=  $$ (NUMBER, WHEN, WHO, WHERE, WHAT)
(   1,<2024-04-01 15:40:00.96 +0400>,<she>,<DPX200>,
      <continue with go, POWCHK disabled, PULCHK disabled
       configuration hash MD5:
       00 E9 B6 7A A2 85 ED C7 34 08 36 98 17 FE 4E 26
       data hash MD5: 32K
       93 55 7C 42 2E 37 A9 7D FE 93 CB A4 58 6B BB 7F>)
(   2,<2024-04-01 15:40:03.98 +0400>,<she>,<DPX200>,
      <Start of raw data processing
       efp BC_mod = 2 LB = 10 FT_mod = 6 PKNL = 1 PHC0 = -13036.9 PHC1 = 411.6834 SI = 64K 
       data hash MD5: 64K
       35 8C 6B D0 5A D0 9B 54 3E 3B 88 DF DA 63 C2 77>)
(   3,<2024-04-01 15:40:18.31 +0400>,<she>,<DPX200>,
      <pk PHC0 = -291.7195 PHC1 = 188.8 
       data hash MD5: 64K
       25 04 36 3C A1 07 B5 B1 EB DB 52 6F 30 16 46 76>)
$$ ##END=
$$ 
$$ hash MD5
$$ 66 60 BF 61 2B 9D 45 5E B4 76 11 1B 17 B0 26 17
##$RELAX= 
##$RELAX= 
##$RELAX= 
##$RELAX= 
##$RELAX= 
##$RELAX= 
##$RELAX= 
##$RELAX= 
##$RELAX= 
$$ Bruker specific parameters
$$ --------------------------
##$DU= <F:/spectra>
##$EXPNO= 1
##$NAME= <P31>
##$PROCNO= 1
##$TYPE= <nmr>
##$USER= <she>
##$AMP= (0..31)
100 100 100 100 100 100 100 100 100 100 100 100 100 100 100 100 100 100 
100 100 100 100 100 100 100 100 100 100 100 100 100 100 
##$AQSEQ= 0
##$AQ_mod= 1
##$AUNM= <au_zg>
##$AUTOPOS= <>
##$BF1= 81.014009
##$BF2= 200.13
##$BF3= 200.13
##$BF4= 200.13
##$BF5= 200.13
##$BF6= 200.13
##$BF7= 200.13
##$BF8= 200.13
##$BYTORDA= 1
##$CFDGTYP= 0
##$CFRGTYP= 5
##$CHEMSTR= <none>
##$CNST= (0..31)
1 1 145 1 1 1 1 1 1 1 1 1 1 1 1 1 1 1 1 1 1 1 1 1 1 1 1 1 1 1 1 1 
##$CPDPRG= <waltz16>
##$CPDPRG1= <>
##$CPDPRG2= <waltz16>
##$CPDPRG3= <>
##$CPDPRG4= <mlev>
##$CPDPRG5= <mlev>
##$CPDPRG6= <mlev>
##$CPDPRG7= <mlev>
##$CPDPRG8= <mlev>
##$CPDPRGB= <>
##$CPDPRGT= <>
##$D= (0..31)
0 1 0 0 0 0 0 0 0 0 0 0.03 2e-05 3e-06 0 0 0 0 0 0 0 0 0 0 0 0 0 0 0 0 
0 0 
##$DATE= 1711971519
##$DBL= (0..7)
120 120 120 11 120 120 24 19 
##$DBP= (0..7)
150 150 150 150 150 150 150 150 
##$DBP07= 0
##$DBPNAM0= <>
##$DBPNAM1= <>
##$DBPNAM2= <>
##$DBPNAM3= <>
##$DBPNAM4= <>
##$DBPNAM5= <>
##$DBPNAM6= <>
##$DBPNAM7= <>
##$DBPOAL= (0..7)
0.5 0.5 0.5 0.5 0.5 0.5 0.5 0.5 
##$DBPOFFS= (0..7)
$$ [...]
##$SUBNAM2= <"">
##$SUBNAM3= <"">
##$SUBNAM4= <"">
##$SUBNAM5= <"">
##$SUBNAM6= <"">
##$SUBNAM7= <"">
##$SUBNAM8= <"">
##$SUBNAM9= <"">
##$SW= 501.771253377433
##$SWIBOX= (0..15)
0 1 3 0 0 0 0 0 0 0 0 0 0 0 0 0 
##$SW_h= 40650.406504065
##$TD= 32768
##$TD0= 1
##$TE= 0
##$TE2= 300
##$TE3= 300
##$TEG= 300
##$TL= (0..7)
0 120 53 12 22 120 120 120 
##$TP= (0..7)
150 150 150 150 150 150 150 150 
##$TP07= 0
##$TPNAME0= <>
##$TPNAME1= <>
##$TPNAME2= <>
##$TPNAME3= <>
##$TPNAME4= <>
##$TPNAME5= <>
##$TPNAME6= <>
##$TPNAME7= <>
##$TPOAL= (0..7)
0.5 0.5 0.5 0.5 0.5 0.5 0.5 0.5 
##$TPOFFS= (0..7)
0 0 0 0 0 0 0 0 
##$TUNHIN= 0
##$TUNHOUT= 0
##$TUNXOUT= 0
##$USERA1= <user>
##$USERA2= <user>
##$USERA3= <user>
##$USERA4= <user>
##$USERA5= <user>
##$V9= 5
##$VALIST= <valist>
##$VCLIST= <CCCCCCCCCCCCCCC>
##$VD= 0
##$VDLIST= <DDDDDDDDDDDDDDD>
##$VPLIST= <PPPPPPPPPPPPPPP>
##$VTLIST= <TTTTTTTTTTTTTTT>
##$WBST= 1024
##$WBSW= 4
##$XGAIN= (0..3)
0 0 0 0 
##$XL= 0
##$YL= 0
##$YMAX_a= 5036
##$YMIN_a= -1787
##$ZGOPTNS= <>
##$ZL1= 120
##$ZL2= 120
##$ZL3= 120
##$ZL4= 120
##$ABSF1= 0
##$ABSF2= 0
##$ABSG= 0
##$ABSL= 0
##$ALPHA= 0
##$AQORDER= 0
##$ASSFAC= 0
##$ASSFACI= 0
##$ASSFACX= 0
##$ASSWID= 0
##$AUNMP= <proc_1d>
##$AZFE= 0.1
##$AZFW= 0.5
##$BCFW= 0
##$BC_mod= 2
##$BYTORDP= 0
##$COROFFS= 0
##$CY= -3
##$DATMOD= 1
##$DC= 0
##$DFILT= <>
##$DTYPP= 0
##$F1P= 0
##$F2P= 0
##$FCOR= 1
##$FTSIZE= 65536
##$FT_mod= 6
##$GAMMA= 0
##$GB= 0
##$INTBC= 1
##$INTSCL= 6.047779e-11
##$ISEN= 30
##$LB= 10
##$LEV0= 0
##$LPBIN= 0
##$MAXI= 10000
##$MC2= 0
##$MEAN= 0
##$ME_mod= 0
##$MI= 50
##$NCOEF= 0
##$NC_proc= -12
##$NLEV= 6
##$NOISF1= 182.463
##$NOISF2= 159.3651
##$NSP= 0
##$NTH_PI= 0
##$NZP= 0
##$OFFSET= 248.5645
##$PC= 4
##$PHC0= -13328.62
##$PHC1= 600.4834
##$PH_mod= 1
##$PKNL= yes
##$PPARMOD= 0
##$PSCAL= 0
##$PSIGN= 0
##$REVERSE= no
##$SF= 81.0140089999694
##$SI= 65536
##$SIGF1= 159.3651
##$SIGF2= -187.1042
##$SINO= 113.3802
##$SIOLD= 16384
##$SREGLST= <1H.CDCl3>
##$SSB= 0
##$STSI= 65536
##$STSR= 0
##$SW_p= 40650.406504065
##$SYMM= 0
##$S_DEV= 0
##$TDeff= 32768
##$TDoff= 0
##$TI= <>
##$TILT= no
##$TM1= 0
##$TM2= 0
##$TOPLEV= 0
##$USERP1= <user>
##$USERP2= <user>
##$USERP3= <user>
##$USERP4= <user>
##$USERP5= <user>
##$WDW= 1
##$XDIM= 65536
##$YMAX_p= 601707614
##$YMIN_p= -241872727
$$ End of Bruker specific parameters
$$ ---------------------------------
##NTUPLES= NMR SPECTRUM
##VAR_NAME=  FREQUENCY,     SPECTRUM/REAL,   SPECTRUM/IMAG
##SYMBOL=    X,             R,               I
##VAR_TYPE=  INDEPENDENT,   DEPENDENT,       DEPENDENT
##VAR_FORM=  AFFN,          ASDF,            ASDF
##VAR_DIM=   65536,         65536,           65536
##UNITS=     HZ,            ARBITRARY UNITS, ARBITRARY UNITS
##FACTOR=    0.620285442955139, 1,           1
##FIRST=     20137.2065510682, 0,            0
##LAST=      -20513.1999529968, 0,           0
##MIN=       -20513.1999529968, -241872727,  0
##MAX=       20137.2065510682, 601707614,    0
$$ Real data points
##PAGE= N=1
##DATA TABLE= (X++(R..R)), XYDATA
$$ [...]
$$ plain form
12880 -20194084 -23694655 -26415425 -28088526 -28380522 -26978561 -23665515 -18377261 -11241448
12872 -11241448 -2586293 7099779 17266530 27435682 37312021 46810552 55985494 64910271
12864 64910271 73580046 81876634 89591030 96477436 102309534 106910288 110139201 111850128
12856 111850128 111854503 109916727 105786681 99265538 90298034 79064941 66027443 51887931
12848 51887931 37479946 23637787 11091320 400527 -8079735 -14220239 -18129239
12841 -18129239 -20141289 -20753671 -20499306 -19795489 -18844215 -17638091 -16058874 -14001499 -11456046
12832 -11456046 -8524300 -5394436 -2311059 444974 2580156 3826038 3975327 2892672
12824 2892672 506970 -3177705 -8032105 -13742661 -19797810 -25547921 -30324030 -33580736
$$ packed form
12880b0194084l500571k720770j673101k91996J401961L313046N288254P135813
12872a1241448Q655155R686072J0166751J0169152R876339R498531R174942Q924777
12864F4910271Q669775Q296588P714396O886406N832098M600754L228913J710927
12856A11850128M375j937776m130046o521143q967504j1233093j3037498j4139512
12848E1887931j4407985j3842159j2546467j0690793q480262o140504l909000
12841a8129239k012050o12382K54365P03817R51274J206124J579217K057375K545453
12832a1456046K931746L129864L083377K756033K135182J245882J49289j082655
12824B892672k385702l684675m854400n710556o055149n750111m776109l256706
$$ plain form
12816 -33580736 -35027040 -34704531 -32972998 -30393869 -27555335 -24917154 -22736784 -21086308
12808 -21086308 -19923057 -19164002 -18732048 -18571383 -18649405 -18963538 -19553680 -20500521 -21888878
12799 -21888878 -23740563 -25952630 -28282273 -30391108 -31923582 -32575828 -32120260 -30378972
12791 -30378972 -27175793 -22324904 -15702295 -7382329 2251833 12524500 22631362 31865908
12783 31865908 39781534 46214532 51187315 54774767 57016101 57906843 57450225 55717863
12775 55717863 52876922 49171013 44870692 40221142 35408749 30553464 25720153 20938724
12767 20938724 16229382 11634842 7254216 3259042 -130025 -2706236 -4350038 -5072027
12759 -5072027 -5005500 -4364597 -3402360 -2386224 -1576404 -1184779 -1320144 -1954956 -2939007
$$ packed form
12816c3580736j446304L22509J731533K579129K838534K638181K180370J650476
12808b1086308J163251P59055M31954J60665p8022l14133n90142r46841j388357
12799b1888878j851685k212067k329643k108835j532474o52246M55568J741288
12791c0378972L203179M850889O622609Q319966R634162J0272667J0106862R234546
12783C1865908P915626O432998M972783L587452K241334Q90742m56618j732362
12775E5717863k840941l705909m300321m649550m812393m855285m833311m781429
12767B0938724m709342m594540m380626l995174l389067k576211j643802p21989
12759e072027O6527O40903R62237J016136Q09820L91625j35365o34812r84051
$$ plain form
12750 -2939007 -4046511 -5023968 -5627299 -5662544 -5035685 -3788212 -2089674 -184331 1687164
12741 1687164 3370254 4868752 6386526 8312104 11134496 15308839 21114375 28555244
12733 28555244 37347260 47005730 56999481 66892208 76394353 85304825 93393474 100313527
12725 100313527 105616031 108875468 109861021 108650053 105613035 101282927 96190238 90747183
12717 90747183 85214092 79730672 74375232 69220155 64365297 59944108 56104350 52964414
12709 52964414 50548889 48724893 47180010 45473151 43147463 39855443 35444984 29984459
12701 29984459 23733938 17082888 10478245 4364726 -852746 -4833048 -7327639 -8223253
12693 -8223253 -7586164 -5678190 -2916450 224147 3327892 6117968 8465325 10342099
$$ packed form
12750b939007j107504r77457o03331l5245O26859J247473J698538J905343J871495
12741A687164J683090J498498J517774J925578K822392M174343N805536P440869
12733B8555244Q792016R658470R993751R892727R502145Q910472Q088649O920053
12725A00313527N302504L259437R85553j210968l037018m330108n092689n443055
12717I0747183n533091n483420n355440n155077m854858m421189l839758l139936
12709E2964414k415525j823996j544883j706859k325688l292020m410459n460525
12701B9984459o250521o651050o604643o113519n217472l980302k494591q95614
12693h223253O37089J907974K761740L140597L103745K790076K347357J876774
$$ plain form
12685 10342099 11764103 12753108 13316631 13432053 13039490 12061545 10450254 8228030 5483769
12676 5483769 2325441 -1161563 -4900797 -8760336 -12493854 -15739312 -18080285 -19140777
12668 -19140777 -18685531 -16705230 -13456826 -9426717 -5215529 -1388498 1649849 3722847
12660 3722847 4888174 5392430 5581845 5784359 6195230 6809320 7433196 7776798 7584137
12651 7584137 6742530 5324984 3556630 1728718 101086 -1163746 -2008589 -2440695 -2481686
12642 -2481686 -2146708 -1461756 -500860 583747 1563676 2185678 2264688 1776705 897161
12633 897161 -42032 -658211 -637967 180279 1794533 4095758 6951739 10265183 13979006
12624 13979006 18039969 22351612 26747244 31006203 34918174 38368063 41391190 44162585
$$ packed form
12685A0342099J422004R89005N63523J15422l92563r77945j611291k222224k744261
12676E483769l158328l487004l739234l859539l733518l245458k340973j060492
12668a9140777M55246J980301L248404M030109M211188L827031L038347K072998
12660C722847J165327N04256J89415K02514M10871O14090O23876L43602j92661
12651G584137q41607j417546j768354j827912j627632j264832q44843m32106m0991
12642b481686L34978O84952R60896J084607R79929O22002P9010m87983q79544
12633H97161r39193o16179K0244Q18246J614254K301225K855981L313444L713823
12624A3979006M060963M311643M395632M258959L911971L449889L023127K771395
$$ plain form
12616 44162585 46925201 49894938 53187531 56798803 60639282 64585739 68496577 72170764
12608 72170764 75285610 77373183 77872011 76251298 72173772 65638428 57035742 47082377
12600 47082377 36669349 26696811 17944224 10978144 6089700 3274496 2269525 2633827
12592 2633827 3841694 5372914 6803959 7891070 8604757 9075600 9465277 9840855 10135175
12583 10135175 10205169 9919699 9200432 8005517 6306691 4102327 1454696 -1491763 -4534663
12574 -4534663 -7463682 -10101619 -12318776 -14035838 -15244154 -16045998 -16674868 -17451392 -18681710
12565 -18681710 -20558400 -23117164 -26247890 -29724704 -33237827 -36440394 -39020985 -40784637
12557 -40784637 -41707518 -41938581 -41745768 -41431919 -41261907 -41429792 -42055307 -43169915 -44671799
$$ packed form
12616D4162585K762616K969737L292593L611272L840479L946457L910838L674187
12608G2170764L114846K087573M98828j620713m077526o535344q602686r953365
12600D7082377j0413028r972538q752587o966080m888444k815204j004971L64302
12592B633827J207867J531220J431045J087111P13687M70843L89677L75578K94320
12583A0135175O9994k85470p19267j194915j698826k204364k647631k946459l042900
12574d534663k929019k637937k217157j717062j208316q01844o28870p76524j230318
12565a8681710j876690k558764l130726l476814l513123l202567k580591j763652
12557d0784637r22881k31063J92813L13849J70012j67885o25515j114608j501884
$$ plain form
12548 -44671799 -46284174 -47582385 -48120329 -47610505 -46063501 -43813932 -41426681 -39533108
12540 -39533108 -38661656 -39114891 -40926125 -43903586 -47735946 -52107209 -56773159 -61580924
12532 -61580924 -66441942 -71281506 -75988910 -80386098 -84219873 -87171315 -88878379 -88980619
12524 -88980619 -87198289 -83439115 -77895643 -71078573 -63745805 -56734289 -50757050 -46249299
12516 -46249299 -43315217 -41768533 -41223429 -41193269 -41172620 -40695243 -39377329 -36962706 -33367677
12507 -33367677 -28689694 -23143166 -16938539 -10180242 -2857766 5063731 13520012 22275659
12499 22275659 30945097 39088556 46329835 52444446 57388011 61257096 64197574 66302937
12491 66302937 67559706 67873462 67154801 65405810 62755661 59431358 55683006 51703819
$$ packed form
12548d4671799j612375j298211n37944N09824J547004K249569K387251J893573
12540c9533108Q71452m53235j811234k977461l832360m371263m665950m807765
12532f1580924m861018m839564m707404m397188l833775k951442j707064j02240
12524h8980619J782330L759174N543472O817070P332768P011516N977239M507751
12516d6249299K934082J546684N45104L0160K0649M77377J317914K414623L595029
12507c3367677M677983N546528O204627O758297P322476P921497Q456281Q755647
12499B2275659Q669438Q143459P241279O114611M943565L869085K940478K105363
12491F6302937J256769L13756p18661j748991k650149l324303l748352l979187
$$ plain form
12483 51703819 47594967 43407131 39235571 35294525 31907908 29423733 28117775 28142018
12475 28142018 29517738 32136328 35743966 39925492 44125723 47731641 50198132 51167220
12467 51167220 50533136 48437873 45214062 41302167 37162674 33195886 29678196 26723201
12459 26723201 24277374 22156141 20108545 17877101 15221480 11908767 7707359 2417852
12451 2417852 -4061676 -11666185 -20117936 -28919737 -37400819 -44826723 -50557486 -54195319
12443 -54195319 -55648065 -55077061 -52771284 -49031460 -44121956 -38283505 -31759764 -24806845
12435 -24806845 -17695794 -10730431 -4274441 1248741 5412427 7889076 8554182 7544645
12427 7544645 5245218 2200795 -1025895 -4008060 -6559803 -8743107 -10774982 -12888580
$$ packed form
12483E1703819m108852m187836m171560l941046l386617k484175j305958K4243
12475B8142018J375720K618590L607638M181526M200231L605918K466491R69088
12467E1167220o34084k095263l223811l911895m139493l966788l517690k954995
12459B6723201k445827k121233k047596k231444k655621l312713m201408n289507
12451B417852o479528p604509q451751q801801q481082p425904n730763l637833
12443e4195319j452746N71004K305777L739824M909504N838451O523741O952919
12435b4806845P111051O965363O455990N523182M163686K476649O65106j009537
12427G544645k299427l044423l226690k982165k551743k183304k031875k113598
$$ plain form
12419 -12888580 -15221368 -17771738 -20416395 -22958627 -25187725 -26940973 -28152804 -28868772
12411 -28868772 -29217941 -29365200 -29473761 -29690412 -30145569 -30956301 -32226682 -34042574 -36458255
12402 -36458255 -39476778 -43031846 -46980167 -51111372 -55181006 -58964949 -62317230 -65200100
12394 -65200100 -67663790 -69784003 -71595473 -73065378 -74124084 -74729047 -74912223 -74775062
12386 -74775062 -74436988 -73974404 -73383125 -72574835 -71405589 -69729948 -67459612 -64589752 -61170554
12377 -61170554 -57246014 -52811537 -47822757 -42241795 -36081487 -29419374 -22381112 -15113834
12369 -15113834 -7773907 -539332 6368048 12680075 18116071 22438134 25493991 27224197
12361 27224197 27639838 26798321 24801002 21811425 18067782 13860163 9466007 5068599
$$ packed form
12419a2888580k332788k550370k644657k542232k229098j753248j211831p15968
12411b8868772l49169j47259j08561k16651m55157q10732j270381j815892k415681
12402c6458255l018523l555068l948321m131205m069634l783943l352281k882870
12394f5200100k463690k120213j811470j469905j058706o04963j83176J37161
12386g4775062L38074M62584N91279Q08290J169246J675641K270336K869860L419198
12377f1170554L924540M434477M988780N580962O160308O662113P038262P267278
12369a5113834P339927P234575O907380O312027N435996M322063L055857J730206
12361B7224197M15641q41517j997319k989577l743643m207619m394156m397408
$$ plain form
12353 5068599 702060 -3738235 -8409500 -13392669 -18585586 -23672662 -28176004 -31550626
12345 -31550626 -33288668 -33024903 -30638682 -26318825 -20544349 -13969148 -7255690 -928682
12337 -928682 4702057 9542147 13660110 17216262 20402649 23407475 26398245 29509314
12329 29509314 32827871 36386631 40173333 44152479 48279707 52492360 56679726 60653254
12321 60653254 64136310 66780591 68206921 68065713 66109432 62261669 56660301 49654567
12313 49654567 41750773 33523429 25524324 18217931 11949207 6930529 3237836 825711
12305 825711 -421688 -610292 230940 2151225 5198900 9309301 14237736 19584685 24895214
12296 24895214 29775369 33981178 37467571 40392331 43058757 45789923 48771140 51938883
$$ packed form
12353E068599m366539m440295m671265m983169n192917n087076m503342l374622
12345c1550626j738042K63765K386221M319857N774476O575201O713458O327008
12337i28682N630739M840090M117963L556152L186387L004826K990770L111069
12329B9509314L318557L558760L786702L979146M127228M212653M187366L973528
12321F0653254L483056K644281J426330j41208j956281l847763n601368p005734
12313D9654567p903794q227344p999105p306393o268724n018678l692693k412125
12305H25711j247399j88604Q41232J920285L047675M110401M928435N346949N310529
12296B4895214M880155M205809L486393K924760K666426K731166K981217L167743
$$ plain form
12288 51938883 54987299 57501652 59151892 59841523 59733629 59149805 58409699 57703744 57058717
12279 57058717 56392156 55600116 54616399 53421308 52026373 50472197 48843189 47269525
12271 47269525 45892023 44797680 43954368 43172199 42112125 40351801 37493466 33270627
12263 33270627 27610461 20638937 12641589 3995878 -4909742 -13744325 -22261404 -30277627
12255 -30277627 -37626624 -44121755 -49550512 -53708285 -56465271 -57845358 -58086445 -57653690
12247 -57653690 -57185059 -57362140 -58730179 -61532712 -65638694 -70598761 -75802334 -80667830
12239 -80667830 -84795743 -88031221 -90417190 -92073599 -93080633 -93428414 -93034234 -91785344
12231 -91785344 -89576777 -86344891 -82101223 -76950932 -71072313 -64656269 -57841072 -50697120
$$ packed form
12288E1938883L048416K514353J650240O89631j07894n83824p40106p05955o45027
12279E7058717o66561p92040r83717j195091j394935j554176j629008j573664
12271D7269525j377502j094343q43312p82169j060074j760324k858335m222839
12263C3270627n660166o971524p997348q645711q905620q834583q517079q016223
12255c0277627p348997o495131n428757m157773k756986j380087k41087M32755
12247e7653690M68631j77081j368039k802533m105982m960067n203573m865496
12239h0667830m127913l235478k385969j656409j007034l47781L94180J248890
12231i1785344K208567L231886M243668N150291N878619O416044O815197P143952
$$ plain form
12223 -50697120 -43291715 -35797577 -28551905 -21991481 -16484774 -12168416 -8888846 -6264908
12215 -6264908 -3814972 -1088582 2224241 6220636 10776037 15617445 20450377 25066080
12207 25066080 29367945 33323474 36906210 40084102 42852465 45265484 47428204 49447801
12199 49447801 51367686 53111419 54462474 55103819 54722393 53144505 50436673 46915697
12191 46915697 43061997 39382465 36284662 34002719 32587684 31958466 31992185 32608075 33794433
12182 33794433 35566282 37893747 40653412 43621823 46500926 48968930 50756495 51725997
12174 51725997 51906044 51450265 50543362 49316525 47824010 46086160 44156261 42150722
12166 42150722 40211239 38428940 36800639 35261845 33771410 32378559 31222977 30472825
$$ packed form
12223e0697120P405405P494138P245672O560424N506707M316358L279570K623938
12215f264908K449936K726390L312823L996395M555401M841408M832932M615703
12207B5066080M301865L955529L582736L177892K768363K413019K162720K019597
12199D9447801J919885J743733J351055O41345l81426j577888k707832l520976
12191D6915697l853700l679532l097803k281943j415035o29218L3719O15890J186358
12182C3794433J771849K327465K759665K968411K879103K468004J787565R69502
12174E1725997J80047m55779r06903j226837j492515j737850j929899k005539
12166D2150722j939483j782299j628301j538794j490435j392851j155582p50152
$$ plain form
12158 30472825 30242875 30537000 31238840 32148027 33039482 33720140 34068172 34048642 33700255
12149 33700255 33093879 32282643 31277854 30072784 28702690 27302951 26127245 25508545
12141 25508545 25769013 27100330 29446512 32433220 35393067 37512728 38066123 36633902
12133 36633902 33201763 28097821 21822796 14873780 7637835 372053 -6756186 -13602620
12125 -13602620 -19978151 -25604349 -30123412 -33179816 -34546747 -34230149 -32491547 -29783816
12117 -29783816 -26638661 -23547187 -20858672 -18720843 -17087136 -15793482 -14667796 -13619294
12109 -13619294 -12675037 -11961889 -11650527 -11886429 -12734363 -14151350 -15984597 -17986511 -19850782
12100 -19850782 -21276640 -22048870 -22101115 -21534487 -20586482 -19565217 -18773958 -18452360 -18748345
$$ packed form
12158C0472825k29950K94125P01840R09187Q91455O80658L48032j9530l48387
12149C3700255o06376q11236j004789j205070j370094j399739j175706o18700
12141B5508545K60468J331317K346182K986708K959847K119661N53395j432221
12133C6633902l432139n103942o275025o949016p235945p265782p128239o846434
12125a3602620o375531n626198m519063l056404j366931L16598J738602K707731
12117b9783816L145155L091474K688515K137829J633707J293654J125686J048502
12109a3619294R44257P13148L11362k35902q47934j416987j833247k001914j864271
12100a9850782j425858p72230n2245N66628R48005J021265P91259L21598k95985
$$ plain form
12091 -18748345 -19710433 -21278722 -23270533 -25382432 -27228591 -28408266 -28578250 -27515809
12083 -27515809 -25171961 -21710432 -17511396 -13114398 -9093631 -5895669 -3704843 -2404234
12075 -2404234 -1653989 -1041329 -224307 983125 2591488 4468499 6413439 8253703 9923816
12066 9923816 11490584 13126530 15066273 17568297 20867013 25092244 30171348 35769533
12058 35769533 41317772 46130034 49566141 51182674 50824541 48629774 44949976 40225520
12050 40225520 34874334 29234801 23562250 18052521 12869821 8169586 4111481 857810
12042 857810 -1442208 -2677002 -2800643 -1855887 22105 2626438 5700845 8930361 11903473
12033 11903473 14100346 14962453 14037439 11132926 6409512 380485 -6183370 -12427923
$$ packed form
12091a8748345r62088j568289j991811k111899j846159j179675j69984J062441
12083b7515809K343848L461529M199036M396998M020767L197962K190826J300609
12075b404234P50245O12660Q17022J207432J608363J877011J944940J840264J670113
12066I923816J566768J635946J939743K502024L298716M225231N079104N598185
12058C5769533N548239M812262L436107J616533l58133k194767l679798m724456
12050D0225520n351186n639533n672551n509729n182700m700235m058105l253671
12042H57810k300018j234794j23641R44756J877992K604333L074407L229516K973112
12033A1903473K196873Q62107r25014k904513m723414o029027o563855o244553
$$ plain form
12025 -12427923 -17623805 -21329435 -23435871 -24086286 -23542461 -22093192 -20043820 -17742822
12017 -17742822 -15566657 -13829086 -12663049 -11963642 -11441917 -10759595 -9664982 -8062795
12009 -8062795 -6001038 -3605608 -1015301 1639809 4210841 6490246 8209415 9092337
12001 9092337 8936381 7670887 5365802 2200553 -1576008 -5672329 -9767642 -13526068
11993 -13526068 -16620596 -18763282 -19732577 -19393831 -17714017 -14770215 -10748532 -5931296
11985 -5931296 -670836 4654663 9703644 14233709 18128528 21363904 23928074 25748110
11977 25748110 26672849 26524809 25191668 22709829 19299776 15332075 11228688 7335121
11969 7335121 3820814 654815 -2338881 -5382449 -8642876 -12149379 -15743317 -19085583
$$ packed form
12025a2427923n195882l705630k106436o50415N43825J449269K049372K300998
12017a7742822K176165J737571J166037O99407N21725O82322J094613J602187
12009h062795K061757K395430K590307K655110K571032K279405J719169Q82922
12001I092337j55956j265494k305085l165249l776561m096321m095313l758426
11993a3526068l094528k142686r69295L38746J679814K943802M021683M817236
11985e931296N260460N325499N048981M530065L894819L235376K564170J820036
11977B5748110R24739j48040j333141k481839l410053l967701m103387l893567
11969G335121l514307l165999k993696l043568l260427l506503l593938l342266
$$ plain form
11961 -19085583 -21739951 -23306112 -23531721 -22343595 -19801467 -16031677 -11194320 -5488823
11953 -5488823 838489 7519821 14320302 21078668 27693396 34060639 40017551 45339594
11945 45339594 49786556 53150466 55273718 56050962 55444923 53520041 50468218 46602019
11937 46602019 42311741 37997146 33989066 30483670 27520059 25019545 22868478 20994783
11929 20994783 19395314 18113061 17200261 16701936 16662151 17127891 18126303 19614696 21429626
11920 21429626 23274808 24775493 25589064 25520335 24580950 22967838 20985617 18959889 17172202
11911 17172202 15820068 14994703 14677073 14761583 15111461 15630371 16316020 17262921 18608601
11902 18608601 20451481 22781660 25450080 28176868 30587889 32269460 32829505 31946861
$$ packed form
11961a9085583k654368j566161k25609J188126K542128L769790M837357N705497
11953e488823O327312O681332O800481O758366O614728O367243N956912N322043
11945D5339594M446962L363910K123252P77244o06039j924882l051823l866199
11937D6602019m290278m314595m008080l505396k963611k500514k151067j873695
11929B0994783j599469j282253r12800m98325l9785M65740R98412J488393J814930
11920B1429626J845182J500685Q13571o8729r39385j613112j982221k025728j787687
11911A7172202j352134q25365l17630Q4510L49878N18910O85649R46901J345680
11902A8608601J842880K330179K668420K726788K411021J681571N60045q82644
$$ plain form
11894 31946861 29394195 25041645 18867566 10991963 1712475 -8498026 -19051772 -29342259
11886 -29342259 -38835669 -47131190 -53982384 -59276919 -62979287 -65063187 -65475166 -64152803
11878 -64152803 -61081753 -56353528 -50194396 -42956938 -35080743 -27035505 -19260426 -12109687
11870 -12109687 -5812518 -462882 3947120 7460932 10098830 11841897 12650827 12482041
11862 12482041 11283806 8997204 5596084 1166077 -4017195 -9463576 -14532238 -18578785
11854 -18578785 -21133824 -22036829 -21471021 -19897915 -17929506 -16179891 -15127542 -15017220
11846 -15017220 -15826995 -17304816 -19053103 -20633949 -21677644 -21976953 -21535712 -20542788 -19277936
11837 -19277936 -17996652 -16846245 -15833574 -14833167 -13619062 -11913193 -9443908 -5999266
$$ packed form
11894C1946861k552666m352550o174079p875603r279488j0210501j0553746j0290487
11886b9342259r493410q295521o851194n294535l702368k083900m11979J322363
11878f4152803L071050M728225O159132P237458P876195Q045238P775079P150739
11870a2109687O297169N349636M410002L513812K637898J743067Q08930j68786
11862A2482041j198235k286602l401120m430007n183272n446381n068662m046547
11854a8578785k555039r03005N65808J573106J968409J749615J052349J10322
11846a5017220q09775j477821j748287j580846j043695k99309M41241R92924J264852
11837a9277936J281284J150407J012671J000407J214105J705869K469285L444642
$$ plain form
11829 -5999266 -1459489 4191219 10856816 18310259 26167272 33878393 40769341 46141418
11821 46141418 49411177 50242445 48622353 44856611 39490186 33180770 26560889 20124637
11813 20124637 14166411 8779569 3900781 -624518 -4974728 -9293105 -13647233 -18020028
11805 -18020028 -22337238 -26515594 -30500516 -34271138 -37818429 -41122453 -44147223 -46846359
11797 -46846359 -49159309 -50991781 -52198919 -52596424 -52003992 -50297713 -47440392 -43476341
11789 -43476341 -38500279 -32618005 -25910821 -18413184 -10118337 -1022926 8803730 19168689
11781 19168689 29763066 40228367 50238519 59549060 67998274 75483934 81951442 87409216
11773 87409216 91954207 95771599 99085548 102075252 104802004 107190443 109073473 110273834
$$ packed form
11829e999266M539777N650708O665597P453443P857013P711121O890948N372077
11821D6141418L269759Q31268j620092l765742n366425o309416o619881o436252
11813B0124637n958226n386842m878788m525299m350210m318377m354128m372795
11805a8020028m317210m178356l984922l770622l547291l304024l024770k699136
11797d6846359k312950j832472j207138l97505N92432J706279K857321L964051
11789d3476341M976062N882274O707184P497637Q294847R095411R826656J0364959
11781A9168689J0594377J0465301J0010152R310541Q449214P485660O467508N457774
11773H7409216M544991L817392L313949K989704K726752K388439J883030J200361
$$ plain form
11765 110273834 110679998 110281597 109150804 107383749 105040370 102124004 98613438 94518362
11757 94518362 89910957 84909514 79632132 74160565 68541236 62820853 57092782 51524550
11749 51524550 46343796 41780614 37994787 35034894 32858998 31402197 30643734 30632146
11741 30632146 31458672 33197151 35840643 39264218 43230371 47428767 51521509 55169567
11733 55169567 58043769 59847171 60370100 59567066 57611113 54874407 51817181 48825086
11725 48825086 46077302 43519715 40961878 38249452 35422342 32770966 30751331 29797957
11717 29797957 30138335 31712150 34226079 37289064 40543625 43745364 46790995 49706126
11709 49706126 52588359 55504583 58377905 60930252 62726659 63303782 62312069 59601174
$$ packed form
11765A10273834M06164l98401j130793j767055k343379k916366l510566m095076
11757I4518362m607405n001443n277382n471567n619329n720383n728071n568232
11749E1524550n180754m563182l785827k959893k175896j456801p58463j1588
11741C0632146Q26526J738479K643492L423575L966153M198396M092742L648058
11733E5169567K874202J803402N22929q03034j955953k736706l057226k992095
11725D8825086k747784k557587k557837k712426k827110k651376k019635r53374
11717B9797957L40378J573815K513929L062985L254561L201739L045631K915131
11709D9706126K882233K916224K873322K552347J796407N77123r91713k710895
$$ plain form
11701 59601174 55223763 49382588 42367381 34514727 26189798 17761046 9544585 1732389
11693 1732389 -5649545 -12715592 -19631381 -26501926 -33287797 -39787875 -45698599 -50719459
11685 -50719459 -54647356 -57418019 -59099026 -59864242 -59958578 -59634300 -59054242 -58203268 -56872833
11676 -56872833 -54752762 -51598290 -47384913 -42360470 -36966566 -31691136 -26955465 -23092324
11668 -23092324 -20384820 -19093139 -19426507 -21474135 -25139983 -30123168 -35962482 -42130642
11660 -42130642 -48137422 -53600576 -58267676 -61994940 -64698196 -66298146 -66690978 -65767313
11652 -65767313 -63472044 -59872197 -55201258 -49861970 -44377649 -39297013 -35089307 -32083285
11644 -32083285 -30470758 -30340289 -31693176 -34434098 -38364927 -43199818 -48590818 -54152511
$$ packed form
11701E9601174m377411n841175p015207p852654q324929q428752q216461p812196
11693A732389p381934p066047o915789o870545o785871o500078n910724n020860
11685e0719459l927897k770663j681007p65216r4336L24278N80058Q50974J330435
11676e6872833K120071L154472M213377N024443N393904N275430M735671L863141
11668b3092324K707504J291681l33368k047628l665848m983185n839314o168160
11660d2130642o006780n463154m667100l727264k703256j599950l92832R23665
11652f5767313K295269L599847M670939N339288N484321N080636M207706L006022
11644c2083285J612527J30469j352887k740922l930829m834891n391000n561693
$$ plain form
11636 -54152511 -59495892 -64284542 -68300381 -71484948 -73931142 -75828150 -77383604 -78751923
11628 -78751923 -79990568 -81051500 -81799250 -82039368 -81546066 -80088600 -77461728 -73524028
11620 -73524028 -68242033 -61729957 -54266233 -46268005 -38220459 -30582223 -23701345 -17768451
11612 -17768451 -12814672 -8747951 -5414252 -2662935 -389699 1462355 2940344 4130480
11604 4130480 5182295 6284831 7599843 9188639 10982582 12823673 14550802 16072664
11596 16072664 17385271 18542805 19619165 20676694 21723755 22647969 23158283 22800560
11588 22800560 21079926 17646669 12447913 5762319 -1893117 -9922572 -17791384 -25094347
11580 -25094347 -31559827 -37033672 -41471792 -44926244 -47492408 -49221599 -50054535 -49832900
$$ packed form
11636e4152511n343381m788650m015839l184567k446194j897008j555454j368319
11628g8751923j238645j060932p47750k40118M93302J457466K626872L937700
11620g3524028N281995O512076P463724P998228Q047546P638236O880878N932894
11612a7768451M953779M066721L333699K751317K273236J852054J477989J190136
11604D130480J051815J102536J315012J588796J793943J841091J727129J521862
11596A6072664J312607J157534J076360J057529J047061R24214N10314l57723
11588B2800560j720634l433257n198756o685594p655436q029455p868812p302963
11580b5094347o465480n473845m438120l454452k566164j729191q32936K21635
$$ plain form
11572 -49832900 -48389687 -45660458 -41749794 -36923649 -31539335 -25950281 -20433719 -15179585
11564 -15179585 -10339534 -6087708 -2633872 -171078 1202528 1526388 952687 -326297
11556 -326297 -2147794 -4405900 -7037326 -9994746 -13228658 -16671134 -20207925 -23650143
11548 -23650143 -26739939 -29212213 -30893865 -31790078 -32108175 -32198586 -32430188 -33047048 -34064928
11539 -34064928 -35254915 -36229382 -36600630 -36143961 -34890939 -33116271 -31238080 -29683808
11531 -29683808 -28768795 -28616208 -29136874 -30075471 -31104074 -31923991 -32345879 -32341080 -32059561
11522 -32059561 -31794063 -31875926 -32531269 -33767561 -35353182 -36898046 -37985740 -38286916 -37608639
11513 -37608639 -35884859 -33151556 -29545137 -25319739 -20842758 -16538185 -12794319 -9887633
$$ packed form
11572d9832900J443213K729229L910664M826145N384314N589054N516562N254134
11564a5179585M840051M251826L453836K462794J373606L23860n73701j278984
11556c26297j821497k258106k631426k957420l233912l442476l536791l442218
11548b3650143l089796k472274j681652q96213l18097r0411k31602o16860j017880
11539c4064928j189987r74467l71248M56669J253022J774668J878191J554272
11531b9683808R15013J52587n20666r38597j028603q19917m21888M799K81519
11522c2059561K65498q1863o55343j236292j585621j544864j087694l01176O78277
11513c7608639J723780K733303L606419M225398M476981M304573L743866K906686
$$ plain form
11505 -9887633 -7963928 -7073195 -7216804 -8365319 -10439124 -13280284 -16651084 -20269841
11497 -20269841 -23865775 -27228191 -30238376 -32884742 -35262063 -37551459 -39978359 -42752276
11489 -42752276 -46003069 -49739180 -53851711 -58164258 -62494912 -66686717 -70592498 -74043120
11481 -74043120 -76841495 -78795881 -79767143 -79693619 -78580135 -76470060 -73434837 -69603584
11473 -69603584 -65221821 -60693769 -56557538 -53382109 -51631879 -51565408 -53198896 -56313464
11465 -56313464 -60474865 -65066845 -69364474 -72656341 -74384896 -74252895 -72253585 -68610651
11457 -68610651 -63650919 -57667494 -50838696 -43231832 -34864514 -25770053 -16035545 -5817963
11449 -5817963 4646489 15040904 24987359 34091743 42000359 48449293 53295513 56527007
$$ packed form
11505i887633J923705Q90733j43609j148515k073805k841160l370800l618757
11497b0269841l595934l362416l010185k646366k377321k289396k426900k773917
11489d2752276l250793l736111m112531m312547m330654m191805l905781l450622
11481g4043120k798375j954386r71262P3524J113484K110075L035223L831253
11473f9603584M381763M528052M136231L175429J750230O6471j633488l114568
11465e6313464m161401m591980m297629l291867j728555J32001J999310L642934
11457f8610651M959732N983425O828798P606864Q367318R094461R734508J0217582
11449e817963J0464452J0394415R946455R104384P908616O448934M846220L231494
$$ plain form
11441 56527007 58249734 58649209 57935311 56296522 53893524 50897850 47543736 44142891
11433 44142891 41031948 38469618 36543404 35152237 34088798 33176171 32371508 31775621
11425 31775621 31562319 31896403 32897051 34646226 37199995 40568233 44668318 49291465
11417 49291465 54118032 58781664 62943188 66332090 68750326 70068930 70242580 69333529
11409 69333529 67519462 65075160 62335349 59642482 57276333 55376566 53891987 52588424
11401 52588424 51115915 49104677 46253653 42392148 37515410 31803314 25622879 19498649
11393 19498649 14032287 9779740 7134171 6274417 7201588 9829617 14068868 19862143
11385 19862143 27170785 35929047 45983684 57034669 68603831 80064858 90748459
$$ packed form
11441E6527007J722727L99475p13898j638789k402998k995674l354114l400845
11433D4142891l110943k562330j926214j391167j063439r12627q04663n95887
11425C1775621k13302L34084J000648J749175K553769L368238M100085M623147
11417D9291465M826567M663632M161524L388902K418236J318604J73650r09051
11409F9333529j814067k444302k739811k692867k366149j899767j484579j303563
11401E2588424j472509k011238k851024l861505m876738n712096o180435o124230
11393A9498649n466362m252547k645569q59754R27171K628029M239251N793275
11385A9862143P308642Q758262J0054637J1050985J1569162J1461027J0683601
$$ plain form
11378 90748459 100093078 107775020 113753121 118206748 121405241 123582274 124874419 125329979
11370 125329979 124946674 123695479 121526577 118382800 114231475 109091585 103030522 96141401
11362 96141401 88539522 80395046 71972192 63631243 55785057 48843200 43177386 39107019
11354 39107019 36877480 36614406 38269879 41597155 46181337 51522753 57140029 62650193
11346 62650193 67797382 72425945 76411436 79573025 81604398 82073659 80527395 76673628
11338 76673628 70549529 62570835 53432131 43920251 34736407 26383476 19120506 12967129
11330 12967129 7748942 3177407 -1053596 -5179950 -9307586 -13388067 -17226601 -20514753
11322 -20514753 -22884109 -23986102 -23598568 -21730605 -18670396 -14936781 -11152000 -7896048
$$ packed form
11378I0748459R344619P681942N978101M453627L198493K177033J292145M55560
11370A25329979l83305j251195k168902l143777m151325n139890o061063o889121
11362I6141401p601879q144476q422854q340949p846186o941857n665814m070367
11354C9107019k229539k63074J655473L327276M584182N341416N617276N510164
11346F2650193N147189M628563L985491L161589K031373M69261j546264l853767
11338G6673628o124099p978694r138704r511880r183844q352931p262970o153377
11330A2967129n218187m571535m231003m126354m127636m080481l838534l288152
11322b0514753k369356j101993L87534J867963L060209L733615L784781L255952
$$ plain form
11314 -7896048 -5593368 -4444709 -4400107 -5178315 -6339225 -7394618 -7923411 -7659975 -6536485
11305 -6536485 -4668657 -2287117 360140 3094882 5859268 8727424 11881442 15549924
11297 15549924 19917927 25042556 30813236 36966796 43137819 48925484 53974051 58060001
11289 58060001 61155120 63427209 65168603 66686252 68209557 69857498 71666872 73646043
11281 73646043 75808844 78166894 80694697 83302279 85844193 88170578 90198516 91961970
11273 91961970 93602601 95298662 97171085 99215494 101279042 103068821 104177900 104133144
11265 104133144 102471675 98834240 93048324 85176155 75513979 64541870 52841679 41017712
11257 41017712 29647855 19258672 10291686 3043758 -2392297 -6139862 -8480915 -9749148
$$ packed form
11314g896048K302680J148659M4602p78208j160910j055393n28793K63436J123490
11305f536485J867828K381540K647257K734742K764386K868156L154018L668482
11297A5549924M368003N124629N770680O153560O171023N787665N048567M085950
11289E8060001L095119K272089J741394J517649J523305J647941J809374J979171
11281G3646043K162801K358050K527803K607582K541914K326385K027938J763454
11273I1961970J640631J696061J872423K044409K063548J789779J109079m4756
11265A04133144j661469l637435n785916p872169r662176j0972109j1700191j1823967
11257D1017712j1369857j0389183q966986p247928n436055l747565k341053j268233
$$ plain form
11249 -9749148 -10219480 -10040715 -9244977 -7836396 -5910189 -3715708 -1604415 107454 1260475
11240 1260475 1877590 2103596 2131686 2169296 2433510 3138922 4463538 6506357 9251460
11231 9251460 12543165 16080173 19447488 22199350 23978433 24626899 24239281 23133075
11223 23133075 21753266 20553723 19896561 19991592 20882857 22482156 24638423 27214325 30133569
11214 30133569 33376753 36932296 40734160 44626797 48382429 51757926 54542999 56556737
11206 56556737 57602228 57440103 55834416 52662876 48028777 42309157 36109157 30130955
11198 30130955 24996121 21086018 18469674 16950857 16201858 15911413 15886197 16084684 16588945
11189 16588945 17530330 18998836 20982168 23372316 26036405 28906197 32032128 35573221
$$ packed form
11249i749148m70332J78765P95738J408581J926207K194481K111293J711869J153021
11240A260475O17115K26006K8090L7610K64214P05412J324616K042819K745103
11231I251460L291705L537008L367315K751862J779083O48466l87618j106206
11223B3133075j379809j199543o57162R5031Q91265J599299K156267K575902K919244
11214C0133569L243184L555543L801864L892637L755632L375497K785073K013738
11206E6556737J045491j62125j605687l171540m634099n719620o200000n978202
11198C0130955n134834l910103k616344j518817p48999k90445k5216J98487N04261
11189A6588945R41385J468506J983332K390148K664089K869792L125931L541093
$$ plain form
11181 35573221 39727614 44633194 50281491 56485148 62913166 69170320 74876141 79709688
11173 79709688 83416072 85795381 86701079 86062827 83925966 80482635 76070987 71135953
11165 71135953 66161213 61590115 57757427 54851874 52912966 51844693 51430246 51357596
11157 51357596 51277241 50884218 49979489 48472769 46336591 43555097 40100862 35946088 31102992
11148 31102992 25683138 19946615 14294669 9177632 4944140 1704997 -714633 -2708543
11140 -2708543 -4743661 -7207253 -10311338 -14075977 -18368020 -22953925 -27540017 -31802399
11132 -31802399 -35426493 -38168374 -39922112 -40753877 -40870429 -40527843 -39925719 -39139569 -38114580
11123 -38114580 -36704038 -34717457 -31958602 -28263638 -23558889 -17927917 -11637038 -5070511
$$ packed form
11181C5573221M154393M905580N648297O203657O428018O257154N705821M833547
11173G9709688L706384K379309R05698o38252k136861l443331m411648m935034
11165G1135953m974740m571098l832688k905553j938908j068273m14447p2650
11157E1357596q0355l93023r04729j506720k136178k781494l454235m154774m843096
11148C1102992n419854n736523n651946n117037m233492l239143k419630j993910
11140b708543k035118k463592l104085l764639m292043m585905m586092m262382
11132c1802399l624094k741881j753738q31765j16552L42586O02124P86150J024989
11123c8114580J410542J986581K758855L694964M704749N630972O290879O566527
$$ plain form
11115 -5070511 1411521 7610293 13532049 19313968 25086276 30855417 36467147 41654434
11107 41654434 46127289 49645186 52037812 53186307 53003618 51438183 48495924 44267578
11099 44267578 38959261 32922766 26662792 20792163 15932818 12596334 11087946 11461169
11091 11461169 13530128 16933389 21226786 25965040 30734701 35136110 38755513 41179771
11083 41179771 42071044 41265373 38832347 35055382 30343357 25122620 19758964 14533230
11075 14533230 9666488 5370296 1882342 -551869 -1758995 -1736752 -704474 933490
11067 933490 2694579 4143636 4988977 5120869 4585681 3513372 2038198 250364 -1816176
11058 -1816176 -4185996 -6954626 -10293843 -14408477 -19426315 -25258597 -31510604 -37511013
$$ packed form
11115e070511O482032O198772N921756N781919N772308N769141N611730N187287
11107D1654434M472855L517897K392626J148495j82689j565435k942259m228346
11099D4267578n308317o036495o259974n870629m859345l336484j508388L73223
11091A1461169K068959L403261M293397M738254M769661M401409L619403K424258
11083D1179771Q91273q05671k433026l776965m712025n220737n363656n225734
11075A4533230m866742m296192l487954k434211j207126K2243J032278J637964
11067I33490J761089J449057Q45341J31892n35188j072309j475174j787834k066540
11058a816176k369820k768630l339217m114634n017838n832282o252007o000409
$$ plain form
11050 -37511013 -42465746 -45668160 -46665550 -45315218 -41734218 -36200960 -29070421 -20729816
11042 -20729816 -11584964 -2054371 7444463 16519237 24832884 32133197 38275472 43229287
11034 43229287 47058480 49870350 51750943 52723693 52762254 51849176 50034766 47455797 44316231
11025 44316231 40862432 37372266 34146322 31483513 29645529 28831341 29174260 30753472
11017 30753472 33600086 37680932 42860075 48861925 55272104 61593626 67337125 72101206
11009 72101206 75611290 77712583 78329441 77411978 74901762 70748254 64975984 57755406
11001 57755406 49416528 40386769 31095594 21908821 13118777 4966717 -2336870 -8600719
10993 -8600719 -13637781 -17253425 -19267469 -19580895 -18245060 -15471365 -11565991 -6838351
$$ packed form
11050c7511013m954733l202414r97390J350332L581000N533258P130539Q340605
11042b0729816R144852R530593R498834R074774Q313647P300313O142275M953815
11034D3229287L829193K811870J880593R72750L8561r13078j814410k578969l139566
11025D4316231l453799l490166l225944k662809j837984q14188L42919J579212
11017C0753472K846614M080846N179143O001850O410179O321522N743499M764081
11009G2101206L510084K101293O16858r17463k510216m153508n772270p220578
11001E7755406q338878r029759r291175r186773q790044q152060p303587o263849
10993h600719n037062l615644k014044l13426J335835K773695L905374M727640
$$ plain form
10985 -6838351 -1542706 4131900 10048631 16109638 22241788 28373377 34406789 40202321
10977 40202321 45582604 50354088 54335204 57382148 59405245 60367803 60264403 59094606
10969 59094606 56866390 53650913 49662163 45294227 41062951 37463370 34816102 33187504
10961 33187504 32424232 32271488 32490114 32893193 33292794 33426410 32947672 31506638 28873786
10952 28873786 25038680 20237349 14898372 9531212 4606408 476703 -2648846 -4705222
10944 -4705222 -5770869 -6054142 -5838961 -5392105 -4873154 -4289929 -3512294 -2331461 -544810
10935 -544810 1956947 5130909 8779742 12609904 16320757 19679878 22555216 24904619
10927 24904619 26742041 28098848 28990563 29396777 29260706 28505645 27054976 24845747 21842031
$$ packed form
10985f838351N295645N674606N916731O061007O132150O131589O033412N795532
10977D0202321N380283M771484L981116L046944K023097R62558j03400j169797
10969E9094606k228216l215477l988750m367936m231276l599581k647268j628598
10961C3187504p63272j52744K18626M03079L99601J33616m78738j441034k632852
10952B8873786l835106m801331n338977n367160m924804m129705l125549k056376
10944d705222j065647k83273K15181M46856N18951N83225P77635J180833J786651
10935e44810K501757L173962L648833L830162L710853L359121K875338K349403
10927B4904619J837422J356807Q91715M06214j36071p55061j450669k209229l003716
$$ plain form
10918 21842031 18060440 13602561 8666521 3514102 -1594679 -6453232 -10903518 -14775254
10910 -14775254 -17817394 -19681589 -19984076 -18422216 -14890530 -9544112 -2785252 4815565
10902 4815565 12626582 20046493 26556407 31736283 35267438 36940444 36675214 34547363
10894 34547363 30803349 25841012 20144306 14189132 8355786 2872656 -2206809 -6995360
10886 -6995360 -11722062 -16641363 -21935378 -27658438 -33738501 -40003845 -46203335 -52028955
10878 -52028955 -57167862 -61378243 -64543707 -66668405 -67819709 -68057455 -67388586 -65772528
10870 -65772528 -63185111 -59715998 -55636559 -51376411 -47407671 -44108089 -41685871 -40190366
10862 -40190366 -39566912 -39701656 -40438924 -41590297 -42958185 -44375798 -45745296 -47050588
$$ packed form
10918B1842031l781591m457879m936040n152419n108781m858553m450286l871736
10910a4775254l042140j864195l02487J561860L531686N346418O758860P600817
10902D815565P811017P419911O509914N179876L531155J673006k65230k127851
10894C4547363l744014m962337n696706n955174n833346n483130n079465m788551
10886f995360m726702m919301n294015n723060o080063o265344o199490n825620
10878e2028955n138907m210381l165464k124698j151304k37746O68869J616058
10870f5772528K587417L469113M079439M260148L968740L299582K422218J495505
10862d0190366O23454j34744p37268j151373j367888j417613j369498j305292
$$ plain form
10854 -47050588 -48331800 -49630123 -50933783 -52160611 -53189390 -53914749 -54282143 -54281406 -53920468
10845 -53920468 -53219390 -52234425 -51072190 -49844173 -48563850 -47056866 -44968626 -41892987
10837 -41892987 -37561698 -31994086 -25531680 -18744140 -12252239 -6548366 -1893410 1673162
10829 1673162 4238607 5913501 6789163 6969768 6632302 6048359 5536268 5368613 5691149
10820 5691149 6492022 7619632 8826886 9829818 10377904 10316480 9603489 8266352 6341374
10811 6341374 3861785 909754 -2329858 -5590527 -8623441 -11294779 -13595761 -15558138
10803 -15558138 -17147531 -18217806 -18557257 -17997475 -16526816 -14352344 -11875244 -9581207
10795 -9581207 -7891000 -7042941 -7064128 -7833376 -9180614 -10950556 -13000443 -15167274 -17263370
$$ packed form
10854d7050588j281212j298323j303660j226828j028779p25359l67394P37L60938
10845e3920468P01078R84965J162235J228017J280323J506984K088240L075639
10837d1892987M331289N567612O462406O787540O491901N703873M654956L566572
10829A673162K565445J674894Q75662J80605l37466n83943n12091j67655L22536
10820E691149Q00873J127610J207254J002932N48086o1424p12991j337137j924978
10811F341374k479589k952031l239612l260669l032914k671338k300982j962377
10803a5558138j589393j070275l39451N59782J470659K174472K477100K294037
10795i581207J690207Q48059k1187p69248j347238j769942k049887k166831k096096
$$ plain form
10786 -17263370 -19113352 -20585143 -21570586 -21938940 -21532840 -20238492 -18083390 -15286327
10778 -15286327 -12226091 -9347099 -7036691 -5508817 -4738659 -4491566 -4446713 -4351947 -4121114
10769 -4121114 -3825469 -3602446 -3551746 -3683522 -3939389 -4257394 -4626276 -5083503 -5647933 -6223583
10759 -6223583 -6542390 -6205233 -4822984 -2184861 1648944 6385751 11635602 17050686
10751 17050686 22390562 27498398 32233756 36427372 39896341 42504420 44210964 45060083
10743 45060083 45117316 44415263 42967841 40852238 38292966 35671317 33432931 31933293
10735 31933293 31296231 31347178 31639935 31556719 30447900 27783754 23290878 17031232 9377441
10726 9377441 876106 -7940895 -16697091 -25195610 -33338117 -41012213 -48024664 -54113286
$$ packed form
10786a7263370j849982j471791r85443l68354M06100J294348K155102K797063
10778a5286327L060236K878992K310408J527874P70158K47093M4853R4766K30833
10769d121114K95645K23023N0700j31776k55867l18005l68882m57227n64430n75650
10759f223583l18807L37157J382249K638123L833805M736807N249851N415084
10751A7050686N339876N107836M735358M193616L468969K608079J706544Q49119
10743D5060083N7233p02053j447422k115603k559272k621649k238386j499638
10735C1933293o37062N0947K92757q3216j108819k664146m492876o259646p653791
10726I377441q501335q817001q756196q498519q142507p674096p012451o088622
$$ plain form
10718 -54113286 -59015675 -62543150 -64618626 -65273217 -64621747 -62831129 -60079515 -56510804
10710 -56510804 -52208241 -47204777 -41516203 -35170715 -28232924 -20837147 -13219054 -5704275
10702 -5704275 1364529 7720492 13220584 17827194 21556195 24433371 26473371 27676335
10694 27676335 28040485 27591756 26419441 24692512 22633735 20451552 18260285 16036354
10686 16036354 13645626 10937865 7864031 4557502 1338356 -1362576 -3126689 -3666655
10678 -3666655 -2899002 -953197 1876099 5215134 8710226 12107084 15277230 18177684
10670 18177684 20763778 22903746 24349727 24795303 23998769 21899791 18648293 14521237
10662 14521237 9788533 4628801 -848501 -6504953 -12083666 -17200049 -21427992 -24438917
$$ packed form
10718e4113286m902389l527475k075476o54591O51470J790618K751614L568711
10710e6510804M302563N003464N688574O345488O937791P395777P618093P514779
10702e704275P068804O355963N500092M606610L729001K877176K040000J202964
10694B7676335L64150m48729j172315j726929k058777k182183k191267k223931
10686A6036354k390728k707761l073834l306529l219146k700932j764113n39966
10678c666655P67653J945805K829296L339035L495092L396858L170146K900454
10670A8177684K586094K139968J445981M45576p96534k098978l251498m127056
10662A4521237m732704n159732n477302n656452n578713n116383m227943l010925
$$ plain form
10654 -24438917 -26120099 -26608182 -26223850 -25355516 -24364470 -23549456 -23150824 -23351697 -24260669
10645 -24260669 -25896114 -28192570 -31020629 -34195616 -37470735 -40542166 -43092082 -44853926
10637 -44853926 -45650155 -45374782 -43953831 -41342506 -37569999 -32776602 -27187722 -21039018
10629 -21039018 -14521870 -7796030 -1049848 5446172 11327187 16164189 19525263 21059965
10621 21059965 20595903 18223276 14332675 9579243 4776172 754358 -1767646 -2286013
10613 -2286013 -594093 3161992 8498341 14721041 21145529 27313884 33105457 38696154
10605 38696154 44400865 50480058 56994251 63762219 70433877 76638932 82136480 86889874
10597 86889874 91032470 94753656 98180390 101322378 104094688 106377611 108065395 109088954
$$ packed form
10654b4438917j681182m88083L84332Q68334R91046Q15014L98632k00873r08972
10645b4260669j635445k296456k828059l174987l275119l071431k549916j761844
10637d4853926p96229K75373J420951K611325L772507M793397N588880O148704
10629b1039018O517148O725840O746182O496020N881015M837002L361074J534702
10621B1059965m64062k372627l890601m753432m803071m021814k522004n18367
10613b286013J691920L756085N336349O222700O424488O168355N791573N590697
10605C8696154N704711O079193O514193O767968O671658O205055N497548M753394
10597H6889874M142596L721186L426734L141988K772310K282923J687784J023559
$$ plain form
10589 109088954 109427240 109118270 108261851 107004869 105517041 103971810 102532657 101332472
10581 101332472 100445361 99872872 99567492 99487283 99645143 100116675 101002648 102375897 104248922
10572 104248922 106576138 109278049 112266084 115454936 118756937 122054889 125156882 127753669
10564 127753669 129410954 129619906 127904281 123956515 117757044 109627986 100194747 90270814
10556 90270814 80709686 72261588 65453588 60513000 57364481 55711459 55164289 55351699
10548 55351699 55978373 56838490 57817839 58907891 60230130 62041520 64680908 68443456
10540 68443456 73423997 79399881 85803357 91795392 96431783 98892047 98700933 95847803
10532 95847803 90752042 84111020 76720908 69341611 62624210 57082563 53079987 50807652
$$ packed form
10589A09088954L38286l08970q56419j256982j487828j545231j439153j200185
10581A01332472q87111n72489l05380q0209J57860M71532Q85973J373249J873025
10572A04248922K327216K701911K988035L188852L302001L297952L101993K596787
10564A27753669J657285K08952j715625l947766o199471q129058r433239r923933
10556I0270814r561128q448098o808000m940588l148519j653022n47170J87410
10548E5351699O26674Q60117R79349J090052J322239J811390K639388L762548
10540F8443456M980541N975884O403476N992035M636391K460264j91114k853130
10532I5847803n095761o641022p390112p379297o717401n541647m002576k272335
$$ plain form
10524 50807652 50251030 51166604 53102869 55486077 57759367 59529771 60661036 61271603
10516 61271603 61649438 62135057 63019098 64475251 66540921 69156039 72243184 75779658
10508 75779658 79823358 84500844 89986638 96480262 104171936 113208331 123689367 135710734
10500 135710734 149433224 165142248 183265098 204336581 228937615 257640651 290953153
10493 290953153 329199368 372290134 419387747 468522318 516288907 557898802 587916120
10486 587916120 601707614 597034566 574879547 538993255 494494419 446379214 398594504
10479 398594504 353763219 313299917 277668336 246667364 219698989 195994293 174798500
10472 174798500 155517983 137807633 121577122 106930855 94080219 83255986 74634266
$$ packed form
10524E0807652n56622R15574J936265K383208K273290J770404J131265O10567
10516F1271603L77835M85619Q84041J456153K065670K615118L087145L536474
10508G5779658M043700M677486N485794O493624P691674R036395J0481036J2021367
10500A35710734J3722490J5709024J8122850K1071483K4601034K8703036L3312502
10493B90953153L8246215M3090766M7097613M9134571M7766589M1609895L0017318
10486E87916120J3791494m673048k2155019l5886292m4498836m8115205m7784710
10479C98594504m4831285m0463302l5631581l1000972k6968375k3704696k1195793
10472A74798500j9280517j7710350j6230511j4646267j2850636j0824233q621720
$$ plain form
10465 74634266 68286118 64150801 62020705 61539091 62235470 63610831 65238956 66831477
10457 66831477 68248018 69470991 70564872 71623409 72711149 73820012 74860112 75686703
10449 75686703 76150118 76148146 75659390 74746507 73536793 72194749 70889398 69748134 68798639
10440 68798639 67921706 66847560 65217427 62704957 59156915 54687221 49668019 44611411
10432 44611411 39995420 36117933 33046116 30676674 28861013 27514359 26645653 26304144
10424 26304144 26491391 27096945 27890380 28570428 28847159 28516852 27491954 25778780 23433674
10415 23433674 20539664 17221377 13681622 10226459 7251698 5183003 4384764 5070890
10407 5070890 7253114 10745236 15213891 20246448 25409630 30294827 34564247 38004029
$$ packed form
10465G4634266o348148m135317k130096m81614O96379J375361J628125J592521
10457F6831477J416541J222973J093881J058537J087740J108863J040100Q26591
10449G5686703M63415j972m88756r12883j209714j342044j305351j141264r49495
10440F8798639q76933j074146j630133k512470l548042m469694n019202n056608
10432D4611411m615991l877487l071817k369442j815661j346654q68706l41509
10424B6304144J87247O05554P93435O80048K76731l30307j024898j713174k345106
10415B3433674k894010l318287l539755l455163k974761k068695p98239O86126
10407E070890K182224L492122M468655N032557N163182M885197M269420L439782
$$ plain form
10399 38004029 40565553 42367816 43655846 44736123 45911558 47424909 49417450 51916792
10391 51916792 54859146 58127490 61578105 65046436 68343684 71256328 73553456 75007559
10383 75007559 75434070 74740802 72965049 70283199 66995074 63488442 60181716 57449827
10375 57449827 55560091 54651118 54761506 55878769 57965907 60941836 64627536 68700464
10367 68700464 72703856 76125166 78509343 79549946 79123549 77273100 74164324 70031832
10359 70031832 65125040 59670855 53871887 47938027 42119265 36700554 31948291 28039949
10351 28039949 25026827 22858104 21450007 20751651 20760962 21476609 22813930 24539840 26276318
10342 26276318 27583564 28085054 27570984 26031636 23615087 20543728 17037351 13273784
$$ packed form
10399C8004029K561524J802263J288030J080277J175435J513351J992541K499342
10391E1916792K942354L268344L450615L468331L297248K912644K297128J454103
10383G5007559M26511o93268j775753k681850l288125l506632l306726k731889
10375E7449827j889736r08973J10388J117263K087138K975929L685700M072928
10367F8700464M003392L421310K384177J040603m26397j850449l108776m132492
10359G0031832m906792n454185n798968n933860n818762n418711m752263l908342
10351B8039949l013122k168723j408097o98356R311P15647J337321J725910J736478
10342B6276318J307246N01490n14070j539348k416549l071359l506377l763567
$$ plain form
10334 13273784 9387513 5486244 1667038 -1972364 -5323712 -8259286 -10626844 -12253652
10326 -12253652 -12970269 -12665011 -11357149 -9240997 -6649870 -3942575 -1381335 920914
10318 920914 2963558 4775086 6342456 7586040 8383383 8625970 8278949 7409713 6169620
10309 6169620 4743294 3292321 1907344 571982 -845947 -2548837 -4707775 -7356398
10301 -7356398 -10353567 -13444022 -16372495 -18974044 -21194481 -23048099 -24549542 -25657771
10293 -25657771 -26259481 -26201045 -25351975 -23665119 -21205494 -18140720 -14698532 -11101434 -7501518
10284 -7501518 -3954072 -456766 2965931 6197871 9045796 11335926 13029065 14268770
10276 14268770 15319532 16429588 17706764 19083277 20381231 21429834 22169196 22698705
$$ packed form
10334A3273784l886271l901269l819206l639402l351348k935574k367558j626808
10326a2253652p16617L05258J307862K116152K591127K707295K561240K302249
10318I20914K042644J811528J567370J243584P97343K42587l47021q69236j240093
10309F169620j426326j450973j384977j335362j417929j702890k158938k648623
10301g356398k997169l090455k928473k601549k220437j853618j501443j108229
10293b5657771o01710N8436Q49070J686856K459625L064774L442188L597098L599916
10284g501518L547446L497306L422697L231940K847925K290130J693139J239705
10276A4268770J050762J110056J277176J376513J297954J048603P39362N29509
$$ plain form
10268 22698705 23260096 24166627 25698905 27991799 30942137 34172721 37082370 38982332
10260 38982332 39277446 37625097 34014129 28739612 22288688 15186937 7872258 648266
10252 648266 -6277489 -12712871 -18414267 -23066412 -26307459 -27778613 -27180522 -24332384
10244 -24332384 -19233455 -12110289 -3415535 6241821 16209325 25889814 34787343 42507919
10236 42507919 48746841 53284406 55996905 56886358 56123417 54075823 51285163 48378021
10228 48378021 45935769 44368525 43836363 44246372 45329593 46766768 48305328 49817979
10220 49817979 51291583 52770604 54289653 55822202 57262312 58444089 59187316 59346405
10212 59346405 58842510 57671361 55892037 53610542 50973022 48170070 45432977 43000415
$$ packed form
10268B2698705N61391R06531J532278K292894K950338L230584K909649J899962
10260C8982332K95114j652349l610968n274517o450924p101751p314679p223992
10252F48266o925755o435382n701396m652145l241047j471154N98091K848138
10244b4332384N098929P123166Q694754R657356R967504R680489Q897529P720576
10236D2507919O238922M537565K712499Q89453p62941k047594k790660k907142
10228D8378021k442252j567244n32162M10009J083221J437175J538560J512651
10220D9817979J473604J479021J519049J532549J440110J181777P43227J59089
10212E9346405n03895j171149j779324k281495k637520k802952k737093k432562
$$ plain form
10204 43000415 41061358 39708440 38929490 38633623 38692901 38989438 39457257 40089142 40883908
10195 40883908 41761927 42522322 42888046 42607674 41543132 39703876 37233613 34362964 31332401
10186 31332401 28305338 25314963 22276018 19048915 15518924 11668521 7641810 3790728
10178 3790728 666376 -1082789 -901139 1464087 5835404 11631238 18032731 24203514
10170 24203514 29464178 33373987 35733233 36546035 35974298 34294153 31854976 29039217
10162 29039217 26221730 23726421 21780645 20478174 19771335 19504568 19475198 19488719 19387429
10153 19387429 19059619 18449447 17574985 16542390 15536284 14773898 14431234 14574751 15140034
10144 15140034 15972009 16898476 17792197 18599613 19344335 20119339 21070019 22365292 24159431
$$ packed form
10204D3000415j939057j352918p78950k95867N9278K96537M67819O31885P94766
10195D0883908Q78019P60395L65724k80372j064542j839256k470263k870649l030563
10186C1332401l027063k990375l038945l227103l529991l850403m026711l851082
10178C790728l124352j749165J81650K365226M371317N795834O401493O170783
10170B4203514N260664L909809K359246Q12802n71737j680145k439177k815759
10162B9039217k817487k495309j945776j302471p06839k66767k9370J3521j01290
10153A9387429l27810o10172q74462j032595j006106p62386l42664J43517N65283
10144A5140034Q31975R26467Q93721Q07416P44722P75004R50680J295273J794139
$$ plain form
10135 24159431 26551220 29546156 33026921 36737895 40290601 43203354 44992957 45315869
10127 45315869 44107433 41636145 38426614 35091711 32169432 30030757 28852201 28612155
10119 28612155 29097575 29945580 30739421 31135644 30965770 30262124 29196205 27963945 26682231
10110 26682231 25356879 23938218 22421006 20916869 19654823 18921997 18990516 20066012
10102 20066012 22261879 25585149 29924813 35049371 40630274 46299546 51723739 56653483
10094 56653483 60916250 64361807 66810149 68051925 67910146 66324994 63407800 59434639
10086 59434639 54792253 49914179 45234050 41152484 38000185 35996674 35225269 35640415
10078 35640415 37099343 39396590 42287469 45498053 48723638 51623924 53834797 55015621
$$ packed form
10135B4159431K391789K994936L480765L710974L552706K912753J789603L22912
10127D5315869j208436k471288l209531l334903k922279k138675j178556k40046
10119B8612155M85420Q48005P93841L96223j69874p03646j065919j232260j281714
10110B6682231j325352j418661j517212j504137j262046p32826O8519J075496
10102B0066012K195867L323270M339664N124558N580903N669272N424193M929744
10094E6653483M262767L445557K448342J241776j41779j585152k917194l973161
10086E9434639m642386m878074m680129m081566l152299k003511p71405M15146
10078C5640415J458928K297247K890879L210584L225585K900286K210873J180824
$$ plain form
10070 55015621 54923962 53476766 50753936 46936276 42215504 36731473 30568955 23804244
10062 23804244 16564661 9068839 1639346 -5306642 -11288511 -15822154 -18503419 -19086152
10054 -19086152 -17519454 -13932664 -8590697 -1854816 5836325 13983531 22073898 29667309
10046 29667309 36488428 42464913 47677204 52246524 56231332 59585652 62173894 63799222
10038 63799222 64222736 63194413 60521480 56155317 50240564 43089852 35103756 26684653
10030 26684653 18172578 9800476 1666637 -6259274 -14081797 -21889197 -29661677 -37212898
10022 -37212898 -44189067 -50138608 -54641336 -57447199 -58553915 -58182850 -56676577 -54384326
10014 -54384326 -51590943 -48502416 -45267636 -42008416 -38837633 -35857484 -33143830 -30735081
$$ packed form
10070E5015621r1659j447196k722830l817660m720772n484031o162518o764711
10062B3804244p239583p495822p429493o945988n981869m533643k681265n82733
10054a9086152J566698L586790N341967O735881P691141Q147206Q090367P593411
10046B9667309O821119N976485N212291M569320L984808L354320K588242J625328
10038F3799222M23514j028323k672933m366163n914753p150712p986096q419103
10030B6684653q512075q372102q133839p925911p822523p807400p772480p551221
10022c7212898o976169n949541m502728k805863j106716L71065J506273K292251
10014e4384326K793383L088527L234780L259220L170783K980149K713654K408749
$$ plain form
10006 -30735081 -28645016 -26902624 -25597693 -24899200 -25027045 -26186021 -28489915 -31901548
9998 -31901548 -36203815 -41011876 -45831428 -50149867 -53526885 -55655135 -56390172 -55766608
9990 -55766608 -54001172 -51459294 -48571145 -45723586 -43180974 -41069861 -39418939 -38215991
9982 -38215991 -37446294 -37100056 -37159402 -37585330 -38320461 -39310475 -40533553 -42017814 -43827113
9973 -43827113 -46012072 -48551485 -51326473 -54153968 -56865157 -59383323 -61758239 -64142112
9965 -64142112 -66721186 -69634771 -72917705 -76489280 -80183228 -83787805 -87064970 -89743965
9957 -89743965 -91512584 -92035248 -91008048 -88233939 -83686161 -77534581 -70131811 -61974070
9949 -61974070 -53651335 -45788357 -38972733 -33676840 -30192999 -28599515 -28762490 -30369798
$$ packed form
10006c0735081K090065J742392J304931O98493j27845j158976k303894l411633
9998c1901548m302267m808061m819552m318439l377018k128250p35037O23564
9990e5766608J765436K541878K888149K847559K542612K111113J650922J202948
9982c8215991P69697L46238n9346m25928p35131r90014j223078j484261j809299
9973d3827113k184959k539413k774988k827495k711189k518166k374916k383873
9965f4142112k579074k913585l282934l571575l693948l604577l277165k678995
9957h9743965j768619n22664J027200K774109M547778O151580P402770Q157741
9949f1974070Q322735P862978O815624N295893L483841J593484j62975j607308
$$ plain form
9941 -30369798 -32993804 -36176607 -39519695 -42749987 -45740898 -48487745 -51055993 -53527928
9933 -53527928 -55969882 -58431343 -60970242 -63681682 -66702671 -70179069 -74204741 -78761761
9925 -78761761 -83694478 -88735547 -93573272 -97923886 -101572756 -104377370 -106255226 -107181651
9917 -107181651 -107199795 -106427484 -105050100 -103301322 -101436082 -99695460 -98266052 -97246732
9909 -97246732 -96638079 -96357259 -96267343 -96211648 -96056052 -95742887 -95340514 -95055007 -95181187 -96004147
9899 -96004147 -97688138 -100190637 -103228149 -106306385 -108802033 -110050194 -109384933 -106121586
9891 -106121586 -99525226 -88831426 -73368455 -52794717 -27402432 1656819 32418570
9884 32418570 62510194 89762104 112711236 130765167 144044478 153098184 158668227
$$ packed form
9941c0369798k624006l182803l343088l230292k990911k746847k568248k471935
9933e3527928k441954k461461k538899k711440l020989l476398m025672m557020
9925g8761761m932717n041069m837725m350614l648870k804614j877856r26425
9917a07181651j8144P72311J377384J748778J865240J740622J429408J019320
9909i7246732O08653K80820Q9916N5695J55596L13165M02373K85507j26180q22960
9899i6004147j683991k502499l037512l078236k495648j248161O65261L263347
9891a06121586O596360J0693800J5462971K0573738K5392285K9059251L0761751
9884C2418570L0091624K7251910K2949132J8053931J3279311R053706N570043
$$ plain form
9877 158668227 161557131 162570732 162493641 162060636 161899109 162452643 163930993 166320448 169438484
9868 169438484 172988392 176592534 179819250 182223117 183396020 183011799 180855776 176848969
9860 176848969 171083499 163867362 155741425 147414851 139603389 132833056 127318596 122985037
9852 122985037 119600624 116919745 114750902 112938287 111307305 109635860 107684734 105279659
9844 105279659 102405799 99264710 96258698 93898984 92664896 92859721 94511958 97356685
9836 97356685 100900077 104533381 107646195 109706116 110305987 109199858 106341127 101915801
9828 101915801 96350435 90274493 84427249 79518981 76083641 74379620 74383573 75875739
9820 75875739 78565155 82190688 86566399 91582295 97186223 103359017 110082549 117305820
$$ packed form
9877A58668227K888904J013601p7091m33005j61527N53534J478350K389455L118036
9868A69438484L549908L604142L226716K403867J172903l84221k156023m006807
9860A76848969n765470p216137q125937q326574p811462o770333n514460m333559
9852A22985037l384413k680879k168843j812615j630982j671445j951126k405075
9844A05279659k873860l141089l006012k359714j234088J94825J652237K844727
9836I7356685L543392L633304L112814K059921N99871j106129k858731m425326
9828A01915801n565366o075942n847244m908268l435340j704021L953J492166
9820G5875739K689416L625533M375711N015896N603928O172794O723532P223271
$$ plain form
9812 117305820 124923226 132771317 140630799 148213827 155136700 160908617 164975003 166822026
9804 166822026 166099176 162695600 156737597 148530615 138495482 127126926 114966260 102568410
9796 102568410 90455626 79062087 68677591 59405335 51157063 43701252 36753151 30071502
9788 30071502 23527492 17132282 11028848 5457897 701050 -2997299 -5514484 -6905586
9780 -6905586 -7395076 -7299727 -6921262 -6463555 -6007117 -5537858 -5003909 -4367092 -3619522 -2755301
9770 -2755301 -1720158 -384230 1428770 3860285 6920142 10420303 13976202 17090607
9762 17090607 19299343 20322431 20155109 19062601 17489931 15932797 14823380 14467659
9754 14467659 15036119 16575802 19006552 22097664 25461754 28606475 31046201 32434255
$$ packed form
9812A17305820P617406P848091P859482P583028O922873N771917M066386J847023
9804A66822026p22850l403576n958003q206982j0035133j1368556j2160666j2397850
9796A02568410j2112784j1393539j0384496r272256q248272p455811o948101o681649
9788C0071502o544010o395210o103434n570951m756847l698349k517185j391102
9780f905586m89490R5349L78465M57707M56438M69259N33949O36817P47570Q64221
9770b755301J035143J335928J813000K431515L059857L500161L555899L114405
9762A7090607K208736J023088j67322j092508j572670j557134j109417l55721
9754A4467659N68460J539683K430750L091112L364090L144721K439726J388054
$$ plain form
9746 32434255 32664854 31907767 30558853 29116338 28029832 27592184 27919800 29005157 30782533
9737 30782533 33163436 36045984 39326854 42926847 46812480 50990745 55475101 60245981
9729 60245981 65236820 70358760 75545258 80779465 86081956 91471072 96928756 102395395
9721 102395395 107794741 113074752 118242984 123371711 128558151 133855072 139214200 144478142
9713 144478142 149418629 153788890 157362999 159959284 161456079 161800110 161001420 159117164
9705 159117164 156237978 152486968 148024942 143046305 137759849 132364817 127034033 121901357
9697 121901357 117042834 112455349 108055222 103711365 99294135 94701964 89852072 84664420
9689 84664420 79079081 73113129 66922945 60829827 55286261 50781079 47699414 46179545
$$ packed form
9746C2434255K30599p57087j348914j442515j086506m37648L27616J085357J777376
9737C0782533K380903K882548L280870L599993L885633M178265M484356M770880
9729F0245981M990839N121940N186498N234207N302491N389116N457684N466639
9721A02395395N399346N280011N168232N128727N186440N296921N359128N263942
9713A44478142M940487M370261L574109K596285J496795L44031p98690j884256
9705A59117164k879186l751010m462026m978637n286456n395032n330784n132676
9697A21901357m858523m587485m400127m343857m417230m592171m849892n187652
9689H4664420n585339n965952o190184o093118n543566m505182l081665j519869
$$ plain form
9681 46179545 46032213 46775022 47776398 48440733 48348539 47300648 45271777 42321764 38523830
9672 38523830 33943450 28652900 22735428 16253457 9209122 1551266 -6752637 -15620480
9664 -15620480 -24796552 -33859384 -42285742 -49546007 -55209435 -59035760 -61024907 -61408195
9656 -61408195 -60591206 -59075986 -57382446 -55969841 -55154309 -55034696 -55457601 -56050208 -56320521
9647 -56320521 -55787585 -54088295 -51027631 -46580149 -40876037 -34192247 -26934573 -19581529
9639 -19581529 -12586532 -6278281 -815808 3776109 7521110 10420557 12449712 13617983
9631 13617983 14038003 13940495 13614463 13307374 13143099 13096674 13030611 12774556 12221814 11412316
9621 11412316 10569490 10065934 10316045 11627050 14066257 17403365 21157252 24731164 27583341
$$ packed form
9681D6179545j47332P42809J001376O64335r2194j047891k028871k950013l797934
9672C8523830m580380n290550n917472o481971p044335p657856q303903q867843
9664a5620480r176072r062832q426358p260265n663428l826325j989147l83288
9656f1408195Q16989J515220J693540J412605Q15532J19613m22905n92607k70313
9647e6320521N32936J699290L060664M447482N704112O683790P257674P353044
9639a9581529O994997O308251N462473M591917L745001K899447K029155J168271
9631A3617983M20020r7508l26032l07089j64275m6425o6063k56055n52742q09498
9621A1412316q42826n03556K50111J311005K439207L337108L753887L573912K852177
$$ plain form
9612 27583341 29368666 30004423 29650722 28633725 27353316 26201060 25492965 25420143 26030492
9603 26030492 27247937 28912751 30819274 32748579 34511669 36005765 37260779 38449515
9595 38449515 39851247 41770594 44424224 47834500 51792595 55928270 59849775 63262728
9587 63262728 65998126 67953697 69009116 68976787 67614318 64686143 60039484 53660055
9579 53660055 45691243 36420417 26243415 15617249 5013543 -5113331 -14341701 -22299086
9571 -22299086 -28697919 -33382933 -36357174 -37759063 -37797393 -36682779 -34594945 -31695757
9563 -31695757 -28163325 -24211748 -20081801 -16017233 -12247331 -8974530 -6347974 -4419491
9555 -4419491 -3113967 -2255843 -1655424 -1205164 -919662 -889941 -1180561 -1733931 -2340779 -2694817
$$ packed form
9612B7583341J785325O35757l53701j016997j280409j152256p08095p2822O10349
9603B6030492J217445J664814J906523J929305J763090J494096J255014J188736
9595C8449515J401732J919347K653630L410276L958095M135675L921505L412953
9587F3262728K735398J955571J055419l2329j362469k928175m646659o379429
9579E3660055p968812r270826j0177002j0626166j0603706j0126874r228370p957385
9571b2299086o398833m685014k974241j401889l8330J114614K087834K899188
9563c1695757L532432L951577M129947M064568L769902L272801K626556J928483
9555d419491J305524Q58124O00419M50260K85502K9721k90620n53370o06848l54038
$$ plain form
9545 -2694817 -2495460 -1530181 310095 3063423 6710616 11129253 16021799 20895205 25136298
9536 25136298 28157776 29550813 29189201 27258289 24208448 20656889 17275004 14686839
9528 14686839 13379957 13626247 15431968 18546219 22528890 26841473 30922571 34245415
9520 34245415 36381591 37080889 36338682 34403427 31700868 28701316 25792323 23213537
9512 23213537 21070748 19402888 18253860 17704662 17845626 18706783 20195756 22087826 24069218
9503 24069218 25794105 26920479 27128429 26147231 23803032 20073369 15127135 9334123
9495 9334123 3232392 -2550491 -7405998 -10848211 -12581300 -12521070 -10778691 -7622504 -3437277
9486 -3437277 1304778 6067741 10296254 13494362 15315096 15617316 14471518 12136670
$$ packed form
9545b694817J99357R65279J840276K753328L647193M418637M892546M873406M241093
9536B5136298L021478J393037l61612j930912l049841l551559l381885k588165
9528A4686839j306882K46290J805721L114251L982671M312583M081098L322844
9520C4245415K136176O99298p42207j935255k702559k999552k908993k578786
9512B3213537k142789j667860j149028n49198J40964Q61157J488973J892070J981392
9503B4069218J724887J126374K07950r81198k344199l729663m946234n793012
9495I334123o101731n782883m855507l442213j733089O0230J742379L156187M185227
9486c437277M742055M762963M228513L198108J820734L02220j145798k334848
$$ plain form
9478 12136670 9038822 5754759 2975565 1423893 1723879 4257896 9068961 15857989
9470 15857989 24076629 33064489 42170885 50836749 58644194 65337361 70802873 75009520
9462 75009520 77938990 79553545 79824133 78802504 76690398 73853701 70756068 67835898
9454 67835898 65388567 63509094 62107327 60970864 59844960 58508641 56832920 54811925
9446 54811925 52564576 50303864 48266470 46612433 45344200 44307656 43284972 42111144
9438 42111144 40728927 39162313 37463462 35693913 33944678 32351324 31066925 30203007
9430 30203007 29786632 29774061 30112194 30791275 31833818 33219851 34810128 36340664 37512403
9421 37512403 38127730 38185795 37872376 37453030 37145134 37050663 37176120 37504077 38063832 38971056
$$ packed form
9478A2136670l097848l284063k779194j551672K99986K534017M811065O789028
9470A5857989Q218640Q987860R106396Q665864P807445O693167N465512M206647
9462G5009520K929470J614555K70588j021629k112106k836697l097633k920170
9454F7835898k447331j879473j401767j136463j125904j336319j675721k020995
9446E4811925k247349k260712k037394j654037j268233j036544j022684j173828
9438D2111144j382217j566614j698851j769549j749235j593354j284399q63918
9430C0203007m16375j2571L38133O79081J042543J386033J590277J530536J171739
9421C7512403O15327N8065l13419m19346l07896r4471J25457L27957N59755R07224
$$ plain form
9411 38971056 40428110 42681442 45938875 50269766 55528201 61333780 67120967 72244975
9403 72244975 76117206 78333358 78754832 77518098 74976095 71602334 67892893 64285985
9395 64285985 61104868 58530826 56615029 55322134 54574289 54264560 54241763 54299366 54194933
9386 54194933 53694833 52620023 50875839 48461470 45457868 41994840 38208581 34211706
9378 34211706 30094200 25953521 21927073 18190663 14908503 12164249 9927152 8080443
9370 8080443 6484134 5020874 3603893 2170187 691434 -791033 -2130895 -3075995
9362 -3075995 -3323966 -2620902 -850596 1941955 5600605 9928670 14716965 19718128 24614560
9353 24614560 29033124 32611968 35074809 36263330 36118206 34639588 31860758 27843956
$$ packed form
9411C8971056J457054K253332L257433M330891N258435N805579N787187N124008
9403G2244975L872231K216152M21474j236734k542003l373761l709441l606908
9395F4285985l181117k574042j915797j292895p47845l09729k2797N7603j04433
9386E4194933n00100j074810j744184k414369l003602l463028l786259l996875
9378C4211706m117506m140679m026448l736410l282160k744254k237097j846709
9370H080443j596309j463260j416981j433706j478753j482467j339862r45100
9362c075995k47971P03064J770306K792551L658650M328065M788295N001163M896432
9353B4614560M418564L578844K462841J188521j45124j478618k778830m016802
$$ plain form
9345 27843956 22694816 16599586 9881847 3035755 -3330600 -8659688 -12640771 -15315107
9337 -15315107 -17018896 -18196118 -19186100 -20094637 -20805286 -21109495 -20869505 -20117824 -19050390
9328 -19050390 -17942728 -17052736 -16558232 -16543444 -17024157 -17990039 -19440423 -21396002 -23879009
9319 -23879009 -26863204 -30207106 -33603597 -36590130 -38641694 -39318179 -38399739 -35951674
9311 -35951674 -32303794 -27969172 -23538607 -19575436 -16520963 -14617530 -13863338 -14018836
9303 -14018836 -14676978 -15387516 -15798810 -15763804 -15363017 -14832983 -14440188 -14372261 -14699104 -15400104
9293 -15400104 -16411826 -17658067 -19058295 -20526163 -21960847 -23232618 -24182794 -24664136
9285 -24664136 -24613972 -24108793 -23350823 -22590174 -22035192 -21801282 -21909692 -22319538 -22974940 -23853231
$$ packed form
9345B7843956n149140o095230o717739o846092o366355n329088l981083k674336
9337a5315107j703789j177222r89982r08537p10649l04209K39990P51681J067434
9328a9050390J107662Q89992M94504J4788m80713r65882j450384j955579k483007
9319b3879009k984195l343902l396491k986533k051564o76485R18440K448065
9311c5951674L647880M334622M430565L963171L054473J903433P54192j55498
9303a4018836o58142p10538m11294L5006M00787N30034L92795O7927l26843p01000
9293a5400104j011722j246241j400228j467868j434684j271771r50176m81342
9285b4664136N0164N05179P57970P60649N54982K33910j08410m09846o55402q78291
$$ plain form
9275 -23853231 -24995350 -26499391 -28474957 -30977022 -33944840 -37166698 -40286960 -42865659
9267 -42865659 -44482327 -44851428 -43908414 -41839383 -39047272 -36060270 -33400550 -31449750
9259 -31449750 -30357918 -30027746 -30173138 -30424779 -30446093 -30022571 -29092697 -27709709 -25960327
9250 -25960327 -23894439 -21511602 -18808845 -15851427 -12814509 -9965670 -7597555 -5947487
9242 -5947487 -5137119 -5139052 -5760468 -6645498 -7318853 -7286942 -6173402 -3830032 -369421 3888651
9232 3888651 8515013 13054175 17061327 20112328 21835918 21995209 20585621 17876202
9224 17876202 14345958 10538501 6912306 3754896 1174091 -867613 -2512809 -3971830
9216 -3971830 -5476185 -7220370 -9313125 -11762422 -14493492 -17374916 -20232559 -22857206
$$ packed form
9275b3853231j142119j504041j975566k502065k967818l221858l120262k578699
9267d2865659j616668l69101R43014K069031K792111K987002K659720J950800
9259c1449750J091832L30172j45392k51641k1314M23522R29874J382988J749382
9250b5960327K065888K382837K702757K957418L036918K848839K368115J650068
9242e947487Q10368j933o21416q85030o73355L1911J113540K343370L460611M258072
9232C888651M626362M539162M007152L051001J723590J59291j409588k709419
9224A7876202l530244l807457l626195l157410k580805k041704j645196j459021
9216c971830j504355j744185k092755k449297k731070k881424k857643k624647
$$ plain form
9208 -22857206 -25027594 -26561195 -27382371 -27578341 -27405999 -27224654 -27366044 -27996401 -29039141
9199 -29039141 -30192414 -31019252 -31056352 -29900119 -27263530 -23019471 -17239763 -10216893 -2441986
9190 -2441986 5475912 12933422 19455089 24766363 28795296 31621046 33411667 34382793
9182 34382793 34774649 34825437 34735436 34642974 34630141 34744031 35002029 35371713 35748487 35957945
9172 35957945 35789160 35051188 33644272 31628653 29255480 26925668 25080861 24076651
9164 24076651 24098040 25143611 27063059 29615460 32522805 35504353 38284430 40580388
9156 40580388 42100625 42590741 41932369 40240417 37877820 35350872 33131492 31501565
9148 31501565 30490741 29913675 29464814 28825030 27756898 26183068 24239832 22283926 20826876
$$ packed form
9208b2857206k170388j533601q21176j95970J72342J81345j41390o30357j042740
9199b9039141j153273q26838l7100J156233K636589M244059N779708P022870P774907
9190b441986P917898P457510O521667N311274M028933K825750J790621R71126
9182C4382793L91856N0788r0001r2462j2833J13890K57998L69684L76774K09458
9172C5957945j68785p37972j406916k015619k373173k329812j844807j004210
9164B4076651K1389J045571J919448K552401K907345K981548K780077K295958
9156D0580388J520237M90116o58372j691952k362597k526948k219380j629927
9148C1501565j010824n77066m48861o39784j068132j573830j943236j955906j457050
$$ plain form
9139 20826876 20395391 21362298 23825580 27597378 32302215 37522118 42916048 48282180
9131 48282180 53574448 58888821 64414814 70347705 76786427 83664737 90747687 97686820
9123 97686820 104102496 109663869 114151619 117499962 119817454 121380668 122587767 123865418
9115 123865418 125548643 127779602 130470655 133345802 136035714 138179617 139492515 139784637
9107 139784637 138950856 136954215 133807145 129540629 124171522 117704393 110189113 101804370
9099 101804370 92907759 84015762 75718920 68558315 62893577 58800152 56034733 54083692
9091 54083692 52274537 49916465 46444549 41547268 35249720 27923337 20210709 12883951
9083 12883951 6680976 2173247 -299171 -628497 1089880 4586063 9440246 15115329
$$ packed form
9139B0826876m31485R66907K463282L771798M704837N219903N393930N366132
9131D8282180N292268N314373N525993N932891O438722O878310P082950O939133
9123I7686820O415676N561373M487750L348343K317492J563214J207099J277651
9115A23865418J683225K230959K691053K875147K689912K143903J312898K92122
9107A39784637q33781j996641l147070m266516n369107o467129p515280q384743
9099A01804370q896611q891997q296842p160605n664738m093425k765419j951041
9091E4083692j809155k358072l471916m897281o297548p326383p712628p326758
9083A2883951o202975m507729k472418l29326J718377L496183M854183N675083
$$ plain form
9075 15115329 21004050 26490517 31028169 34230442 35947952 36290239 35568239 34178586
9067 34178586 32486793 30764656 29199275 27943404 27152472 26969044 27456686 28522038 29876566
9058 29876566 31075496 31634137 31172581 29510659 26660581 22734759 17841981 12037672
9050 12037672 5339129 -2229841 -10605933 -19681724 -29317757 -39344608 -49536560 -59568828
9042 -59568828 -68998545 -77304651 -83982140 -88647590 -91108027 -91371901 -89614124 -86128040
9034 -86128040 -81296504 -75588229 -69547016 -63727345 -58565438 -54235107 -50564836 -47063124
9026 -47063124 -43047002 -37834830 -30949598 -22266723 -12043752 -814926 10793911 22234466
9018 22234466 33122141 43239355 52501204 60924335 68606097 75694125 82328873 88570128
$$ packed form
9075A5115329N888721N486467M537652L202273J717510L42287p22000j389653
9067C4178586j691793j722137j565381j255871p90932j83428M87642J065352J354528
9058B9876566J198930N58641m61556j661922k850078l925822m892778n804309
9050A2037672o698543p568970q376092r075791r636033j0026851j0191952j0032268
9042e9568828r429717q306106o677489m665450k460437k63874J757777L486084
9034h6128040M831536N708275O041213N819671N161907M330331L670271L501712
9026d7063124M016122N212172O885232Q682875J0222971J1228826J1608837J1440555
9018B2234466J0887675J0117214R261849Q423131P681762P088028O634748O241255
$$ plain form
9010 88570128 94345485 99453442 103616125 106542705 107966853 107653402 105399360 101062216
9002 101062216 94633075 86338450 76716093 66596316 56953165 48656203 42212179 37604333
8994 37604333 34306718 31479558 28267034 24071348 18702808 12381622 5628507 -905991
8986 -905991 -6633948 -11203397 -14602738 -17157309 -19416897 -21978154 -25313575 -29670950
8978 -29670950 -35063173 -41316003 -48123942 -55092302 -61777348 -67735138 -72564594 -75924918
8970 -75924918 -77534495 -77183423 -74781827 -70429129 -64460944 -57434189 -50042643 -42990568
8962 -42990568 -36867707 -32059445 -28705841 -26710614 -25797828 -25607106 -25801227 -26145107 -26522700
8953 -26522700 -26892427 -27219450 -27433799 -27439670 -27166221 -26628380 -25959467 -25381165 -25101933 -25186868
$$ packed form
9010H8570128N775357N107957M162683K926580J424148l13451k254042m337144
9002A01062216o429141q294625r622357j0119777r643151q296962o444024m607846
8994C7604333l297615k827160l212524m195686n368540o321186o753115o534498
8986i05991n727957m569449l399341k554571k259588k561257l335421m357375
8978b9670950n392223o252830o807939o968360o685046n957790m829456l360324
8970g5924918j609577L51072K401596M352698N968185P026755P391546P052075
8962d2990568O122861M808262L353604J995227R12786J90722j94121l43880l77593
8953b6522700l69727l27023k14349n871K73449N37841O68913N78302K79232q4935
$$ plain form
8943 -25186868 -25481781 -25648856 -25289338 -24070145 -21792891 -18407572 -14001010 -8766619 -2942652
8934 -2942652 3270387 9765067 16508033 23449650 30423273 37111150 43110823 48065152
8926 48065152 51776377 54241329 55600598 56042642 55718441 54707503 53046055 50795608
8918 50795608 48110459 45265785 42627034 40563211 39329975 38971323 39292086 39921066 40435200
8909 40435200 40487895 39893519 38646719 36883810 34819735 32703728 30810683 29440394 28881539
8900 28881539 29331373 30808204 33106556 35822589 38445327 40481560 41565982 41517635 40340484
8891 40340484 38198383 35390320 32322012 29454652 27226872 25968932 25834693 26767964
8883 26767964 28509558 30646630 32701871 34248410 35016868 34951176 34189462 32986953 31623008
$$ packed form
8943b5186868k94913j67075L59518J219193K277254L385319M406562N234391N823967
8934b942652O213039O494680O742966O941617O973623O687877N999673M954329
8926D8065152L711225K464952J359269M42044l24201j010938j661448k250447
8918E0795608k685149k844674k638751k063823j233236l58652L20763O28980N14134
8909D0435200N2695n94376j246800j762909k064075k116007j893045j370289n58855
8900B8881539M49834J476831K298352K716033K622738K036233J084422m8347j177151
8891D0340484k142101k808063l068308k867360k227780j257940j34239R33271
8883B6767964J741594K137072K055241J546539P68458o5692p61714j202509j363945
$$ plain form
8874 31623008 30323559 29207306 28260050 27349161 26281048 24879679 23052882 20824938
8866 20824938 18328573 15756624 13287089 11017149 8945053 7007840 5143838 3339578
8858 3339578 1642413 145149 -1040596 -1806604 -2058156 -1718094 -740114 861823 2980939
8849 2980939 5402964 7818590 9859098 11151903 11394415 10427722 8269263 5072760 1033618
8840 1033618 -3695250 -9020253 -14858797 -21078786 -27472874 -33768612 -39646964 -44758167
8832 -44758167 -48754836 -51361551 -52464701 -52176658 -50835094 -48928355 -46961935 -45296918
8824 -45296918 -44014240 -42876308 -41429616 -39212485 -35961221 -31712002 -26766839 -21561844
8816 -21561844 -16500683 -11810925 -7472986 -3255660 1144729 5912157 10949240 15830341
$$ packed form
8874C1623008j299449j116253r47256r10889j068113j401369j826797k227944
8866B0824938k496365k571949k469535k269940k072096j937213j864002j804260
8858C339578j697165j497264j185745p66008k51552L40062R77980J601937K119116
8849B980939K422025K415626K040508J292805K42512r66693k158459l196503m039142
8840A033618m728868n325003n838544o219989o394088o295738n878352n111203
8832d4758167l996669k606715j103150K88043J341564J906739J966420J665017
8824d5296918J282678J137932J446692K217131L251264M249219M945163N204995
8816b1561844N061161M689758M337939M217326M400389M767428N037083M881101
$$ plain form
8808 15830341 19912555 22568213 23425452 22493562 20126604 16877473 13333308 9992625
8800 9992625 7200155 5136010 3850176 3322384 3516359 4399157 5912743 7913909 10129917
8791 10129917 12183136 13696576 14429748 14368640 13726886 12869161 12196804 12035087 12549448
8782 12549448 13703608 15260499 16825653 17935477 18177579 17299028 15251551 12163213
8774 12163213 8276997 3904626 -590504 -4800440 -8295827 -10681326 -11680734 -11221249
8766 -11221249 -9468913 -6789245 -3656276 -558028 2076694 3938237 4888656 4987387 4466272
8757 4466272 3659221 2919654 2556336 2795944 3768429 5515964 8026881 11277814 15248645
8748 15248645 19888491 25055785 30487034 35829552 40723019 44885372 48169509 50579221
$$ packed form
8808A5830341M082214K655658Q57239r31890k366958l249131l544165l340683
8800I992625k792470k064145j285834n27792J93975Q82798J513586K001166K216008
8791A0129917K053219J513440P33172o1108o41754q57725o72357j61717N14361
8782A2549448J154160J556891J565154J109824K42102q78551k047477l088338
8774A2163213l886216m372371m495130m209936l495387k385499r99408M59485
8766a1221249J752336K679668L132969L098248K634722J861543R50419R8731n21115
8757D466272q07051p39567l63318K39608R72485J747535K510917L250933L970831
8748A5248645M639846N167294N431249N342518M893467M162353L284137K409712
$$ plain form
8740 50579221 52241129 53336869 54021877 54374580 54403517 54097689 53475916 52597034 51522988
8731 51522988 50258009 48703438 46662167 43900789 40246645 35678163 30365952 24638845
8723 24638845 18885851 13449430 8578504 4462199 1291223 -732232 -1463380 -913918
8715 -913918 694588 2964080 5425394 7663605 9406232 10543501 11093344 11151263 10854093
8706 10854093 10356623 9809972 9344254 9063517 9046225 9336271 9924940 10739884 11648788 12468935
8696 12468935 12977569 12933889 12121791 10401212 7742347 4224817 589 -4764308 -9937301
8687 -9937301 -15418056 -21076553 -26666767 -31778995 -35873015 -38389251 -38900413 -37246322
8679 -37246322 -33586298 -28326855 -21949792 -14834439 -7170632 1011830 9748676 19052231
$$ packed form
8740E0579221J661908J095740O85008L52703K8937l05828o21773q78882j074046
8731E1522988j264979j554571k041271k761378l654144m568482n312211n727107
8723B4638845n752994n436421m870926m116305l170976k023455p31148N49462
8715i13918J608506K269492K461314K238211J742627J137269N49843N7919k97170
8706A0854093m97470n46651m65718k80737j7292K90046N88669Q14944R08904Q20147
8696A2468935N08634m3680q12098j720579k658865l517530m224228m764897n172993
8687i937301n480755n658497n590214n112228m094020k516236n11162J654091
8679c7246322L660024N259443O377063P115353P663807Q182462Q736846R303555
$$ plain form
8671 19052231 28863810 39041435 49360990 59518859 69144641 77843397 85271882 91221929
8663 91221929 95669734 98770276 100808207 102127907 103059134 103854022 104656877 105518585 106441506
8654 106441506 107423629 108475718 109599362 110729286 111668869 112073796 111527300 109688007 106427816
8645 106427816 101876281 96350381 90214976 83743870 77039407 70042025 62625070 54726796
8637 54726796 46444737 38035609 29823200 22076718 14937459 8429969 2529680 -2774211
8629 -2774211 -7460777 -11499005 -14879855 -17637302 -19850861 -21627550 -23069592 -24249618
8621 -24249618 -25216709 -26032140 -26806646 -27709956 -28942725 -30677850 -32989546 -35803155 -38902903
8612 -38902903 -42004921 -44853146 -47276743 -49183646 -50518409 -51230677 -51275763 -50636379 -49343520
$$ packed form
8671A9052231R811579J0177625J0319555J0157869R625782Q698756P428485N950047
8663I1221929M447805L100542K037931J319700R31227P94888Q02855Q61708R22921
8654A06441506R82123J052089J123644J129924R39583M04927n46496j839293l260191
8645A06427816m551535n525900o135405o471106o704463o997382p416955p898274
8637E4726796q282059q409128q212409p746482p139259o507490n900289n303891
8629b774211m686566m038228l380850k757447k213559j776689j442042j180026
8621b4249618r67091q15431p74506r03310j232769j735125k311696k813609l099748
8612c8902903l102018k848225k423597j906903j334763p12268m5086O39384J292859
$$ plain form
8603 -49343520 -47482933 -45184660 -42597146 -39846629 -36985922 -33950142 -30550182 -26526694
8595 -26526694 -21652837 -15840264 -9202494 -2060981 5093371 11669146 17069261 20802415
8587 20802415 22584660 22398448 20491225 17317397 13441059 9422609 5715623 2598972
8579 2598972 158809 -1680967 -3095801 -4290736 -5450785 -6725345 -8236591 -10085458
8571 -10085458 -12337288 -14993685 -17971515 -21102805 -24154508 -26860721 -28960928 -30237688
8563 -30237688 -30546768 -29836471 -28156436 -25653220 -22546021 -19083301 -15497723 -11983951
8555 -11983951 -8708843 -5839266 -3563655 -2094966 -1654121 -2428099 -4493284 -7722122
8547 -7722122 -11737298 -15982919 -19911474 -23190079 -25802982 -27998161 -30126623 -32471141
$$ packed form
8603d9343520J860587K298273K587514K750517K860707L035780L399960M023488
8595b6526694M873857N812573O637770P141513P154352O575775N400115L733154
8587B0802415J782245j86212j907223l173828l876338m018450l706986l116651
8579B598972k440163j839776j414834j194935j160049j274560j511246j848867
8571a0085458k251830k656397k977830l131290l051703k706213k100207j276760
8563c0237688l09080P10297J680035K503216L107199L462720L585578L513772
8555a1983951L275108K869577K275611J468689M40845p73978k065185l228838
8547g722122m015176m245621l928555l278605k612903k195179k128462k344518
$$ plain form
8539 -32471141 -35140196 -38051787 -40986918 -43669489 -45834752 -47275152 -47872866 -47622508
8531 -47622508 -46631299 -45086623 -43200535 -41151404 -39037207 -36849917 -34482211 -31771597
8523 -31771597 -28568800 -24803740 -20525400 -15903680 -11194747 -6688223 -2665557 614853
8515 614853 2923805 4091500 4067020 2970580 1093747 -1163189 -3386313 -5230223 -6456745
8506 -6456745 -6927889 -6574504 -5369142 -3319350 -476400 3059422 7153378 11672588 16530036
8497 16530036 21712792 27271118 33257039 39627440 46160885 52451332 58006385 62404962
8489 62404962 65421859 67053947 67458223 66861069 65486724 63516563 61073833 58231391
8481 58231391 55040746 51573504 47957809 44384748 41060972 38110801 35476720 32888544
$$ packed form
8539c2471141k669055k911591k935131k682571k165263j440400n97714K50358
8531d7622508R91209J544676J886088K049131K114197K187290K367706K710614
8523c1771597L202797L765060M278340M621720M708933M506524M022666L280410
8515F14853K308952J167695k4480j096440j876833k256936k223124j843910j226522
8506f456745m71144L53385J205362K049792K842950L535822M093956M519210M857448
8497A6530036N182756N558326N985921O370401O533445O290447N555053M398577
8489F2404962L016897J632088M04276n97154j374345j970161k442730k842442
8481E8231391l190645l467242l615695l573061l323776k950171k634081k588176
$$ plain form
8473 32888544 29938294 26235596 21576741 16056249 10070626 4206124 -939427 -4913725
8465 -4913725 -7484717 -8640063 -8557626 -7568272 -6089507 -4511846 -3069720 -1768524 -422598
8456 -422598 1207195 3254242 5658770 8195754 10583474 12592723 14093496 15031133 15371933
8447 15371933 15072211 14103398 12522508 10537239 8507716 6862203 5957798 5951040 6738014
8438 6738014 7987316 9245170 10064100 10108134 9210425 7380288 4763913 1569433 -2013700
8429 -2013700 -5854037 -9845711 -13826825 -17518488 -20548127 -22558731 -23337547 -22881306 -21364248
8420 -21364248 -19046795 -16193918 -13039716 -9778402 -6543887 -3375733 -208893 3084907
8412 3084907 6624148 10458884 14548034 18758786 22876657 26642412 29833154 32365605
$$ packed form
8473C2888544k950250l702698m658855n520492n985623n864502n145551l974298
8465d913725k570992j155346Q2437R89354J478765J577661J442126J301196J345926
8456d22598J629793K047047K404528K536984K387720K009249J500773R37637L40800
8447A5371933k99722r68813j580890j985269k029523j645513r04405o758P86974
8438F738014J249302J257854Q18930M4034q97709j830137k616375l194480l583133
8429b013700l840337l991674l981114l691663l029639k010604p78816M56241J517058
8420b1364248K317453K852877L154202L261314L234515L168154L166840L293800
8412C084907L539241L834736M089150M210752M117871L765755L190742K532451
$$ plain form
8404 32365605 34365396 36157680 38180319 40861310 44515088 49296642 55215094 62171366
8396 62171366 69980215 78370496 86988460 95420750 103225831 109959896 115205784 118617391
8388 118617391 119964240 119143668 116156053 111081420 104096457 95521202 85837416 75629341
8380 75629341 65458762 55743383 46705539 38398870 30762023 23646225 16811503 9929770
8372 9929770 2633026 -5387344 -14257273 -23818306 -33595137 -42862019 -50801333 -56709111
8364 -56709111 -60180756 -61212473 -60180181 -57705161 -54465993 -51035546 -47793956 -44919783
8356 -44919783 -42432198 -40255813 -38284515 -36419887 -34568465 -32611269 -30388508 -27738925
8348 -27738925 -24590361 -21048185 -17413687 -14101055 -11484337 -9750123 -8827421 -8419984
$$ packed form
8404C2365605J999791J792284K022639K680991L653778M781554N918452O956272
8396F2171366P808849Q390281Q617964Q432290P805081O734065N245888L411607
8388A18617391J346849q20572k987615n074633o984963q575255r683786j0208075
8380G5629341j0170579r715379r037844q306669p636847p115798o834722o881733
8372I929770p296744q020370q869929r561033r776831r266882p939314n907778
8364e6709111l471645j031717J032292K475020L239168L430447L241590K874173
8356d4919783K487585K176385J971298J864628J851422J957196K222761K649583
8348b7738925L148564L542176L634498L312632K616718J734214R22702M07437
$$ plain form
8340 -8419984 -8114061 -7510766 -6341576 -4542532 -2267035 179416 2469989 4393021 5918075
8331 5918075 7159752 8276853 9374564 10452851 11406887 12069561 12283158 11978321 11230649
8322 11230649 10272577 9455302 9170754 9757941 11429830 14250305 18160226 23023524 28665487
8313 28665487 34895520 41516742 48322119 55080156 61523756 67354995 72263265 75945751
8305 75945751 78128675 78599342 77255694 74164147 69601361 64051036 58139847 52526127
8297 52526127 47781901 44310147 42315194 41819112 42705287 44766317 47734848 51293409
8289 51293409 55087248 58771087 62089018 64946126 67425471 69739505 72144273 74856592
8281 74856592 78000541 81587654 85519806 89601925 93562256 97086431 99863487 101625218
$$ packed form
8340h419984L05923O03295J169190J799044K275497K446451K290573J923032J525054
8331E918075J241677J117101J097711J078287R54036O62674K13597l04837p47672
8322A1230649r58072q17275k84548N87187J671889K820475L909921M863298N641963
8313B8665487O230033O621222O805377O758037O443600N831239M908270L682486
8305G5945751K182924M70667j343648l091547m562786n550325n911189n613720
8297E2526127m744226l471754j994953m96082Q86175K061030K968531L558561
8289E1293409L793839L683839L317931K857108K479345K314034K404768K712319
8281G4856592L143949L587113L932152M082119L960331L524175K777056J761731
$$ plain form
8273 101625218 102160172 101308928 98971843 95151616 90011886 83897461 77270159 70568507
8265 70568507 64060220 57772994 51543963 45155066 38477502 31559862 24637447 18074850
8257 18074850 12267701 7536956 4055979 1841569 806128 830868 1813397 3673270 6334604
8248 6334604 9710093 13687162 18100264 22691014 27091892 30873618 33652535 35200164
8240 35200164 35487082 34637637 32828477 30188413 26744533 22431631 17155108 10877094
8232 10877094 3687258 -4171174 -12328541 -20355700 -27842709 -34457556 -39965869 -44217210
8224 -44217210 -47122444 -48646383 -48826853 -47816794 -45928025 -43635280 -41502191 -40037427
8216 -40037427 -39549063 -40077251 -41432822 -43304144 -45370081 -47371985 -49122202 -50454208
$$ packed form
8273A01625218N34954q51244k337085l820227n139730o114425o627302o701652
8265G0568507o508287o287226o229031o388897o677564o917640o922415o562597
8257A8074850n807149m730745l480977k214410j035441K4740R82529J859873K661334
8248F334604L375489L977069M413102M590750M400878L781726K778917J547629
8240C5200164K86918q49445j809160k640064l443880m312902n276523o278014
8232A0877094p189836p858432q157367q027159p487009o614847n508313m251341
8224d4217210k905234j523939j80470J010059J888769K292745K133089J464764
8216d0037427M88364n28188j355571j871322k065937k001904j750217j332006
$$ plain form
8208 -50454208 -51154897 -50939670 -49503581 -46621123 -42231480 -36467548 -29634503 -22166956
8200 -22166956 -14582377 -7429907 -1229651 3594450 6776003 8244678 8125988 6697210
8192 6697210 4312616 1326250 -1959078 -5302375 -8499529 -11341551 -13580630 -14926851
8184 -14926851 -15086128 -13827785 -11050326 -6813070 -1322480 5110783 12115100 19281739
8176 19281739 26174964 32358138 37465961 41317955 44017175 45956540 47694801 49746500
8168 49746500 52394828 55629639 59233624 62944110 66578508 70055723 73330970 76315248
8160 76315248 78841946 80699438 81711227 81826202 81175886 80067640 78915178 78140536 78088311
8151 78088311 78974341 80871293 83726007 87399432 91712524 96478314 101509389 106606665
$$ packed form
8208e0454208p00689K15227J436089K882458M389643N763932O833045P467547
8200b2166956P584579P152470O200256M824101L181553J468675j18690j428778
8192F697210k384594k986366l285328l343297l197154k842022k239079j346221
8184a4926851j59277J258343K777459M237256N490590O433263P004317P166639
8176A9281739O893225O183174N107823L851994K699220J939365J738261K051699
8168D9746500K648328L234811L603985L710486L634398L477215L275247K984278
8160G6315248K526698J857492J011789J14975o50316j108246j152462p74642n2225
8151G8088311Q86030J896952K854714L673425M313092M765790N031075N097276
$$ plain form
8143 106606665 111548365 116098889 120042665 123226410 125582478 127117354 127872569 127881988 127152436
8134 127152436 125685204 123529624 120823324 117762033 114487368 110959405 106916885 101975895
8126 101975895 95816425 88341773 79719827 70304647 60519209 50790952 41565958 33347533
8118 33347533 26685266 22092078 19928302 20306880 23049703 27704507 33625171 40101923
8110 40101923 46497095 52329273 57278432 61134998 63743059 64975287 64745461 63040295
8102 63040295 59943901 55631771 50326009 44229219 37477905 30154072 22357430 14294229
8094 14294229 6321076 -1090476 -7451820 -12364662 -15586150 -17033392 -16748593 -14863127
8086 -14863127 -11581837 -7175953 -1958231 3766792 9752491 15825941 21860359 27726730
$$ packed form
8143A06606665M941700M550524L943776L183745K356068J534876P55215R419p29552
8134A27152436j467232k155580k706300l061291l274665l527963m042520m940990
8126A01975895o159470p474652q621946r415180r785438r728257r224994q218425
8118C3347533o662267m593188k163776L78578K742823M654804N920664O476752
8110D0101923O395172N832178M949159L856566K608061J232228k29826j705166
8102F3040295l096394m312130n305762o096790o751314p323833p796642q063201
8094A4294229p973153p411552o361344m912842l221488j447242K84799J885466
8086a4863127L281290M405884N217722N725023N985699O073450O034418N866371
$$ plain form
8078 27726730 33256509 38233365 42417782 45605201 47709841 48839466 49305681 49540876
8070 49540876 49960919 50857430 52372244 54530307 57267510 60422313 63717228 66775634
8062 66775634 69192423 70639212 70963466 70239423 68745265 66873000 65009527 63438136
$$ packed form
8078B7726730N529779M976856M184417L187419K104640J129625M66215K35195
8070D9540876M20043Q96511J514814K158063K737203L154803L294915L058406
8062F6775634K416789J446789L24254p24043j494158j872265j863473j571391
$$ [...]
##END NTUPLES=NMR SPECTRUM
##END=
