##TITLE=31Pdec_DE-41W1
 D2O
 64 sc
 1.4.2024
##JCAMPDX= 6.0         $$ Bruker NMR JCAMP-DX V2.0
##DATA TYPE= NMR SPECTRUM
##DATA CLASS= NTUPLES
##ORIGIN= UXNMR, Bruker Analytische Messtechnik GmbH
##OWNER= root
$$ XWIN-NMR		Version 3.5
$$ Mon Apr  1 14:21:54 2024 Russian Standard Time (UT+4h)  she@DPX200
##.OBSERVE FREQUENCY= 81.013821
##.OBSERVE NUCLEUS= ^31P
##.ACQUISITION MODE= SIMULTANEOUS
##.ACQUISITION SCHEME= undefined
##.AVERAGES= 64
##.DIGITISER RES= 16
##SPECTROMETER/DATA SYSTEM= spect
##.PULSE SEQUENCE= zgpg30
##.SOLVENT NAME= D2O
##.SHIFT REFERENCE= (INTERNAL, D2O, 0, 248.564)
##AUDIT TRAIL= $$ (NUMBER, WHEN, WHO, WHERE, WHAT)
$$ ##TITLE= Audit trail, XWIN-NMR		Version 3.5
$$ ##JCAMPDX= 5.01
$$ ##ORIGIN= Bruker BioSpin GmbH
$$ ##OWNER= she
$$ F:/spectra/data/she/nmr/P31/1/pdata/1/auditp.txt
$$ ##AUDIT TRAIL=  $$ (NUMBER, WHEN, WHO, WHERE, WHAT)
(   1,<2024-04-01 14:20:22.51 +0400>,<she>,<DPX200>,
      <continue with go, POWCHK disabled, PULCHK disabled
       configuration hash MD5:
       00 E9 B6 7A A2 85 ED C7 34 08 36 98 17 FE 4E 26
       data hash MD5: 32K
       8E 36 CD 60 F2 8E 02 27 23 1C 6F 59 35 AC 11 59>)
(   2,<2024-04-01 14:20:29.00 +0400>,<she>,<DPX200>,
      <Start of raw data processing
       efp BC_mod = 2 LB = 10 FT_mod = 6 PKNL = 1 PHC0 = -12909.04 PHC1 = 45.28329 SI = 64K 
       data hash MD5: 64K
       D3 95 2C 83 4F FF 27 47 0E 51 36 44 EE 5D ED 04>)
(   3,<2024-04-01 14:21:27.04 +0400>,<she>,<DPX200>,
      <pk PHC0 = 49.01103 PHC1 = 22.8 
       data hash MD5: 64K
       9B 67 9E 74 00 C2 A8 20 80 7A D2 BC 16 9A 7F 88>)
$$ ##END=
$$ 
$$ hash MD5
$$ 92 05 83 97 5A 95 03 20 DE A5 95 63 0D 48 EC F1
##$RELAX= 
##$RELAX= 
##$RELAX= 
##$RELAX= 
##$RELAX= 
##$RELAX= 
##$RELAX= 
##$RELAX= 
##$RELAX= 
$$ Bruker specific parameters
$$ --------------------------
##$DU= <F:/spectra>
##$EXPNO= 1
##$NAME= <P31>
##$PROCNO= 1
##$TYPE= <nmr>
##$USER= <she>
##$AMP= (0..31)
100 100 100 100 100 100 100 100 100 100 100 100 100 100 100 100 100 100 
100 100 100 100 100 100 100 100 100 100 100 100 100 100 
##$AQSEQ= 0
##$AQ_mod= 1
##$AUNM= <au_zg>
##$AUTOPOS= <>
##$BF1= 81.014009
##$BF2= 200.13
##$BF3= 200.13
##$BF4= 200.13
##$BF5= 200.13
##$BF6= 200.13
##$BF7= 200.13
##$BF8= 200.13
##$BYTORDA= 1
##$CFDGTYP= 0
##$CFRGTYP= 5
##$CHEMSTR= <none>
##$CNST= (0..31)
1 1 145 1 1 1 1 1 1 1 1 1 1 1 1 1 1 1 1 1 1 1 1 1 1 1 1 1 1 1 1 1 
##$CPDPRG= <waltz16>
##$CPDPRG1= <>
##$CPDPRG2= <waltz16>
##$CPDPRG3= <>
##$CPDPRG4= <mlev>
##$CPDPRG5= <mlev>
##$CPDPRG6= <mlev>
##$CPDPRG7= <mlev>
##$CPDPRG8= <mlev>
##$CPDPRGB= <>
##$CPDPRGT= <>
##$D= (0..31)
0 1 0 0 0 0 0 0 0 0 0 0.03 2e-05 3e-06 0 0 0 0 0 0 0 0 0 0 0 0 0 0 0 0 
0 0 
##$DATE= 1711966722
##$DBL= (0..7)
120 120 120 11 120 120 24 19 
##$DBP= (0..7)
150 150 150 150 150 150 150 150 
##$DBP07= 0
##$DBPNAM0= <>
##$DBPNAM1= <>
##$DBPNAM2= <>
##$DBPNAM3= <>
##$DBPNAM4= <>
##$DBPNAM5= <>
##$DBPNAM6= <>
##$DBPNAM7= <>
##$DBPOAL= (0..7)
0.5 0.5 0.5 0.5 0.5 0.5 0.5 0.5 
##$DBPOFFS= (0..7)
$$ [...]
##$SUBNAM2= <"">
##$SUBNAM3= <"">
##$SUBNAM4= <"">
##$SUBNAM5= <"">
##$SUBNAM6= <"">
##$SUBNAM7= <"">
##$SUBNAM8= <"">
##$SUBNAM9= <"">
##$SW= 501.771253377433
##$SWIBOX= (0..15)
0 1 3 0 0 0 0 0 0 0 0 0 0 0 0 0 
##$SW_h= 40650.406504065
##$TD= 32768
##$TD0= 1
##$TE= 0
##$TE2= 300
##$TE3= 300
##$TEG= 300
##$TL= (0..7)
0 120 53 12 22 120 120 120 
##$TP= (0..7)
150 150 150 150 150 150 150 150 
##$TP07= 0
##$TPNAME0= <>
##$TPNAME1= <>
##$TPNAME2= <>
##$TPNAME3= <>
##$TPNAME4= <>
##$TPNAME5= <>
##$TPNAME6= <>
##$TPNAME7= <>
##$TPOAL= (0..7)
0.5 0.5 0.5 0.5 0.5 0.5 0.5 0.5 
##$TPOFFS= (0..7)
0 0 0 0 0 0 0 0 
##$TUNHIN= 0
##$TUNHOUT= 0
##$TUNXOUT= 0
##$USERA1= <user>
##$USERA2= <user>
##$USERA3= <user>
##$USERA4= <user>
##$USERA5= <user>
##$V9= 5
##$VALIST= <valist>
##$VCLIST= <CCCCCCCCCCCCCCC>
##$VD= 0
##$VDLIST= <DDDDDDDDDDDDDDD>
##$VPLIST= <PPPPPPPPPPPPPPP>
##$VTLIST= <TTTTTTTTTTTTTTT>
##$WBST= 1024
##$WBSW= 4
##$XGAIN= (0..3)
0 0 0 0 
##$XL= 0
##$YL= 0
##$YMAX_a= 4657
##$YMIN_a= -3496
##$ZGOPTNS= <>
##$ZL1= 120
##$ZL2= 120
##$ZL3= 120
##$ZL4= 120
##$ABSF1= 0
##$ABSF2= 0
##$ABSG= 0
##$ABSL= 0
##$ALPHA= 0
##$AQORDER= 0
##$ASSFAC= 0
##$ASSFACI= 0
##$ASSFACX= 0
##$ASSWID= 0
##$AUNMP= <proc_1d>
##$AZFE= 0.1
##$AZFW= 0.5
##$BCFW= 0
##$BC_mod= 2
##$BYTORDP= 0
##$COROFFS= 0
##$CY= -3
##$DATMOD= 1
##$DC= 0
##$DFILT= <>
##$DTYPP= 0
##$F1P= 0
##$F2P= 0
##$FCOR= 1
##$FTSIZE= 65536
##$FT_mod= 6
##$GAMMA= 0
##$GB= 0
##$INTBC= 1
##$INTSCL= 6.047779e-11
##$ISEN= 30
##$LB= 10
##$LEV0= 0
##$LPBIN= 0
##$MAXI= 10000
##$MC2= 0
##$MEAN= 0
##$ME_mod= 0
##$MI= 50
##$NCOEF= 0
##$NC_proc= -12
##$NLEV= 6
##$NOISF1= 182.463
##$NOISF2= 159.3651
##$NSP= 0
##$NTH_PI= 0
##$NZP= 0
##$OFFSET= 248.5645
##$PC= 4
##$PHC0= -12860.03
##$PHC1= 68.08329
##$PH_mod= 1
##$PKNL= yes
##$PPARMOD= 0
##$PSCAL= 0
##$PSIGN= 0
##$REVERSE= no
##$SF= 81.0140089999694
##$SI= 65536
##$SIGF1= 159.3651
##$SIGF2= -187.1042
##$SINO= 113.3802
##$SIOLD= 16384
##$SREGLST= <1H.CDCl3>
##$SSB= 0
##$STSI= 65536
##$STSR= 0
##$SW_p= 40650.406504065
##$SYMM= 0
##$S_DEV= 0
##$TDeff= 32768
##$TDoff= 0
##$TI= <>
##$TILT= no
##$TM1= 0
##$TM2= 0
##$TOPLEV= 0
##$USERP1= <user>
##$USERP2= <user>
##$USERP3= <user>
##$USERP4= <user>
##$USERP5= <user>
##$WDW= 1
##$XDIM= 65536
##$YMAX_p= 473536187
##$YMIN_p= -374115434
$$ End of Bruker specific parameters
$$ ---------------------------------
##NTUPLES= NMR SPECTRUM
##VAR_NAME=  FREQUENCY,     SPECTRUM/REAL,   SPECTRUM/IMAG
##SYMBOL=    X,             R,               I
##VAR_TYPE=  INDEPENDENT,   DEPENDENT,       DEPENDENT
##VAR_FORM=  AFFN,          ASDF,            ASDF
##VAR_DIM=   65536,         65536,           65536
##UNITS=     HZ,            ARBITRARY UNITS, ARBITRARY UNITS
##FACTOR=    0.620285442955139, 1,           1
##FIRST=     20137.2065510682, 0,            0
##LAST=      -20513.1999529968, 0,           0
##MIN=       -20513.1999529968, -374115434,  0
##MAX=       20137.2065510682, 473536187,    0
$$ Real data points
##PAGE= N=1
##DATA TABLE= (X++(R..R)), XYDATA
$$ [...]
14022 -40307830 -40037053 -39536420 -39000619 -38565073 -38274377 -38080456 -37893180 -37667559 -37474766
14013 -37474766 -37508930 -38026388 -39254775 -41311389 -44148756 -47536024 -51090645 -54367026
14005 -54367026 -56977191 -58691906 -59477929 -59460998 -58837558 -57775623 -56345477 -54504290 -52130820
13996 -52130820 -49084731 -45264110 -40647058 -35311202 -29425873 -23216496 -16913132 -10705827
13988 -10705827 -4729708 909933 6087238 10620474 14293298 16935135 18510859 19155667
13980 19155667 19132656 18747739 18277286 17940608 17914139 18363566 19466260 21403802 24321063
13971 24321063 28267233 33143554 38680376 44459933 49990855 54818599 58631232 61317829
13963 61317829 62964144 63799341 64112930 64155878 64048988 63734066 62987550 61479488 58848232
13954 58848232 54785775 49143902 42041575 33915738 25470065 17534905 10896793 6155098
13946 6155098 3639723 3401002 5254571 8833644 13605274 18861834 23753440 27414420
13938 27414420 29160293 28664502 26027030 21708825 16371772 10693482 5216528 262594
13930 262594 -4085308 -7943510 -11545435 -15132946 -18845871 -22643910 -26295041 -29445213
13922 -29445213 -31748697 -33004623 -33235857 -32670144 -31631023 -30394881 -29094603 -27727839
13914 -27727839 -26261444 -24754448 -23404854 -22477468 -22150715 -22373462 -22821150 -22989923 -22390421
13905 -22390421 -20739571 -18047102 -14565240 -10659422 -6689084 -2945488 365866 3131828
13897 3131828 5342822 7100626 8606316 10119633 11898117 14139946 16953090 20353379
13889 20353379 24275348 28581171 33067356 37476317 41518320 44910800 47444489 49069037
13881 49069037 49954403 50465860 51029196 51942562 53243819 54713766 56006577 56822607 57028964
13872 57028964 56681064 55959205 55072966 54190981 53426692 52868566 52616273 52792496 53528586
13863 53528586 54938047 57084334 59941702 63359455 67058131 70680865 73887083 76438309
13855 76438309 78226641 79241671 79519781 79120806 78132583 76669967 74852207 72781191
13847 72781191 70545369 68238855 65967260 63836917 61951070 60422101 59374729 58912992
13839 58912992 59060708 59716866 60661019 61610079 62298060 62543098 62281199 61568880 60566882
13830 60566882 59509151 58653468 58219436 58334153 59002640 60102667 61397198 62567258 63269664
13821 63269664 63206693 62181513 60124962 57100156 53292996 48983616 44494888 40134650
13813 40134650 36158631 32761502 30076298 28162671 26989685 26433728 26298191 26341675 26303311
13804 26303311 25929424 25008237 23405584 21088728 18136058 14737806 11183640 7824794
13796 7824794 5010772 3020318 2007900 1973010 2754928 4063539 5552964 6917785 7967395
13787 7967395 8644439 8994481 9127716 9206473 9450507 10117041 11423409 13431860 15960736
13778 15960736 18581836 20717161 21798820 21429615 19480693 16086380 11544390 6178551
13770 6178551 233786 -6157750 -12941259 -20059997 -27370100 -34596633 -41362984 -47275255
13762 -47275255 -51997867 -55270408 -56879783 -56644202 -54440633 -50251160 -44184097 -36458330
13754 -36458330 -27376634 -17311057 -6691864 4022367 14392282 24033917 32624359
13747 32624359 39896986 45663471 49867677 52632055 54252452 55132819 55683075 56207343
13739 56207343 56805546 57318310 57348187 56366984 53877937 49573210 43429561 35712874 26900636
13730 26900636 17564237 8263182 -514677 -8365285 -14956579 -20023687 -23391176 -25017777
13722 -25017777 -25033176 -23731437 -21511665 -18792935 -15944432 -13255398 -10943736 -9185441
13714 -9185441 -8140400 -7952756 -8722042 -10467808 -13119310 -16538652 -20554316 -24978197
13706 -24978197 -29604278 -34207298 -38553931 -42422910 -45628612 -48050675 -49669097 -50587418
13698 -50587418 -51019040 -51229727 -51459970 -51866794 -52512616 -53397981 -54506555 -55825539 -57329981
13689 -57329981 -58955867 -60598002 -62139454 -63481793 -64545306 -65245655 -65480267 -65141843
13681 -65141843 -64144589 -62444423 -60054862 -57066662 -53660197 -50087712 -46622050 -43496691
13673 -43496691 -40864442 -38781533 -37210467 -36041031 -35136036 -34398737 -33837618 -33591041 -33884534
13664 -33884534 -34928540 -36805805 -39412676 -42487982 -45706519 -48777250 -51495937 -53741713
13656 -53741713 -55442165 -56542999 -57008991 -56860999 -56227445 -55371323 -54660824 -54484547 -55149438
13647 -55149438 -56810789 -59456924 -62929594 -66944555 -71100735 -74901393 -77813197 -79355569
13639 -79355569 -79183083 -77131515 -73229447 -67693587 -60913911 -53416318 -45789635 -38581982
13631 -38581982 -32193931 -26806805 -22374247 -18677255 -15416696 -12311794 -9184592 -6017677
13623 -6017677 -2967864 -318489 1626642 2673030 2835078 2359203 1656499 1174046 1263641
13614 1263641 2100507 3667272 5784757 8167866 10497439 12495720 13975594 14836667
13606 14836667 15018290 14455991 13081854 10865541 7854948 4176862 -8448 -4569942
13598 -4569942 -9444534 -14624869 -20099342 -25777243 -31444906 -36785045 -41454777 -45180544
13590 -45180544 -47820149 -49371277 -49942712 -49711699 -48869819 -47549330 -45745250 -43278773
13582 -43278773 -39842784 -35126540 -28970078 -21482714 -13079284 -4426574 3671783 10411761
13574 10411761 15119533 17361822 17014233 14256737 9489039 3207716 -4090332 -11947241
13566 -11947241 -19948669 -27731885 -35008172 -41582554 -47358291 -52335109 -56614058 -60399133
13558 -60399133 -63963427 -67559804 -71304038 -75099981 -78663456 -81635606 -83715483 -84740309
13550 -84740309 -84693993 -83675464 -81867294 -79517981 -76921162 -74368679 -72076187 -70112080
13542 -70112080 -68374451 -66640257 -64669119 -62311522 -59568287 -56575087 -53528183 -50601097
13534 -50601097 -47901768 -45483497 -43382082 -41641021 -40307445 -39406662 -38916315 -38763958
13526 -38763958 -38861920 -39165373 -39712407 -40613132 -41997915 -43964721 -46547309 -49687546 -53191602
13517 -53191602 -56689668 -59653021 -61503519 -61785085 -60309041 -57190024 -52761608 -47442530
13509 -47442530 -41643147 -35744599 -30112302 -25087965 -20941983 -17812178 -15670199 -14344798
13501 -14344798 -13602982 -13255088 -13228247 -13566346 -14357735 -15631324 -17275354 -19025386 -20545705
13492 -20545705 -21586359 -22145598 -22542050 -23336892 -25130552 -28333652 -33022870 -38932390
13484 -38932390 -45550560 -52253606 -58430912 -63592144 -67445676 -69915998 -71081678 -71072416
13476 -71072416 -70001204 -67976870 -65176219 -61918527 -58693181 -56113531 -54794020 -55185382
13468 -55185382 -57440485 -61378502 -66556909 -72398151 -78304047 -83725593 -88196794 -91357500
13460 -91357500 -92980891 -93001634 -91526988 -88816673 -85233981 -81183470 -77048005 -73128777
13452 -73128777 -69591995 -66437642 -63514633 -60596752 -57501286 -54194691 -50821642 -47635681
13444 -47635681 -44876031 -42667715 -40991607 -39711853 -38618544 -37459738 -35966470 -33884258
13436 -33884258 -31015169 -27263819 -22677178 -17468113 -12012093 -6807374 -2396582 735247
13428 735247 2253022 2019157 82542 -3376059 -8113279 -13882690 -20469962 -27697762
13420 -27697762 -35407115 -43433207 -51589902 -59660215 -67384095 -74452257 -80532556 -85343493
13412 -85343493 -88751722 -90841334 -91907509 -92361867 -92580926 -92761209 -92847657 -92569804 -91567563
13403 -91567563 -89546383 -86393958 -82218179 -77308661 -72055870 -66866790 -62098942 -58016125
13395 -58016125 -54763904 -52364541 -50726791 -49658712 -48876047 -48016263 -46680273 -44513536
13387 -44513536 -41309837 -37093798 -32132520 -26854715 -21710009 -17046126 -13073340 -9919233
13379 -9919233 -7705644 -6568853 -6601944 -7768031 -9853834 -12499282 -15291226 -17882042
13371 -17882042 -20088015 -21927993 -23584165 -25306173 -27311823 -29727977 -32570156 -35730312
13363 -35730312 -38962766 -41896782 -44104757 -45212323 -45000157 -43452228 -40735600 -37123209
13355 -37123209 -32889740 -28226044 -23214447 -17872091 -12225247 -6365144 -463915 5234594
13347 5234594 10422508 14723970 17697757 18881860 17899687 14598810 9149056 2035273
13339 2035273 -6056806 -14400637 -22362795 -29474058 -35440368 -40115849 -43465771 -45546630
13331 -45546630 -46515765 -46654503 -46367949 -46133968 -46408490 -47524879 -49628383 -52665061 -56418532
13322 -56418532 -60572895 -64778018 -68699943 -72051073 -74606446 -76214553 -76802378 -76367911
13314 -76367911 -74961397 -72669067 -69609937 -65938188 -61835302 -57489762 -53077838 -48755017
13306 -48755017 -44653851 -40883463 -37535312 -34695804 -32449314 -30855235 -29910824 -29535016
13298 -29535016 -29593650 -29949137 -30500142 -31191368 -31994856 -32875356 -33762170 -34558224 -35198045
13289 -35198045 -35714882 -36243062 -36920315 -37745650 -38502335 -38814179 -38305469 -36768120 -34247008
13280 -34247008 -31010690 -27434983 -23865671 -20531609 -17543932 -14958437 -12840865 -11289587
13272 -11289587 -10415353 -10304255 -10981574 -12380928 -14330174 -16574397 -18837058 -20885788
13264 -20885788 -22563858 -23783889 -24513924 -24777255 -24654153 -24263740 -23726941 -23130520 -22504428
13255 -22504428 -21810928 -20948176 -19779163 -18184023 -16110530 -13598411 -10779820 -7873542
13247 -7873542 -5172094 -2999310 -1631676 -1220621 -1771449 -3196821 -5400847 -8325714
13239 -8325714 -11929072 -16120020 -20709329 -25408905 -29876537 -33781878 -36873871 -39037647
13231 -39037647 -40326151 -40947547 -41200422 -41374347 -41655083 -42074254 -42522251 -42813758 -42772437
13222 -42772437 -42295182 -41372359 -40072806 -38527341 -36935454 -35579586 -34802969 -34928080 -36146422
13213 -36146422 -38439542 -41568193 -45122397 -48602470 -51503568 -53384631 -53913032 -52892828
13205 -52892828 -50289917 -46244518 -41035740 -34982618 -28327054 -21179291 -13567068 -5549176
13197 -5549176 2691851 10841342 18530012 25444214 31400333 36347387 40319068 43389292
13189 43389292 45664599 47300373 48507697 49534893 50627493 51970748 53619628 55440941
13181 55440941 57109436 58182100 58228445 56959907 54305875 50417542 45615862 40316288
13173 40316288 34956572 29936103 25565939 22037650 19431041 17769463 17094351 17501828
13165 17501828 19100658 21908245 25752177 30243614 34839229 38957007 42096581 43930468
13157 43930468 44347337 43432391 41383143 38391799 34552791 29842349 24170713 17466996
13149 17466996 9752134 1178265 -7966164 -17281605 -26312156 -34624892 -41893198 -47948535
13141 -47948535 -52770192 -56415711 -58936024 -60332619 -60582713 -59707030 -57826160 -55164850
13133 -55164850 -52001313 -48590461 -45099589 -41584075 -38009289 -34305448 -30433413 -26441200
13125 -26441200 -22495850 -18879302 -15943640 -14033770 -13400356 -14135494 -16161439 -19282989
13117 -19282989 -23277669 -27965892 -33209199 -38838671 -44578176 -50039275 -54809860 -58584961
13109 -58584961 -61260491 -62945487 -63903901 -64463496 -64919886 -65449917 -66054089 -66556974 -66676783
13100 -66676783 -66132703 -64732048 -62399399 -59155718 -55079521 -50269375 -44807687 -38730164
13092 -38730164 -32023009 -24669334 -16738502 -8478818 -360003 6974240 12844688 16716230
13084 16716230 18335782 17764347 15307777 11414176 6605569 1453216 -3443363 -7505428
13076 -7505428 -10242632 -11311263 -10551375 -8005781 -3915685 1321152 7229092 13344670
13068 13344670 19285646 24781367 29667378 33864230 37368680 40271496 42779706 45197298
13060 45197298 47843804 50947989 54582289 58670077 63038609 67465300 71691687 75423552
13052 75423552 78352480 80209697 80825630 80160609 78302326 75453739 71921838 68083149
13044 68083149 64302448 60827443 57719928 54867494 52069629 49155694 46084126 42980555
13036 42980555 40096351 37709889 36027153 35136873 35041745 35747321 37357369 40106671 44283247
13027 44283247 50062060 57343289 65691162 74400874 82650285 89671528 94889442 97989357
13019 97989357 98902837 97742805 94743340 90231131 84606530 78303994 71739408 65276173
13011 65276173 59217218 53792512 49116850 45139547 41642536 38323105 34935457 31414635
13003 31414635 27910962 24719829 22153302 20420899 19563331 19448295 19817740 20367184 20828409
12994 20828409 21024946 20888471 20450858 19831076 19212358 18787313 18668355 18803698 18958565
12985 18958565 18792507 18007694 16499030 14429329 12185566 10232959 8939997 8458564
12977 8458564 8698010 9371559 10071845 10355907 9843870 8323926 5825866 2618803 -879193
12968 -879193 -4246694 -7201326 -9685346 -11866937 -14064771 -16634209 -19864408 -23916901
12960 -23916901 -28800833 -34361534 -40276569 -46083353 -51260536 -55344001 -58022519 -59172067
12952 -59172067 -58837218 -57198529 -54549542 -51273609 -47800078 -44539284 -41820885 -39863181
12944 -39863181 -38777614 -38585292 -39222649 -40544750 -42357422 -44484195 -46822736 -49335793
12936 -49335793 -51978799 -54629537 -57081201 -59096940 -60476596 -61098198 -60935219 -60064094
12928 -60064094 -58660868 -56973037 -55261291 -53726074 -52450094 -51390825 -50438209 -49512294
12920 -49512294 -48639351 -47951970 -47614237 -47729911 -48294514 -49203257 -50281517 -51306047 -52016414
12911 -52016414 -52132930 -51386009 -49546523 -46447080 -41993936 -36174450 -29064287 -20835441
12903 -20835441 -11759841 -2196154 7450580 16791817 25518998 33440684 40476292 46608423
12895 46608423 51816096 56022359 59081756 60809717 61034776 59650041 56649094 52143044
12887 52143044 46363160 39653946 32453222 25248784 18510224 12616119 7805885 4169050
12879 4169050 1662671 144108 -585064 -729695 -462041 93110 852297 1760468 2780809
12870 2780809 3889488 5077361 6357231 7762750 9322079 11012886 12736806 14350805
12862 14350805 15749388 16943812 18081199 19392193 21105358 23375312 26242503 29615983
12854 29615983 33271678 36872309 40014363 42291384 43350415 42921534 40815998 36910625
12846 36910625 31153036 23613920 14570986 4566424 -5618918 -15082460 -22966313 -28620620
12838 -28620620 -31726935 -32355503 -30934687 -28131138 -24676030 -21195181 -18089086 -15479480
12830 -15479480 -13221613 -10979976 -8359705 -5063380 -1019114 3573042 8296182 12648194
12822 12648194 16196257 18697987 20149817 20749777 20792993 20545992 20155796 19631930 18900305
12813 18900305 17889907 16599082 15105579 13520318 11916230 10274126 8476005 6350079
12805 6350079 3742459 573832 -3149342 -7364346 -11986571 -16913796 -21995907 -26996590
12797 -26996590 -31580451 -35341181 -37860708 -38775153 -37830809 -34931867 -30186164 -23935572
12789 -23935572 -16738222 -9282214 -2249920 3819571 8625879 12136536 14542510 16150099
12781 16150099 17244544 17977287 18316351 18065132 16927162 14589661 10809432 5492691
12773 5492691 -1245515 -9070605 -17490743 -25976946 -34077817 -41465625 -47911416 -53246804
12765 -53246804 -57363054 -60240216 -61963185 -62699777 -62651322 -62000330 -60877700 -59366960 -57545632
12756 -57545632 -55533245 -53505820 -51668667 -50216637 -49304387 -49013286 -49297149 -49932827 -50536192
12747 -50536192 -50674092 -50028725 -48524016 -46345564 -43854269 -41453664 -39482481 -38167291
12739 -38167291 -37620660 -37849947 -38761149 -40171019 -41842919 -43536516 -45041334 -46175451
12731 -46175451 -46762822 -46622140 -45586879 -43543840 -40459122 -36374035 -31382043 -25608597
12723 -25608597 -19199506 -12306495 -5065464 2419141 10073120 17846663 25722932 33733471
12715 33733471 41947185 50415606 59100955 67831579 76303075 84111467 90804506 95953276
12707 95953276 99241591 100545747 99967783 97806928 94481876 90426932 85986375 81339594
12699 81339594 76493322 71352902 65839075 59989440 53999102 48192767 42945021 38570491
12691 38570491 35212600 32775033 30937301 29255449 27296677 24743175 21437650 17388452
12683 17388452 12760574 7855802 3070373 -1170238 -4481931 -6577117 -7292650 -6590182
12675 -6590182 -4540565 -1311881 2829454 7522477 12352855 16939744 21032166 24560283
12667 24560283 27612578 30353865 32928083 35392902 37710927 39782140 41471664 42601994
12659 42601994 42932615 42181069 40103648 36588599 31697637 25639085 18708161 11234810
12651 11234810 3551535 -4025730 -11211937 -17767678 -23514800 -28344189 -32207065 -35099315
12643 -35099315 -37060775 -38190477 -38645258 -38593700 -38146198 -37318731 -36065824 -34361185 -32272645
12634 -32272645 -29993514 -27826359 -26134199 -25274563 -25527857 -27032198 -29740589 -33416304
12626 -33416304 -37674863 -42068666 -46198887 -49828498 -52959303 -55834854 -58856440 -62444516
12618 -62444516 -66907822 -72369764 -78761713 -85862348 -93355202 -100880977 -108069994 -114557486
12610 -114557486 -120000970 -124113011 -126695835 -127650712 -126956268 -124641424 -120781711 -115520316
12602 -115520316 -109090033 -101811588 -94060562 -86213015 -78590968 -71428205 -64862021 -58938538
12594 -58938538 -53617355 -48778019 -44244203 -39832311 -35409120 -30933121 -26464789 -22147491
12586 -22147491 -18168234 -14708103 -11894857 -9773449 -8304687 -7387704 -6892452 -6693450
12578 -6693450 -6703637 -6899631 -7315624 -7993576 -8918160 -9991437 -11070007 -12021415 -12735610
12569 -12735610 -13084760 -12896370 -12002334 -10348141 -8078830 -5532199 -3144045 -1328205
12561 -1328205 -392051 -506924 -1717585 -3965930 -7112244 -10946992 -15194781 -19522990
12553 -19522990 -23574568 -27032613 -29693221 -31498798 -32497626 -32745792 -32215568 -30777691
12545 -30777691 -28275776 -24643133 -19977676 -14521482 -8567930 -2375106 3854143 9938229
12537 9938229 15692210 20954145 25640194 29770074 33426376 36664280 39428986 41540541
12529 41540541 42766270 42941493 42063353 40303280 37942657 35279054 32547576 29875432
12521 29875432 27270428 24637364 21808013 18568203 14684094 9952291 4287452 -2187117
12513 -2187117 -9114405 -15982210 -22264759 -27536587 -31499656 -33948585 -34748909 -33870635
12505 -33870635 -31444968 -27778643 -23299657 -18471353 -13731320 -9475967 -6066919 -3825933
12497 -3825933 -3010085 -3784525 -6209403 -10235595 -15688967 -22237359 -29368414 -36423912
12489 -36423912 -42711765 -47665404 -50984213 -52694816 -53111055 -52712413 -51988239 -51303910 -50833221
12480 -50833221 -50569944 -50394724 -50153496 -49710575 -48962551 -47820929 -46185076 -43932899 -40949826
12471 -40949826 -37192181 -32750543 -27868808 -22899588 -18218299 -14142132 -10888076 -8570266
12463 -8570266 -7212430 -6756817 -7077473 -8019999 -9468456 -11401230 -13887839 -17018077 -20807323
12454 -20807323 -25135996 -29749242 -34302801 -38424701 -41768910 -44051514 -45073696 -44740615
12446 -44740615 -43074121 -40202340 -36315780 -31609263 -26247518 -20373212 -14138856 -7727150
12438 -7727150 -1339371 4842516 10697122 16183401 21327374 26184442 30795105 35144260
12430 35144260 39130328 42564099 45222745 46949654 47739441 47743132 47187719 46265912 45055862
12421 45055862 43492825 41390593 38511508 34674000 29852615 24208193 18022842 11584291
12413 11584291 5104035 -1273311 -7383218 -12949154 -17561732 -20757984 -22166748 -21648713
12405 -21648713 -19365618 -15751604 -11404105 -6938763 -2855683 547812 3198544 5199951
12397 5199951 6732993 7942867 8856275 9361583 9258581 8357486 6585876 4054525 1047961
12388 1047961 -2057678 -4909248 -7271481 -9069440 -10377011 -11370421 -12270406 -13292840
12380 -13292840 -14620484 -16398014 -18739923 -21732999 -25418383 -29752518 -34564393 -39537340
12372 -39537340 -44238714 -48199467 -51018193 -52447963 -52431110 -51073399 -48576813 -45163074
12364 -45163074 -41014179 -36240007 -30868522 -24852016 -18093752 -10507245 -2103370 6936500
12356 6936500 16257907 25416400 33992717 41663596 48203867 53463516 57368819 59940696
12348 59940696 61283307 61523393 60738666 58928539 56037442 51995114 46741302 40241770
12340 40241770 32522954 23725802 14136735 4149012 -5845179 -15574550 -24948515 -34023072
12332 -34023072 -42895602 -51587606 -59975063 -67797045 -74730734 -80488370 -84890449 -87896555
12324 -87896555 -89601219 -90205299 -89965217 -89127554 -87873557 -86301483 -84453480 -82366208
12316 -82366208 -80113215 -77815811 -75620235 -73662844 -72055074 -70898893 -70303396 -70358281
12308 -70358281 -71057491 -72224143 -73505212 -74461351 -74712996 -74068974 -72575766 -70470199 -68068170
12299 -68068170 -65647885 -63373505 -61271287 -59248833 -57147952 -54820520 -52201499 -49343902
12291 -49343902 -46398143 -43551060 -40959993 -38716382 -36858150 -35423421 -34506740 -34270401
12283 -34270401 -34895424 -36502633 -39087946 -42493699 -46417189 -50456369 -54187373 -57246696
12275 -57246696 -59381949 -60461902 -60468595 -59489447 -57697909 -55306981 -52511172 -49453573 -46232786
12266 -46232786 -42926317 -39599153 -36291846 -33006344 -29707201 -26341798 -22873273 -19315521
12258 -19315521 -15757083 -12362744 -9350065 -6944264 -5315305 -4508325 -4399147 -4716318
12250 -4716318 -5138525 -5416329 -5440217 -5217613 -4790596 -4158113 -3246597 -1938150 -141960
12241 -141960 2124921 4697394 7300108 9651210 11571651 13035447 14134167 14974590
12233 14974590 15561575 15733966 15206329 13711472 11166320 7756697 3884391 5850
12225 5850 -3548600 -6684302 -9531148 -12317489 -15184716 -18028991 -20452341 -21857046 -21644007
12216 -21644007 -19420923 -15126027 -9025140 -1606443 6560450 14933262 23040632 30477679
12208 30477679 36901409 42057201 45817290 48182825 49229670 49036625 47658502 45168163
12200 45168163 41729023 37631274 33255025 28984233 25132780 21922938 19497134 17911208
12192 17911208 17091573 16802575 16686096 16379167 15645283 14441416 12891269 11195531 9536110
12183 9536110 8016485 6645632 5346430 3968944 2309008 147025 -2688612 -6254171
12175 -6254171 -10452128 -15040260 -19679599 -23995268 -27628414 -30275557 -31724129 -31886939
12167 -31886939 -30821311 -28712136 -25812356 -22359422 -18503698 -14285153 -9675560 -4668037
12159 -4668037 638234 6013435 11147787 15737457 19543743 22394489 24150450 24687649
12151 24687649 23928094 21906216 18825452 15061566 11100963 7440981 4500974 2581783
12143 2581783 1868800 2432262 4183351 6804108 9726521 12222341 13583984 13308458 11205068
12134 11205068 7411002 2345103 -3372915 -9032567 -13966690 -17679710 -19922395 -20683251
12126 -20683251 -20115003 -18452698 -15969444 -12967738 -9772297 -6705346 -4055837 -2054388
12118 -2054388 -842699 -425158 -623264 -1079732 -1342392 -1008930 129845 2018854 4375725
12109 4375725 6811137 8964311 10596171 11631208 12168302 12465123 12878539 13758405 15330813
12100 15330813 17622824 20457501 23509749 26386628 28690881 30046833 30104478 28560335
12092 28560335 25217005 20062907 13329613 5492469 -2796653 -10831207 -17985987 -23810001
12084 -23810001 -28041182 -30565571 -31382048 -30608569 -28504097 -25451440 -21879093 -18156790
12076 -18156790 -14525707 -11102778 -7950361 -5161331 -2902833 -1395288 -850316 -1411426
12068 -1411426 -3120411 -5899602 -9534072 -13661294 -17796227 -21409635 -24042504 -25409380
12060 -25409380 -25444146 -24274911 -22155349 -19394798 -16307781 -13172596 -10185359 -7422161
12052 -7422161 -4841065 -2338911 158868 2617562 4856351 6571123 7413325 7097126
12044 7097126 5484984 2607049 -1387860 -6305092 -11949435 -18128070 -24635142 -31246161
12036 -31246161 -37728027 -43854431 -49421016 -54262973 -58272752 -61407242 -63681441 -65163493
12028 -65163493 -65984861 -66351793 -66524377 -66750835 -67188603 -67858670 -68649276 -69348762 -69683536
12019 -69683536 -69356067 -68087759 -65666720 -61996449 -57140549 -51350039 -45050696 -38779539
12011 -38779539 -33090565 -28469268 -25282609 -23762098 -24001897 -25959402 -29459122 -34206837
12003 -34206837 -39815777 -45837350 -51788271 -57177499 -61545043 -64514035 -65837723 -65421374
11995 -65421374 -63319107 -59719860 -54927039 -49321780 -43303406 -37216341 -31281641 -25554503
11987 -25554503 -19932795 -14230016 -8285815 -2049391 4413301 10972791 17487811 23814083
11979 23814083 29783826 35194532 39825288 43472223 45990128 47332002 47574774 46916326
11971 46916326 45643994 44098084 42655675 41728804 41737201 43020856 45707413 49600977 54163833
11962 54163833 58616631 62124891 64007058 63896118 61802653 58060481 53183628 47701882
11954 47701882 42042251 36486068 31188771 26230293 21667252 17566265 14002996 11020639
11946 11020639 8561958 6414391 4217792 1559384 -1875174 -6174090 -11172748 -16547514
11938 -16547514 -21975864 -27272173 -32431250 -37574034 -42847607 -48345936 -54083515 -60007843
11930 -60007843 -66022007 -72008708 -77862392 -83519676 -88954220 -94113769 -98825686 -102737485
11922 -102737485 -105349678 -106144502 -104755756 -101100605 -95416983 -88201005 -80081623 -71681213
11914 -71681213 -63500022 -55850886 -48859900 -42525050 -36794320 -31618241 -26962153 -22800420
11906 -22800420 -19120679 -15941666 -13326704 -11377585 -10210079 -9923131 -10572505 -12152441
11898 -12152441 -14583862 -17709435 -21300588 -25080564 -28757927 -32057180 -34738814 -36614746
11890 -36614746 -37570963 -37599992 -36829832 -35525511 -34043902 -32746327 -31906135 -31661560 -32036970
11881 -32036970 -33006206 -34544938 -36636258 -39231788 -42195468 -45262151 -48039368 -50069014
11873 -50069014 -50940713 -50418830 -48531369 -45579331 -42051758 -38468867 -35217032 -32458337
11865 -32458337 -30158756 -28193226 -26427659 -24714735 -22842667 -20534431 -17543528 -13790079
11857 -13790079 -9441501 -4897698 -714230 2491619 4144714 3835230 1439632 -2816179
11849 -2816179 -8396369 -14592076 -20703075 -26196199 -30790302 -34453469 -37333589 -39662199
11841 -39662199 -41668915 -43527158 -45332297 -47099242 -48766560 -50209662 -51278478 -51862572
11833 -51862572 -51954057 -51663195 -51166755 -50615020 -50051050 -49391204 -48487981 -47253036 -45772934
11824 -45772934 -44337601 -43350401 -43171461 -43989474 -45783133 -48362285 -51439676 -54695496
11816 -54695496 -57823777 -60560968 -62697988 -64082500 -64623766 -64305885 -63201889 -61478301
11808 -61478301 -59389274 -57264005 -55482070 -54425718 -54414220 -55649324 -58199337 -62016970
11800 -62016970 -66959736 -72794575 -79202897 -85812249 -92251811 -98197038 -103373578 -107528747
11792 -107528747 -110411921 -111801575 -111578711 -109804609 -106749299 -102845952 -98591383 -94437833
11784 -94437833 -90713282 -87585539 -85071156 -83083237 -81501247 -80232756 -79236428 -78494698
11776 -78494698 -77953011 -77464037 -76777203 -75591639 -73650775 -70823934 -67124757 -62664069
11768 -62664069 -57589441 -52072283 -46351737 -40780734 -35807818 -31880302 -29317134 -28218070
11760 -28218070 -28447734 -29694724 -31579409 -33767813 -36046764 -38337509 -40659032 -43066396
11752 -43066396 -45577565 -48096575 -50361204 -51958690 -52426305 -51399758 -48743219 -44612297
11744 -44612297 -39439376 -33857541 -28588217 -24315309 -21562866 -20595255 -21372614 -23596511
11736 -23596511 -26842962 -30719596 -34961772 -39429853 -44041810 -48704862 -53285468 -57620130
11728 -57620130 -61549955 -64954545 -67759532 -69908091 -71318084 -71863626 -71400589 -69818223
11720 -69818223 -67081503 -63243428 -58432976 -52838401 -46699141 -40301005 -33955322 -27950229
11712 -27950229 -22490316 -17663311 -13462361 -9855325 -6861371 -4592576 -3236277 -2978417
11704 -2978417 -3897503 -5887627 -8668854 -11892586 -15277640 -18686803 -22103887 -25548607
11696 -25548607 -28995477 -32327815 -35315844 -37610568 -38775890 -38384178 -36159011 -32105917
11688 -32105917 -26571825 -20208822 -13851824 -8339350 -4324199 -2134305 -1731832 -2777015
11680 -2777015 -4762400 -7167545 -9585808 -11780533 -13650627 -15135362 -16131142 -16481030
11672 -16481030 -16036660 -14742741 -12695748 -10156540 -7513153 -5196899 -3573712 -2853795
11664 -2853795 -3055933 -4028244 -5501066 -7152867 -8686881 -9914354 -10820288 -11577245 -12490365
11655 -12490365 -13890487 -16015427 -18917375 -22416875 -26109485 -29426240 -31743226 -32520592
11647 -32520592 -31433434 -28451008 -23835301 -18062719 -11708049 -5343583 517335 5446011
11639 5446011 9126740 11397408 12275039 11934846 10644733 8689306 6315985 3710266
11631 3710266 989455 -1790357 -4605538 -7408902 -10067828 -12343180 -13943909 -14640937
11623 -14640937 -14376307 -13304653 -11750495 -10112314 -8760180 -7960960 -7842100 -8384401 -9427099
11614 -9427099 -10682784 -11781444 -12361896 -12194694 -11282503 -9880246 -8415593 -7344459 -7011295
11605 -7011295 -7576645 -9026279 -11221761 -13937911 -16869866 -19639627 -21839904 -23119445
11597 -23119445 -23277880 -22328831 -20503728 -18190936 -15829077 -13793332 -12316208 -11465786
11589 -11465786 -11179324 -11333665 -11826523 -12639006 -13854724 -15631518 -18146295 -21538946 -25865194
11580 -25865194 -31055843 -36889194 -42996172 -48905850 -54111952 -58137792 -60605342 -61326828
11572 -61326828 -60399201 -58233447 -55465293 -52775033 -50709869 -49587229 -49490892 -50326313 -51898946
11563 -51898946 -53986058 -56372505 -58838343 -61128913 -62963450 -64105503 -64452010 -64067620
11555 -64067620 -63130969 -61830557 -60282020 -58510166 -56483404 -54158529 -51508042 -48531318
11547 -48531318 -45258677 -41742976 -38028306 -34107192 -29902032 -25296058 -20196723 -14585941
11539 -14585941 -8530438 -2168608 4294201 10578129 16339004 21223649 24961458 27450957
11531 27450957 28796583 29272765 29225815 28957425 28650059 28374650 28167234 28110709 28354096
11522 28354096 29052489 30276946 31969469 33978871 36141403 38332283 40449017 42359935
11514 42359935 43886151 44847299 45134065 44743139 43744259 42205204 40128744 37439798 34023639
11505 34023639 29788832 24726271 18946121 12679679 6235484 -84187 -6071083 -11656300
11497 -11656300 -16892207 -21888305 -26732861 -31422488 -35816524 -39637535 -42528725 -44144816
11489 -44144816 -44228420 -42641001 -39360583 -34481395 -28233410 -21006246 -13346643 -5910814
11481 -5910814 623689 5665598 8812024 9923042 9151082 6912724 3800708 451980
11473 451980 -2591290 -4979501 -6576982 -7407950 -7565263 -7131685 -6145015 -4609209 -2531643
11464 -2531643 43683 3032559 6336991 9869569 13538493 17193171 20574060 23311706
11456 23311706 24978520 25160036 23512645 19798033 13902905 5858104 -4133043 -15663661
11448 -15663661 -28118335 -40728395 -52694974 -63346164 -72271315 -79383454 -84889772
11441 -84889772 -89183695 -92697559 -95763159 -98519110 -100889059 -102637713 -103485156 -103227287
11433 -103227287 -101798757 -99248450 -95659188 -91083960 -85556772 -79177654 -72210385 -65111713
11425 -65111713 -58451793 -52763198 -48409366 -45544036 -44157038 -44140401 -45316108 -47424576
11417 -47424576 -50115797 -52974763 -55572504 -57513649 -58468501 -58203761 -56625992 -53825991
11409 -53825991 -50091302 -45860674 -41622270 -37787799 -34594444 -32083807 -30171569 -28764754
11401 -28764754 -27848084 -27484438 -27742530 -28619668 -30023417 -31821608 -33913879 -36265174 -38880523
11392 -38880523 -41754852 -44850420 -48121285 -51556648 -55200942 -59131779 -63403257 -67974359
11384 -67974359 -72652270 -77088541 -80846921 -83511985 -84773174 -84441307 -82412670 -78629648
11376 -78629648 -73073534 -65792323 -56944301 -46830673 -35893754 -24674205 -13743060
11369 -13743060 -3632568 5218331 12493807 17995019 21600431 23227015 22838756 20508352
11361 20508352 16478272 11156241 5035386 -1406327 -7761793 -13685730 -18856809 -22968379
11353 -22968379 -25779128 -27199903 -27351543 -26540745 -25162540 -23591250 -22114174 -20907992
11345 -20907992 -20023422 -19365832 -18702361 -17729816 -16191834 -13985545 -11194497 -8028335 -4706417
11336 -4706417 -1355339 2019856 5479850 9058318 12705119 16305876 19751619 22988588
11328 22988588 25997020 28712046 30953263 32429618 32836921 32005837 30026696 27287015
11320 27287015 24398002 22036018 20762103 20890269 22448303 25227323 28877247 32998115
11312 32998115 37199695 41130602 44493231 47061342 48710111 49455199 49478154 49103982 48711157
11303 48711157 48594858 48844027 49299521 49622199 49437331 48477823 46658099 44066182 40914772
11294 40914772 37496792 34152592 31224030 28981535 27549932 26883003 26816091 27171729 27849485
11285 27849485 28840604 30169270 31819159 33701243 35667344 37538348 39129538 40282685
11277 40282685 40910748 41036126 40796183 40408396 40109856 40098781 40506801 41410280 42850671
11268 42850671 44818885 47199011 49724209 52000466 53597334 54157930 53485286 51584512
11260 51584512 48644690 44954241 40783902 36305076 31587180 26654846 21550884 16367962
11252 16367962 11245914 6350752 1856105 -2058722 -5199765 -7361061 -8352668 -8043255
11244 -8043255 -6399422 -3515552 372808 4914694 9722324 14471322 18961077 23102647
11236 23102647 26859136 30186912 33005051 35196507 36639120 37256424 37056216 36118230
11228 36118230 34527788 32304726 29390599 25711987 21274569 16221312 10822942 5419167
11220 5419167 347517 -4117513 -7805093 -10652989 -12660966 -13803712 -13950730 -12847554
11212 -12847554 -10178672 -5684703 722414 8898390 18480275 28954887 39740746 50256154
11204 50256154 59976014 68488150 75537592 81029606 84981122 87449340 88481121 88103254
11196 88103254 86342259 83253784 78948757 73604320 67444216 60688190 53501684 45990038
11188 45990038 38250016 30441285 22823137 15733409 9530294 4530626 959628 -1090917
11180 -1090917 -1695394 -1101896 304707 2084567 3840079 5283211 6244658 6639191 6434741
11171 6434741 5662027 4452480 3051816 1768795 876563 532277 770734 1567668 2915379
11162 2915379 4854198 7448211 10734114 14678010 19159413 23989508 28962164 33918918
11154 33918918 38790824 43586380 48331120 53001003 57495069 61663297 65370497 68559603
11146 68559603 71281974 73682610 75954981 78296900 80890120 83897589 87451564 91615971
11138 91615971 96336843 101413472 106512077 111216662 115092430 117736323 118803048 118016227
11130 118016227 115190704 110285078 103467668 95142954 85892427 76339954 67009598 58249258
11122 58249258 50243999 43085088 36838154 31571690 27342326 24160006 21960611 20599013
11114 20599013 19860193 19484758 19210530 18825425 18209545 17339757 16250636 14973184 13483093
11105 13483093 11681719 9419485 6557406 3045683 -1013862 -5350922 -9567357 -13228230
11097 -13228230 -15978826 -17647352 -18291387 -18171987 -17677136 -17230197 -17202103 -17831895 -19173090
11088 -19173090 -21098364 -23374729 -25773886 -28156636 -30493617 -32832268 -35248554 -37814450
11080 -37814450 -40584831 -43587104 -46799444 -50124243 -53381085 -56339005 -58782343 -60577925
11072 -60577925 -61703456 -62215061 -62168879 -61545641 -60230068 -58060865 -54921438 -50825671 -45969714
11063 -45969714 -40738003 -35653151 -31266829 -28019305 -26123503 -25518085 -25890930 -26744765
11055 -26744765 -27483339 -27513652 -26356709 -23741614 -19653277 -14320954 -8155786 -1655410
11047 -1655410 4702817 10552756 15685605 20038808 23647604 26598902 29010641 31021029
11039 31021029 32754573 34258443 35443727 36074623 35817409 34327371 31344996 26781067
11031 26781067 20769785 13665332 5974463 -1745413 -8972395 -15262134 -20261209 -23725512
11023 -23725512 -25551272 -25789222 -24609979 -22226605 -18817879 -14495326 -9323670 -3373572
11015 -3373572 3221341 10222909 17274939 23926657 29695056 34156261 37042446 38310418
11007 38310418 38150857 36931127 35098654 33086499 31245195 29798917 28820623 28234115
10999 28234115 27849730 27418595 26678333 25379866 23307087 20299217 16269212 11212108
10991 11212108 5214741 -1520459 -8653247 -15725317 -22245853 -27817688 -32243635 -35561222
10983 -35561222 -37994230 -39847734 -41389812 -42760031 -43931973 -44739776 -44956321 -44387321
10975 -44387321 -42934162 -40593263 -37399026 -33356000 -28412761 -22496660 -15581644 -7741166
10967 -7741166 839779 9882054 19036486 27913681 36136056 43409335 49574893 54602111
10959 54602111 58524451 61368460 63124022 63762484 63271550 61673126 59018387 55387461
10951 55387461 50926723 45916908 40807536 36145330 32399039 29778095 28157509 27140377
10943 27140377 26201587 24841296 22713369 19713519 16001112 11933240 7931693 4346589
10935 4346589 1380223 -908577 -2549929 -3611628 -4188365 -4427697 -4555210 -4859012 -5620290
10926 -5620290 -7010711 -9001251 -11330838 -13560071 -15191944 -15806751 -15158774 -13210404
10918 -13210404 -10107123 -6113286 -1540221 3302422 8127566 12692243 16842808 20559560
10910 20559560 23946884 27150903 30254252 33221285 35923433 38213318 39991743 41229179
10902 41229179 41936660 42109783 41685220 40544848 38575961 35760532 32244445 28343766
10894 28343766 24476993 21052118 18362365 16539094 15576201 15396379 15902782 16972192
10886 16972192 18396236 19830788 20820901 20913035 19791532 17350822 13664686 8893701
10878 8893701 3211694 -3197443 -10087445 -17103533 -23799982 -29733244 -34589448 -38278393
10870 -38278393 -40942489 -42878311 -44417253 -45825301 -47255332 -48747660 -50255809 -51675013
10862 -51675013 -52854287 -53579376 -53537127 -52302882 -49394859 -44395728 -37086072 -27519933
10854 -27519933 -16011122 -3053216 10777085 24895412 38756001 51880053 63872721
10847 63872721 74421129 83268708 90185549 94969360 97488855 97738459 95857072 92092580
10839 92092580 86735520 80060380 72298578 63647642 54309204 44538098 34673591 25125092
10831 25125092 16308312 8560724 2079478 -3091906 -7033624 -9901504 -11882502 -13160517
10823 -13160517 -13887059 -14148460 -13930188 -13097859 -11427225 -8697003 -4810964 118725 5775956
10814 5775956 11722581 17502499 22717124 27058678 30318901 32395625 33303263 33173974
10806 33173974 32233929 30759700 29041280 27370550 26040805 25325193 25425165 26417908 28239919
10797 28239919 30717029 33621620 36729788 39860373 42890689 45754402 48428735 50908070
10789 50908070 53154571 55034982 56285056 56545433 55464312 52806139 48504321 42653805
10781 42653805 35491922 27406946 18959551 10867756 3926591 -1117877 -3693826 -3491926
10773 -3491926 -502149 5003860 12540632 21505458 31264606 41197797 50705717 59215977
10765 59215977 66215988 71306729 74250737 74999862 73708553 70733720 66599228 61900746
10757 61900746 57164146 52718002 48649431 44867415 41232383 37673825 34232382 31015096
10749 31015096 28106938 25504084 23110789 20789282 18412994 15882433 13111539 10028593
10741 10028593 6617184 2967829 -716485 -4182157 -7215698 -9705977 -11655955 -13162065
10733 -13162065 -14381568 -15487787 -16611861 -17793542 -18975784 -20051642 -20927729 -21552223
10725 -21552223 -21887987 -21864452 -21364079 -20266308 -18516087 -16162515 -13346010 -10258912 -7112941
10716 -7112941 -4116835 -1445164 805336 2644909 4174265 5522158 6771236 7911342
10708 7911342 8834753 9361443 9277872 8384016 6546184 3740420 63890 -4292828 -9096332
10699 -9096332 -14122140 -19195990 -24214430 -29126729 -33870564 -38289812 -42088360 -44856452
10691 -44856452 -46161914 -45668350 -43239842 -39000432 -33327851 -26781007 -19985918 -13517050
10683 -13517050 -7804610 -3087273 577862 3250251 5013286 5899516 5868740 4840250
10675 4840250 2752019 -382585 -4432624 -9122370 -14028818 -18628374 -22405860 -24995619
10667 -24995619 -26287154 -26439560 -25804948 -24811330 -23863008 -23289243 -23337899 -24184974 -25922578
10658 -25922578 -28509034 -31709393 -35083418 -38055011 -40038577 -40560699 -39332869 -36278350
10650 -36278350 -31543947 -25511625 -18785301 -12108401 -6199678 -1562761 1633047 3538156
10642 3538156 4500463 4921618 5158458 5474890 6018199 6810539 7768262 8753561 9639549
10633 9639549 10361452 10937006 11452058 12016847 12709779 13535708 14423105 15265426 15986636
10624 15986636 16593667 17180089 17869881 18728326 19693421 20573078 21114853 21113313 20500263 19371149
10614 19371149 17930974 16383916 14822827 13176466 11239462 8765378 5576121 1643152
10606 1643152 -2882096 -7687512 -12356049 -16444345 -19570120 -21485667 -22110415 -21515022
10598 -21515022 -19883718 -17492892 -14713570 -12007022 -9882490 -8821726 -9201656 -11238698
10590 -11238698 -14957772 -20184636 -26568494 -33641922 -40912126 -47962435 -54534824 -60566989
10582 -60566989 -66173672 -71584960 -77065531 -82830546 -88964091 -95355823 -101689208 -107507370
10574 -107507370 -112341206 -115841995 -117857728 -118432547 -117756704 -116111259 -113829103 -111260911
10566 -111260911 -108727070 -106460249 -104567303 -103033325 -101761495 -100622190 -99491568 -98278637
10558 -98278637 -96947946 -95537245 -94158982 -92975207 -92150664 -91807956 -92012685 -92794721 -94178620
10549 -94178620 -96182794 -98770612 -101780086 -104885420 -107629700 -109522992 -110159484 -109303112
10541 -109303112 -106923527 -103199889 -98515095 -93437844 -88666895 -84919344 -82780087 -82564175
10533 -82564175 -84249005 -87502892 -91791033 -96511364 -101115637 -105191732 -108500843 -110972372
10525 -110972372 -112666210 -113715754 -114264156 -114409102 -114181354 -113579026 -112644878 -111533444 -110518488
10516 -110518488 -109942339 -110149804 -111435946 -113998226 -117878652 -122917930 -128769955 -135000286
10508 -135000286 -141234658 -147285937 -153202975 -159235399 -165749688 -173137548 -181741836 -191812496
10500 -191812496 -203494445 -216831989 -231767512 -248135370 -265675696 -284069191 -302942615
10493 -302942615 -321791760 -339829980 -355825051 -368001713 -374115434 -371837884 -359492064
10486 -359492064 -336876396 -305672605 -269083181 -230854558 -194247988 -161449019 -133499065
10479 -133499065 -110521490 -92007155 -77068786 -64663220 -53788355 -43654269 -33819980
10472 -33819980 -24262326 -15328552 -7557896 -1425489 2886850 5588055 7194827 8313811
10464 8313811 9412010 10695367 12130201 13553221 14794541 15771823 16541771 17295601 18287747
10455 18287747 19716220 21612163 23807935 26015216 27972384 29565723 30843587 31922090
10447 31922090 32857008 33564966 33824256 33331878 31779285 28923340 24640919 18956786 12036149
10438 12036149 4143415 -4417846 -13360938 -22446143 -31472139 -40233830 -48476729 -55893264
10430 -55893264 -62186884 -67175345 -70860063 -73404780 -75037142 -75944180 -76224377 -75903950
10422 -75903950 -74983838 -73485504 -71484619 -69129955 -66639450 -64266438 -62243691 -60726449
10414 -60726449 -59752813 -59226306 -58918733 -58495443 -57565913 -55752596 -52763781 -48461335 -42915838
10405 -42915838 -36425344 -29463023 -22548380 -16093128 -10297230 -5134973 -414634 4130925
10397 4130925 8760963 13678439 19027656 24916671 31418768 38527463 46092780 53794737
10389 53794737 61183053 67764110 73094848 76854007 78877976 79158129 77804539 74990578
10381 74990578 70897286 65672509 59412930 52171617 43989082 34939332 25173998 14941442
10373 14941442 4562997 -5630633 -15374102 -24514839 -33010479 -40882345 -48153167 -54802239
10365 -54802239 -60758811 -65929287 -70228765 -73584428 -75907259 -77068049 -76925214 -75417411
10357 -75417411 -72677895 -69094794 -65260616 -61816167 -59260035 -57820055 -57447850 -57925355
10349 -57925355 -59014823 -60576987 -62615326 -65242328 -68589184 -72700703 -77471180 -82661853
10341 -82661853 -87989745 -93227775 -98254195 -103035625 -107575972 -111875464 -115924479 -119728481
10333 -119728481 -123336903 -126839243 -130309973 -133727071 -136922413 -139609441 -141481844 -142331921
10325 -142331921 -142132522 -141053474 -139413055 -137582760 -135874479 -134446364 -133260057 -132100763
10317 -132100763 -130642753 -128527476 -125430863 -121117482 -115487886 -108615000 -100753153 -92308431
10309 -92308431 -83777090 -75669666 -68432976 -62373743 -57593117 -53957406 -51134234 -48700086
10301 -48700086 -46287154 -43713520 -41046109 -38571230 -36678052 -35692492 -35727920 -36623885 -38005446
10292 -38005446 -39430221 -40545034 -41180018 -41351729 -41192038 -40845355 -40382934 -39772407 -38912900
10283 -38912900 -37709029 -36132964 -34234847 -32105261 -29833513 -27501643 -25208325 -23080326
10275 -23080326 -21245147 -19787532 -18735040 -18090046 -17882134 -18197974 -19160582 -20860533 -23276034
10266 -23276034 -26238164 -29475683 -32714968 -35767279 -38552282 -41062235 -43306899 -45272988
10258 -45272988 -46912065 -48161170 -48992693 -49471897 -49783408 -50192639 -50940837 -52118998 -53595959
10249 -53595959 -55056620 -56136780 -56572028 -56271383 -55287794 -53729804 -51684265 -49192994
10241 -49192994 -46278659 -42980793 -39360996 -35467771 -31290878 -26747036 -21714982 -16106492
10233 -16106492 -9947569 -3444509 2993137 8798884 13364859 16183608 16951661 15596430
10225 15596430 12242286 7165991 775629 -6401224 -13764700 -20748356 -26951413 -32228608
10217 -32228608 -36683695 -40566137 -44121602 -47465308 -50529026 -53094462 -54891544 -55724412
10209 -55724412 -55586600 -54727152 -53633457 -52919949 -53155125 -54693634 -57575625 -61517564 -65979723
10200 -65979723 -70277981 -73707480 -75651807 -75662382 -73508121 -69205105 -63029624 -55503014
10192 -55503014 -47331952 -39302717 -32151013 -26444162 -22512451 -20450535 -20178842 -21521017
10184 -21521017 -24245306 -28054059 -32560707 -37312028 -41871309 -45916161 -49285965 -51954857
10176 -51954857 -53964474 -55374851 -56266800 -56779688 -57134080 -57595825 -58381765 -59554457 -60969467
10167 -60969467 -62313698 -63223098 -63420838 -62801191 -61416008 -59384218 -56793473 -53658907
10159 -53658907 -49956226 -45697687 -41000626 -36108272 -31349031 -27053082 -23470750 -20738763
10151 -20738763 -18912187 -18035416 -18192915 -19487216 -21944888 -25415005 -29538263 -33807978
10143 -33807978 -37671862 -40609123 -42165114 -41973184 -39795614 -35587897 -29565503 -22238157
10135 -22238157 -14374588 -6882292 -628617 3740761 5934016 6066040 4619112 2316435
10127 2316435 -57188 -1831736 -2578751 -2167497 -742084 1382672 3879085 6545472
10119 6545472 9347107 12340467 15543145 18841536 21987336 24668491 26604454 27621202
10111 27621202 27683821 26882316 25380327 23351527 20935637 18232326 15324587 12307851
10103 12307851 9307941 6485149 4025088 2112289 884478 379005 497836 1019565
10095 1019565 1668198 2215665 2570046 2805238 3118331 3734868 4801190 6305616 8057251
10086 8057251 9722900 10893324 11146801 10103823 7488629 3202444 -2614945 -9567251
10078 -9567251 -17039973 -24284659 -30530617 -35106028 -37549630 -37694018 -35705476 -32068789
10070 -32068789 -27507135 -22836519 -18780210 -15800723 -14015695 -13227612 -13033543 -12943371 -12460797
10061 -12460797 -11143008 -8682887 -5019931 -425647 4507901 9003465 12315270 13935802
10053 13935802 13702376 11767547 8476605 4242674 -514408 -5371638 -9907485 -13754815
10045 -13754815 -16691718 -18709696 -19997200 -20827821 -21411674 -21801315 -21908959 -21614362 -20885213
10036 -20885213 -19835775 -18700957 -17756221 -17234830 -17280684 -17945042 -19209914 -21012525 -23255369
10027 -23255369 -25805063 -28495448 -31145828 -33588684 -35691474 -37366405 -38578183 -39359146
10019 -39359146 -39821655 -40144356 -40522139 -41098814 -41919330 -42928741 -44014697 -45061160 -45977821
10010 -45977821 -46697037 -47160159 -47314978 -47120389 -46541631 -45535610 -44043530 -42002664 -39375388
10001 -39375388 -36192842 -32609721 -28946570 -25675642 -23323219 -22312762 -22816767 -24688084
9993 -24688084 -27506582 -30723339 -33835823 -36513388 -38627089 -40194540 -41285629 -41935837
9985 -41935837 -42100823 -41671253 -40544461 -38722290 -36390756 -33943206 -31924405 -30896428
9977 -30896428 -31264348 -33133255 -36262981 -40135979 -44096688 -47499313 -49818934 -50714456
9969 -50714456 -50058332 -47952945 -44735047 -40947234 -37258315 -34345111 -32774677 -32922257
9961 -32922257 -34935858 -38739839 -44066130 -50504575 -57565468 -64745946 -71588103 -77716265
9953 -77716265 -82850349 -86805358 -89487023 -90879217 -91013855 -89934886 -87692657 -84393452
9945 -84393452 -80278050 -75760966 -71377012 -67644255 -64904082 -63202050 -62246869 -61463885
9937 -61463885 -60140094 -57620719 -53484330 -47638293 -40329633 -32094523 -23649945 -15721591
9929 -15721591 -8847078 -3243330 1193087 4763805 7799819 10529988 13043357 15355040
9921 15355040 17525846 19748666 22341456 25656754 29963104 35348251 41673158 48592574
9913 48592574 55635498 62306592 68163082 72852987 76132229 77879498 78112089 76994279
9905 76994279 74823694 71985844 68892826 65948074 63565490 62223522 62505544 65094667
9897 65094667 70728330 80145992 94069267 113221693 138330324 170017931 208542989
9890 208542989 253420875 302993211 354065385 401883565 440801767 465691335 473536187
9883 473536187 464318038 440688062 406747113 366741457 324263465 282006721 241815806
9876 241815806 204812627 171530659 142059699 116205204 93649217 74077325 57232825
9869 57232825 42900450 30872424 20947592 12963919 6826154 2495760 -60149 -934341
9861 -934341 -317733 1515007 4252435 7575564 11143079 14559160 17371257 19116738 19399749
9852 19399749 17969147 14778975 10020510 4112471 -2362391 -8766710 -14528315 -19229062
9844 -19229062 -22649507 -24784358 -25831408 -26125981 -26007344 -25670712 -25099787 -24126463 -22568032
9835 -22568032 -20344685 -17517901 -14262565 -10823969 -7493727 -4594603 -2441671 -1272060
9827 -1272060 -1180785 -2110255 -3898357 -6341166 -9223764 -12312968 -15345050 -18046988 -20200393
9818 -20200393 -21713453 -22644393 -23148307 -23379091 -23409467 -23206863 -22660550 -21642417 -20088217
9809 -20088217 -18072691 -15831333 -13697173 -11976013 -10829630 -10232367 -10018197 -9979306 -9952168
9800 -9952168 -9851267 -9660735 -9418931 -9210080 -9150952 -9369242 -9990237 -11134965 -12903137
9791 -12903137 -15325267 -18319427 -21708105 -25301277 -28986651 -32759991 -36679016 -40777824
9783 -40777824 -44994471 -49146215 -52957782 -56125661 -58393221 -59612631 -59772115 -58973222
9775 -58973222 -57361629 -55041063 -52013086 -48175502 -43388434 -37589590 -30912372 -23745389
9767 -23745389 -16690666 -10428720 -5546390 -2395022 -1023545 -1195043 -2462944 -4265365
9759 -4265365 -6004333 -7105374 -7073706 -5555125 -2387722 2375340 8478777 15510160 22973014
9750 22973014 30378288 37327228 43552538 48909404 53345014 56883522 59631601 61773940
9742 61773940 63530997 65091572 66565666 67992144 69390667 70810821 72335934 74039631
9734 74039631 75934705 77960409 80019991 82036399 83980856 85856222 87655837 89335191
9726 89335191 90819801 92042653 92978886 93643101 94042899 94120740 93727532 92643376 90624544
9717 90624544 87446443 82927626 76936393 69391923 60279462 49691904 37879927 25268033
9709 25268033 12412755 -72409 -11581024 -21553469 -29515925 -35138167 -38297229 -39114129
9701 -39114129 -37937796 -35271081 -31659608 -27587560 -23424701 -19434379 -15809977 -12698696
9693 -12698696 -10201561 -8371217 -7233311 -6833542 -7282511 -8758086 -11445825 -15443151
9685 -15443151 -20684317 -26929023 -33812578 -40925164 -47890703 -54427797 -60375397 -65668176
9677 -65668176 -70270173 -74105192 -77027388 -78849898 -79417216 -78687010 -76779865 -73962450
9669 -73962450 -70560593 -66846256 -62969814 -58982462 -54926879 -50923978 -47193386 -44000709
9661 -44000709 -41572211 -40021950 -39312099 -39249125 -39517701 -39751772 -39625772 -38934114 -37634249
9652 -37634249 -35849817 -33841018 -31945041 -30492598 -29726346 -29756514 -30563199 -32015685 -33876100
9643 -33876100 -35796112 -37350045 -38126824 -37843235 -36408034 -33900100 -30494870 -26412413
9635 -26412413 -21926149 -17393082 -13224410 -9762939 -7132946 -5178034 -3546807 -1878653
9627 -1878653 17048 2069746 3966203 5259571 5528465 4525327 2248273 -1093828
9619 -1093828 -5191132 -9747086 -14542221 -19440240 -24364315 -29271950 -34135549 -38920565
9611 -38920565 -43557412 -47917928 -51813911 -55027211 -57364356 -58712231 -59062045 -58477848
9603 -58477848 -57019782 -54671184 -51324304 -46838355 -41131776 -34254064 -26406979 -17917661
9595 -17917661 -9183184 -609830 7433059 14638690 20780871 25740646 29537159 32337578
9587 32337578 34426823 36144964 37818181 39701962 41937326 44515089 47255026 49821164
9579 49821164 51791415 52772319 52514244 50970435 48271921 44641005 40299463 35421479
9571 35421479 30146781 24632720 19104256 13866159 9268725 5647111 3259793 2233918
9563 2233918 2516888 3854691 5837723 8027145 10107708 11976974 13723679 15530630
9555 15530630 17578351 19995588 22848433 26138058 29793677 33670172 37563742 41246549
9547 41246549 44506905 47176889 49137797 50309300 50636777 50085016 48633911 46269203
9539 46269203 42973115 38730953 33563429 27571957 20966190 14049151 7162751 622096
9531 622096 -5330252 -10538351 -14925853 -18485552 -21272999 -23397028 -24995467 -26194352
9523 -26194352 -27064396 -27595047 -27699502 -27251348 -26144105 -24357833 -22008075 -19348778 -16716346
9514 -16716346 -14436560 -12744837 -11763825 -11539647 -12094375 -13446074 -15581911 -18409832 -21727691
9505 -21727691 -25235725 -28597180 -31529792 -33888588 -35694490 -37092070 -38265954 -39363696
9497 -39363696 -40449762 -41488015 -42349566 -42849391 -42800703 -42059574 -40547576 -38270457 -35348023
9488 -35348023 -32034863 -28696391 -25734121 -23488766 -22153134 -21714729 -21947248 -22466559 -22837731
9479 -22837731 -22684814 -21752970 -19905730 -17076751 -13214954 -8262445 -2183249 4978525
9471 4978525 13058818 21782265 30805320 39758108 48268121 55976204 62560481 67772817
9463 67772817 71482738 73715599 74660674 74623369 73920145 72756660 71156743 68992412 66106032
9454 66106032 62454146 58187712 53628175 49164219 45130416 41723725 38987346 36860336
9446 36860336 35260047 34147858 33543972 33493669 34011665 35031295 36379442 37795362 38995778
9437 38995778 39757870 39976505 39671376 38949369 37938363 36710419 35226698 33346555 30915091
9428 30915091 27885318 24396932 20757640 17333455 14404325 12053184 10131593 8304992
9420 8304992 6152826 3295371 -477845 -5114938 -10293218 -15520522 -20308435 -24330098
9412 -24330098 -27488143 -29880733 -31709205 -33182379 -34449647 -35567529 -36493054 -37103061
9404 -37103061 -37246568 -36827616 -35886980 -34632051 -33386428 -32483912 -32166379 -32529393 -33518065
9395 -33518065 -34955020 -36589918 -38163861 -39467482 -40365933 -40789894 -40721386 -40194382 -39292914
9386 -39292914 -38118724 -36737130 -35144927 -33287348 -31102255 -28550358 -25619217 -22322534
9378 -22322534 -18714320 -14910559 -11094843 -7492772 -4321268 -1738536 173573 1380904
9370 1380904 1843745 1483340 194993 -2108706 -5465057 -9859950 -15241287 -21516756 -28528421
9361 -28528421 -36028304 -43686598 -51140546 -58059440 -64187191 -69340659 -73376998 -76169001
9353 -76169001 -77620486 -77717325 -76575606 -74449654 -71697771 -68735241 -65999504 -63922026
9345 -63922026 -62885052 -63157867 -64834846 -67806668 -71785322 -76388378 -81269947 -86256202
9337 -86256202 -91416771 -97017324 -103365113 -110631034 -118743773 -127392600 -136103350 -144330221
9329 -144330221 -151536222 -157267664 -161224909 -163306625 -163598237 -162302407 -159645298 -155803854
9321 -155803854 -150879409 -144913659 -137927511 -129964850 -121129356 -111605001 -101653448 -91589577
9313 -91589577 -81745129 -72432067 -63912234 -56376042 -49932528 -44611521 -40374731 -37131812
9305 -37131812 -34759679 -33120586 -32066806 -31422228 -30951648 -30347974 -29260362 -27356261 -24390033
9296 -24390033 -20257782 -15034525 -8990449 -2571515 3669321 9179679 13514897 16398859
9288 16398859 17716622 17456176 15643910 12314996 7529726 1412430 -5826135 -13910809
9280 -13910809 -22564046 -31566948 -40765220 -49999981 -59011852 -67410367 -74765407 -80779654
9272 -80779654 -85426924 -88959603 -91780202 -94255916 -96572918 -98688883 -100390691 -101424347
9264 -101424347 -101637983 -101071782 -99953060 -98606464 -97335808 -96341031 -95698840 -95391608 -95351525
9255 -95351525 -95501463 -95794832 -96255667 -96997712 -98188903 -99954779 -102269457 -104914011 -107546767
9246 -107546767 -109846059 -111624793 -112837567 -113491095 -113548154 -112912941 -111507360 -109370065 -106703232
9237 -106703232 -103848563 -101224172 -99251192 -98270396 -98449828 -99716818 -101759278 -104101822
9229 -104101822 -106210664 -107574115 -107744581 -106364771 -103201270 -98186163 -91449864 -83323684
9221 -83323684 -74294940 -64913168 -55673651 -46926126 -38848423 -31488043 -24839218 -18915726
9213 -18915726 -13796838 -9640582 -6662512 -5081739 -5052783 -6619277 -9716935 -14216978
9205 -14216978 -19971561 -26828868 -34614721 -43094961 -51932237 -60655156 -68672188 -75356537
9197 -75356537 -80183341 -82853881 -83345940 -81883882 -78868195 -74800488 -70208487 -65564623
9189 -65564623 -61211254 -57322756 -53923871 -50954997 -48353730 -46117987 -44324475 -43092622
9181 -43092622 -42506532 -42528315 -42942221 -43355421 -43257136 -42118980 -39513949 -35232858 -29372692
9172 -29372692 -22361876 -14893201 -7772021 -1735269 2688676 5244102 5946455 5037765
9164 5037765 2907983 -7035 -3318116 -6730881 -10049372 -13166904 -16062854 -18787107
9156 -18787107 -21405700 -23913718 -26157003 -27810945 -28442773 -27645416 -25189420 -21122544
9148 -21122544 -15778416 -9713521 -3617639 1784206 5851477 8164918 8626862 7457347
9140 7457347 5070124 1888497 -1804643 -5921089 -10531393 -15788727 -21855816 -28845262
9132 -28845262 -36770880 -45525017 -54905950 -64690825 -74708863 -84865496 -95108242 -105367580
9124 -105367580 -115513138 -125341259 -134583373 -142916772 -149972862 -155359160 -158717752 -159820976
9116 -159820976 -158668515 -155532488 -150918855 -145459521 -139782983 -134408038 -129675201 -125708687
9108 -125708687 -122409379 -119496774 -116607744 -113419404 -109736233 -105503515 -100759382 -95568034
9100 -95568034 -89972851 -83992404 -77666457 -71132280 -64678985 -58722454 -53685276 -49829554
9092 -49829554 -47129053 -45254478 -43686739 -41900367 -39522893 -36406485 -32615903 -28374583
9084 -28374583 -23994968 -19796690 -16029378 -12838456 -10293837 -8455716 -7434542 -7424210
9076 -7424210 -8703253 -11589219 -16336667 -23014158 -31434222 -41184743 -51737725 -62564783
9068 -62564783 -73204724 -83275617 -92457228 -100477735 -107127611 -112296908 -116003166 -118374781
9060 -118374781 -119588962 -119800671 -119098655 -117493734 -114927316 -111302214 -106548818 -100714339
9052 -100714339 -94024240 -86866886 -79705188 -72969126 -66978136 -61897829 -57714278 -54236322
9044 -54236322 -51162604 -48216834 -45282135 -42441449 -39901953 -37880543 -36545995 -36033444
9036 -36033444 -36465238 -37920669 -40373017 -43656264 -47487779 -51511490 -55317513 -58445212
9028 -58445212 -60420037 -60853029 -59563267 -56640383 -52396436 -47236668 -41532166 -35560770
9020 -35560770 -29523980 -23603028 -18008137 -12985357 -8765631 -5476222 -3072440 -1349700
9012 -1349700 -45486 1025660 1887295 2415849 2439641 1855824 693415 -908354 -2780100
9003 -2780100 -4803596 -6949031 -9255722 -11769748 -14467124 -17201036 -19707097 -21670919
8995 -21670919 -22825298 -23032334 -22323722 -20893850 -19047676 -17111214 -15329219 -13788883
8987 -13788883 -12400169 -10937443 -9125174 -6741517 -3708209 -130065 3743176 7625140
8979 7625140 11320005 14800225 18194554 21699704 25467558 29519709 33713620 37757384
8971 37757384 41258580 43793584 44986037 44581217 42499024 38849103 33902382 28031040
8963 28031040 21642768 15134987 8878166 3212880 -1568291 -5267441 -7832286 -9366577
8955 -9366577 -10084230 -10245198 -10123970 -10011566 -10199162 -10905877 -12181321 -13855380 -15579108
8946 -15579108 -16938290 -17583762 -17325369 -16161163 -14246226 -11835630 -9240606 -6803651
8938 -6803651 -4857693 -3637553 -3167000 -3196667 -3255792 -2805410 -1408244 1174024 4981308
8929 4981308 9907288 15740311 22172907 28811292 35224399 41031912 45985484 49992765
8921 49992765 53076256 55307560 56767251 57548397 57786327 57688011 57540749 57681605 58417528
8912 58417528 59920215 62155612 64894733 67789396 70450697 72491353 73551826 73350694
8904 73350694 71764190 68896301 65093026 60878311 56821698 53378963 50768823 48943212
8896 48943212 47666676 46664063 45761532 44954040 44375491 44199906 44533350 45350331 46496450
8887 46496450 47749468 48916696 49935850 50932678 52192738 54046912 56728325 60279681
8879 60279681 64551222 69266502 74100176 78725945 82826788 86083902 88168789 88759950
8871 88759950 87591037 84512892 79535300 72825522 64673932 55459111 45632389 35709919
8863 35709919 26243415 17753599 10636938 5076267 992534 -1932217 -4156166 -6137931
8855 -6137931 -8216713 -10560738 -13187527 -16021107 -18948711 -21863639 -24700253 -27464940
8847 -27464940 -30252864 -33232647 -36588635 -40431274 -44709933 -49172965 -53403057 -56916715
8839 -56916715 -59281422 -60199452 -59536763 -57313160 -53684949 -48934460 -43453724 -37703765
8831 -37703765 -32153465 -27226609 -23281602 -20617420 -19474165 -20002210 -22203681 -25879251
8823 -25879251 -30623364 -35893910 -41140790 -45934238 -50025732 -53317676 -55779499 -57374797
8815 -57374797 -58039672 -57708280 -56356222 -54034442 -50880910 -47109544 -42980362 -38754360
8807 -38754360 -34638998 -30738612 -27029674 -23372737 -19556049 -15356167 -10601984 -5230262
8799 -5230262 680649 6908149 13113180 18893103 23855180 27698920 30279627 31622998
8791 31622998 31883123 31264178 29937149 27980593 25368463 22009724 17811651 12722365
8783 12722365 6736609 -105383 -7690890 -15788794 -24032856 -31970140 -39164883 -45313445
8775 -45313445 -50320846 -54305094 -57525307 -60265674 -62729876 -64991914 -67017089 -68733053
8767 -68733053 -70108699 -71193803 -72093354 -72894164 -73596520 -74096840 -74225417 -73808519 -72723350
8758 -72723350 -70932420 -68493809 -65544364 -62259473 -58807715 -55324061 -51911193 -48656979
8750 -48656979 -45647672 -42965870 -40675351 -38797771 -37282773 -35978666 -34627506 -32915115
8742 -32915115 -30581161 -27546266 -23982953 -20280086 -16915844 -14310164 -12726559 -12239195
8734 -12239195 -12729437 -13879431 -15181765 -16018550 -15827312 -14289142 -11430136 -7572788 -3171374
8725 -3171374 1371513 5822924 10142475 14424611 18794513 23304540 27882626 32359553
8717 32359553 36549103 40314849 43571692 46232289 48163277 49211928 49300069 48513689 47107389
8708 47107389 45405542 43662066 41967797 40251315 38351885 36105647 33394105 30140421
8700 30140421 26279272 21744091 16494604 10564197 4086149 -2718973 -9579211 -16212086
8692 -16212086 -22368970 -27879400 -32671797 -36747844 -40118866 -42738256 -44460748 -45045371
8684 -45045371 -44210776 -41734122 -37552693 -31815304 -24863104 -17163765 -9231103 -1541514
8676 -1541514 5544924 11830392 17261591 21855095 25614614 28491829 30407413 31311244
8668 31311244 31245073 30376877 28991776 27439245 26046984 25023235 24383910 23945242 23399235
8659 23399235 22444838 20915265 18846174 16462752 14100232 12094003 10678742 9924511
8651 9924511 9720357 9803738 9829504 9466861 8500476 6900304 4827797 2569697 425550
8642 425550 -1399111 -2845181 -3982780 -4948032 -5871330 -6820785 -7766571 -8568211 -8990828
8633 -8990828 -8754045 -7606303 -5405233 -2177006 1868549 6370455 10874935 14892326
8625 14892326 17946326 19630421 19678696 18030369 14854604 10519924 5520036 379861
8617 379861 -4438107 -8610237 -11991507 -14601854 -16561112 -18002324 -19007754 -19596087 -19751475
8608 -19751475 -19456262 -18695119 -17431946 -15589827 -13062130 -9754857 -5633738 -745904
8600 -745904 4796567 10862479 17353508 24232398 31500795 39122894 46929713 54565033
8592 54565033 61518052 67236248 71265419 73354957 73491984 71865232 68788648 64623495
8584 64623495 59723296 54403850 48933282 43542809 38452532 33884648 30033577 27000625
8576 27000625 24743687 23088525 21801118 20681508 19635832 18698100 17991589 17648110 17732524
8567 17732524 18215484 18993141 19915893 20799781 21430857 21583433 21052393 19685565 17411526
8558 17411526 14267386 10421098 6169300 1896745 -1996388 -5175626 -7432989 -8705628
8550 -8705628 -9049522 -8590559 -7488619 -5935966 -4176909 -2510207 -1243987 -612160 -699722
8541 -699722 -1427034 -2603758 -4012995 -5467362 -6805240 -7843762 -8338073 -7992954 -6537548
8532 -6537548 -3830764 57449 4830898 10024534 15110259 19616195 23226350 25831616
8524 25831616 27514431 28477177 28956104 29167658 29300257 29521134 29959241 30659863 31544180
8515 31544180 32405974 32943783 32803342 31615982 29042205 24832634 18897695 11356388 2532511
8506 2532511 -7113948 -17099577 -27025418 -36632325 -45793275 -54471480 -62675318 -70414105
8498 -70414105 -77648045 -84246687 -89984091 -94575128 -97725173 -99169445 -98707532 -96244774
8490 -96244774 -91827002 -85643430 -77997810 -69274548 -59914913 -50386703 -41126019 -32461210
8482 -32461210 -24560063 -17439105 -11039245 -5327279 -357924 3747131 6882056 9025353
8474 9025353 10230808 10551752 9970879 8399064 5746815 2022106 -2601433 -7782872 -13084207
8465 -13084207 -18082464 -22471916 -26115536 -29040431 -31398498 -33413568 -35326065 -37345719
8457 -37345719 -39625419 -42259200 -45291220 -48721539 -52510130 -56589396 -60882232 -65304890
8449 -65304890 -69740848 -74004303 -77835705 -80956224 -83163149 -84413528 -84846152 -84725278
8441 -84725278 -84330722 -83848992 -83322070 -82673898 -81780074 -80522855 -78805396 -76545656 -73675044
8432 -73675044 -70135318 -65857385 -60737014 -54644748 -47478817 -39225113 -29985382 -19970699
8424 -19970699 -9478927 1137208 11516272 21338926 30356279 38377675 45228719 50711045
8416 50711045 54594760 56656428 56746453 54844656 51066330 45619857 38758407 30768848
8408 30768848 21998814 12880789 3909538 -4436284 -11796792 -18004372 -23081075 -27148571
8400 -27148571 -30293652 -32471909 -33518401 -33264956 -31689977 -29008389 -25655958 -22187794
8392 -22187794 -19147308 -16959406 -15877510 -15984130 -17220854 -19419281 -22322661 -25610445
8384 -25610445 -28942582 -32025512 -34681239 -36886150 -38746845 -40407956 -41935075 -43244000
8376 -43244000 -44120223 -44309262 -43618161 -41978694 -39456532 -36215887 -32465573 -28423465 -24323381
8367 -24323381 -20445245 -17114809 -14637831 -13192410 -12743344 -13029525 -13630918 -14084191 -14002349
8358 -14002349 -13161237 -11536809 -9297616 -6761753 -4320505 -2335353 -1038477 -482746
8350 -482746 -566034 -1108708 -1936395 -2935341 -4079553 -5439418 -7167573 -9450509 -12432975
8341 -12432975 -16148009 -20487555 -25224827 -30074313 -34765757 -39108340 -43021855 -46519602
8333 -46519602 -49650272 -52430651 -54805413 -56650240 -57807753 -58131421 -57515900 -55906885
8325 -55906885 -53299651 -49741857 -45347392 -40312051 -34914785 -29497157 -24427692 -20062143
8317 -20062143 -16702842 -14551641 -13653019 -13838152 -14698871 -15628654 -15950734 -15106675 -12825749
8308 -12825749 -9184469 -4526205 694688 6036421 11105450 15541603 19025653 21333472
8300 21333472 22394867 22305422 21282561 19596157 17507120 15228979 12911489 10638626
8292 10638626 8434472 6278773 4141311 2037426 84859 -1477212 -2339315 -2237202
8284 -2237202 -1078165 993239 3625681 6358844 8723552 10301848 10753794 9841799 7469718
8275 7469718 3728291 -1079975 -6471019 -11885457 -16847262 -21102283 -24660059 -27716059
8267 -27716059 -30497699 -33109066 -35442945 -37202116 -38027231 -37670891 -36122904 -33619145
8259 -33619145 -30542645 -27289481 -24177203 -21428589 -19210468 -17680023 -16997335 -17291177
8251 -17291177 -18595719 -20793697 -23601418 -26612910 -29390194 -31560359 -32879561 -33251871
8243 -33251871 -32719333 -31440524 -29654684 -27619170 -25524471 -23415383 -21154507 -18450474
8235 -18450474 -14949355 -10363027 -4589657 2222190 9694954 17320011 24585784 31076927
8227 31076927 36508249 40699389 43527680 44897737 44744423 43060200 39920169 35475474
8219 35475474 29906801 23368806 15978826 7875375 -689848 -9298356 -17394577 -24384751
8211 -24384751 -29755985 -33172743 -34528317 -33941499 -31700257 -28173708 -23729283 -18685621
8203 -18685621 -13305874 -7811537 -2391458 2806110 7692500 12253987 16552016 20703669
8195 20703669 24842295 29064839 33384481 37713788 41889632 45723349 49044300 51716127
8187 51716127 53627893 54676042 54754066 53761258 51629916 48355512 44012607 38758023 32838721
8178 32838721 26608448 20527833 15118459 10873037 8155587 7127590 7719727 9656735
8170 9656735 12531151 15899763 19361025 22586292 25312629 27325516 28454313 28589532
8162 28589532 27719113 25963438 23572036 20856198 18078653 15365567 12701222 10009884
8154 10009884 7266881 4559130 2050880 -119346 -1929606 -3477600 -4886640 -6179263
8146 -6179263 -7205999 -7676277 -7273877 -5796416 -3254966 103528 3851426 7484019 10531373
8137 10531373 12645703 13649079 13542205 12482059 10734970 8610177 6383950 4233136
8129 4233136 2199535 197517 -1939303 -4392952 -7307282 -10768743 -14820851 -19484552
8121 -19484552 -24750869 -30534915 -36613665 -42589724 -47918883 -52010831 -54369716 -54710394
8113 -54710394 -52997652 -49406438 -44244772 -37878852 -30669692 -22920414 -14851825 -6630669
8105 -6630669 1556906 9436136 16632063 22727797 27356590 30276109 31395600 30762047
8097 30762047 28530346 24934065 20252918 14765879 8693283 2150255 -4863795 -12432712
8089 -12432712 -20664537 -29633962 -39345834 -49715953 -60548055 -71496740 -82041421 -91518833
8081 -91518833 -99237523 -104639295 -107432644 -107639085 -105549052 -101630967 -96443644 -90575562
8073 -90575562 -84602331 -79039525 -74280140 -70534824 -67812995 -65970126 -64803582 -64142581
8065 -64142581 -63882798 -63961933 -64319113 -64888174 -65637560 -66621242 -67988459 -69931339 -72602396
8056 -72602396 -76059570 -80270326 -85154397 -90617512 -96547155 -102780407 -109074809 -115104852
8048 -115104852 -120486564 -124820724 -127747028 -129008263 -128521207 -126434482 -123137654 -119194505
8040 -119194505 -115211212 -111690687 -108933727 -107018303 -105842317 -105184663 -104743927 -104148872
8032 -104148872 -102968695 -100751737 -97091324 -91694241 -84435595 -75401019 -64910308 -53496159
8024 -53496159 -41818833 -30539189 -20204228 -11185254 -3669190 2317436 6865533 10127796
8016 10127796 12265398 13420772 13727543 13339608 12443145 11227442 9824688 8256261 6420994
8007 6420994 4132546 1184496 -2584848 -7241137 -12713721 -18765649 -24989121 -30849336
7999 -30849336 -35780892 -39306742 -41133587 -41196484 -39657067 -36870975 -33330601 -29587043
7991 -29587043 -26170420 -23537550 -22060071 -22038128 -23710973 -27241725 -32668202 -39830574
7983 -39830574 -48309350 -57420137 -66295288 -74041087 -79920952 -83504281 -84735403 -83903416
7975 -83903416 -81522545 -78160949 -74275887 -70112790 -65698782 -60918311 -55625404 -49745329
7967 -49745329 -43343036 -36657340 -30098810 -24199584 -19511631 -16476554 -15308832 -15929632
7959 -15929632 -17971198 -20855448 -23929470 -26611653 -28487190 -29318382 -28993005 -27473520
7951 -27473520 -24792644 -21082808 -16584454 -11591890 -6352855 -985783 4526852 10265069
7943 10265069 16269238 22473358 28705000 34738304 40361506 45422897 49839471 53577952
7935 53577952 56634621 59035525 60854221 62223847 63324645 64350198 65469515 66798169
7927 66798169 68384064 70211902 72225225 74350970 76507539 78598068 80513462 82159408
7919 82159408 83485561 84482848 85149357 85465210 85408906 84999057 84315599 83478155 82606346
7910 82606346 81803719 81177497 80863597 81014232 81736853 83018965 84689765 86442604 87902233
7901 87902233 88705374 88571313 87343452 84981128 81502398 76923970 71260106 64588719
7893 64588719 57117134 49170810 41100717 33176721 25532510 18173981 11026626 3998466
7885 3998466 -2959360 -9818507 -16484240 -22839480 -28784132 -34240369 -39128128 -43338848
7877 -43338848 -46731213 -49150059 -50450262 -50508161 -49224239 -46539762 -42480079 -37203807
7869 -37203807 -31019028 -24347913 -17655727 -11372495 -5826951 -1207631 2434111 5142166
7861 5142166 7009517 8169982 8833825 9326388 10076063 11526338 13991390 17514413 21806386
7852 21806386 26318922 30432250 33661352 35767228 36727118 36611487 35461500 33235810
7844 33235810 29838752 25200628 19369605 12580381 5274108 -1944266 -8406777 -13514746
7836 -13514746 -16861500 -18307762 -17992073 -16282440 -13690339 -10772747 -8046051 -5928603
7828 -5928603 -4715181 -4572579 -5542180 -7544906 -10394535 -13825069 -17529356 -21200609 -24569752
7819 -24569752 -27434615 -29678578 -31278277 -32301930 -32898390 -33274032 -33656567 -34252186 -35207163
7810 -35207163 -36583328 -38355299 -40438307 -42748569 -45275304 -48119694 -51460514 -55448996
7802 -55448996 -60089672 -65183772 -70374450 -75264006 -79528866 -82973865 -85522061 -87174540
7794 -87174540 -87969706 -87948669 -87127006 -85481113 -82954330 -79473000 -74959609 -69346329 -62602557
7785 -62602557 -54775046 -46017372 -36587251 -26816092 -17074085 -7745605 792750 8206162
7777 8206162 14245346 18777424 21783391 23326878 23521867 22524059 20544713 17861162 14795736
7768 14795736 11655820 8657020 5867507 3201011 455758 -2628071 -6319645 -10866492
7760 -10866492 -16474191 -23285547 -31350658 -40586192 -50735644 -61355654 -71850494 -81554261
7752 -81554261 -89835692 -96193125 -100317396 -102116290 -101705580 -99376735 -95550588 -90721477
7744 -90721477 -85390713 -79986797 -74779948 -69821280 -64952986 -59914032 -54504049 -48717570
7736 -48717570 -42777194 -37067061 -32023903 -28034786 -25350552 -24011760 -23806485 -24291777
7728 -24291777 -24885279 -24993691 -24129173 -21980897 -18434748 -13549578 -7504134 -534118 7116828
7719 7116828 15214776 23522323 31770779 39637265 46743872 52692629 57133191 59827183
7711 59827183 60658538 59577935 56532837 51449239 44277176 35055875 23958203 11312868
7703 11312868 -2386285 -16494926 -30271658 -42958777 -53861749 -62413833 -68231532
7696 -68231532 -71161257 -71300822 -68978691 -64691086 -59015228 -52524419 -45723880 -39008182
7688 -39008182 -32627777 -26661556 -21015285 -15470488 -9783163 -3802163 2432601 8647145
7680 8647145 14371024 19055933 22230427 23614077 23136635 20874823 16974329 11622497
7672 11622497 5085005 -2240211 -9822304 -17087019 -23560148 -28974486 -33269212 -36495164
7664 -36495164 -38713007 -39964540 -40320336 -39937092 -39058105 -37950301 -36828854 -35826127 -35017758
7655 -35017758 -34468126 -34244339 -34383804 -34853301 -35554707 -36390873 -37341894 -38483330 -39926886
7646 -39926886 -41731126 -43849260 -46142467 -48436742 -50580816 -52473092 -54047953 -55235134
7638 -55235134 -55924525 -55969712 -55239208 -53688531 -51407519 -48612430 -45590450 -42633183 -39990517
7629 -39990517 -37845191 -36289473 -35301798 -34749287 -34438778 -34201385 -33965476 -33781147 -33789530
7620 -33789530 -34153057 -34975147 -36248181 -37864252 -39686844 -41633325 -43706594 -45957407
7612 -45957407 -48416909 -51056678 -53799707 -56559629 -59270901 -61895488 -64418246 -66843290
7604 -66843290 -69183787 -71431456 -73514123 -75273955 -76493265 -76962053 -76554115 -75277099
7596 -75277099 -73277811 -70801366 -68117150 -65435932 -62845497 -60283776 -57557318 -54407970
7588 -54407970 -50625720 -46186018 -41356896 -36703609 -32950125 -30735463 -30377184 -31761416
7580 -31761416 -34405201 -37637929 -40798191 -43366241 -45012981 -45590556 -45096868 -43632953
7572 -43632953 -41360139 -38459302 -35093726 -31380419 -27383645 -23147812 -18767150 -14450525
7564 -14450525 -10519152 -7309140 -5024682 -3636619 -2896199 -2453093 -1997953 -1345909 -435701
7555 -435701 712043 2013480 3299213 4297918 4683757 4184421 2679698 223176 -3014194
7546 -3014194 -6826421 -11034091 -15514411 -20206615 -25097334 -30192343 -35487626 -40947350
7538 -40947350 -46485085 -51950490 -57141251 -61854709 -65957162 -69424303 -72331779 -74824666
7530 -74824666 -77105941 -79440367 -82126770 -85407351 -89345466 -93744979 -98161354 -101994664
7522 -101994664 -104616251 -105487249 -104252992 -100809268 -95330361 -88242967 -80138635 -71640729
7514 -71640729 -63268219 -55349223 -48015876 -41265140 -35031742 -29224218 -23720214 -18361546
7506 -18361546 -12992621 -7545854 -2129126 2947291 7238873 10309785 11887515 11963715
7498 11963715 10808842 8906457 6834289 5126782 4158618 4085724 4859330 6297919 8183559
7489 8183559 10350452 12740480 15405242 18447836 21927238 25773310 29755367 33515836
7481 33515836 36652082 38821187 39844090 39782446 38956779 37881478 37117980 37086958 37915744
7472 37915744 39399369 41102506 42548001 43388608 43486194 42898813 41825583 40545593 39349219
7463 39349219 38457061 37954846 37788974 37832941 37979924 38198539 38523889 39006872 39667127 40480735
7453 40480735 41405399 42424644 43583609 44990852 46774605 49007064 51634191 54451966
7445 54451966 57145928 59375485 60865624 61476541 61238350 60342936 59083885 57751311 56521882
7436 56521882 55403004 54265523 52944340 51344266 49489085 47490968 45467494 43464320
7428 43464320 41433468 39275497 36908952 34316546 31540967 28639571 25628365 22444064
7420 22444064 18940406 14924154 10228058 4804571 -1194782 -7396152 -13254343 -18154314
7412 -18154314 -21517834 -22888197 -21995795 -18808320 -13545458 -6632265 1400908 10024108
7404 10024108 18770169 27244169 35107895 42069864 47889122 52387660 55472240 57166553
7396 57166553 57631531 57133501 55949354 54261097 52117747 49491831 46381648 42886390
7388 42886390 39216767 35645604 32420117 29665643 27319945 25131963 22735372 19783278
7380 19783278 16109646 11855001 7480003 3634063 934967 -231152 188467 1919513
7372 1919513 4449828 7174125 9554913 11241956 12106878 12196347 11642793 10573591 9047380
7363 9047380 7035085 4445088 1167706 -2894648 -7827012 -13714904 -20634290 -28592963
7355 -28592963 -37445358 -46852267 -56345715 -65474430 -73928469 -81563724 -88344906 -94285225
7347 -94285225 -99426692 -103840392 -107612231 -110813422 -113481845 -115635486 -117314906 -118624671
7339 -118624671 -119731171 -120798351 -121897253 -122959684 -123818536 -124309465 -124363585 -124033570 -123448947
7330 -123448947 -122746908 -122034868 -121401369 -120938598 -120728401 -120788221 -121024157 -121241370 -121220907 -120829440
7320 -120829440 -120108844 -119294304 -118733998 -118733048 -119395895 -120552570 -121808544 -122683495 -122751619 -121704164
7310 -121704164 -119322395 -115424579 -109864379 -102595080 -93740903 -83610076 -72642363 -61335227
7302 -61335227 -50189214 -39675494 -30203983 -22077454 -15440477 -10248735 -6279339 -3179400
7294 -3179400 -530402 2091009 5059442 8654083 13027904 18200679 24066372 30397795
7286 30397795 36851141 42997268 48399723 52721943 55814708 57740005 58722946 59059344
7278 59059344 59020456 58787851 58433947 57947471 57289208 56452627 55502067 54571380 53821806 53372444
7268 53372444 53230333 53257043 53199846 52778302 51773764 50061924 47573974 44235421 39955422
7259 39955422 34697676 28589278 21982919 15419365 9512261 4825930 1800806 730349
7251 730349 1762153 4900552 10005038 16790154 24840481 33657601 42743090 51695869
7243 51695869 60285843 68472136 76354138 84066486 91654294 98983035 105726621 111435809
7235 111435809 115649985 118008848 118336801 116685115 113322321 108677294 103258576 97575157
7227 97575157 92065944 87034987 82603726 78707757 75152524 71706180 68186516 64513596
7219 64513596 60728509 56988967 53543139 50680025 48667102 47693344 47823640 48959444
7211 48959444 50814206 52934212 54785395 55882152 55902399 54747544 52542195 49583124
7203 49583124 46241196 42828487 39473247 36063023 32292200 27798948 22333256 15882629
7195 15882629 8697934 1206582 -6141316 -13011128 -19239331 -24798418 -29716485 -34006466
7187 -34006466 -37631840 -40506604 -42521106 -43591539 -43725649 -43076420 -41943182 -40701352
7179 -40701352 -39691766 -39136644 -39131952 -39702498 -40853535 -42564118 -44734421 -47154078 -49543847
7170 -49543847 -51652971 -53339968 -54576804 -55377779 -55705983 -55415612 -54259622 -51960168 -48317422
7161 -48317422 -43317831 -37196733 -30423120 -23607825 -17372852 -12234897 -8542180 -6472997
7153 -6472997 -6076833 -7326069 -10148300 -14421494 -19934898 -26344444 -33168466 -39856658
7145 -39856658 -45918246 -51046714 -55173514 -58431299 -61065442 -63350881 -65544748 -67868957
7137 -67868957 -70501210 -73559718 -77083444 -81022768 -85251925 -89592667 -93823240 -97666167
7129 -97666167 -100788805 -102858674 -103646955 -103115111 -101418445 -98821703 -95586136 -91900699
7121 -91900699 -87891824 -83692514 -79516813 -75686567 -72589326 -70585156 -69900748 -70548152
7113 -70548152 -72297548 -74722840 -77314702 -79619109 -81337991 -82349777 -82661113 -82344090
7105 -82344090 -81508441 -80309874 -78949426 -77622052 -76425622 -75291224 -73989521 -72213526
7097 -72213526 -69692332 -66289675 -62065380 -57288341 -52385815 -47825579 -43966896 -40951670
7089 -40951670 -38696613 -36985832 -35596840 -34378773 -33251974 -32163342 -31051099 -29839129
7081 -29839129 -28445139 -26788960 -24810597 -22509709 -19993007 -17498093 -15375466 -14036966
7073 -14036966 -13888615 -15257066 -18314983 -23022599 -29112269 -36128857 -43508654 -50663297
7065 -50663297 -57048621 -62223442 -65910164 -68050906 -68831155 -68642784 -67986037 -67348269 -67114531
7056 -67114531 -67540167 -68764258 -70814440 -73580771 -76790128 -80031321 -82843723 -84832698
7048 -84832698 -85763352 -85608527 -84549753 -82932798 -81179588 -79673599 -78658039 -78189562 -78163346
7039 -78163346 -78386023 -78653563 -78804650 -78744440 -78442061 -77902399 -77123026 -76067510 -74682691
7030 -74682691 -72949467 -70924165 -68738492 -66562278 -64550327 -62787216 -61242569 -59760986
7022 -59760986 -58105471 -56037534 -53385832 -50065961 -46057040 -41372302 -36054867 -30199271
7014 -30199271 -23973989 -17619183 -11414397 -5633634 -511412 3768608 7066995 9276914
7006 9276914 10320493 10160737 8826386 6437090 3215528 -518063 -4367820 -7904597
6998 -7904597 -10736295 -12599382 -13438229 -13426668 -12907534 -12270337 -11823605 -11720597 -11962576
6989 -11962576 -12455356 -13066188 -13641309 -13989241 -13871246 -13032027 -11257794 -8414954 -4441518
6980 -4441518 683098 6937136 14205173 22217232 30541746 38659179 46085559 52487254
6972 52487254 57742163 61932681 65277631 68023632 70331513 72204627 73492071 73957047
6964 73957047 73361672 71522475 68330761 63763554 57904081 50964592 43291991 35343405
6956 35343405 27628212 20622051 14673051 9932426 6334777 3632134 1469086 -522133
6948 -522133 -2637292 -5060269 -7879131 -11132143 -14842717 -19022523 -23646308 -28606442
6940 -28606442 -33658143 -38386576 -42238202 -44626564 -45067926 -43281894 -39223596 -33057168
6932 -33057168 -25099463 -15763137 -5522549 5094119 15515778 25181737 33637696 40621338
6924 40621338 46079776 50114263 52899452 54624578 55469315 55604983 55212290 54503400 53721660
6915 53721660 53095318 52757520 52683043 52690145 52512780 51903500 50712714 48906634 46519723
6906 46519723 43574488 40024161 35761513 30689983 24806114 18235473 11202694 3962669
6898 3962669 -3265299 -10337903 -17202607 -23887849 -30461089 -36956302 -43300931 -49286490
6890 -49286490 -54602590 -58912211 -61929663 -63480845 -63544150 -62263068 -59907100 -56772349
6882 -56772349 -53058007 -48788383 -43833889 -38024144 -31287760 -23740174 -15679767 -7509463
6874 -7509463 365686 7619353 14044069 19555128 24172888 27995459 31164388 33820192
6866 33820192 36052270 37863640 39174778 39871322 39872715 39187636 37933318 36315811 34584449
6857 34584449 32983976 31728376 31004684 30988225 31836353 33644936 36389472 39894997 43862319
6848 43862319 47937912 51788988 55153306 57857244 59808494 60969176 61318821 60827547
6840 60827547 59460004 57210856 54150317 50453708 46398461 42322296 38547895 35299331
6832 35299331 32650342 30531961 28789384 27247844 25748989 24145187 22267791 19903673
6824 19903673 16814151 12803339 7799875 1895466 -4685677 -11655638 -18715430 -25570451
6816 -25570451 -31935578 -37563202 -42289862 -46064767 -48933863 -50991476 -52334593 -53042636
6808 -53042636 -53177473 -52785828 -51897300 -50525689 -48677871 -46357910 -43551293 -40197954 -36188150
6799 -36188150 -31406037 -25802209 -19443736 -12506668 -5226736 2142997 9334908 16043232
6791 16043232 21917024 26598856 29795065 31333139 31175789 29405230 26215449 21926036
6783 21926036 16989109 11953474 7385447 3779401 1489259 690717 1374471 3371728
6775 3371728 6403345 10125672 14146977 18017881 21229448 23251596 23613372 21994139
6767 21994139 18284315 12587538 5162457 -3668628 -13596836 -24345596 -35622049 -47039667
6759 -47039667 -58076091 -68109549 -76526084 -82848427 -86833510 -88511501 -88166662 -86270227
6751 -86270227 -83375450 -79995853 -76511591 -73154107 -70076674 -67451811 -65512872 -64506432
6743 -64506432 -64593919 -65766493 -67812439 -70347177 -72899220 -75022042 -76379444 -76768849 -76098956
6734 -76098956 -74363286 -71621422 -67969096 -63497504 -58275491 -52373026 -45895999 -38990695
6726 -38990695 -31815995 -24516222 -17219784 -10061433 -3210553 3114415 8659365 13172084
6718 13172084 16444615 18350350 18886819 18226642 16741777 14957177 13437802 12667479 12977871
6709 12977871 14539858 17391775 21471914 26631103 32617740 39055626 45457427 51303327
6701 51303327 56168224 59840909 62376784 64057415 65272873 66376455 67572177 68877642
6693 68877642 70168407 71274916 72083872 72596966 72920012 73187684 73458352 73627151 73400147
6684 73400147 72349174 70029745 66111519 60468346 53205140 44630567 35192513 25390295
6676 25390295 15686522 6453090 -2028103 -9526127 -15825111 -20723390 -24068600 -25803303
6668 -25803303 -25989467 -24796884 -22468622 -19289688 -15568379 -11616155 -7716025 -4095787
6660 -4095787 -928807 1643789 3501150 4559055 4798747 4281332 3141062 1571893 -178911
6651 -178911 -1812465 -2993360 -3400547 -2820033 -1250415 1036134 3524566 5578511 6604759
6642 6604759 6199092 4227624 821530 -3710280 -9013938 -14810281 -20954832 -27432130
6634 -27432130 -34311524 -41692350 -49649791 -58184664 -67183332 -76394259 -85425475 -93771062
6626 -93771062 -100877556 -106245286 -109530590 -110603244 -109536126 -106541861 -101894393 -95873674
6618 -95873674 -88756136 -80847602 -72526170 -64249455 -56499957 -49684948 -44040964 -39591146
6610 -39591146 -36168438 -33480063 -31181062 -28947113 -26552646 -23941327 -21246782 -18731438
6602 -18731438 -16663717 -15195524 -14295069 -13756681 -13283790 -12618913 -11663243 -10518225 -9427335
6593 -9427335 -8668177 -8470181 -8989915 -10319155 -12486287 -15436492 -19005490 -22915022 -26812755
6584 -26812755 -30356103 -33310832 -35622126 -37425514 -38986356 -40582548 -42375926 -44337156
6576 -44337156 -46268169 -47909322 -49070415 -49721302 -50007906 -50194435 -50561628 -51309512 -52506262
6567 -52506262 -54091755 -55915856 -57792097 -59559720 -61142568 -62579889 -64009575 -65607715
6559 -65607715 -67505159 -69706199 -72040068 -74176509 -75710195 -76273446 -75617088 -73628109
6551 -73628109 -70299962 -65693681 -59918064 -53135031 -45575573 -37538078 -29346946 -21282761
6543 -21282761 -13532679 -6208843 569678 6598885 11596084 15313149 17694268 18971892
6535 18971892 19628660 20238359 21272108 22967190 25306829 28094246 31068766 34013501
6527 34013501 36818775 39477785 42015018 44391634 46461166 48018512 48909455 49119200
6519 49119200 48782875 48122882 47353779 46593012 45807205 44819324 43380140 41268274 38365650
6510 38365650 34682863 30350304 25599661 20736496 16088421 11930565 8420355 5580167
6502 5580167 3338494 1602129 315157 -525533 -898873 -807889 -314382 461188 1366098
6493 1366098 2232504 2855021 2940744 2086223 -167329 -4202737 -10181624 -17966185 -27153302
6484 -27153302 -37202441 -47589921 -57919545 -67957615 -77601460 -86806968 -95502116 -103521001
6476 -103521001 -110596436 -116421300 -120738547 -123395768 -124331125 -123513443 -120890548 -116389897
6468 -116389897 -109981313 -101773069 -92085225 -81446626 -70501879 -59868404 -50011723 -41190822
6460 -41190822 -33480907 -26839864 -21171248 -16356613 -12264352 -8757334 -5702346 -2958782
6452 -2958782 -335125 2451185 5747422 9848308 14843042 20524958 26423881 31938912
6444 31938912 36497914 39681468 41289611 41353398 40094539 37840592 34922294 31594886
6436 31594886 28013997 24260854 20378459 16379628 12224209 7804158 2977488 -2352209
6428 -2352209 -8159176 -14267624 -20374729 -26094183 -30998582 -34665497 -36741520 -37025444
6420 -37025444 -35551124 -32632299 -28826288 -24800526 -21146370 -18234552 -16190444 -14984763
6412 -14984763 -14554731 -14861758 -15856209 -17395073 -19185093 -20796398 -21746109 -21618601 -20174899
6403 -20174899 -17406628 -13514429 -8828369 -3709279 1541293 6753212 11925179 17193200
6395 17193200 22716265 28526432 34430733 40024553 44807914 48348400 50427093 51116142
6387 51116142 50757868 49852052 48900169 48273859 48157355 48574059 49465848 50766670 52420407
6378 52420407 54341792 56371346 58277675 59810710 60763756 61006889 60491379 59245659 57372227
6369 57372227 55036806 52440043 49774714 47181231 44713537 42321827 39857124 37105737
6361 37105737 33857865 29995670 25563225 20778399 15974805 11500104 7614759 4424637
6353 4424637 1860781 -289694 -2301319 -4394427 -6634432 -8902858 -10955476 -12522887
6345 -12522887 -13391679 -13443890 -12673516 -11193929 -9222828 -7032048 -4876960 -2934569 -1271660
6336 -1271660 141406 1362018 2376119 3038022 3112654 2408635 915798 -1141234 -3360944
6327 -3360944 -5298850 -6611947 -7151535 -6978051 -6323427 -5549486 -5117978 -5541173 -7284585
6318 -7284585 -10642912 -15645414 -22033244 -29312608 -36856535 -44013184 -50184713 -54870386
6310 -54870386 -57695886 -58442801 -57058982 -53624238 -48282678 -41186566 -32485810 -22362172
6302 -22362172 -11087210 920752 13071007 24636931 34861263 43098693 48942571
6295 48942571 52289909 53324831 52433907 50095415 46789431 42950281 38951894 35107051
6287 35107051 31667335 28812043 26616191 25008393 23756336 22515404 20937538 18796518
6279 18796518 16073800 12966032 9810096 6964402 4713063 3240863 2665085 3061652
6271 3061652 4440406 6691812 9572581 12770464 16014794 19152960 22139542 24957345
6263 24957345 27538965 29745529 31410882 32423120 32806380 32768163 32684612 33018589 34198748
6254 34198748 36506030 40004332 44532274 49759019 55290590 60787434 66040385 70973282
6246 70973282 75582151 79847869 83661028 86790698 88918999 89737191 89058696 86885018
6238 86885018 83390584 78850680 73568526 67836093 61918461 56034747 50333649 44891683
6230 44891683 39755295 35007320 30807334 27368664 24881664 23432088 22963886 23299994
6222 23299994 24193807 25372281 26555903 27472247 27883183 27621173 26612021 24872164 22489595
6213 22489595 19600226 16358744 12900415 9304912 5584683 1710365 -2339719 -6538913
6205 -6538913 -10811211 -15073720 -19292407 -23509542 -27827238 -32370717 -37266925 -42646391
6197 -42646391 -48639254 -55328730 -62657397 -70331318 -77795830 -84332727 -89255081 -92104891
6189 -92104891 -92753750 -91376217 -88346450 -84130955 -79210711 -74021187 -68895001 -64019278
6181 -64019278 -59436445 -55100416 -50963956 -47048398 -43453048 -40296259 -37623248 -35340853
6173 -35340853 -33226520 -31010080 -28474677 -25510667 -22097364 -18245659 -13956391 -9219954
6165 -9219954 -4039690 1551294 7490616 13693225 20049916 26413376 32577904 38267610
6157 38267610 43151891 46894736 49216423 49931005 48948358 46273944 42043514 36574167
6149 36574167 30360105 23966087 17860625 12289528 7258516 2612773 -1849272 -6287561
6141 -6287561 -10789344 -15394618 -20140638 -25068536 -30163641 -35264344 -40012445 -43894594
6133 -43894594 -46366895 -47010313 -45651016 -42393312 -37552436 -31527185 -24681817 -17286903
6125 -17286903 -9521779 -1511508 6626910 14743294 22631218 30039472 36725837 42537027
6117 42537027 47471397 51674519 55351102 58637337 61518466 63855308 65509851 66489091
6109 66489091 67010610 67443339 68156746 69364961 71043110 72937888 74646738 75731696 75843307
6100 75843307 74823581 72744270 69855347 66470886 62858598 59185785 55525101 51888694
6092 51888694 48263939 44647115 41077178 37655484 34530125 31849633 29727502 28257213
6084 28257213 27567397 27857447 29357210 32207006 36312468 41257783 46346586 50778905
6076 50778905 53888717 55320732 55063737 53352321 50518789 46878535 42687879 38164124
6068 38164124 33524201 28995579 24788862 21066748 17946804 15530172 13913111 13157782
6060 13157782 13243642 14036741 15295551 16711417 17972227 18828219 19132220 18838310 17966134
6051 17966134 16549502 14585783 12005238 8685663 4523025 -470012 -6094944 -11973135
6043 -11973135 -17627769 -22601194 -26552611 -29298375 -30791754 -31067514 -30183536 -28182139
6035 -28182139 -25083992 -20920284 -15793582 -9935290 -3718117 2397321 7962094 12634585
6027 12634585 16225205 18677240 20007327 20239723 19353596 17250594 13757989 8689891
6019 8689891 1965358 -6263136 -15540653 -25144508 -34212688 -41911395 -47576077 -50783832
6011 -50783832 -51357896 -49338918 -44957522 -38613267 -30839878 -22240958 -13406505 -4842902
6003 -4842902 3049562 9941784 15514995 19435630 21411884 21315636 19294050 15791549 11456313
5994 11456313 6969360 2867810 -570751 -3345924 -5657070 -7766398 -9851967 -11898258
5986 -11898258 -13664783 -14756246 -14779554 -13524261 -11081773 -7849053 -4423532 -1442285
5978 -1442285 572856 1319908 749379 -975353 -3569082 -6729514 -10216297 -13881988 -17658903
5969 -17658903 -21523156 -25456287 -29413296 -33299745 -36964123 -40214251 -42858178 -44755910
5961 -44755910 -45860733 -46231772 -46009655 -45362753 -44429446 -43289043 -41976722 -40524788 -38993904
5952 -38993904 -37473883 -36067723 -34888151 -34076634 -33821767 -34343084 -35830968 -38370406 -41890202
5943 -41890202 -46158898 -50819103 -55442229 -59594321 -62906165 -65130464 -66167285 -66058753
5935 -66058753 -64973630 -63196009 -61109322 -59157838 -57781150 -57333877 -58011059 -59804988
5927 -59804988 -62519964 -65852901 -69511562 -73316335 -77237792 -81352428 -85734112 -90330796
5919 -90330796 -94893344 -99003286 -102187581 -104054522 -104383564 -103147344 -100487249 -96672978
5911 -96672978 -92062183 -87059854 -82067164 -77412775 -73281127 -69674106 -66431946 -63296763
5903 -63296763 -59974176 -56170280 -51625119 -46174045 -39832881 -32864306 -25779558 -19257992
5895 -19257992 -14002433 -10575638 -9274641 -10085655 -12723801 -16723649 -21536136 -26605538
5887 -26605538 -31422954 -35562098 -38702744 -40647755 -41340655 -40882866 -39532752 -37658192
5879 -37658192 -35631236 -33698150 -31898132 -30093799 -28106963 -25876154 -23537491 -21390602
5871 -21390602 -19786408 -19000705 -19137597 -20084314 -21532165 -23063577 -24270687 -24847782 -24620740
5862 -24620740 -23525381 -21574561 -18839061 -15435804 -11506270 -7185785 -2586103 2188342
5854 2188342 6997848 11632808 15819739 19271485 21756558 23155134 23477473 22833826 21366782
5845 21366782 19185926 16352871 12926788 9022063 4812943 470203 -3918210 -8377397
5837 -8377397 -13011624 -17947520 -23301507 -29179247 -35680082 -42884076 -50827847 -59488450
5829 -59488450 -68778993 -78540920 -88522440 -98354639 -107550648 -115548508 -121802340 -125904131
5821 -125904131 -127691950 -127288117 -125038315 -121382268 -116729430 -111399092 -105631392 -99635247
5813 -99635247 -93635573 -87895351 -82696120 -78270543 -74708526 -71889858 -69496133 -67110148
5805 -67110148 -64355363 -61007694 -57038556 -52591137 -47918152 -43312926 -39057892 -35399613
5797 -35399613 -32538516 -30609725 -29646834 -29553143 -30116806 -31076666 -32201476 -33334032 -34386706
5788 -34386706 -35319077 -36135396 -36903394 -37757793 -38857496 -40311990 -42127907 -44209118 -46394391
5779 -46394391 -48495380 -50325286 -51741083 -52711476 -53380617 -54075824 -55231290 -57246689 -60336822
5770 -60336822 -64440541 -69237687 -74270089 -79100459 -83418788 -87045633 -89854787 -91684904
5762 -91684904 -92303514 -91448585 -88934866 -84784902 -79326918 -73201984 -67251992 -62309504
5754 -62309504 -58954351 -57320567 -57029230 -57289347 -57148971 -55806706 -52853298 -48344726 -42701219
5745 -42701219 -36514788 -30368507 -24722327 -19857965 -15852359 -12570099 -9692839 -6802044
5737 -6802044 -3499446 483076 5234743 10695642 16736258 23229907 30070104 37126607
5729 37126607 44182298 50913122 56944739 61958776 65775844 68353879 69705558 69806306
5721 69806306 68575951 65959166 62048740 57158363 51786386 46488057 41731547 37814941
5713 37814941 34872264 32933553 31971470 31890151 32473826 33359272 34081908 34181682 33303282
$$ [...]
##END NTUPLES=NMR SPECTRUM
##END=
