##TITLE=31Pdec_DE-41EA_D2O
 D2O, 64 sc
 12.7.2024
##JCAMPDX= 6.0         $$ Bruker NMR JCAMP-DX V2.0
##DATA TYPE= NMR SPECTRUM
##DATA CLASS= NTUPLES
##ORIGIN= UXNMR, Bruker Analytische Messtechnik GmbH
##OWNER= root
$$ XWIN-NMR		Version 3.5
$$ Fri Jul 12 13:44:33 2024 Russian Standard Time (UT+4h)  she@DPX200
##.OBSERVE FREQUENCY= 81.013821
##.OBSERVE NUCLEUS= ^31P
##.ACQUISITION MODE= SIMULTANEOUS
##.ACQUISITION SCHEME= undefined
##.AVERAGES= 64
##.DIGITISER RES= 17
##SPECTROMETER/DATA SYSTEM= spect
##.PULSE SEQUENCE= zgpg30
##.SOLVENT NAME= CDCl3
##.SHIFT REFERENCE= (INTERNAL, CDCl3, 0, 198.062)
##AUDIT TRAIL= $$ (NUMBER, WHEN, WHO, WHERE, WHAT)
$$ ##TITLE= Audit trail, XWIN-NMR		Version 3.5
$$ ##JCAMPDX= 5.01
$$ ##ORIGIN= Bruker BioSpin GmbH
$$ ##OWNER= she
$$ F:/spectra/data/she/nmr/P31/2/pdata/1/auditp.txt
$$ ##AUDIT TRAIL=  $$ (NUMBER, WHEN, WHO, WHERE, WHAT)
(   1,<2024-07-12 13:43:11.29 +0400>,<she>,<DPX200>,
      <created by zg, POWCHK disabled, PULCHK disabled
       configuration hash MD5:
       00 E9 B6 7A A2 85 ED C7 34 08 36 98 17 FE 4E 26
       data hash MD5: 32K
       25 CE 19 E0 2C 66 2E BF 04 E6 8E 93 B1 19 36 60>)
(   2,<2024-07-12 13:43:13.59 +0400>,<she>,<DPX200>,
      <Start of raw data processing
       efp BC_mod = 2 LB = 1.5 FT_mod = 6 PKNL = 1 PHC0 = 2604.541 PHC1 = 101.8871 SI = 64K 
       data hash MD5: 64K
       E9 D5 15 83 78 E7 A7 43 F9 97 86 B9 3B A7 3F 8E>)
(   3,<2024-07-12 13:43:31.29 +0400>,<she>,<DPX200>,
      <pk PHC0 = 64.81285 PHC1 = -92.40002 
       data hash MD5: 64K
       52 1B 2A 2D 3C 37 0E CB 14 88 BC 55 9A 5C EB 37>)
(   4,<2024-07-12 13:43:35.12 +0400>,<she>,<DPX200>,
      <abs ABSG = 5 
       data hash MD5: 64K
       5E C9 7F B2 45 74 44 B0 1D DB 93 F8 8E 68 C0 CD>)
(   5,<2024-07-12 13:43:59.82 +0400>,<she>,<DPX200>,
      <pk PHC0 = -82.71106 PHC1 = 218.7999 
       data hash MD5: 64K
       AD C7 12 66 61 4D 73 E1 E7 60 52 35 A8 D6 29 7E>)
$$ ##END=
$$ 
$$ hash MD5
$$ B6 11 E7 0B C0 F0 9E 6E 1E 80 A8 DA 9E 6C 29 C5
##$RELAX= 
##$RELAX= 
##$RELAX= 
##$RELAX= 
##$RELAX= 
##$RELAX= 
##$RELAX= 
##$RELAX= 
$$ Bruker specific parameters
$$ --------------------------
##$DU= <F:/spectra>
##$EXPNO= 2
##$NAME= <P31>
##$PROCNO= 1
##$TYPE= <nmr>
##$USER= <she>
##$AMP= (0..31)
100 100 100 100 100 100 100 100 100 100 100 100 100 100 100 100 100 100 
100 100 100 100 100 100 100 100 100 100 100 100 100 100 
##$AQSEQ= 0
##$AQ_mod= 1
##$AUNM= <au_zg>
##$AUTOPOS= <>
##$BF1= 81.014009
##$BF2= 200.13
##$BF3= 200.13
##$BF4= 200.13
##$BF5= 200.13
##$BF6= 200.13
##$BF7= 200.13
##$BF8= 200.13
##$BYTORDA= 1
##$CFDGTYP= 0
##$CFRGTYP= 5
##$CHEMSTR= <none>
##$CNST= (0..31)
1 1 145 1 1 1 1 1 1 1 1 1 1 1 1 1 1 1 1 1 1 1 1 1 1 1 1 1 1 1 1 1 
##$CPDPRG= <waltz16>
##$CPDPRG1= <>
##$CPDPRG2= <waltz16>
##$CPDPRG3= <>
##$CPDPRG4= <mlev>
##$CPDPRG5= <mlev>
##$CPDPRG6= <mlev>
##$CPDPRG7= <mlev>
##$CPDPRG8= <mlev>
##$CPDPRGB= <>
##$CPDPRGT= <>
##$D= (0..31)
$$ [...]
##$SUBNAM3= <"">
##$SUBNAM4= <"">
##$SUBNAM5= <"">
##$SUBNAM6= <"">
##$SUBNAM7= <"">
##$SUBNAM8= <"">
##$SUBNAM9= <"">
##$SW= 400.765351723535
##$SWIBOX= (0..15)
0 1 3 0 0 0 0 0 0 0 0 0 0 0 0 0 
##$SW_h= 32467.5324675325
##$TD= 32768
##$TD0= 1
##$TE= 0
##$TE2= 300
##$TE3= 300
##$TEG= 300
##$TL= (0..7)
0 120 53 12 22 120 120 120 
##$TP= (0..7)
150 150 150 150 150 150 150 150 
##$TP07= 0
##$TPNAME0= <>
##$TPNAME1= <>
##$TPNAME2= <>
##$TPNAME3= <>
##$TPNAME4= <>
##$TPNAME5= <>
##$TPNAME6= <>
##$TPNAME7= <>
##$TPOAL= (0..7)
0.5 0.5 0.5 0.5 0.5 0.5 0.5 0.5 
##$TPOFFS= (0..7)
0 0 0 0 0 0 0 0 
##$TUNHIN= 0
##$TUNHOUT= 0
##$TUNXOUT= 0
##$USERA1= <user>
##$USERA2= <user>
##$USERA3= <user>
##$USERA4= <user>
##$USERA5= <user>
##$V9= 5
##$VALIST= <valist>
##$VCLIST= <CCCCCCCCCCCCCCC>
##$VD= 0
##$VDLIST= <DDDDDDDDDDDDDDD>
##$VPLIST= <PPPPPPPPPPPPPPP>
##$VTLIST= <TTTTTTTTTTTTTTT>
##$WBST= 1024
##$WBSW= 4
##$XGAIN= (0..3)
0 0 0 0 
##$XL= 0
##$YL= 0
##$YMAX_a= 5833
##$YMIN_a= -16319
##$ZGOPTNS= <>
##$ZL1= 120
##$ZL2= 120
##$ZL3= 120
##$ZL4= 120
##$ABSF1= 198.0616
##$ABSF2= -202.7028
##$ABSG= 5
##$ABSL= 3
##$ALPHA= 0
##$AQORDER= 0
##$ASSFAC= 0
##$ASSFACI= 0
##$ASSFACX= 0
##$ASSWID= 0
##$AUNMP= <proc_1d>
##$AZFE= 0.1
##$AZFW= 0.5
##$BCFW= 0
##$BC_mod= 2
##$BYTORDP= 0
##$COROFFS= 0
##$CY= -3
##$DATMOD= 1
##$DC= 0
##$DFILT= <>
##$DTYPP= 0
##$F1P= 0
##$F2P= 0
##$FCOR= 1
##$FTSIZE= 65536
##$FT_mod= 6
##$GAMMA= 0
##$GB= 0
##$INTBC= 1
##$INTSCL= 9.790993e-09
##$ISEN= 30
##$LB= 1.5
##$LEV0= 0
##$LPBIN= 0
##$MAXI= 10000
##$MC2= 0
##$MEAN= 0
##$ME_mod= 0
##$MI= 50
##$NCOEF= 0
##$NC_proc= -8
##$NLEV= 6
##$NOISF1= 182.463
##$NOISF2= 159.3651
##$NSP= 0
##$NTH_PI= 0
##$NZP= 0
##$OFFSET= 198.0616
##$PC= 4
##$PHC0= 2586.643
##$PHC1= 228.287
##$PH_mod= 1
##$PKNL= yes
##$PPARMOD= 0
##$PSCAL= 0
##$PSIGN= 0
##$REVERSE= no
##$SF= 81.0140089999434
##$SI= 65536
##$SIGF1= 159.3651
##$SIGF2= -187.1042
##$SINO= 113.3802
##$SIOLD= 16384
##$SREGLST= <1H.CDCl3>
##$SSB= 0
##$STSI= 65536
##$STSR= 0
##$SW_p= 32467.5324675325
##$SYMM= 0
##$S_DEV= 0
##$TDeff= 32768
##$TDoff= 0
##$TI= <>
##$TILT= no
##$TM1= 0
##$TM2= 0
##$TOPLEV= 0
##$USERP1= <user>
##$USERP2= <user>
##$USERP3= <user>
##$USERP4= <user>
##$USERP5= <user>
##$WDW= 1
##$XDIM= 65536
##$YMAX_p= 394147279
##$YMIN_p= -41736146
$$ End of Bruker specific parameters
$$ ---------------------------------
##NTUPLES= NMR SPECTRUM
##VAR_NAME=  FREQUENCY,     SPECTRUM/REAL,   SPECTRUM/IMAG
##SYMBOL=    X,             R,               I
##VAR_TYPE=  INDEPENDENT,   DEPENDENT,       DEPENDENT
##VAR_FORM=  AFFN,          ASDF,            ASDF
##VAR_DIM=   65536,         65536,           65536
##UNITS=     HZ,            ARBITRARY UNITS, ARBITRARY UNITS
##FACTOR=    0.49542278885378, 1,            1
##FIRST=     16045.7642231865, 0,            0
##LAST=      -16421.768244346, 0,            0
##MIN=       -16421.768244346, -41736146,    0
##MAX=       16045.7642231865, 394147279,    0
$$ Real data points
##PAGE= N=1
##DATA TABLE= (X++(R..R)), XYDATA
$$ [...]
$$ plain form
43203 8299918 6105304 4640407 3438809 1710633 -166606 -1201344 -977344 304143
43195 304143 2087429 3168269 2132860 -1049965 -4616384 -6841322 -7333215 -5856781
43187 -5856781 -1425698 5822985 12981992 16711970 16819003 15565278 13795584 10229774
43179 10229774 4990521 1140680 1015324 2740224 2508221 -449745 -3254144 -3717789
43171 -3717789 -3282001 -4595033 -7447180 -8854021 -7088043 -3893015 -1787228 -651088
43163 -651088 1079301 2684778 1591082 -1939609 -3754106 -1463025 1628247 1416272
43155 1416272 -305982 1605852 7284109 11078249 9932215 7568373 8016393 9375049
43147 9375049 7670182 3637019 1117809 471148 -1775397 -7051599 -12533633 -15179168
$$ packed form
43203H299918k194614j464897j201598j728176j877239j034738K24000J281487
43195C04143J783286J080840j035409l182825l566419k224938m91893J476434
43187e856781M431083P248683P159007L729978J07033j253725j769694l565810
43179A0229774n239253l849841j25356J724900k32003k957966k804399m63645
43171c717789M35788j313032k852147j406841J765978L195028K105787J136140
43163f51088J730389J605477j093696l530691j814497K291081L091272k11975
43155A416272j722254J911834N678257L794140j146034k363842M48020J358656
43147I375049j704867m033163k519210o46661k246545n276202n482034k645535
$$ plain form
43139 -15179168 -14684130 -11916965 -7524335 -2998751 -318720 799186 3035061 7458212
43131 7458212 11243251 10897402 6492483 1417049 -1218475 -1139961 -703815 -2560493 -6711950
43122 -6711950 -10051176 -10058079 -8310538 -8141062 -9357629 -8600853 -5295259 -3266558 -4698929
43113 -4698929 -6287663 -4313875 -375451 1634954 1816334 3169700 5695217 6319526
43105 6319526 4513820 3509639 5149195 7388322 8131004 8069806 8096989 7031836 4052425
43096 4052425 886950 -691303 -1526276 -2909259 -3526469 -1346589 2396106 3855872
43088 3855872 1181239 -3548889 -7071142 -7915031 -6462789 -3695658 -660255 1683187
43080 1683187 2815923 2720922 1504485 -764373 -3734548 -6361027 -6931628 -4093273 1434708
$$ packed form
43139a5179168M95038K767165M392630M525584K680031J117906K235875M423151
43131G458212L785039l45849m404919n075434k635524P8514M36146j856678m151457
43122f711950l339226o903J747541J69476j216567P56776L305594K028701j432371
43113d698929j588734J973788L938424K010405J81380J353366K525517O24309
43105F319526j805706j004181J639556K239127P42682o1198K7183j065153k979411
43096D052425l165475j578253q34973j382983o17210K179880L742695J459766
43088C855872k674633m730128l522253q43889J452242K767131L035403K343442
43080A683187J132736r5001j216437k268858k970175k626479n70601K838355N527981
$$ plain form
43071 1434708 6580249 8563187 7821230 7039491 7300565 6978607 4844737 2117123 308626
43062 308626 -887709 -1905963 -1474277 1164955 3655200 2984359 -114982 -2027075 -1371294
43053 -1371294 -498486 -1514101 -3491501 -4672033 -5184834 -6019766 -6778703 -6154237 -4139383
43044 -4139383 -2635811 -3828897 -8081616 -13133935 -15764868 -15051343 -13451466 -13488056 -14156358
43035 -14156358 -12578864 -8635995 -5156815 -3264913 -684539 4015288 8376527 9411101
43027 9411101 7829552 6428146 5819521 4409039 1647458 -1299055 -3661704 -5494000
43019 -5494000 -6255436 -5341589 -4177197 -5523406 -9927465 -14409038 -15490897 -12660064
43011 -12660064 -8487192 -6068751 -6358596 -7276883 -5746261 -1443367 2169050 1855094
$$ packed form
43071A434708N145541J982938p41957p81739K61074l21958k133870k727614j808497
43062C08626j196335j018254M31686K639232K490245o70841l099341j912093O55781
43053a371294Q72808j015615j977400j180532n12801q34932p58937O24466K014854
43044d139383J503572j193086m252719n052319k630933P13525J599877l6590o68302
43035a4156358J577494L942869L479180J891902K580374M699827M361239J034574
43027I411101j581549j401406o08625j410482k761581k946513k362649j832296
43019e494000p61436R13847J164392j346209m404059m481573j081859K830833
43011a2660064M172872K418441k89845r18287J530622M302894L612417l13956
$$ plain form
43003 1855094 -1135748 -2713257 -1333360 653880 1124423 1024389 2167114 4434945
42995 4434945 6578499 8047068 8446794 6605400 2070131 -3153716 -6015906 -5431283
42987 -5431283 -2925798 -691907 88233 -557709 -1842247 -2963112 -3916770 -5199604 -6365553
42978 -6365553 -5777925 -2663481 1260067 3237062 2243066 -414525 -2771217 -3649385 -2884948
42969 -2884948 -1105235 779317 2408508 4041482 5492519 5824535 4865021 4145130 5096135
42960 5096135 6867605 7319136 5888193 3992542 2611701 1127411 -880067 -2194964
42952 -2194964 -1577032 -68381 -271990 -3173978 -6640079 -7639920 -5492426 -2207817 144979
42943 144979 1282821 1531394 209935 -3173572 -6666116 -6942383 -3264867 1124543 2345734
$$ packed form
43003A855094k990842j577509J379897J987240M70543j00034J142725K267831
42995D434945K143554J468569L99726j841394m535269n223847k862190N84623
42987e431283K505485K233891P80140o45942j284538j120865r53658j282834j165949
42978f365553N87628L114444L923548J976995r93996k657591k356692q78168P64437
42969b884948J779713J884552J629191J632974J451037L32016r59514p19891R51005
42960E096135J771470M51531j430943j895651j380841j484290k007478j314897
42952b194964O17932J508651k03609k901988l466101r99841K147494L284609K352796
42943A44979J137842K48573j321459l383507l492544k76267L677516M389410J221191
$$ plain form
42934 2345734 -525766 -5594599 -10133263 -11558644 -8498365 -2808568 817324 -617353
42926 -617353 -4982456 -7823748 -7585336 -6017167 -4508512 -2912861 -1737614 -2382950 -4443439
42917 -4443439 -5316309 -3705463 -1631251 -1720227 -3906783 -5947063 -6189233 -4986126 -4084295
42908 -4084295 -4951225 -6966242 -7532405 -5223593 -2251355 -1800343 -3317273 -3161204 -83022
42899 -83022 3103470 4197285 4615844 5944839 6561671 4334475 459498 -2141720 -2640497
42890 -2640497 -2035268 -621407 1707798 3971089 5426576 7091617 9427474 10020072
42882 10020072 6598506 1157455 -2205915 -2653199 -2411830 -2094325 -186748 3005205
42874 3005205 5070991 5653029 6896667 8885778 8706554 5571643 2961442 3488623 5060686
$$ packed form
42934B345734k871500n068833m538664j425381L060279N689797L625892j434677
42926f17353m365103k841292K38412J568169J508655J595651J175247o45336k060489
42917d443439q72870J610846K074212q8976k186556k040280k42170J203107R01831
42908d084295q66930k015017n66163K308812K972238M51012j516930J56069L078182
42899h3022L186492J093815M18559J328995O16832k227196l874977k601218m98777
42890b640497O05229J413861K329205K263291J455487J665041K335857N92598
42882A0020072l421566n441051l363370m47284K41369L17505J907577L191953
42874C005205K065786N82038J243638J989111j79224l134911k610201N27181J572063
$$ plain form
42865 5060686 4603886 2422417 40665 -3238446 -7969311 -10960868 -8170308 -433873
42857 -433873 7063573 10688880 10942895 9647737 7615122 5404230 3897222 3391283 3595961
42848 3595961 4675772 6991428 10018418 12790966 14884783 15647505 13532622 8258165
42840 8258165 2810653 870121 2598691 5256835 7429347 9774530 11760359 11110553
42832 11110553 7488983 3821782 2486545 2499400 1917203 795785 -5270 -1043447 -3247858
42823 -3247858 -5934381 -7737863 -8573964 -9078180 -9034477 -7930034 -6196635 -4332147 -1638196
42814 -1638196 2451548 6463128 8186957 7656683 7136550 8115858 9731689 10287734 9159562
42805 9159562 7078825 5457434 5373945 6412352 6801050 5531884 3679974 2432354 735432
$$ packed form
42865E060686m56800k181469k381752l279111m730865k991557K790560P736435
42857d33873P497446L625307K54015j295158k032615k210892j507008n05939K04678
42848C595961J079811K315656L026990K772548K093817P62722k114883n274457
42840H258165n447512j940532J728570K658144K172512K345183J985829o49806
42832A1110553l621570l667201j335237J2855n82197j121418q01055j038177k204411
42823c247858k686523j803482q36101n04216M3703J104443J733399J864488K693951
42814a638196M089744M011580J723829n30274n20133R79308J615831N56045j128172
42805I159562k080737j621391q3489J038407L88698j269166j851910j247620j696922
$$ plain form
42796 735432 -3028542 -7391648 -8420725 -4709417 402502 2791182 1999820 343716
42788 343716 -839107 -2053897 -3616615 -4879365 -5494772 -5798551 -5592638 -3839398 -158787
42779 -158787 4158333 7132532 7668290 6038403 3406368 1013604 -781634 -2809724
42771 -2809724 -5760687 -8436725 -8383244 -4929700 -691665 1103735 356490 -141876 1296643
42762 1296643 2903583 1862151 -1851347 -5180108 -5373715 -2807851 -330544 -395286 -2980322
42753 -2980322 -5866205 -6761933 -5450878 -3925942 -4144530 -5752710 -6535293 -5062263 -2109207
42744 -2109207 766151 3101346 5246862 6949134 7368931 6347911 4638733 2835957
42736 2835957 1039018 -283751 -218720 1220295 2527213 2315711 910671 -434149 -1309181
$$ packed form
42796G35432l763974m363106j029077L711308N111919K388680p91362j656104
42788C43716j182823j214790j562718j262750o15407l03779K05913J753240L680611
42779a58787M317120K974199N35758j629887k632035k392764j795238k028090
42771b809724k950963k676038N3481L453544M238035J795400p47245m98366J438519
42762A296643J606940j041432l713498l328761j93607K565864K477307o4742k585036
42753b980322k885883q95728J311055J524936k18588j608180p82583J473030K953056
42744b109207K875358K335195K145516J702272M19797j021020j709178j802776
42736B835957j796939j322769O5031J439015J306918k11502j405040j344820q75032
$$ plain form
42727 -1309181 -2119721 -2680185 -2133450 -418918 1282368 1977795 1880014 1568612 1016800
42718 1016800 155340 -283660 546714 2247018 3216455 2149486 -696029 -3387276 -3263837
42709 -3263837 1183306 8430377 14259076 15066744 11126847 6151963 3764013 4829765
42701 4829765 7714909 10032570 10187886 8330257 6131092 4940322 4144356 2184903
42693 2184903 -917512 -3294545 -3642337 -2553903 -1057401 683642 2437801 3129485
42685 3129485 2230215 929898 736449 1692225 2929313 3946752 4213962 2789398 -694
42676 -694 -1564672 241864 4026056 6468898 6459452 5432568 4150458 2050741 9574
42667 9574 549455 3862676 6138055 3884814 -1579243 -5725130 -5796327 -2748251 625213
$$ packed form
42727a309181q10540n60464N46735J714532J701286O95427r7781l11402n51812
42718A016800q61460m39000Q30374J700304R69437j066969k845515k691247J23439
42709c263837M447143P247071N828699Q07668l939897m974884k387950J065752
42701D829765K885144K317661J55316j857629k199165j190770p95966j959453
42693B184903l102415k377033l47792J088434J496502J741043J754159O91684
42685C129485q99270j300317j93449R55776J237088J017439K67210j424564k790092
42676f94j563978J806536L784192K442842r446j026884j282110k099717k041167
42667I574N39881L313221K275379k253241n464057m145887p1197L048076L373464
$$ plain form
42658 625213 1860057 -8928 -3737213 -6671766 -7408326 -7086741 -7076350 -6491672 -3733827
42649 -3733827 195574 2055819 289334 -2984347 -4410002 -2801012 310338 2702935
42641 2702935 3515562 3571595 3948913 4430618 3893005 2282211 1208972 1952806 3780753
42632 3780753 5124013 5610046 5887805 6162286 6100672 5685332 5073605 4162760 3335908
42623 3335908 3824466 5932527 7657491 6771158 3731985 746005 -1479847 -3765825
42615 -3765825 -5487204 -4431173 -520963 2746417 2243812 -866478 -2690601 -1111091
42607 -1111091 2575741 5731158 6688551 5302815 2400968 -951740 -3881620 -5515501
42599 -5515501 -4835279 -1584576 2701586 5587140 5995942 4879047 3560036 2399344
$$ packed form
42658F25213J234844j868985l728285k934553p36560L21585J0391N84678K757845
42649c733827L929401J860245j766485l273681j425655J608990L111350K392597
42641B702935Q12627N6033L77318M81705n37613j610794j073239P43834J827947
42632C780753J343260M86033K77759K74481o1614m15340o11727r10845q26852
42623C335908M88558K108061J724964q86333l039173k985980k225852k285978
42615c765825j721379J056031L910210L267380n02605l110290j824123J579510
42607a111091L686832L155417R57393j385736k901847l352708k929880j633881
42599e515501O80222L250703M286162K885554M08802j116895j319011j160692
$$ plain form
42591 2399344 1337704 694437 849754 1775535 3206078 4761627 5946246 6699151 7663754
42582 7663754 9010172 9540133 8321996 6613728 6272816 6687520 5634768 3000403 792565
42573 792565 -768676 -3718013 -7794136 -9109566 -5681918 -1176049 -170213 -2205779
42565 -2205779 -3821485 -4294886 -5400155 -6814381 -6056377 -2833570 251863 1590055
42557 1590055 1985009 2054335 1499372 1380246 3695229 7644086 9353861 6683806 1746050
42548 1746050 -2511637 -5501555 -7355956 -6989852 -4085767 -934867 24058 -932824 -2232480
42539 -2232480 -3634728 -5430606 -6603674 -6145139 -5060473 -4780553 -4553006 -2748553 90180
42530 90180 2046824 3117323 4960597 7431909 8151077 6131680 3445035 2339199 2688198
$$ packed form
42591B399344j061640o43267J55317R25781J430543J555549J184619P52905R64603
42582G663754J346418N29961j218137j708268l40912M14704j052752k634365k207838
42573G92565j561241k949337m076123j315430L427648M505869J005836k035566
42565b205779j615706m73401j105269j414226P58004L222807L085433J338192
42557A590055L94954O9326n54963j19126K314983L948857J709775k670055m937756
42548A746050m257687k989918j854401L66104K904085L150900R58925r56882j299656
42539b232480j402248j795878j173068M58535J084666K79920K27547J804453K838733
42530I0180J956644J070499J843274K471312P19168k019397k686645j105836L48999
$$ plain form
42521 2688198 3258555 3562946 3196189 1145180 -2493703 -5427497 -5763306 -4901291 -5811348
42512 -5811348 -8767837 -10910276 -10264507 -8121647 -6573404 -5566085 -3933292 -1942163
42504 -1942163 -692461 353070 2815388 6185245 7551234 5526204 2373840 728351
42496 728351 70232 -1436133 -3183005 -3090033 -1567109 -1213220 -2333535 -2025709 1135392
42487 1135392 4423303 4762355 2801627 1015745 -272094 -2327080 -4724589 -5409303
42479 -5409303 -3695824 -1115543 496159 202259 -1990414 -4506831 -4609937 -1673655
42471 -1673655 867508 -458753 -3928916 -4711828 -1945411 187899 -793145 -1970552
42463 -1970552 -80246 3395223 5199279 5598628 7168677 10084287 12245219 13025737
$$ packed form
42521B688198N70357L04391l66757k051009l638883k933794l35809Q62015r10057
42512e811348k956489k142439O45769K142860J548243J007319J632793J991129
42504a942163J249702J045531K462318L369857J365989k025030l152364j645489
42496G28351o58119j506365j746872R2972J522924L53889j120315L07826L161101
42487A135392L287911L39052j960728j785882j287839k054986k397509o84714
42479e409303J713479K580281J611702k93900k192673k516417j03106K936282
42471a673655K541163j326261l470163p82912K766417K133310r81044j177407
42463a970552J890306L475469J804056L99349J570049K915610K160932P80518
$$ plain form
42455 13025737 13310315 12370394 8483768 2895519 -491978 -387842 150323 -1335219 -3082016
42446 -3082016 -2587814 -1128299 -1848478 -4819560 -7060528 -7008569 -6202246 -6258830 -6445962
42437 -6445962 -5004827 -1337133 3782694 8936860 12459174 13257228 11864575 9815438
42429 9815438 7730804 5254109 3160665 3601009 6920696 9867365 9110246 5744736
42421 5744736 3902916 4979683 5843740 3693285 317624 -473601 1709337 3386534
42413 3386534 1962715 -1212250 -3021504 -2109805 650876 3822853 6123124 6239537
42405 6239537 3627982 -233903 -2479310 -1337887 2384500 6404041 8879406 9047322
42397 9047322 6993558 3869489 1912179 2826109 5637483 7093536 4974061 452136
$$ packed form
42455A3025737K84578r39921l886626n588249l387497J04136N38165j485542j746797
42446c082016M94202J459515p20179k971082k240968N1959Q06323n6584j87132
42437f445962J441135L667694N119827N154166L522314P98054j392653k049137
42429I815438k084634k476695k093444M40344L319687K946669p57119l365510
42421E744736j841820J076767Q64057k150455l375661p91225K182938J677197
42413C386534j423819l174965j809254R11699K760681L171977K300271J16413
42405F239537k611555l861885k245407J141423L722387M019541K475365J67916
42397I047322k053764l124069j957310R13930K811374J456053k119475m521925
$$ plain form
42389 452136 -3541273 -5554658 -5963670 -4694153 -892502 4276416 6583920 2743605
42381 2743605 -5130343 -11140964 -11772245 -8701214 -5329566 -2740450 -226709 2123856
42373 2123856 3456760 3861069 4000203 3351890 797120 -2892168 -5093728 -4615796 -3402421
42364 -3402421 -3858886 -5533576 -5754820 -3129688 677329 2664837 1441779 -1516532
42356 -1516532 -3386715 -3016749 -2293033 -3730786 -6822134 -8254836 -6357998 -3738349
42348 -3738349 -4132740 -7785179 -11557854 -12745287 -10939748 -6821157 -1449532 3164558
42340 3164558 4980587 4030172 2018513 -332288 -3481182 -6242995 -5504069 -423439
42332 -423439 5115452 6382016 2969192 -1617151 -4249518 -4083495 -1405697 2734889
$$ packed form
42389D52136l993409k013385m09012J269517L801651N168918K307504l840315
42381B743605p873948o010621o31281L071031L371648K589116K513741K350565
42373B123856J332904M04309J39134o48313k554770l689288k201560M77932J213375
42364c402421m56465j674690k21244K625132L807017J987508j223058k958311
42356a516532j870183L69966P23716j437753l091348j432702J896838K619649
42348c738349l94391l652439l772675j187433J805539M118591N371625M614090
42340C164558J816029r50415k011659k350801l148894k761813P38926N080630
42332d23439N538891J266564l412824m586343k632367J66023K677798M140586
$$ plain form
42324 2734889 5937683 5883250 2891856 -381468 -1949031 -1952257 -1389843 -959341 -1055958
42315 -1055958 -1333472 -338693 2802301 6476489 8173433 7842564 7498034 7405714 5329769
42306 5329769 471114 -4327841 -5851813 -4186404 -1720587 -148654 107970 -847497
42298 -847497 -2048979 -1994754 -904915 -1119229 -3413636 -4613985 -1496592 4027322 6667631
42289 6667631 4545720 1363879 1160295 3293305 3961253 1289132 -2481455 -3509059
42281 -3509059 -440927 3957248 5404208 2581835 -1530558 -3170421 -1560066 1682881
42273 1682881 5375757 9094353 11668229 11832735 10300058 9056151 8521767 7450440
42265 7450440 5729746 4941959 5575683 5990910 5208757 4680747 5830350 7422106 7067330
$$ packed form
42324B734889L202794n4433k991394l273324j567563l226N62414M30502r6617
42315a055958k77514R94779L140994L674188J696944l30869l44530r2320k075945
42306E329769m858655m798955j523972J665409K465817J571933K56624r55467
42298h47497j201482N4225J089839k14314k294407j200349L117393N523914K640309
42289F667631k121911l181841k03584K133010O67948k672121l770587j027604
42281c509059L068132M398175J446960k822373m112393j639863J610355L242947
42273A682881L692876L718596K573876J64506j532677j243907n34384j071327
42265G450440j720694p87787O33724M15227p82153n28010J149603J591756l54776
$$ plain form
42256 7067330 4475787 1817963 1284422 3123770 5673280 6888317 6355165 5768038 6508349
42247 6508349 7183035 5397439 1851901 47763 1138332 1904680 -405074 -3803623
42239 -3803623 -4664460 -3048152 -1780356 -1513977 -344659 1844393 2287824 -355056 -3435484
42230 -3435484 -3808835 -2102718 -1653851 -4077300 -7460585 -8743250 -6878344 -3605075
42222 -3605075 -1625701 -2123112 -3995561 -5511625 -6275883 -7014460 -7861404 -7997018 -7171126
42213 -7171126 -6533322 -7267815 -8923532 -9765159 -8683895 -6395867 -4722134 -4777513 -5842809
42204 -5842809 -6044386 -4217865 -1083458 1345646 1307897 -1582623 -6095096 -9962935 -11186856
42195 -11186856 -9226049 -4890022 670586 6164759 9582341 8904412 4231870 -1692294
$$ packed form
42256G067330k591543k657824n33541J839348K549510J215037n33152n87127P40311
42247F508349O74686j785596l545538j804138J090569P66348k309754l398549
42239c803623q60837J616308J267796K66379J169318K189052M43431k642880l080428
42230c435484l73351J706117M48867k423449l383285j282665J864906L273269
42222c605075J979374m97411j872449j516064p64258p38577q46944j35614Q25892
42213g171126O37804p34493j655717q41627J081264K288028J673733n5379j065296
42204e842809k01577J826521L134407K429104l7749k890520m512473l867839j223921
42195a1186856J960807M336027N560608N494173L417582o77929m672542n924164
$$ plain form
42187 -1692294 -5926033 -7603575 -7256387 -5262915 -2413405 -902363 -2473351 -5500109
42179 -5500109 -5938599 -2090042 2860539 4205730 1036251 -2881313 -3503219 -757232
42171 -757232 2270986 3651623 4431274 5685717 5795139 2793288 -1752001 -4264583 -4472128
42162 -4472128 -5750409 -9229360 -11204397 -8591435 -3659372 -217215 2077254 5569106
42154 5569106 8840898 7995121 3134826 -1115322 -1978692 -1299771 -1218329 -1061434 141465
42145 141465 1570486 2566920 3578444 3851147 1496832 -2580233 -4326053 -2182371 325252
42136 325252 163080 -445704 1893803 5853906 7523119 6357893 4916938 4035929 2370638
42127 2370638 73418 -985814 -623272 -575584 -1207069 -1038140 277357 1394735 1848880
$$ packed form
42187a692294m233739j677542L47188J993472K849510J511042j570988l026758
42179e500109m38490L848557M950581J345191l169479l917564o21906K745987
42171g57232L028218J380637P79651J254443J09422l001851m545289k512582k07545
42162d472128j278281l478951j975037K612962M932063L442157K294469L491852
42154E569106L271792q45777m860295m250148q63370O78921Q1442J56895J202899
42145A41465J429021R96434J011524K72703k354315m077065j745820K143682K507623
42136C25252j62172o08784K339507L960103J669213j165226j440955q81009j665291
42127B370638k297220j059232L62542M7688o31485J68929J315497J117378M54145
$$ plain form
42118 1848880 2288995 1985609 -680425 -4553002 -5761411 -2885799 592019 764531 -1806335
42109 -1806335 -3515212 -2616181 -918145 -1225073 -4252026 -7852984 -9072449 -7474211
42101 -7474211 -6006296 -7377806 -10233731 -10908198 -8580492 -6120080 -5693214 -6433808 -7185133
42092 -7185133 -8438912 -10005912 -9629442 -6199503 -2200929 -565952 -761270 -313890 1369959
42083 1369959 3298575 5660826 9271014 12791995 13439060 10703478 7182164 5431673
42075 5431673 5726125 6839142 7139904 4998933 260532 -4450731 -6025039 -4915026
42067 -4915026 -4719532 -7017740 -8981170 -7572853 -4049533 -2101772 -2752323 -3541855 -2480041
42058 -2480041 -524960 448166 478987 1167076 3153195 4958525 4423863 971141 -3653883
$$ packed form
42118A848880M40115l03386k666034l872577j208409K875612L477818J72512k570866
42109a806335j708877Q99031J698036l06928l026953l600958j219465J598238
42101g474211J467915j371510k855925o74467K327706K460412M26866p40594p51325
42092g185133j253779j567000L76470L429939L998574J634977j95318M47380J683849
42083A369959J928616K362251L610188L520981O47065k735582l521314j750491
42075E431673K94452J113017L00762k140971m738401m711263j574308J110013
42067d915026J95494k298208j963430J408317L523320J947761o50551p89532J061814
42058b480041J955081R73126L0821O88089J986119J805330n34662l452722m625024
$$ plain form
42049 -3653883 -6866520 -7473342 -6324286 -4795038 -3170797 -1041365 1164485 2140423
42041 2140423 1486692 619515 1172435 3003583 4548711 4721582 3507816 1065414 -2211044
42032 -2211044 -4442158 -2884925 2792184 8923113 11325906 10076871 9177449 11482498
42024 11482498 15686485 18709827 19182039 17448608 13785424 8618692 3948496 2488971
42016 2488971 4802697 8359149 10002664 8772514 6003715 3349987 1338303 -401299
42008 -401299 -2132219 -3501372 -3869625 -2920629 -898725 1548246 3584381 4495482 4236672
41999 4236672 3632605 3561815 3919939 3938985 3587703 3829954 5019389 5818068 4696951
41990 4696951 2274723 1095253 2684886 5487284 6378394 4063447 370486 -1924848
$$ packed form
42049c653883l212637o06822J149056J529248J624241K129432K205850R75938
42041B140423o53731q67177N52920J831148J545128J72871j213766k442402l276458
42032b211044k231114J557233N677109O130929K402793j249035q99422K305049
42024A1482498M203987L023342M72212j733431l663184n166732m670196j459525
42016B488971K313726L556452J643515j230150k768799k653728k011684j739602
42008d01299j730920j369153l68253R48996K021904K446971K036135R11101k58810
41999D236672o04067p0790L58124J9046l51282K42251J189435P98679j121117
41990D696951k422228j179470J589633K802398Q91110k314947l692961k295334
$$ plain form
41982 -1924848 -1930032 -854942 -53755 90916 -469800 -1746695 -2883092 -2467311 -679330
41973 -679330 228830 -901713 -1740791 564149 4764965 6611732 4741308 2674070 3893905
41964 3893905 7368401 9651474 9596696 8866594 8743230 8511211 6978281 4333903 2234731
41955 2234731 2294281 4200065 5510562 4252377 1442072 -481274 -1393150 -3249898 -5955206
41946 -5955206 -6591547 -3954771 -637562 1393342 4091250 9314199 14372463 15306232
41938 15306232 12543491 9367352 6486254 2576582 -951825 -795696 2640731 5275444
41930 5275444 5600002 6293135 8465084 8908046 5144628 -697032 -5378913 -8487884 -10492465
41921 -10492465 -10233990 -7307713 -4188348 -2844590 -1426505 2537281 7395821 9006307
$$ packed form
41982a924848n184J075090Q01187J44671n60716j276895j136397M15781J787981
41973f79330R08160j130543q39078K304940M200816J846767j870424k067238J219835
41964C893905L474496K283073n4778p30102j23364k32019j532930k644378k099172
41955B234731N9550J905784J310497j258185k810305j923346r11876j856748k705308
41946e955206o36341K636776L317209K030904K697908N222949N058264R33769
41938A5306232k762741l176139k881098l909672l528407J56129L436427K634713
41930E275444L24558O93133K171949M42962l763418n841660m681881l108971k004581
41921a0492465K58475K926277L119365J343758J418085L963786M858540J610486
$$ plain form
41913 9006307 6032742 948640 -3305526 -5289982 -4644431 -2087279 610842 2234596
41905 2234596 2967036 2778703 938150 -1519337 -1563531 1168748 2191632 -1983343 -8054596
41896 -8054596 -9998411 -7347233 -4993539 -5596170 -6879183 -6611352 -5775537 -5777555 -6267271
41887 -6267271 -6977437 -8553532 -10446374 -10909300 -9966587 -9312105 -8478453 -4804313 1257512
41878 1257512 4628003 2037373 -2990693 -4537553 -1419421 3015592 6256416 8350848
41870 8350848 9204743 7578708 3229279 -1984751 -5563402 -5914658 -2916187 1677160
41862 1677160 4691541 3825858 -244904 -4552205 -6409072 -5204277 -2567486 -1173461
41854 -1173461 -2376986 -4652474 -5542103 -5245461 -6327465 -9374962 -11520223 -10670929 -8601120
$$ packed form
41913I006307k973565n084102m254166j984456O45551K557152K698121J623754
41905B234596P32440j88333j840553k457487m4194K732279J022884m174975o071253
41896h054596j943815K651178K353694o02631j283013K67831Q35815k018m89716
41887f267271p10166j576095j892842m62926R42713O54482Q33652L674140O061825
41878A257512L370491k590630n028066j546860L118132M435013L240824K094432
41870H350848Q53895j626035m349429n214030l578651l51256K998471M593347
41862A677160L014381q65683m070762m307301j856867J204795K636791J394025
41854a173461j203525k275488q89629K96642j082004l047497k145261Q49294K069809
$$ plain form
41845 -8601120 -7634884 -6661107 -3574194 -56106 -183116 -4487028 -8572893 -8159693 -3336624
41836 -3336624 2353042 5129301 3459358 -507296 -2111985 976177 5304435 5580371
41828 5580371 1944988 115768 3663251 9554090 12949167 13290770 13165262 13588694 13549387
41819 13549387 12866500 12347437 11475769 8659181 4064663 218014 -600078 1803136 6087710
41810 6087710 10038820 10847784 7122083 1441813 -1098405 1701721 6548846 8797965
41802 8797965 7845347 6545392 6279778 5280567 2163658 -1363342 -2836424 -2579039 -2971602
41793 -2971602 -4644204 -5229583 -2378717 3058830 7509262 7896132 4112680 -1269627
41785 -1269627 -5363642 -7128437 -7395669 -7130991 -6397852 -5243393 -4514112 -4727897 -4879608
$$ packed form
41845h601120R66236R73777L086913L518088j27010m303912m085865M13200M823069
41836c336624N689666K776259j669943l966654j604689L088162M328258K75936
41828E580371l635383j829220L547483N890839L395077L41603j25508M23432l9307
41819A3549387o82887n19063q71668k816588m594518l846649q18092K403214M284574
41810F087710L951110Q08964l725701n680270k540218K800126M847125K249119
41802H797965r52618j299955k65614r99211l116909l527000j473082K57385l92563
41793b971602j672602n85379K850866N437547M450432L86870l783452n382307
41785a269627m094015j764795k67232K64678P33139J154459P29281k13785j51711
$$ plain form
41776 -4879608 -3864846 -2784094 -4075054 -8041355 -11794357 -12282857 -9195843 -4407277
41768 -4407277 102747 3145447 4567351 5508653 7244400 9023537 8463476 4966436
41760 4966436 1064111 -912564 -1714754 -2955337 -3813902 -2555287 -140067 770318 117311
41751 117311 687381 3548581 5964155 5011081 1255822 -2459744 -4371585 -4626542 -3882448
41742 -3882448 -2497442 -830581 481970 739827 -112136 -781570 445643 3022507 3418820
41733 3418820 -930276 -7430264 -10493240 -8090557 -3752758 -1502819 -1411535 -1437250 -1156797
41724 -1156797 -1452174 -2030333 -1596273 94404 2066857 3549675 4201368 3468774 1133550
41715 1133550 -1790182 -3856837 -4647428 -4565118 -3684694 -1858307 375074 1988260 2435751
$$ packed form
41776d879608J014762J080752j290960l966301l753002m88500L087014M788566
41768d407277M510024L042700J421904R41302J735747J779137n60061l497040
41760D966436l902325j976675q02190j240583q58565J258615K415220R10385o53007
41751A17311N70070K861200K415574r53074l755259l715566j911841k54957P44094
41742c882448J385006J666861J312551K57857q51963o69434J227213K576864L96313
41733C418820m349096o499988l062976K402683M337799K249939R1284k5715K80453
41724a156797k95377n78159M34060J690677J972453J482818O51693p32594k335224
41715A133550k923732k066655p90591Q2310Q80424J826387K233381J613186M47491
$$ plain form
41706 2435751 1813953 502052 -692035 -672904 660025 1641374 348056 -3149713 -6636187
41697 -6636187 -7744577 -5846234 -2467577 -257657 -959099 -3807993 -6268914 -6593918
41689 -6593918 -5131495 -3134238 -1394906 -409245 -598405 -1567920 -2105233 -1617326 -685245
41680 -685245 277068 1738965 3907205 6246238 8722990 11832188 14561939 14376334 10649611
41671 10649611 6237420 3943498 3244014 2408397 1863614 2874057 4502507 4855095 4286871
41662 4286871 4452606 5030435 4352816 2541396 898803 -1091014 -4570384 -7511084 -6246996
41653 -6246996 -1326419 2247088 1919526 980746 3196531 7401126 9838558 9224964 6943887
41644 6943887 4296420 2050378 1092149 1195931 429794 -2187853 -4670065 -4557709 -2176373
$$ packed form
41706B435751o21798j311901j194087J9131J332929R81349j293318l497769l486474
41697f636187j108390J898343L378657K209920p01442k848894k460921l25004
41689f593918J462423J997257J739332R85661j89160r69515n37313M87907R32081
41680f85245R62313J461897K168240K339033K476752L109198K729751j85605l726723
41671A0649611m412191k293922o99484q35617n44783J010443J628450L52588n68224
41662D286871J65735N77829o77619j811420j642593j989817l479370k940700J264088
41653f246996M920577L573507l27562r38780K215785M204595K437432o13594k281077
41644F943887k647467k246042r58229J03782p66137k617647k482212J12356K381336
$$ plain form
41635 -2176373 413183 2365662 3935236 4632515 3748024 1981248 570852 -603433
41627 -603433 -2356083 -4366149 -5690002 -6364793 -6924595 -7223169 -7346425 -8489402 -10871123
41618 -10871123 -11901653 -8871964 -2681058 3615222 9137438 14978647 20007618 20554062
41610 20554062 15379444 8149015 3474232 2501640 3554443 4981395 5778332 5175085
41602 5175085 3536279 2624846 3355090 4145788 3069775 992199 920778 4318014 9289096
41593 9289096 12547684 12404445 9857935 7413553 6775221 7167668 6109149 2386022 -2040511
41584 -2040511 -3920747 -2476137 -371151 -613862 -3301682 -6076077 -7061093 -6180113 -3910092
41575 -3910092 -492428 2972889 4363981 3089954 1728795 3083577 6191397 7611382
$$ packed form
41635b176373K589556J952479J569574O97279q84491j766776j410396j174285
41627f03433j752650k010066j323853o74791n59802k98574j23256j142977k381721
41618a0871123j030530L029689O190906O296280N522216N841209N028971N46444
41610B0554062n174618p230429m674783r72592J052803J426952P96937o03247
41602E175085j638806r11433P30244P90698j076013k077576p1421L397236M971082
41593I289096L258588j43239k546510k444382o38332L92447j058519l723127m426533
41584b040511j880236J444610K104986k42711k687820k774395r85016Q80980K270021
41575c910092L417664L465317J391092j274027j361159J354782L107820J419985
$$ plain form
41567 7611382 6496937 5539174 6272780 6508585 4003590 -42407 -3252641 -5341143 -6574807
41558 -6574807 -5426632 -1209289 2752153 2596017 -354858 -1428035 254098 817003
41550 817003 -1821523 -4870562 -5424625 -4333532 -3501922 -2835481 -1969182 -1856709 -2376575
41541 -2376575 -1383510 1362726 2355571 -498487 -3566741 -1983587 3498244 7902945
41533 7902945 8846075 8109477 7341288 6215650 4867673 4612925 5692651 6924668 7675830
41524 7675830 7675089 5328830 -504587 -7080771 -9723550 -7886607 -5817584 -6213428 -6858178
41515 -6858178 -5243871 -2895085 -2349643 -2729776 -1763585 -381064 -1538203 -4962578 -6453277
41506 -6453277 -3130456 2793191 6387188 4921621 -153521 -5218632 -7833158 -8350303
$$ packed form
41567G611382j114445r57763P33606K35805k504995m045997l210234k088502j233664
41558f574807J148175M217343L961442j56136k950875j073177J682133N62905
41550H17003k638526l049039n54063J091093Q31610O66441Q66299J12473n19866
41541b376575R93065K746236R92845k854058l068254J583154N481831M404701
41533G902945R43130p36598p68189j125638j347977k54748J079726J232017P51162
41524G675830p41k346259n833417o576184k642779J836943K069023l95844o44750
41515f858178J614307K348786N45442l80133R66191J382521j157139l424375j490699
41506f453277L322821N923647L593997j465567n075142n065111k614526n17145
$$ plain form
41498 -8350303 -8547625 -9075985 -8939760 -7403910 -5253212 -3712622 -3181521 -3590535 -4853763
41489 -4853763 -6200159 -6229019 -4644249 -2930193 -2267304 -1770677 56255 3071652 5967723
41480 5967723 8152355 9837976 10962047 11275751 10802349 9065702 4910877 -1365734
41472 -1365734 -6745738 -8348765 -6959629 -5729851 -5892785 -5949734 -4779433 -3078842 -1538124
41463 -1538124 -4661 1002931 284402 -1647357 -2302571 -541590 1675201 2192276 1646029
41454 1646029 1967685 3248538 3924914 3356598 2570551 2708322 3965486 5939048 8111322
41445 8111322 9999606 11270568 11561386 10254868 7216324 3780915 1815738 1472683
41437 1472683 1139742 2135 -900089 -781118 -461747 -541110 -20921 1748163 3343217
$$ packed form
41498h350303j97322n28360J36225J535850K150698J540590N31101m09014j263228
41489d853763j346396k8860J584770J714056O62889M96627J826932L015397K896071
41480E967723K184632J685621J124071L13704m73402j736647m154825o276611
41472a365734n380004j603027J389136J229778j62934n6949J170301J700591J540718
41463a538124J533463J007592p18529j931759o55214J760981K216791N17075n46247
41454A646029L21656J280853O76376n68316p86047J37771J257164J973562K172274
41445H111322J888284J270962K90818j306518l038544l435409j965177l43055
41437A472683l32941j137607r02224J18971L19371p9363N20189J769084J595054
$$ plain form
41428 3343217 3199169 1829513 346224 -1672840 -4626154 -6651859 -5696956 -2908332
41420 -2908332 -1136706 -696188 421047 2523355 3709289 3467376 3381755 3621277 2116177
41411 2116177 -1609442 -5021551 -6529998 -7685748 -9424989 -9325293 -5572585 -1106383
41403 -1106383 -141578 -2007802 -2143056 1351614 5650122 7855397 8552901 9779606 11827079
41394 11827079 13344903 13182206 11153619 7977817 5139571 4075561 5039254 7141230
41386 7141230 9324677 10728980 10693460 9483109 8494720 8440560 7785684 4526864 -764463
41377 -764463 -5348008 -7656286 -8503622 -8948487 -8854603 -7933941 -6391270 -3973521 -112573
41368 -112573 4329907 7197110 7706330 7231460 6535238 4311588 99614 -3242775 -2423638
$$ packed form
41428C343217j44048j369656j483289k019064k953314k025705R54903K788624
41420b908332J771626M40518J117235K102308J185934k41913q5621K39522j505100
41411B116177l725619l412109j508447j155750j739241R9696L752708M466202
41403a106383R64805j866224j35254L494670M298508K205275O97504J226705K047473
41394A1827079J517824j62697k028587l175802k838246j064010R63693K101976
41386G141230K183447J404303l5520j210351r88389n4160o54876l258820n291327
41377g64463m583545k308278q47336m44865R3884R20662J542671K417749L860948
41368a12573M442480K867203N09220m74870o96222k223650m211974l342389Q19137
$$ plain form
41359 -2423638 1787648 5268269 5473538 3611823 1932884 1006590 363780 1039 -125637
41350 -125637 -1136928 -4238397 -8702987 -11855831 -11496094 -7931192 -3310175 666343
41342 666343 3779428 6227762 7602427 7631081 7283542 8036072 10075681 12035468 12445811
41333 12445811 10726273 7103851 2765679 -47737 312170 2721602 4106507 3018897
41325 3018897 1164264 888234 2649027 5680178 9312016 12223855 12007941 7516039
41317 7516039 858613 -4612978 -7616770 -8795924 -8469119 -6743681 -5124486 -5383117
41309 -5383117 -6770421 -6673808 -4348043 -1834599 -780697 -586007 -386076 -594651 -1365312
41300 -1365312 -1606322 -934204 -767281 -1915521 -2819359 -1983262 -487083 139577 1051983
$$ packed form
41359b423638M211286L480621K05269j861715j678939r26294o42810l62741j26676
41350a25637j011291l101469m464590l152844L59737L564902M621017L976518
41342F66343L113085K448334J374665K8654l47539P52530K039609J959787M10343
41333A2445811j719538l622422m338172k813416L59907K409432J384905j087610
41325C018897j854633k76030J760793L031151L631838K911839k15914m491902
41317G516039o657426n471591l003792j179154L26805J725438J619195k58631
41309e383117j387304R6613K325765K513444J053902J94690J99931k08575p70661
41300a365312k41010O72118J66923j148240r03838Q36097J496179O26660R12406
$$ plain form
41291 1051983 4260266 8507753 10197489 8532416 6634357 6723967 7096050 5471811 2880786
41282 2880786 1902427 2697949 3354247 3252401 3440178 3896503 3093556 843494 -726056
41273 -726056 -150080 1233446 1449926 621612 -156210 -1371969 -4236389 -7731292 -8925977
41264 -8925977 -6665439 -2994942 -207311 1678934 3355904 3926251 2200399 -548045
41256 -548045 -1363304 667662 3200588 3767518 2861368 3025468 5606513 9225813 11132722
41247 11132722 9580697 5289855 1133128 61368 2656599 6635656 8967954 8326253
41239 8326253 5415712 1689963 -1390386 -2309985 -200715 3845685 7157825 8043439
41231 8043439 7421980 7196023 7778210 8443242 9420947 11580682 13840793 13179684 8503575
$$ packed form
41291A051983L208283M247487J689736j665073j898059Q9610L72083j624239k591025
41282B880786r78359P95522O56298j01846J87777M56325q02947k250062j569550
41273g26056N75976J383526K16480q28314p77822j215759k864420l494903j194685
41264h925977K260538L670497K787631J886245J676970N70347j725852k748444
41256e48045q15259K030966K532926N66930r06150J64100K581045L619300J906909
41247A1132722j552025m290842m156727j071760K595231L979057K332298o41701
41239H326253k910541l725749l080349r19599K109270M046400L312140Q85614
41231H043439o21459k25957N82187O65032R77705K159735K260111o61109m676109
$$ plain form
41222 8503575 2746567 -591139 -1572432 -2441823 -3440478 -2910827 -1102946 -537821 -1889154
41213 -1889154 -2522536 -541074 2280425 3402183 3167378 3460328 4608302 6016616 8348359
41204 8348359 12305424 16129883 17052568 14889445 11883460 9406315 7227985 5655003
41196 5655003 5576665 6170687 5211152 2276663 -572686 -1820643 -1998885 -1751859 -878411
41187 -878411 -33362 -817129 -3025452 -4198314 -3224815 -2064881 -2399583 -2989116 -2241323
41178 -2241323 -1028395 -592460 132772 2175069 3331454 901888 -3332841 -4662620
41170 -4662620 -2019231 560417 -180528 -2643811 -3739471 -3540518 -4152815 -5638923 -5892373
41161 -5892373 -4262268 -2869800 -3584275 -5325694 -5637243 -4054595 -2323803 -1414329 -153876
$$ packed form
41222H503575n757008l337706r81293q69391r98655N29651J807881N65125j351333
41213a889154o33382J981462K821499J121758k34805K92950J147974J408314K331743
41204H348359L957065L824459R22685k163123l005985k477145k178330j572982
41196E655003p8338N94022r59535k934489k849349j247957j78242K47026Q73448
41187h78411Q45049p83767k208323j172862R73499J159934l34702n89533P47793
41178b241323J212928M35935P25232K042297J156385k429566m234729j329779
41170d662620K643389K579648p40945k463283j095660J98953o12297j486108k53450
41161e892373J630105J392468p14475j741419l11549J582648J730792R09474J260453
$$ plain form
41152 -153876 2366564 4751692 5322985 4811802 4648670 3513808 -1122607 -7972308 -12139334
41143 -12139334 -11522457 -9423986 -8905384 -8349908 -5740346 -3761825 -5981960 -10184265
41135 -10184265 -10762828 -6903830 -3281725 -2743672 -3528885 -4448596 -7344854 -12289009 -15237817
41126 -15237817 -13667665 -10710691 -10155710 -10511401 -8013665 -3122996 377159 1451642
41118 1451642 2633724 5062576 6689767 6085619 4781896 4620947 5158748 5033316 4221280
41109 4221280 3610928 3368269 2876337 1910071 1197685 1758124 3599544 5072450 4202501
41100 4202501 1061404 -2069304 -3486214 -3836442 -4200204 -3981242 -2466562 -1128896 -1869203
41091 -1869203 -3636281 -3584848 -1598209 -759792 -2554770 -4322655 -3045159 424615 2866762
$$ packed form
41152a53876K520440K385128N71293n11183j63132j134862m636415o849701m167026
41143a2139334O16877K098471N18602N55476K609562J978521k220135m202305
41135a0184265n78563L858998L622105N38053p85213r19711k896258m944155k948808
41126a5237817J570152K956974N54981l55691K497736M890669L500155J074483
41118A451642J182082K428852J627191o04148j303723j60949N37801j25432q12036
41109D221280o10352k42659m91932r66266p12386N60439J841420J472906q69949
41100D202501l141097l130708j416910l50228l63762K18962J514680J337666p40307
41091a869203j767078N1433J986639Q38417j794978j767885J277496L469774K442147
$$ plain form
41082 2866762 3014057 2326366 2309208 3173393 4959774 7961956 11401562 13076163 11396931
41073 11396931 7326282 3575771 2026231 2363052 3011091 2723653 1155221 -1281729
41065 -1281729 -3361498 -3324100 -384814 3838860 6383772 5860274 3568884 1462818 152000
41056 152000 -458680 62867 1923639 4047786 5295512 6148186 7637624 9058831 8512069
41047 8512069 5690940 2497799 644340 -24749 -631150 -1913077 -3879980 -5681677
41039 -5681677 -5954262 -4536433 -3398665 -4171373 -5319021 -4231670 -1925565 -2449130 -6815604
41030 -6815604 -10853945 -10858228 -8343092 -6706300 -5886243 -3686581 -485077 1298468 1624865
41021 1624865 2884517 5484787 6910634 5783556 3646374 1771634 -647958 -3615985
$$ packed form
41082B866762J47295o87691j7158Q64185J786381L002182L439606J674601j679232
41073A1396931m070649l750511j549540L36821O48039k87438j568432k436950
41065a281729k079769L7398K939286M223674K544912n23498k291390k106066j310818
41056A52000o10680N21547J860772K124147J247726Q52674J489438J421207n46762
41047H512069k821129l193141j853459o69089o06401j281927j966903j801697
41039e681677k72585J417829J137768p72708j147648J087351K306105n23565m366474
41030f815604m038341m283K515136J636792Q20057K199662L201504J783545L26397
41021A624865J259652K600270J425847j127078k137182j874740k419592k968027
$$ plain form
41013 -3615985 -4668136 -2509320 -97018 -1196701 -5048976 -7273052 -5623062 -2255674
41005 -2255674 -169337 227367 283971 811500 1859440 3566654 5880217 7928761 8750439
40996 8750439 8539307 8471957 9298662 10491645 10672074 8650529 4490212 93955 -1707248
40987 -1707248 322652 4089114 5858178 4077202 764621 -1321411 -1881879 -2446579
40979 -2446579 -3396070 -3296546 -1204337 1969703 4912783 7337942 9165450 9622439 8508044
40970 8508044 7485877 8493794 11088448 12766999 11943331 9337315 6308768 3284980
40962 3284980 530045 -767563 443466 3117211 4280503 1703137 -3720148 -8460024
40954 -8460024 -9347022 -6190028 -1536715 1887637 3194565 3120132 2761060 2854327 3422201
$$ packed form
41013c615985j052151K158816K412302j099683l852275k224076J649990L367388
41005b255674K086337L96704N6604N27529J047940J707214K313563K048544Q21678
40996H750439k11132o7350Q26705J192983J80429k021545m160317m396257j801203
40987a707248K029900L766462J769064j780976l312581k086032n60468n64700
40979b446579r49491R9524K092209L174040K943080K425159J827508M56989j114395
40970H508044j022167J007917K594654J678551q23668k606016l028547l023788
40962C284980k754935j297608J211029K673745J163292k577366n423285m739876
40954h460024q86998L156994M653313L424352J306928p4433l59072R3267N67874
$$ plain form
40945 3422201 3448315 1630218 -1736084 -4317651 -4162530 -1902460 516586 2394470 3917693
40936 3917693 4055872 1364457 -2888545 -4985190 -3349141 -925814 -1474972 -4993053
40928 -4993053 -8488843 -10107535 -10498898 -10654653 -10362526 -8983450 -6396963 -2877185 1018469
40919 1018469 4187485 5355095 4102867 1360868 -1147923 -2093449 -1731615 -1913106 -4012758
40910 -4012758 -6743884 -7329560 -5234497 -3025880 -2595837 -2488702 -692842 1790445 2729191
40901 2729191 2637677 3748391 5573992 5095846 1832519 -829520 -787526 -559818 -3218846
40892 -3218846 -7366645 -8930158 -6611094 -2916073 -462673 360993 345137 253647 840330
40883 840330 2367445 3814741 3823377 2542308 1457882 1509321 2504184 4060239 5601232
$$ packed form
40945C422201K6114j818097l366302k581567J55121K260070K419046J877884J523223
40936C917693J38179k691415m253002k096645J636049K423327n49158l518081
40928d993053l495790j618692l91363j55755K92127J379076K586487L519778L895654
40919A018469L169016J167610j252228k741999k508791r45526L61834j81491k099652
40910d012758k731126n85676K095063K208617M30043J07135J795860K483287R38746
40901B729191r1514J110714J825601m78146l263327k662039M1994K27708k659028
40892c218846m147799j563513K319064L695021K453400Q23666j5856r1490N86683
40883H40330J527115J447296Q636j281069j084426N1439R94863J556055J540993
$$ plain form
40874 5601232 5584658 2622371 -2159864 -5457105 -5130345 -1995563 2007171 5680897 7929171
40865 7929171 7365089 4282902 1560232 1546740 2951694 2916315 1467666 1322651 3278585
40856 3278585 4672810 3486366 1452537 1158569 1901157 944593 -2004054 -4230758 -3903836
40847 -3903836 -2144848 -697032 285356 1049357 751920 -1122726 -2987740 -2635898 -82903
40838 -82903 2549638 3720053 3630089 2886961 1635317 417762 512816 2539754 5402097
40829 5402097 7231175 6934835 4546777 807207 -2972174 -5129508 -4543261 -1448812
40821 -1448812 2725652 6177406 7501433 6343969 3767066 1664232 1319119 2433369
40813 2433369 3603611 3686577 2774856 2008707 2350010 3449986 4044781 3649494 3246275
$$ packed form
40874E601232j6574k962287m782235l297241L26760L134782M002734L673726K248274
40865G929171n64082l082187k722670j3492J404954l5379j448649j45015J955934
40856C278585J394225j186444k033829k93968P42588r56564k948647k226704L26922
40847c903836J758988J447816R82388P64001k97437j874646j865014L51842K552995
40838h2903K632541J170415q9964p43128j251644j217555R5054K026938K862343
40829E402097J829078k96340k388058l739570l779381k157334N86247L094449
40821a448812M174464L451754J324027j157464k576903k102834l45113J114250
40813B433369J170242Q2966r11721p66149L41303J099976N94795l95287m03219
$$ plain form
40804 3246275 3744207 4413789 3808959 1858345 -6119 -596685 109503 1458705 2424978
40795 2424978 1869502 -78783 -1277950 85565 2725210 3905811 3668117 4730309
40787 4730309 7888080 10684203 11689219 12569586 13809903 12001313 5003896 -2825537
40779 -2825537 -5016263 -1278723 2967204 4635355 5788730 8191509 10117747 10435414
40771 10435414 11588728 15605187 20111790 21341383 19014768 15456735 11661238 7225866
40763 7225866 2965598 503735 -303393 -951066 -1613021 -1337822 -675206 -1364378 -3011570
40754 -3011570 -2767098 538168 4151513 4947094 3576805 3027157 4005689 4259853 2700520
40745 2700520 1799792 4228466 8377859 9595714 6116616 1633380 634391 2762629
$$ packed form
40804C246275M97932O69582o04830j950614j864464n90566P06188J349202R66273
40795B424978n55476j948285j199167J363515K639645J180601k37694J062192
40787D730309L157771K796123J005016Q80367J240317j808590o997417p829433
40779b825537k190726L737540M245927J668151J153375K402779J926238L17667
40771A0435414J153314M016459M506603J229593k326615l558033l795497m435372
40763G225866m260268k461863q07128o47673o61955K75199O62616o89172j647192
40754c011570K44472L305266L613345P95581j370289n49648R78532K54164j559333
40745B700520r00728K428674M149393J217855l479098m483236r98989K128238
$$ plain form
40737 2762629 4011931 2787151 1878666 3718419 6351143 6120425 2790842 -328805
40729 -328805 -730477 1010509 3232230 5380383 7542936 9306972 10116109 10083942 9789060
40720 9789060 9725647 10293211 11658190 13083694 12962729 10343931 6421288 3939777 4773597
40711 4773597 8111045 11197356 12021898 11204972 10946556 12130267 13062611 11535128 7756260
40702 7756260 4599748 4981006 9358091 15562543 20426669 21661935 19114909 14885591
40694 14885591 11935494 11899437 13952897 15861662 16114633 14894883 13079405 10873561
40686 10873561 8051679 5369127 4670238 6811630 9994857 11246046 9691327 7576750
40678 7576750 7726372 10566185 14060023 16240617 17384091 19610852 24316542 30165291
$$ packed form
40737B762629J249302j224780r08485J839753K632724k30718l329583l119647
40729c28805m01672J740986K221721K148153K162553J764036Q09137l2167k94882
40720I789060o3413N67564J364979J425504j20965k618798l922643k481511Q33820
40711D773597L337448L086311Q24542q16926k58416J183711R32344j527483l778868
40702G756260l156512L81258M377085O204452M864126J235266k547026m229318
40694A4885591k950097l6057K053460J908765K52971j219750j815478k205844
40686A0873561k821882k682552o98889K141392L183227J251189j554719k114577
40678G576750J49622K839813L493838K180594J143474K226761M705690N848749
$$ plain form
40670 30165291 34290387 35798430 37151150 41105743 47048124 51801438 53733803 54567467
40662 54567467 57280058 63762257 74356478 87770245 101305822 113247145 125370821
40655 125370821 140886024 159540523 177712864 194493192 214360900 241439252 273835104
40648 273835104 306584434 337545658 366146597 387721353 394147279 381205515 352394800
40641 352394800 315058526 275679957 239263409 209434810 186728884 168515285 152238452
40634 152238452 137641170 125299103 114980067 106558149 100740737 97507439 95194455
40627 95194455 92408033 89762697 88652790 89235616 90396187 90654298 88504474 83235994
40619 83235994 76326683 70809214 68323926 67841484 67925420 68764032 70920503 73545311 75401755
$$ packed form
40670C0165291M125096J508043J352720L954593N942381M753314J932365Q33664
40662E4567467K712591O482199J0594221J3413767J3535577J1941323J2123676
40655A25370821J5515203J8654499J8172341J6780328J9867708K7078352L2395852
40648B73835104L2749330L0961224K8600939K1574756O425926j2941764k8810715
40641C52394800l7336274l9378569l6416548k9828599k2705926j8213599j6276833
40634A52238452j4597282j2342067j0319036q421918n817412l233298k312984
40627I5194455k786422k645336j109907N82826J160571K58111k149824n268480
40619H3235994o909311n517469k485288m82442Q3936Q38612K156471K624808J856444
$$ plain form
40610 75401755 76874936 79586646 84370295 90524131 96822872 102886196 109889119 119597205
40602 119597205 131576980 141787043 145852060 143642636 138197301 130037843 116128942
40595 116128942 96049387 75640441 61421625 53692085 48385789 43788522 41455868
40588 41455868 41412962 40749785 37686519 33877460 31638563 31181626 31454608 31751978 31618357
40579 31618357 30717908 29556036 29256998 30467341 33572069 39448329 48051385 56606677
40571 56606677 61832665 64392389 68548087 76410109 84884397 89621655 89710721 86660001
40563 86660001 80876104 71973500 61696506 53614499 49313676 46648969 42632496 37079926
40555 37079926 32499471 30678888 30239398 28160378 23582656 19110627 17551827 18109827
$$ packed form
40610G5401755J473181K711710M783649O153836O298741O063324P002923R708086
40602A19597205J1979775J0210063M065017k209424n445335q159458j3908901
40595A16128942k0079555k0408946j4218816p729540n306296m597267k332654
40588D1455868m2906o63177l063266l809059k238897m56937K72982K97370j33621
40579C1618357r00449j161872k99038J210343L104728N876260Q603056Q555292
40571E6606677N225988K559724M155698P862022Q474288M737258Q9066l050720
40563H6660001n783897q902604j0276994q082007m300823k664707m016473n552570
40555C7079926m580455j820583m39490k079020m577722m472029j558800N58000
$$ plain form
40547 18109827 17261198 13265932 8185110 5044450 4532158 5230943 5727641 5514641 4996294
40538 4996294 5660267 9039547 14184219 17355417 16107064 12954305 12737373 16279106
40530 16279106 18889933 16100178 9213006 3758863 3358344 6548754 9287514 9154655
40522 9154655 6865288 4798547 4804953 7006300 10015410 12211339 13042022 13245107 13992475
40513 13992475 16012599 19246087 22691557 24611808 23833033 21244353 19045954 17803735
40505 17803735 15351701 9913463 3379352 -427255 -368804 1210757 2254605 3109648
40497 3109648 4358952 5272101 5859064 7996559 12365947 16256175 16971543 15887353 16219110
40488 16219110 17841625 17617117 14534857 11116925 9187790 7378717 4149777 851741
$$ packed form
40547A8109827q48629l995266n080822l140660n12292O98785M96698k13000n18347
40538D996294O63973L379280N144672L171198j248353l152759k16932L541733
40530A6279106K610827k789755o887172n454143m00519L190410K738760j32859
40522I154655k289367k066741O406K201347L009110K195929Q30683K03085P47368
40513A3992475K020124L233488L445470J920251p78775k588680k198399j242219
40505A7803735k452034n438238o534111l806607N8451J579561J043848Q55043
40497C109648J249304R13149N86963K137495M369388L890228P15368j084190L31757
40488A6219110J622515k24508l082260l417932j929135j809073l228940l298036
$$ plain form
40480 851741 -7131 1769309 3664383 2891198 -1081838 -5490001 -5946451 -770199 6413250
40471 6413250 10243885 9671848 8131999 7825949 7124808 4549725 1770571 487099 -719804
40462 -719804 -3559685 -6224887 -5631892 -2266694 204861 -386458 -2893099 -5210810 -6150203
40453 -6150203 -5334028 -3463296 -2538389 -3834195 -5756510 -5469177 -2446888 1234375 3693692
40444 3693692 4496749 3655405 1592846 -93078 -51994 673147 133805 -983943 10276
40435 10276 3187662 4874979 2500041 -1767638 -3999815 -3410515 -2286940 -2088398 -1702378
40426 -1702378 453483 3989814 6726172 7050183 5895323 5873911 7956377 9821965 8782283
40417 8782283 5597452 3352220 2890303 2090370 155646 -460127 1903316 4739202 4553521
$$ packed form
40480H51741q58872J776440J895074p73185l973036m408163m56450N176252P183449
40471F413250L830635n72037j539849l06050p01141k575083k779154j283472j206903
40462g19804k839881k665202N92995L365198K471555n91319k506641k317711r39393
40453f150203Q16175J870732R24907j295806j922315K87333L022289L681263K459317
40444C693692Q03057q41344k062559j685924M1084P25141n39342j117748R94219
40435A0276L177386J687317k374938m267679k232177N89300J123575J98542L86020
40426a702378K155861L536331K736358L24011j154860k1412K082466J865588j039682
40417H782283l184831k245232m61917p99933j934724o15773K363443K835886j85681
$$ plain form
40408 4553521 1751252 -267875 160976 1727298 2994880 3828412 3980115 2676489 168315
40399 168315 -2094580 -3366267 -4295880 -5485916 -6786286 -8130979 -9432710 -9456760 -6757968
40390 -6757968 -2388738 260070 -595861 -3012991 -4336968 -4573458 -4971361 -4786517 -2085630
40381 -2085630 2612806 6029188 6024618 4009622 2661341 2607658 2370535 722120 -1915310
40372 -1915310 -4068423 -4557858 -3431066 -1888950 -1126340 -1282882 -1957022 -3421182 -6156727
40363 -6156727 -9006534 -9301034 -5938416 -1439795 390932 -1484865 -4684496 -6386908
40355 -6386908 -5656796 -2942725 1025706 4966221 6744190 4749179 -242068 -5184891
40347 -5184891 -7179933 -5934246 -3867405 -3587968 -5089091 -5698974 -3113713 1870757
$$ packed form
40408D553521k802269k019127M28851J566322J267582Q33532J51703j303626k508174
40399A68315k262895j271687r29613j190036j300370j344693j301731k4050K698792
40390f757968M369230K648808q55931k417130j323977k36490l97903J84844K700887
40381b085630M698436L416382m570k014996j348281n3683k37123j648415k637430
40372a915310k153113m89435J126792J542116P62610j56542o74140j464160k735545
40363f156727k849807k94500L362618M498621J830727j875797l199631j702412
40355f386908P30112K714071L968431L940515J777969j995011m991247m942823
40347e184891j995042J245687K066841K79437j501123o09883K585261M984470
$$ plain form
40339 1870757 6219060 7988225 7951430 7781066 7536362 5754620 1859605 -2267442 -3655353
40330 -3655353 -1149176 3537026 7879354 10863532 12394491 11425866 7011081 1376559
40322 1376559 -957847 1194282 3391705 1424483 -2628213 -3626770 -1102588 735765
40314 735765 380155 1258235 5244182 8844714 8682305 6693882 6100624 5418293 1085139
40305 1085139 -5853123 -10480585 -10778788 -9300320 -8097831 -6159411 -2700235 619515
40297 619515 2141577 2177134 1465481 174107 -682378 438390 2629209 2520477 -1153616
40288 -1153616 -5325284 -6690057 -5895156 -5737995 -7195437 -9392126 -11684681 -13295830
40280 -13295830 -12424298 -8649175 -5350534 -6684988 -12228603 -17313983 -18920298 -18600571
$$ packed form
40339A870757M348303J769165l6795j70364k44704j781742l895015m127047j387911
40330c655353K506177M686202M342328K984178J530959r68625m414785n634522
40322A376559k334406K152129K197423j967222m052696r98557K524182J838353
40314G35765l55610Q78080L985947L600532j62409j988423n93258o82331m333154
40305A085139o938262m627462k98203J478468J202489J938420L459176L319750
40297F19515J522062L5557p11653j291374q56485J120768K190819j08732l674093
40288a153616m171668j364773P94901J57161j457442k196689k292555j611149
40280a3295830Q71532L775123L298641j334454n543615n085380j606315L19727
$$ plain form
40272 -18600571 -18844909 -19137581 -17351827 -13445625 -9775830 -8299639 -9005327 -10885468
40264 -10885468 -12944063 -13844297 -11878930 -6654266 -686975 2004197 -141053 -4149075
40256 -4149075 -5464526 -2908759 458567 1605175 1130472 1620975 3733032 5715400
40248 5715400 6336523 6284418 6328224 5905411 4557109 3414374 3738013 4627449 3819277
40239 3819277 782021 -2453618 -3992505 -4271328 -4693629 -5225499 -4778036 -3392108 -2398565
40230 -2398565 -2406940 -2647953 -2564868 -2533140 -2510480 -1616897 38322 745236 -227652 -909714
40220 -909714 693863 3281471 3695924 1075261 -2442901 -4667509 -4890129 -2954126 579071
40211 579071 3198633 2135793 -1841216 -4657124 -4007541 -2003455 -1462772 -1829306 -829760
$$ packed form
40272a8600571k44338k92672J785754L906202L669795J476191p05688j880141
40264a0885468k058595r00234J965367N224664N967291K691172k145250m008022
40256d149075j315451K555767L367326J146608m74703M90503K112057J982368
40248E715400O21123n2105M3806m22813j348302j142735L23639Q89436q08172
40239C819277l037256l235639j538887k78823m22301n31870M47463J385928R93543
40230b398565q375k41013Q3085L1728K2660Q93583J655219P06914r72888o82062
40220i09714J603577K587608M14453k620663l518162k224608k22620J936003L533197
40211E79071K619562j062840l977009k815908O49583K004086N40683l66534R99546
$$ plain form
40202 -829760 1405764 2308350 451933 -2682243 -4483018 -3601646 -684762 2456517 4416490
40193 4416490 5110930 4822292 2899998 -1095403 -5155713 -5989483 -3101639 410373 2019929
40184 2019929 2396283 2682984 1976478 -255845 -1774133 -627353 1179689 386284 -2396886
40175 -2396886 -3706935 -2572960 -1183612 -469975 1095398 3649021 4533222 2244838
40167 2244838 -1038623 -2558532 -2365073 -2002798 -1799900 -1252489 -586589 -162363 633191
40158 633191 2364651 4160110 4561766 3205090 893121 -1211251 -1849017 -230209 2762057
40149 2762057 4889322 5002561 4354471 4683803 5861484 6222766 4353868 -142419 -6464433
40140 -6464433 -12102664 -13631216 -9630817 -2597099 3048495 4623187 2452846 -1444529
$$ packed form
40202h29760K235524R02586j856417l134176j800775Q81372K916884L141279J959973
40193D416490O94440k88638j922294l995401m060310q33770K887844L512012J609556
40184B019929L76354K86701p06506k232323j518288J146780J807042p93405k783170
40175b396886j310049J133975J389348P13637J565373K553623Q84201k288384
40167B244838l283461j519909J93459L62275K02898N47411O65900M24226P95554
40158F33191J731460J795459M01656j356676k311969k104372o37766J618808K992266
40149B762057K127265J13239o48090L29332J177681L61282j868898m496287o322014
40140f464433n638231j528552M000399P033718N645594J574692k170341l897375
$$ plain form
40132 -1444529 -4794882 -6010628 -5231402 -4284681 -4522698 -4888132 -3132650 1267061 6465262
40123 6465262 10363840 12264326 12418896 11153310 8906841 6383601 4209079 2827209
40115 2827209 2756263 4204816 6216439 7062875 6153176 5034195 5702403 8094460 10009961
40106 10009961 9622590 7436325 5538296 5537824 7577020 10545719 12377167 10779821 5226700
40097 5226700 -1549653 -5345418 -4385004 -615177 3060712 5458139 6602123 6540919 6111372
40088 6111372 7151256 9814759 10928836 7592662 1711632 -1857301 -1485053 -147458
40080 -147458 -394048 -1254226 -1365008 -2000950 -4639247 -7643911 -8007477 -5297649 -1707877
40071 -1707877 1041723 3002300 4891688 7401480 11006591 14927221 16973294 16025195
$$ packed form
40132a444529l350353j215746P79226R46721k38017l65434J755482M399711N198201
40123F465262L898578J900486J54570j265586k246469k523240k174522j381870
40115B827209p0946J448553K011623Q46436r09699j118981O68208K392057J915501
40106A0009961l87371k186265j898029m72K039196K968699J831448j597346n553121
40097E226700o776353l795765R60414L769827L675889K397427J143984o1204m29547
40088F111372J039884K663503J114077l336174n881030l568933L72248J337595
40080a47458k46590q60178j10782o35942k638297l004664l63566K709828L589772
40071a707877K749600J960577J889388K509792L605111L920630K046073r48099
$$ plain form
40063 16025195 13987666 13575148 14785066 15403920 14458257 13085407 12250907 11796297 11817060
40054 11817060 12777446 13838416 13176394 10681028 8409818 7482289 6437841 3931026
40046 3931026 1287192 585862 1357183 1130795 -1172038 -4003006 -5207912 -4050095 -1328721
40037 -1328721 1482288 3336958 4686111 7017068 10363311 12090274 9966020 6054078
40029 6054078 5080177 8253915 11112889 9140008 3642268 -269400 -394588 626003
40021 626003 -96486 -1948521 -2497236 -823772 2006544 4300122 4538860 2319862 -367031
40012 -367031 -343853 2763142 5101343 2987720 -2342146 -6361170 -6730232 -4886128 -2769854
40003 -2769854 -653129 1592366 3530259 5164085 6940730 8110735 7013405 3800485
$$ packed form
40063A6025195k037529m12518J209918O18854r45663j372850q34500m54610K0763
40054A1817060R60386J060970o62022k495366k271210r27529j044448k506815
40046C931026k643834p01330P71321k26388k302833k830968j204906J157817K721374
40037a328721K811009J854670J349153K330957L346243J726963k124254l911942
40029F054078r73901L173738K858974j972881n497740l911668j25188J020591
40021F26003p22489j852035n48715J673464K830316K293578K38738k218998k686893
40012c67031K3178L106995K338201k113623n329866m019024l69062J844104K116274
40003b769854K116725K245495J937893J633826J776645J170005j097330l212920
$$ plain form
39995 3800485 1061926 790081 2330381 4169592 5908355 7302860 7204295 5120423 2524402
39986 2524402 1047068 453689 -229632 -864018 -1082534 -1806534 -3952023 -6469016 -7620167
39977 -7620167 -7647729 -8292642 -10072315 -11878763 -12972355 -13468083 -12982330 -10836973 -7864972
39968 -7864972 -6066720 -5838604 -5237906 -2908609 -340886 -52017 -2420425 -5475548 -7287001
39959 -7287001 -7422672 -6200617 -3675464 -6305 3600806 5139600 3437277 -600011
39951 -600011 -4699367 -7163575 -7922543 -7903404 -7856651 -7789984 -7202945 -5976979 -5193166 -6371767
39941 -6371767 -9244733 -11186885 -10122206 -7233868 -5168031 -4333284 -3231054 -1883446
39933 -1883446 -1865344 -2653551 -1300940 3003704 7060057 8027088 6986215 6360704 6545668
$$ packed form
39995C800485k738559k71845J540300J839211J738763J394505r8565k083872k596021
39986B524402j477334n93379o83321o34386k18516p24000k145489k516993j151151
39977g620167k7562o44913j779673j806448j093592m95728M85753K145357K972001
39968g864972J798252K28116O00698K329297K567723K88869k368408l055123j811453
39959g287001j35671J222055K525153L669159L607111J538794j702323m037288
39951f00011m099356k464208p58968J9139M6753O6667N87039J225966P83813j178601
39941f371767k872966j942152J064679K888338K065837Q34747J102230J347608
39933a883446J8102p88207J352611M304644M056353R67031j040873o25511J84964
$$ plain form
39924 6545668 7214828 9092170 11710909 12105901 8924464 5444909 5077941 6267604 5870346
39915 5870346 5260274 7927507 12280289 12521575 6977114 608249 -1600768 499955
39907 499955 4607111 8695901 10208081 6916578 501858 -4235467 -5254283 -4982044
39899 -4982044 -5101867 -3898626 -713737 1286254 -269071 -3047877 -3789777 -3025010 -3054329
39890 -3054329 -4012461 -5050253 -6865907 -9760051 -11382447 -9782925 -6916735 -5960606
39882 -5960606 -6808116 -7230986 -6729199 -6042058 -4575736 -1799111 237191 -645777 -2919761
39873 -2919761 -3465594 -2444292 -2418432 -3597178 -3952377 -3511877 -4317185 -6052363 -5877855
39864 -5877855 -3239760 -940074 -408135 398894 2942894 5369676 5802863 5622195 7209404
$$ packed form
39924F545668O69160J877342K618739L94992l181437l479555l66968J189663l97258
39915E870346o10072K667233M352782K41286n544461o368865k209017K100723
39907D99955M107156M088790J512180l291503o414720m737325j018816K72239
39899d982044j19823J203241L184889J999991j555325k778806p41900P64767k9319
39890c054329r58132j037792j815654k894144j622396J599522K866190R56129
39882e960606q47510m22870N01787O87141J466322K776625K036302q82968k273984
39873b919761n45833J021302K5860j178746l55199M40500q05308j735178J74508
39864e877855K638095K299686N31939Q07029K544000K426782M33187j80668J587209
$$ plain form
39855 7209404 10291228 12494048 12269215 9834139 6320337 3097646 1040961 -140150
39847 -140150 -982539 -889416 699394 2136996 1145653 -1235170 -1327382 1549556 3218023
39838 3218023 286559 -5001147 -7984299 -7609381 -6536268 -6622915 -7132890 -6880798 -5731179
39829 -5731179 -4022756 -2289447 -1431593 -1697828 -1803604 -496978 1368248 1793024 313978
39820 313978 -1752027 -3310765 -4016789 -3167613 -327345 2541440 1749553 -4055167 -11761309
39811 -11761309 -16810160 -17425326 -15134357 -12424292 -11125283 -11907873 -13513843 -12995370
39803 -12995370 -8610153 -2430509 1693572 2808921 3421110 4987146 5470602 2963465
39795 2963465 -578840 -1747614 -313878 1315990 2110030 2621479 1960093 -1351639 -5110660
$$ packed form
39855G209404L081824K202820k24833k435076l513802l222691k056685j181111
39847a40150q42389R3123J588810J437602r91343k380823r2212K876938J668467
39838C218023k931464n287706k983152L74918J073113q6647n09975K52092J149619
39829e731179J708423J733309Q57854k66235j05776J306626J865226M24776j479046
39820C13978k066005j558738p06024Q49176K840268K868785p91887n804720p706142
39811a1761309n048851o15166K290969K710065J299009p82590j605970N18473
39803a2995370M385217O179644M124081J115349O12189J566036M83456k507137
39795B963465l542305j168774J433736J629868P94040N11449o61386l311732l759021
$$ plain form
39786 -5110660 -4402423 1374483 6274293 5168001 121858 -3511467 -4273125 -4067462 -2992423
39777 -2992423 494883 5235132 7734375 6904627 4753437 2468086 -406868 -2836480
39769 -2836480 -2455365 335919 2208337 1923488 1954345 3921800 6154474 7442146 9422450
39760 9422450 12855856 14974215 13512533 10570099 9293108 9095965 7582036 5284451
39752 5284451 4759353 6056313 6678909 5673152 4655580 4802178 5384561 5306127 3951127
39743 3951127 803813 -3572458 -6569655 -6015318 -3519154 -2868379 -4876649 -6181218
39735 -6181218 -3663053 1961989 7420083 9812105 7858310 2370792 -3510281 -6170468
39727 -6170468 -4734684 -1591312 533789 741282 -821814 -3815096 -6848890 -7552860
$$ packed form
39786e110660P08237N776906M899810j106292n046143l633325p61658K05663J075039
39777b992423L487306M740249K499243q29748k151190k285351k874954k429612
39769b836480L81115K791284J872418k84849L0857J967455K232674J287672J980304
39760I422450L433406K118359j461682k942434j276991j97143j513929k297585
39752E284451n25098J296960O22596j005757j017572J46598N82383p8434j355000
39743C951127l147314m376271k997197N54337K496164O50775k008270j304569
39735f181218K518165N625042N458094K392022j953795n487518n881073k660187
39727f170468J435784L143372K125101K07493j563096k993282l033794p03970
$$ plain form
39719 -7552860 -4958949 -863613 2223007 3582044 3905339 3605157 2824869 2354804 3075644
39710 3075644 4650017 5780731 5724809 4919439 4334056 4748759 6292325 8051248 8504807
39701 8504807 7065243 4927439 3741947 3751001 3955248 3813943 3895701 4967165 7253254
39692 7253254 10398325 13162817 13442778 10227893 5883994 4619534 7524585 10813926
39684 10813926 10805787 9147133 10323450 14741933 17964018 17562499 17013980 20427650 26279022
39675 26279022 29692643 29182875 27428637 26155969 24173632 20814031 17685981 15761805
39667 15761805 13650691 10367862 7466082 6657709 7137255 6941953 5527563 3558542
39659 3558542 1495929 -273768 -1131100 -1135675 -1016767 -619385 816428 2196224 1053174
$$ packed form
39719g552860K593911M095336L086620J359037L23295l00182p80288m70065P20840
39710C075644J574373J130714n5922q05370n85383M14703J543566J758923M53559
39701H504807j439564k137804j185492R054K04247j41305Q1758J071464K286089
39692G253254L145071K764492K79961l214885m343899j264460K905051L289341
39684A0813926q139j658654J176317M418483L222085m01519n48519L413670N851372
39675B6279022L413621n09768j754238j272668j982337l359601l128050j924176
39667A5761805k111114l282829k901780q08373M79546j95302j414390j969021
39659C558542k062613j769697q57332m575J18908L97382J435813J379796j143050
$$ plain form
39650 1053174 -2118008 -2997096 674913 4991501 4764134 410801 -3461135 -4585608
39642 -4585608 -4185722 -2729580 975190 6291164 10348995 12043350 13298788 15503619
39634 15503619 17523149 18155625 17948685 17606558 16890685 15891595 15165737 13992554 10853287
39625 10853287 6244725 2528961 398517 -1736719 -4155511 -4920478 -3881727 -4028151
39617 -4028151 -6507803 -7495234 -3310777 3538440 7072332 5518610 2906903 3249681
39609 3249681 6072366 8168907 7548187 4745995 1532449 -766063 -1956543 -2368587
39601 -2368587 -2012284 -1066272 -820144 -2527039 -5066617 -5547850 -2908048 819917 3462279
39592 3462279 4813159 4948280 3145847 272353 -345283 2965055 7142788 8152320
$$ packed form
39650A053174l171182q79088L672009M316588k27367m353333l871936j124473
39642d585608L99886J456142L704770N315974M057831J694355J255438K204831
39634A5503619K019530O32476k06940l42127p15873r99090p25858j173183l139267
39625A0853287m608562l715764k130444k135236k418792p64967J038751j46424
39617d028151k479652r87431M184457O849217L533892j553722k611707L42778
39609C249681K822685K096541o20720k802192l213546k298512j190480m12044
39601b368587L56303R46012K46128j706895k539578m81233K639802L727965K642362
39592C462279J350880J35121j802433k873494o17636L310338M177733J009532
$$ plain form
39584 8152320 6244975 4671902 4597848 4446723 3301014 1726532 -105651 -1924607 -1634256
39575 -1634256 2369047 7435424 9061076 7302309 6744780 9146416 10362964 6729597
39567 6729597 858219 -1915912 -319212 2667628 4489889 4727467 3336564 422447
39559 422447 -2430274 -3200303 -2056009 -1101735 -1457888 -2279663 -2642952 -2536144 -1634332
39550 -1634332 1057195 5293620 8482363 7764028 2992517 -3063342 -7449860 -9487862
39542 -9487862 -10371619 -10745873 -9589935 -6234897 -2872674 -3248545 -8010772 -12785036 -12623426
39533 -12623426 -7872680 -3751569 -3947151 -6597138 -7632677 -6334389 -5417360 -6233810
39525 -6233810 -6525155 -3880571 555177 3654378 4470737 4605754 4768910 3586641 655371
$$ packed form
39584H152320j907345j573073p4054j51125j145709j574482j832183j818956K90351
39575a634256M003303N066377J625652j758767n57529K401636J216548l633367
39567F729597n871378k774131J596700K986840J822261K37578j390903k914117
39559D22447k852721p70029J144294R54274l56153q21775l63289J06808R01812
39550a634332K691527M236425L188743p18335m771511o055859m386518k038002
39542i487862q83757l74254J155938L355038L362223l75871m762227m774264J61610
39533a2623426M750746M121111j95582k649987j035539J298288R17029q16450
39525f233810k91345K644584M435748L099201Q16359J35017J63156j182269k931270
$$ plain form
39516 655371 -1567373 -744461 1948361 3497648 3265553 3318220 4816238 6320644 6195077
39507 6195077 4985795 4579184 5945457 8184915 9158025 7175039 2995824 -217449
39499 -217449 -265190 1207782 962101 -1097115 -1859399 174642 2837616 3928387 4008373
39490 4008373 3973948 2654682 -653438 -3416620 -2642508 812607 3498813 3967321 3379869
39481 3379869 2473942 1119243 527641 2508563 6127191 8192680 7793461 7370996 8229571
39472 8229571 7999368 4357133 -1218139 -5503593 -7358757 -7371674 -5573044 -2176297 618569
39463 618569 477837 -1652064 -2394400 -373366 2101538 2022589 -1192438 -5725238 -9099063
39454 -9099063 -9754949 -8170709 -6528626 -6238856 -6130338 -4415200 -1745201 -157501 606252
$$ packed form
39516F55371k222744Q22912K692822J549287k32095N2667J498018J504406j25567
39507F195077j209282m06611J366273K239458R73110j982986m179215l213273
39499b17449m7741J472972k45681k059216p62284K034041K662974J090771P9986
39490D008373l4425j319266l308120k763182P74112L455115K686206M68508n87452
39481C379869r05927j354699n91602J980922L618628K065489l99219m22465Q58575
39472H229571k30203l642235n575272m285454j855164j2917J798630L396747K794866
39463F18569j40732k129901p42336K021034K474904p8949l215027m532800l373825
39454i099063o55886J584240J642083K89770J08518J715138K669999J587700P63753
$$ plain form
39445 606252 2719138 5701409 5773097 1861236 -842083 3066135 11191640 15503237 12419213
39436 12419213 6784083 4631910 5635609 5389500 2698168 908677 2499480 5609014
39428 5609014 6808631 5163283 2324055 -8007 -1389199 -2154281 -2776606 -3480701 -3913135
39419 -3913135 -3559729 -2822123 -2916911 -4089645 -4777898 -3522245 -1052644 629890 696056
39410 696056 -173198 -1193222 -1488216 843048 7181054 15203330 19479156 16838193 9908408
39401 9908408 3992830 1566602 1226938 907203 237651 159745 1705785 4854735 7571414
39392 7571414 6948862 2849570 -676357 182180 3881526 5480920 3455092 1481963
39384 1481963 2844142 6100814 7818415 7117991 5589398 4563384 4500892 5730661 7815002
$$ packed form
39445F06252K112886K982271P1688l911861k703319L908218Q125505M311597l084024
39436A2419213n635130k152173J003699k46109k691332j789491J590803L109534
39428E609014J199617j645348k839228k332062j381192p65082o22325p04095m32434
39419c913135L53406P37606r4788j172734o88253J255653K469601J682534O6166
39410F96056q69254j020024k94994K331264O338006Q022276M275826k640963o929785
39401I908408n915578k426228l39664l19735o69552p7906J546040L148950K716679
39392G571414o22552m099292l525927Q58537L699346J599394k025828j973129
39384A481963J362179L256672J717601p00424j528593j026014o2492J229769K084341
$$ plain form
39375 7815002 9043542 8131431 5706729 3081466 719098 -1095871 -1764011 -1916418 -3522828
39366 -3522828 -6675028 -8392290 -7008975 -5547489 -7513426 -11222450 -12278962 -10353915
39358 -10353915 -8809610 -8106952 -4972235 938503 4876855 3910607 1549569 2270017
39350 2270017 4940829 5336452 2591542 -576074 -2243237 -2323383 -632798 2551697 4872115
39341 4872115 4151770 1818799 1161850 2717223 4314305 5071454 5956428 6574686 5096790
39332 5096790 1925050 -138987 -478187 -1962681 -5952478 -9240655 -8591645 -5841495
39324 -5841495 -5262830 -7278702 -8200472 -5949528 -2893383 -2154987 -3501784 -4541062 -4731990
39315 -4731990 -6285303 -10959858 -17190656 -21170031 -20486514 -16141588 -11075322 -7346004
$$ packed form
39375G815002J228540r12111k424702k625263k362368j814969o68140j52407j606410
39366c522828l152200j717262J383315J461486j965937l709024j056512J925047
39358a0353915J544305P02658L134717N910738L938352r66248k361038P20448
39350B270017K670812L95623k744910l167616j667163q0146J690585L184495K320418
39341D872115p20345k332971o56949J555373J597082P57149Q84974O18258j477896
39332E096790l171740k064037l39200j484494l989797l288177O49010K750150
39324e841495N78665k015872r21770K250944L056145P38396j346797j039278j90928
39315d731990j553313m674555o230798l979375O83517M344926N066266L729318
$$ plain form
39307 -7346004 -4946474 -2757220 -165551 1964146 1757700 -1593201 -5975044 -7638494
39299 -7638494 -5140863 -1081683 992088 245414 -2143848 -5729901 -10237234 -13029218
39291 -13029218 -10577117 -3358815 3450634 5739940 4850330 4493763 5174902 4142361
39283 4142361 483 -5179186 -8502361 -9061716 -7527345 -4488859 -419572 3298723
39275 3298723 4601757 2549493 -1433017 -4718551 -5997007 -6156725 -6528590 -7127651 -7305139
39266 -7305139 -7226662 -7448204 -7616248 -7087329 -6460032 -6755550 -7244855 -6136279 -3660617
39257 -3660617 -2278549 -3138879 -4528200 -4900175 -5204923 -6574264 -7693333 -6658160 -4076442
39248 -4076442 -2092615 -1280583 -635250 126787 452383 609209 1277330 1773712 796508
$$ packed form
39307g346004K399530K189254K591669K129697k06446l350901m381843j663450
39299g638494K497631M059180K073771p46674k389262l586053m507333k791984
39291a3029218K452101P218302O809449K289306q89610l56567O81139j032541
39283D142361m141878n179669l323175n59355J534371L038486M069287L718295
39275C298723J303034k052264l982510l285534j278456j59718l71865n99061j77488
39266g305139P8477k21542j68044N28919O27297k95518m89305J108576K475662
39257c660617J382068q60330j389321l71975l04748j369341j119069J035173K581718
39248d076442J983827Q12032O45333P62037L25596J56826O68121M96382r77204
$$ plain form
39239 796508 -1196734 -2418924 -2462626 -2376467 -2015922 69827 3387022 4690842 1966800
39230 1966800 -2603672 -5325121 -5298214 -4384439 -3924142 -3374130 -1809797 846537 4059011
39221 4059011 6864479 7857312 6317900 3701665 2854062 4967559 7931983 8522250 5998312
39212 5998312 2742048 1238231 1311218 1070706 -23334 -466908 610785 1556314 327172
39203 327172 -2214264 -2881134 -185627 3699391 5577098 4613233 2318541 343438 -395136
39194 -395136 832861 4186840 8153920 10299258 9756937 7952624 6257684 4174339
39186 4174339 1054228 -1506848 -1110974 1761195 3846321 3659199 3732256 6609592 10438409
39177 10438409 11155991 8202455 5155340 4634108 5418901 5405004 4719179 4339969 3770319
$$ packed form
39239G96508j993242j222190m3702Q6159L60545K085749L317195J303820k724042
39230A966800m570472k721449K6907R13775M60297N50012J564333K656334L212474
39221D059011K805468R92833j539412k616235q47603K113497K964424N90267k523938
39212E998312l256264j503817P2987k40512j094040m43574J077693R45529j229142
39203C27172k541436o66870K695507L885018J877707r63865k294692j975103p38574
39194c95136J227997L353979L967080K145338n42321j804313j694940k083345
39186D174339l120111k561076L95874K872169K085126j87122P3057K877336L828817
39177A0438409P17582k953536l047115n21232P84793j3897o85825l79210n69650
$$ plain form
39168 3770319 2105341 26657 -1169177 -1515948 -1699346 -1531417 -921462 -1312308 -3918746
39159 -3918746 -7083157 -7651062 -4959946 -1569727 332 -505815 -2140722 -4136139
39151 -4136139 -5762380 -6303776 -5770802 -4797055 -3864439 -3505206 -4625653 -7092347 -8589366
39142 -8589366 -6900735 -3054219 -14478 1565516 3670220 6795491 8561109 7601250
39134 7601250 6025002 6078854 6487993 4332141 -791335 -6404148 -9893584 -10033363 -6965679
39125 -6965679 -2480721 576316 894382 26213 -169730 -209959 -1335795 -2511516 -1769875
39116 -1769875 -100739 -997994 -5371545 -9338004 -8635647 -3817951 627711 1690114
39108 1690114 676983 474230 1513730 1833333 620934 -305763 490710 1265425 -592856
$$ packed form
39168C770319j664978k078684j195834l46771j83398J67929O09955l90846k606438
39159c918746l164411n67905K691116L390219J570059n06147j634907j995417
39151d136139j626241n41396N32974R73747R32616L59233j120447k466694j497019
39142h589366J688631L846516L039741J579994K104704L125271J765618r59859
39134G601250j576248N3852M09139k155852n123476n612813l489436j39779L067684
39125f965679M484958L057037L18066q68169j95943m0229j125836j175721P41641
39116a769875J669136q97255m373551l966459P02357M817696M445662J062403
39108A690114j013131k02753J039500L19603j212399r26697P96473P74715j858281
$$ plain form
39099 -592856 -4242862 -6003017 -4348993 -1595481 27329 1009046 1877680 995537 -2370914
39090 -2370914 -5218817 -4371132 -1422278 -770272 -3569531 -6982370 -8961804 -10192833
39082 -10192833 -11047521 -10181789 -7339589 -4752450 -4310102 -5354797 -6307355 -6518218 -5638158
39073 -5638158 -3261348 -220510 1790707 2876659 5030265 8416877 9994953 7557226
39065 7557226 2980095 -495044 -2189364 -3065673 -3007291 -1858497 -1592867 -4185237 -8085706
39056 -8085706 -9836196 -8690561 -6650442 -4430981 -1011162 2540074 2708877 -1453035
39048 -1453035 -6128274 -7541254 -6369839 -5195809 -4073908 -1613511 1293860 2329172
39040 2329172 1712536 2041809 4052555 5505656 4911494 3614206 3078456 2635792 1556775
$$ packed form
39099e92856l650006j760155J654024K753512J622810R81717Q68634q82143l366451
39090b370914k847903Q47685K948854O52006k799259l412839j979434j231029
39082a0192833q54688Q65732K842200K587139M42348j044695r52558k10863Q80060
39073e638158K376810L040838K011217J085952K153606L386612J578076k437727
39065G557226m577131l475139j694320q76309N8382J148794K65630k592370l900469
39056h085706j750490J145635K040119K219461L419819L551236J68803m161912
39048a453035m675239j412980J171415J174030J121901K460397K907371J035312
39040B329172o16636L29273K010746J453101n94162j297288n35750m42664j079017
$$ plain form
39031 1556775 1132850 2432536 3587391 2017181 -1374859 -2943984 -1242577 1250549
39023 1250549 1800999 514813 -1160368 -2907228 -4983558 -6730327 -7367618 -7312918 -7145276
39014 -7145276 -6137245 -3548376 -741842 -84808 -1877113 -4040247 -4747122 -3698442
39006 -3698442 -1043466 2707939 5386178 4326035 85255 -3102064 -2287182 462610
38998 462610 1208063 -532074 -2078132 -2153777 -2069241 -2392089 -1621713 673834 1988066
38989 1988066 94824 -3409094 -4774223 -2524847 1460119 4758068 6675571 7864830
38981 7864830 9009443 9929826 9139751 4801147 -2563120 -8792464 -9455819 -4792692 403000
38972 403000 2342244 1970176 2345475 4193161 5728781 5653875 4347123 2598908 954987
$$ packed form
39031A556775m23925J299686J154855j570210l392040j569125J701407K493126
39023A250549N50450j286186j675181j746860k076330j746769o37291N4700J67642
39014g145276J008031K588869K806534O57034j792305k163134p06875J048680
39006c698442K654976L751405K678239j060143m240780l187319Q14882K749792
38998D62610P45453j740137j546058p5645Q4536l22848P70376K295547J314232
38989A988066j893242l503918j365129K249376L984966L297949J917503J189259
38981G864830J144613R20383p90075m338604p364267o229344o63355M663127N195692
38972D03000J939244l72068L75299J847686J535620p4906j306752j748215j643921
$$ plain form
38963 954987 161327 634572 1333671 454490 -2523513 -6360498 -9371889 -10156474 -7693245
38954 -7693245 -2671569 1444072 1144782 -2547114 -4449976 -1505830 3204602 4482178
38946 4482178 1474980 -2137539 -3507298 -3533446 -4175148 -5018404 -3736906 817731 6865500
38937 6865500 11037369 11373845 8963378 6326966 4442950 2486211 618369 1065428
38929 1065428 4928680 9375449 10271231 7209237 3929774 3783670 6574535 9946030
38921 9946030 11939482 11634789 9046399 5476101 2926386 2278351 2726709 3438183 4713929
38912 4713929 6695722 7799629 5790312 649102 -4333456 -5121210 -999398 4294125
38904 4294125 6314658 4578042 2216137 1172952 182489 -1575308 -1918569 531816
$$ packed form
38963I54987p93660M73245O99099q79181k978003l836985l011391p84585K463229
38954g693245N021676M115641k99290l691896j902862K944146M710432J277576
38946D482178l007198l612519j369759k6148o41702q43256J281498M554637O047769
38937F865500M171869L36476k410467k636412j884016j956739j867842M47059
38929A065428L863252M446769Q95782l061994l279463j46104K790865L371495
38921I946030J993452l04693k588390l570298k549715o48035M48358P11474J275746
38912D713929J981793J103907k009317n141210m982558p87754M121812N293523
38904D294125K020533j736616k361905j043185r90463j757797l43261K450385
$$ plain form
38896 531816 2503598 44714 -4948878 -6690207 -3764187 -748103 -907669 -2151585
38888 -2151585 -2041490 -2046811 -3792397 -5216210 -4409581 -4011028 -7197455 -11563665 -11916254
38879 -11916254 -8008709 -4637758 -4269211 -4246439 -2085867 572170 847963 -1592946 -5118090
38870 -5118090 -8068434 -8965810 -7155426 -4490004 -4209568 -6857767 -9271166 -8807014 -6498754
38861 -6498754 -4617266 -3244938 -1219376 1249310 3148367 4632824 6109428 6182876
38853 6182876 3123134 -1603131 -3749549 -1260509 2770942 3465959 -278740 -4892112
38845 -4892112 -6597491 -5431584 -4148340 -4065509 -3457479 -227811 5098622 9844152 11877852
38836 11877852 11099786 8974701 7485814 7847895 9170219 8969095 6122371 2655416
$$ packed form
38896E31816J971782k458884m993592j741329K926020L016084j59566j243916
38888b151585J10095n321j745586j423813Q06629L98553l186427m366210l52589
38879a1916254L907545L370951L68547K2772K160572K658037K75793k440909l525144
38870e118090k950344q97376J810384K665422K80436k648199k413399M64152K308260
38861f498754J881488J372328K025562K468686J899057J484457J476604P3448
38853F182876l059742m726265k146418K489040M031451O95017l744699m613372
38845d892112j705379J165907J283244Q2831O08030L229668N326433M745530K033700
38836A1877852p78066k125085j488887L62081J322324k01124k846724l466955
$$ plain form
38828 2655416 1245027 1630055 1253110 -933063 -3293964 -4128127 -3452332 -1896805 222847
38819 222847 2170330 2922151 2744071 3043600 4028341 4186484 2803734 1204353 530402
38810 530402 59879 -1040046 -1955197 -1759983 -1392963 -2464947 -5001234 -7776426 -10060390
38801 -10060390 -11691943 -12206618 -11322837 -9851198 -8962159 -8834385 -8747881 -8034059 -6454001
38792 -6454001 -4394200 -3067423 -3510644 -5102616 -6375855 -7351664 -9006963 -10159876
38784 -10159876 -7937097 -2727633 587790 -1050137 -4090413 -3226637 1106309 3931343
38776 3931343 2932261 230479 -2317926 -5118561 -7787177 -8242740 -6067239 -3571887
38768 -3571887 -2361169 -1582489 -418337 602822 1669006 3891686 6174938 5084753
$$ packed form
38828B655416j410389L85028l76945k186173k360901q34163O75795J555527K119652
38819B22847J947483P51821j78080K99529R84741J58143j382750j599381o73951
38810E30402m70523j099925r15151J95214L67020j071984k536287k775192k283964
38801a0060390j631553n14675Q83781J471639Q89039J27774Q6504P13822J580058
38792f454001K059801J326777m43221j591972j273239r75809j655299j152913
38784a0159876K222779N209464L315423j637927l040276Q63776M332946K825034
38776C931343r99082k701782k548405k800635k668616m55563K175501K495352
38768c571887J210718P78680J164152J021159J066184K222680K283252j090185
$$ plain form
38760 5084753 -312570 -6272426 -8951355 -8516058 -6750396 -3574003 1244600 5444578
38752 5444578 6750313 6388420 6954964 8064137 7281031 4350827 1239899 -1318814 -3947061
38743 -3947061 -5655917 -4412800 -1193096 -148146 -3470840 -8554623 -11507928 -11496917
38735 -11496917 -10455514 -10251930 -11340173 -12885858 -13311162 -11839617 -9934882 -9774959
38727 -9774959 -11010742 -10936911 -8423065 -5453993 -3747160 -2208639 526406 3107765
38719 3107765 3323439 1524656 -99238 -549670 36122 2404913 7188431 12172995 13666194
38710 13666194 11213651 8294645 7308245 6372229 2772734 -2429032 -5509194 -4796351
38702 -4796351 -2212335 -540055 -924470 -2938526 -5486900 -7363172 -8061038 -8264946 -8672299
$$ packed form
38760E084753n397323n959856k678929M35297J765662L176393M818603M199978
38752E444578J305735l61893N66544J109173p83106k930204l110928k558713k628247
38743c947061j708856J243117L219704J044950l322694n083783k953305J1011
38735a1496917J041403K03584j088243j545685m25304J471545J904735J59923
38727i774959j235783P3831K513846K969072J706833J538521K735045K581359
38719C107765K15674j798783j623894m50432N85792K368791M783518M984564J493199
38710A3666194k452543k919006r86400r36016l599495n201766l080162P12843
38702d796351K584016J672280l84415k014056k548374j876272o97866k03908m07353
$$ plain form
38693 -8672299 -8432760 -5940215 -1273777 3451664 6586923 8583799 10474340 11849159
38685 11849159 11412566 8947035 5779689 3589894 3317065 4697418 6182450 5890672
38677 5890672 3512809 871043 -174982 195921 709694 1247540 2610715 4389414 4978696
38668 4978696 4143544 3908811 5975084 9368641 11572278 11158244 8502983 4691205 636372
38659 636372 -3195166 -6869628 -10361906 -12540423 -11772133 -8260116 -4736144 -3711506
38651 -3711506 -4787079 -5773800 -5636879 -4947911 -4175854 -3320687 -2922795 -3533489 -4093283
38642 -4093283 -2736385 289883 2276214 1499292 -457400 -925300 518490 2230754
38634 2230754 3103986 3478696 3795372 3728614 2886190 1528783 305990 -330627 -385110
$$ packed form
38693h672299K39539K492545M666438M725441L135259J996876J890541J374819
38685A1849159m36593k465531l167346k189795k72829J380353J485032k91778
38677E890672k377863k641766j046025L70903N13773N37846J363175J778699N89282
38668D978696q35152k34733K066273L393557K203637m14034k655261l811778m054833
38659F36372l831538l674462l492278k178517P68290L512017L523972J024638
38651c711506j075573r86721J36921O88968P72057Q55167L97892o10694n59794
38642d093283J356898L026268J986331p76922j956692m67900J443790J712264
38634B230754Q73232L74710L16676o6758q42424j357407j222793o36617n4483
$$ plain form
38625 -385110 -254077 -370420 -775620 -1193358 -1503634 -1766268 -1855731 -1721663 -1960653 -3159801
38615 -3159801 -4539837 -4491282 -2856173 -1172292 90109 2581762 6693001 9021954
38607 9021954 6154876 166335 -3023157 -1126533 1874751 1673748 -898058 -2374793
38599 -2374793 -1879842 -839064 623126 3273253 5455948 4135599 -160047 -2998142
38591 -2998142 -2086070 -447627 -1260088 -2335677 700812 7204472 11543974 10474519
38583 10474519 6825896 4690213 4209648 3370428 2429899 3283643 5442321 5931349 3476550
38574 3476550 145510 -1997023 -3584868 -5896482 -7875915 -7235924 -3903568 -643291
38566 -643291 -167771 -2563441 -5474582 -6161781 -3798000 -556074 79133 -2908219 -6477394
$$ packed form
38625c85110J31033j16343m05200m17738l10276k62634q9463J34068k38990j199148
38615c159801j380036M8555J635109J683881J262401K491653M111239K328953
38607I021954k867078n988541l189492J896624L001284k01003k571806j476735
38599b374793M94951J040778J462190K650127K182695j320349m295646k838095
38591b998142R12072J638443q12461j075589L036489O503660M339502j069455
38583A0474519l648623k135683m80565q39220r40529Q53744K158678M89028k454799
38574C476550l331040k142533j587845k311614j979433O39991L332356L260277
38566f43291M75520k395670k911141o87199K363781L241926O35207k987352l569175
$$ plain form
38557 -6477394 -6955678 -4546945 -2789754 -3788670 -6045478 -7297453 -7201048 -6202745 -4028170
38548 -4028170 -1138680 104319 -1794633 -4483335 -4102343 -354662 3100545 3416755
38540 3416755 1498052 -223639 -772209 -557597 -160088 -156344 -630283 -83697 3408419
38531 3408419 8980981 12845673 12731822 10486796 8494949 5756326 471213 -5045395
38523 -5045395 -5976345 -1616037 3197127 4389982 3495279 4428528 7644058 9877744 8755884
38514 8755884 5513843 3047906 2587496 2862691 2284991 1479654 2842587 7091407 11374184
38505 11374184 12345656 10379578 8596832 8125294 7194409 5346276 5221527 8433249 12474899
38496 12474899 14176625 14022044 14153033 13816912 10323922 3981071 -1241019 -2354015
$$ packed form
38557f477394m78284K408733J757191r98916k256808j251975R6405R98303K174575
38548d028170K889490J242999j898952k688702L80992L747681L455207L16210
38540C416755j918703j721691n48570K14612L97509L744m73939N46586L492116
38531C408419N572562L864692j13851k245026j991847k738623n285113n516608
38523e045395r30950M360308M813164J192855q94703R33249L215530K233686j121860
38514H755884l242041k465937m60410K75195n77700q05337J362933M248820M282777
38505A1374184R71472j966078j782746m71538r30885j848133j24749L211722M041650
38496A2474899J701726j54581J30989l36121l492990o342851n222090j112996
$$ plain form
38488 -2354015 -257081 2284404 3377454 2398660 -231047 -3001866 -4517012 -5000724
38480 -5000724 -5326316 -4968720 -2882358 -63311 1264346 1108778 1699798 3640698 4986679
38471 4986679 5005858 5679102 7769663 8422355 5293641 826448 -662085 1136848 2546446
38462 2546446 1258958 -1038482 -1477545 676447 3902055 6147695 6368188 5281552
38454 5281552 4651509 5318066 6422526 6894603 6432379 4383441 -258115 -6032052 -8353030
38445 -8353030 -4663295 979709 1966504 -2401101 -5982377 -3990692 1165032 3796901
38437 3796901 2058586 -1079626 -2360377 -1379218 283031 1174494 961270 301098 129556
38428 129556 861885 2170121 3282945 3270682 1599536 -862687 -1904941 -60317 3695698
$$ packed form
38488b354015K096934K541485J093050r78794k629707k770819j515146m83712
38480e000724l25592L57596K086362K819047J327657j55568N91020J940900J345981
38471D986679J9179O73244K090561O52692l128714m467193j488533J798933J409598
38462B546446j287488k297440m39063K153992L225608K245640K20493j086636
38454E281552o30043O66557J104460M72077m62224k048938m641556n773937k320978
38445h353030L689735N643004R86795m367605l581276J991685N155724K631869
38437C796901j738315l138212j280751R81159J662249Q91463k13224o60172j71542
38428A29556P32329J308236J112824j2263j671146k462223j042254J844624L756015
$$ plain form
38419 3695698 7260095 9752623 11282606 11297752 9267767 6594395 5435260 5569610 4889900
38410 4889900 3270466 3139511 5354840 7398741 7197714 6085587 5952518 5837026 3930474
38401 3930474 1158333 -118959 124192 -73210 -1072090 -987158 1391519 5046876 8076420
38392 8076420 8954202 6794122 2127005 -2779027 -5922615 -7546373 -8771945 -9292673
38384 -9292673 -8484699 -7768709 -8980136 -10777620 -9844832 -5911503 -2342024 -944091 444788
38375 444788 3590723 6261300 5591367 2804957 1581740 2904310 4290854 3620320 1368012
38366 1368012 -709863 -1080564 1138994 5179698 8001971 6727880 2144023 -1943943
38358 -1943943 -3342432 -3668834 -5053771 -6432659 -4885519 131047 5713054 8756957
$$ packed form
38419C695698L564397K492528J529983J5146k029985k673372j159135J34350o79710
38410D889900j619434j30955K215329K043901k01027j112127j33069j15492j906552
38401C930474k772141j277292K43151j97402r98880Q4932K378677L655357L029544
38392H076420Q77782k160080m667117m906032l143588j623758j225572n20728
38384i292673Q07974P15990j211427j797484R32788L933329L569479J397933J388879
38375D44788L145935K670577o69933k786410j223217J322570J386544o70534k252308
38366A368012k077875l70701K219558M040704K822273j274091m583857m087966
38358a943943j398489l26402j384937j378888J547140N016566N582007L043903
$$ plain form
38350 8756957 8944011 8046092 7341736 6727291 6016957 5911891 7071638 8788416 9442682
38341 9442682 8290810 6144116 4180011 2850077 2287203 2830407 4181947 4644133 2586696
38332 2586696 -1189015 -3751448 -3269066 -1094797 24877 -913271 -2651931 -3632768 -3249626
38323 -3249626 -1410902 1618988 4462722 5035336 2782172 -196831 -1358974 -662597
38315 -662597 -234542 -1362160 -3040241 -3595821 -2613763 -948510 190056 -112747 -1658948
38306 -1658948 -2612730 -1035928 2452036 4876845 4623421 3464242 3551049 3932624 2239558
38297 2239558 -1148692 -3347969 -3300320 -3078744 -4058113 -4290469 -1399919 3504676 6705912
38288 6705912 5947856 2214003 -1930632 -4354578 -4117943 -1760525 868622 1963766
$$ packed form
38350H756957J87054q97919p04356o14445p10334j05066J159747J716778O54266
38341I442682j151872k146694j964105j329934n62874N43204J351540M62186k057437
38332B586696l775711k562433M82382K174269J119674r38148j738660r80837L83142
38323c249626J838724L029890K843734N72614k253164k979003j162143O96377
38315f62597M28055j127618j678081n55580R82058J665253J138566l02803j546201
38306a658948r53782J576802L487964K424809k53424j159179Q6807L81575j693066
38297B239558l388250k199277M7649K21576r79369k32356K890550M904595L201236
38288F705912p58056l733853m144635k423946K36635K357418K629147J095144
$$ plain form
38280 1963766 1263045 -152223 -1346758 -2218822 -2913841 -3389875 -3717104 -4135882 -4465931
38271 -4465931 -3904583 -1914447 799816 2730153 3266335 3569456 5077395 7251313 7888366
38262 7888366 6177438 4274721 4637638 6688513 7884829 7662099 8057450 10008645 11327590
38253 11327590 9743801 6386548 4512363 5532003 7696844 8231757 5703770 903920
38245 903920 -3475346 -4586686 -2056023 1434691 3060228 2734506 2097361 1579859 235980
38236 235980 -1885851 -3207397 -2871456 -1980352 -1888194 -2398897 -2510692 -2258658 -2942737
38227 -2942737 -5560848 -9288332 -11556848 -9968039 -4604922 1704709 5858559 7004803
38219 7004803 6281812 4757224 2678501 483147 -750595 -328328 1186648 2412776
$$ packed form
38280A963766p00721j415268j194535q72064o95019m76034l27229m18778l30049
38271d465931N61348J990136K714263J930337N36182L03121J507939K173918O37053
38262G888366j710928j902717L62917K050875J196316k22730L95351J951195J318945
38253A1327590j583789l357253j874185J019640K164841N34913k527987m799850
38245I03920m379266j111340K530663L490714J625537l25722o37145n17502j343879
38236B35980k121831j321546L35941Q91104R2158n10703j11795K52034o84079
38227b942737k618111l727484k268516J588809N363117O309631M153850J146244
38219G004803p22991j524588k078723k195354j233742M22267J514976J226128
$$ plain form
38211 2412776 2223851 592337 -1164888 -1257947 855618 3836300 6035282 7229477 8098414
38202 8098414 8543045 7565516 4618895 331839 -3713855 -5332271 -2913853 2409816
38194 2409816 6705266 7153680 5461834 5439248 7724032 9329685 8230158 5493479 2359234
38185 2359234 -1644724 -6122540 -8119439 -5466429 -178368 3772216 4939551 4672676
38177 4672676 4150463 3618822 3898233 5954132 8706876 9427972 7031207 3532697 1619969
38168 1619969 1814274 2466069 1667311 -1137519 -4610046 -6320320 -4858064 -1428459 1194174
38159 1194174 1311126 -684316 -3588520 -6443322 -8128228 -7294911 -3764299 552028
38151 552028 3098703 3075758 1885600 1176636 962388 45874 -1912968 -3392838 -2498471
$$ packed form
38211B412776j88925j631514j757225r3059K113565K980682K198982J194195Q68937
38202H098414M44631r77529k946621m287056m045694j618416K418418N323669
38194B409816M295450M48414j691846k2586K284784J605653j099527k736679l134245
38185B359234m003958m477816j996899K653010N288061L950584J167335k66875
38177D672676n22213n31641K79411K055899K752744P21096k396765l498510j912728
38168A619969J94305O51795p98758k804830l472527j710274J462256L429605K622633
38159A194174J16952j995442k904204k854802j684906Q33317L530612M316327
38151E52028K546675k2945j190158p08964k14248r16514j958842j479870Q94367
$$ plain form
38142 -2498471 812744 4543944 6675868 6880166 6248247 5898463 5912546 5122448 2078454
38133 2078454 -2966597 -7181662 -7472054 -3854564 734069 4162437 6858204 9198177
38125 9198177 9407593 5950369 501523 -3699893 -5581613 -6180512 -5691839 -3268553 271140
38116 271140 2187886 1025894 -1867822 -4661344 -6967109 -8672353 -8816752 -7024228
38108 -7024228 -4733846 -3677204 -4011822 -4899021 -5870261 -6523806 -5807917 -2900208 1558290
38099 1558290 5769890 7786048 6117082 931822 -4561004 -5896476 -2343380 1383744
38091 1383744 698052 -2755332 -3552175 -540533 1358638 -1434930 -5476546 -4892394 403571
38082 403571 4600407 3607806 -584915 -3897604 -5498149 -7139806 -9144976 -9903259 -8969451
$$ packed form
38142b498471L311215L731200K131924K04298o31919l49784J4083p90098l043994
38133B078454n045051m215065k90392L617490M588633L428368K695767K339973
38125I198177K09416l457224n448846m201416j881720n98899M88673K423286L539693
38116B71140J916746j161992k893716k793522k305765j705244j44399J792524
38108g024228K290382J056642l34618q87199r71240o53545P15889K907709M458498
38099A558290M211600K016158j668966n185260n492826j335472L553096L727124
38091A383744o85692l453384p96843L011642J899171k793568m041616N84152N295965
38082D03571M196836r92601m192721l312689j600545j641657k005170p58283R33808
$$ plain form
38073 -8969451 -8053804 -8303591 -8684613 -8276093 -8459031 -10856531 -13949233 -14058262 -10002241
38064 -10002241 -4960414 -2894934 -4456615 -7388893 -9713028 -10924361 -10691086 -8427159
$$ packed form
38073h969451R15647k49787l81022M08520j82938k397500l092702j09029M056021
38064a0002241N041827K065480j561681k932278k324135j211333K33275K263927
$$ [...]
##END NTUPLES=NMR SPECTRUM
##END=
