##TITLE=31Pdec_DE-40spext
 D2O
 64 sc
 1.4.2024
##JCAMPDX= 6.0         $$ Bruker NMR JCAMP-DX V2.0
##DATA TYPE= NMR SPECTRUM
##DATA CLASS= NTUPLES
##ORIGIN= UXNMR, Bruker Analytische Messtechnik GmbH
##OWNER= root
$$ XWIN-NMR		Version 3.5
$$ Mon Apr  1 14:30:50 2024 Russian Standard Time (UT+4h)  she@DPX200
##.OBSERVE FREQUENCY= 81.013821
##.OBSERVE NUCLEUS= ^31P
##.ACQUISITION MODE= SIMULTANEOUS
##.ACQUISITION SCHEME= undefined
##.AVERAGES= 64
##.DIGITISER RES= 16
##SPECTROMETER/DATA SYSTEM= spect
##.PULSE SEQUENCE= zgpg30
##.SOLVENT NAME= D2O
##.SHIFT REFERENCE= (INTERNAL, D2O, 0, 248.564)
##AUDIT TRAIL= $$ (NUMBER, WHEN, WHO, WHERE, WHAT)
$$ ##TITLE= Audit trail, XWIN-NMR		Version 3.5
$$ ##JCAMPDX= 5.01
$$ ##ORIGIN= Bruker BioSpin GmbH
$$ ##OWNER= she
$$ F:/spectra/data/she/nmr/P31/1/pdata/1/auditp.txt
$$ ##AUDIT TRAIL=  $$ (NUMBER, WHEN, WHO, WHERE, WHAT)
(   1,<2024-04-01 14:29:55.59 +0400>,<she>,<DPX200>,
      <continue with go, POWCHK disabled, PULCHK disabled
       configuration hash MD5:
       00 E9 B6 7A A2 85 ED C7 34 08 36 98 17 FE 4E 26
       data hash MD5: 32K
       25 E9 4C 43 AC AD A9 F2 B4 42 B0 6E 4D 4B 83 6E>)
(   2,<2024-04-01 14:29:58.87 +0400>,<she>,<DPX200>,
      <Start of raw data processing
       efp BC_mod = 2 LB = 10 FT_mod = 6 PKNL = 1 PHC0 = -12860.03 PHC1 = 68.0833 SI = 64K 
       data hash MD5: 64K
       74 98 38 82 F3 BE D5 75 7F FD D4 F6 4D B4 AD 62>)
(   3,<2024-04-01 14:30:17.75 +0400>,<she>,<DPX200>,
      <pk PHC0 = 25.22721 PHC1 = 30.60002 
       data hash MD5: 64K
       6B F4 DE 9E 16 3B 62 78 64 75 2E 3E 01 8C 5C B9>)
$$ ##END=
$$ 
$$ hash MD5
$$ CD 37 7B EE 62 6A 9A 1A 6F 1B 89 31 C3 6E CF 7F
##$RELAX= 
##$RELAX= 
##$RELAX= 
##$RELAX= 
##$RELAX= 
##$RELAX= 
##$RELAX= 
##$RELAX= 
##$RELAX= 
$$ Bruker specific parameters
$$ --------------------------
##$DU= <F:/spectra>
##$EXPNO= 1
##$NAME= <P31>
##$PROCNO= 1
##$TYPE= <nmr>
##$USER= <she>
##$AMP= (0..31)
100 100 100 100 100 100 100 100 100 100 100 100 100 100 100 100 100 100 
100 100 100 100 100 100 100 100 100 100 100 100 100 100 
##$AQSEQ= 0
##$AQ_mod= 1
##$AUNM= <au_zg>
##$AUTOPOS= <>
##$BF1= 81.014009
##$BF2= 200.13
##$BF3= 200.13
##$BF4= 200.13
##$BF5= 200.13
##$BF6= 200.13
##$BF7= 200.13
##$BF8= 200.13
##$BYTORDA= 1
##$CFDGTYP= 0
##$CFRGTYP= 5
##$CHEMSTR= <none>
##$CNST= (0..31)
1 1 145 1 1 1 1 1 1 1 1 1 1 1 1 1 1 1 1 1 1 1 1 1 1 1 1 1 1 1 1 1 
##$CPDPRG= <waltz16>
##$CPDPRG1= <>
##$CPDPRG2= <waltz16>
##$CPDPRG3= <>
##$CPDPRG4= <mlev>
##$CPDPRG5= <mlev>
##$CPDPRG6= <mlev>
##$CPDPRG7= <mlev>
##$CPDPRG8= <mlev>
##$CPDPRGB= <>
##$CPDPRGT= <>
##$D= (0..31)
0 1 0 0 0 0 0 0 0 0 0 0.03 2e-05 3e-06 0 0 0 0 0 0 0 0 0 0 0 0 0 0 0 0 
0 0 
##$DATE= 1711967296
##$DBL= (0..7)
120 120 120 11 120 120 24 19 
##$DBP= (0..7)
150 150 150 150 150 150 150 150 
##$DBP07= 0
##$DBPNAM0= <>
##$DBPNAM1= <>
##$DBPNAM2= <>
##$DBPNAM3= <>
##$DBPNAM4= <>
##$DBPNAM5= <>
##$DBPNAM6= <>
##$DBPNAM7= <>
##$DBPOAL= (0..7)
0.5 0.5 0.5 0.5 0.5 0.5 0.5 0.5 
##$DBPOFFS= (0..7)
$$ [...]
##$SUBNAM2= <"">
##$SUBNAM3= <"">
##$SUBNAM4= <"">
##$SUBNAM5= <"">
##$SUBNAM6= <"">
##$SUBNAM7= <"">
##$SUBNAM8= <"">
##$SUBNAM9= <"">
##$SW= 501.771253377433
##$SWIBOX= (0..15)
0 1 3 0 0 0 0 0 0 0 0 0 0 0 0 0 
##$SW_h= 40650.406504065
##$TD= 32768
##$TD0= 1
##$TE= 0
##$TE2= 300
##$TE3= 300
##$TEG= 300
##$TL= (0..7)
0 120 53 12 22 120 120 120 
##$TP= (0..7)
150 150 150 150 150 150 150 150 
##$TP07= 0
##$TPNAME0= <>
##$TPNAME1= <>
##$TPNAME2= <>
##$TPNAME3= <>
##$TPNAME4= <>
##$TPNAME5= <>
##$TPNAME6= <>
##$TPNAME7= <>
##$TPOAL= (0..7)
0.5 0.5 0.5 0.5 0.5 0.5 0.5 0.5 
##$TPOFFS= (0..7)
0 0 0 0 0 0 0 0 
##$TUNHIN= 0
##$TUNHOUT= 0
##$TUNXOUT= 0
##$USERA1= <user>
##$USERA2= <user>
##$USERA3= <user>
##$USERA4= <user>
##$USERA5= <user>
##$V9= 5
##$VALIST= <valist>
##$VCLIST= <CCCCCCCCCCCCCCC>
##$VD= 0
##$VDLIST= <DDDDDDDDDDDDDDD>
##$VPLIST= <PPPPPPPPPPPPPPP>
##$VTLIST= <TTTTTTTTTTTTTTT>
##$WBST= 1024
##$WBSW= 4
##$XGAIN= (0..3)
0 0 0 0 
##$XL= 0
##$YL= 0
##$YMAX_a= 1808
##$YMIN_a= -1660
##$ZGOPTNS= <>
##$ZL1= 120
##$ZL2= 120
##$ZL3= 120
##$ZL4= 120
##$ABSF1= 0
##$ABSF2= 0
##$ABSG= 0
##$ABSL= 0
##$ALPHA= 0
##$AQORDER= 0
##$ASSFAC= 0
##$ASSFACI= 0
##$ASSFACX= 0
##$ASSWID= 0
##$AUNMP= <proc_1d>
##$AZFE= 0.1
##$AZFW= 0.5
##$BCFW= 0
##$BC_mod= 2
##$BYTORDP= 0
##$COROFFS= 0
##$CY= -3
##$DATMOD= 1
##$DC= 0
##$DFILT= <>
##$DTYPP= 0
##$F1P= 0
##$F2P= 0
##$FCOR= 1
##$FTSIZE= 65536
##$FT_mod= 6
##$GAMMA= 0
##$GB= 0
##$INTBC= 1
##$INTSCL= 6.047779e-11
##$ISEN= 30
##$LB= 10
##$LEV0= 0
##$LPBIN= 0
##$MAXI= 10000
##$MC2= 0
##$MEAN= 0
##$ME_mod= 0
##$MI= 50
##$NCOEF= 0
##$NC_proc= -11
##$NLEV= 6
##$NOISF1= 182.463
##$NOISF2= 159.3651
##$NSP= 0
##$NTH_PI= 0
##$NZP= 0
##$OFFSET= 248.5645
##$PC= 4
##$PHC0= -12834.8
##$PHC1= 98.68332
##$PH_mod= 1
##$PKNL= yes
##$PPARMOD= 0
##$PSCAL= 0
##$PSIGN= 0
##$REVERSE= no
##$SF= 81.0140089999694
##$SI= 65536
##$SIGF1= 159.3651
##$SIGF2= -187.1042
##$SINO= 113.3802
##$SIOLD= 16384
##$SREGLST= <1H.CDCl3>
##$SSB= 0
##$STSI= 65536
##$STSR= 0
##$SW_p= 40650.406504065
##$SYMM= 0
##$S_DEV= 0
##$TDeff= 32768
##$TDoff= 0
##$TI= <>
##$TILT= no
##$TM1= 0
##$TM2= 0
##$TOPLEV= 0
##$USERP1= <user>
##$USERP2= <user>
##$USERP3= <user>
##$USERP4= <user>
##$USERP5= <user>
##$WDW= 1
##$XDIM= 65536
##$YMAX_p= 363549554
##$YMIN_p= -102932508
$$ End of Bruker specific parameters
$$ ---------------------------------
##NTUPLES= NMR SPECTRUM
##VAR_NAME=  FREQUENCY,     SPECTRUM/REAL,   SPECTRUM/IMAG
##SYMBOL=    X,             R,               I
##VAR_TYPE=  INDEPENDENT,   DEPENDENT,       DEPENDENT
##VAR_FORM=  AFFN,          ASDF,            ASDF
##VAR_DIM=   65536,         65536,           65536
##UNITS=     HZ,            ARBITRARY UNITS, ARBITRARY UNITS
##FACTOR=    0.620285442955139, 1,           1
##FIRST=     20137.2065510682, 0,            0
##LAST=      -20513.1999529968, 0,           0
##MIN=       -20513.1999529968, -102932508,  0
##MAX=       20137.2065510682, 363549554,    0
$$ Real data points
##PAGE= N=1
##DATA TABLE= (X++(R..R)), XYDATA
$$ [...]
14797 14286109 14327563 14119984 13651614 12984410 12218217 11440498 10697598 10004073 9378161
14788 9378161 8873349 8578421 8580827 8917587 9551644 10394258 11357889 12401009 13535859
14779 13535859 14799285 16208666 17727915 19258742 20658557 21773251 22467922 22646329
14771 22646329 22262719 21332320 19937587 18221136 16363188 14551518 12952077 11681470
14763 11681470 10781935 10207431 9833254 9492279 9025699 8328679 7376683 6229520 5018519
14754 5018519 3923393 3141348 2847784 3150663 4049700 5419089 7029359 8607689 9916240
14745 9916240 10818561 11311284 11515565 11638239 11919214 12579448 13777425 15577027 17930553
14736 17930553 20685285 23620338 26506047 29160385 31475769 33410969 34967510 36173891
14728 36173891 37082456 37765194 38295563 38720487 39041273 39219829 39209517 38991793 38594502
14719 38594502 38079559 37508000 36904780 36245462 35474143 34544571 33462582 32304229 31194819
14710 31194819 30256814 29555195 29071318 28717007 28375099 27940542 27343887 26555509 25580093
14701 25580093 24451709 23233633 22018977 20922730 20058520 19505801 19286448 19368992 19700143
14692 19700143 20241485 20985132 21940190 23105241 24449817 25915333 27428454 28914360
14684 28914360 30306073 31554856 32644331 33601337 34493953 35416220 36469199 37746730
14676 37746730 39323747 41239910 43479451 45961042 48551626 51101030 53475903 55574059
14668 55574059 57323131 58683669 59663809 60324616 60750201 60987442 60994798 60639825 59751751
14659 59751751 58202104 55975450 53199414 50119289 47026120 44170806 41701730 39644322
14651 39644322 37917370 36372923 34848444 33216167 31409693 29418563 27264792 24985591
14643 24985591 22632154 20274748 18001986 15913689 14112930 12698745 11757914 11357647
14635 11357647 11542386 12331175 13706095 15589389 17823462 20176036 22379912 24191882
14627 24191882 25440500 26041047 25979716 25286441 24014992 22235985 20037129 17522656 14808696
14618 14808696 12017775 9277759 6724399 4496541 2712051 1428069 609141 128695
14610 128695 -192217 -530199 -1016312 -1718352 -2645700 -3765791 -5021653 -6345306 -7669122
14601 -7669122 -8940925 -10142878 -11304025 -12494759 -13802832 -15303126 -17034637 -18989994
14593 -18989994 -21115836 -23321215 -25492850 -27516840 -29304479 -30814154 -32056830 -33078851
14585 -33078851 -33932588 -34655818 -35269959 -35786590 -36206036 -36506730 -36638701 -36532003 -36118471
14576 -36118471 -35357455 -34255031 -32866772 -31279340 -29578783 -27822860 -26028927 -24173786
14568 -24173786 -22196812 -20007983 -17512718 -14658758 -11489011 -8167074 -4947866 -2096604
14560 -2096604 205217 1917799 3140562 4061993 4893439 5812915 6931942 8289073 9863752
14551 9863752 11592645 13370412 15034649 16355963 17058131 16876317 15636581 13322811
14543 13322811 10097560 6263603 2183732 -1803641 -5440796 -8570321 -11130618 -13143970
14535 -13143970 -14703299 -15951402 -17045067 -18109126 -19200676 -20303811 -21357231 -22297461
14527 -22297461 -23095812 -23775866 -24407653 -25081134 -25869492 -26799458 -27842302 -28925284 -29952393
14518 -29952393 -30824398 -31455661 -31787818 -31797270 -31491926 -30897717 -30042999 -28951994 -27653353
14509 -27653353 -26200427 -24691103 -23270965 -22106805 -21331435 -20981936 -20966328 -21082220 -21081033
14500 -21081033 -20748002 -19967128 -18751536 -17229530 -15588678 -14001411 -12570446 -11318919
14492 -11318919 -10216497 -9213658 -8267271 -7358367 -6502241 -5740706 -5111904 -4615591 -4203711
14483 -4203711 -3808490 -3388158 -2956294 -2578356 -2348423 -2368823 -2738495 -3538322 -4807996
14474 -4807996 -6528457 -8625801 -10991388 -13498055 -16004775 -18363305 -20439721 -22142986
14466 -22142986 -23440763 -24353979 -24939635 -25274639 -25442351 -25514653 -25526766 -25455153 -25216122 -24693490
14456 -24693490 -23783286 -22430618 -20640914 -18466945 -15986234 -13282980 -10440999 -7547355
14448 -7547355 -4701443 -2020952 363852 2331049 3797819 4746565 5229559 5346114 5205244
14439 5205244 4896412 4480545 3995315 3463752 2904457 2346671 1844830 1478396 1328897
14430 1328897 1443280 1804502 2327738 2885946 3350534 3623261 3644300 3383321 2834061 2022916
14420 2022916 1020362 -63903 -1106985 -2006426 -2704693 -3198728 -3538992 -3822629 -4180335
14411 -4180335 -4754399 -5669104 -7000537 -8755804 -10868822 -13212733 -15622598 -17920869
14403 -17920869 -19941872 -21555860 -22693785 -23369617 -23689796 -23834866 -24005430 -24346409 -24886668
14394 -24886668 -25531697 -26116509 -26486698 -26560830 -26346287 -25912280 -25343671 -24701282 -24004711
14385 -24004711 -23238800 -22373152 -21383754 -20273702 -19091381 -17935539 -16934186 -16199956 -15783486
14376 -15783486 -15646053 -15657448 -15615969 -15288406 -14463515 -13001077 -10858265 -8092015 -4849716
14367 -4849716 -1354758 2119593 5293809 7935305 9902474 11161009 11764282 11808201 11389107
14358 11389107 10591753 9505970 8240879 6908456 5582704 4269094 2912186 1437956
14350 1437956 -197402 -1981000 -3849873 -5720700 -7521481 -9207066 -10753610 -12141552
14342 -12141552 -13344473 -14336993 -15119675 -15742476 -16305676 -16932393 -17725157 -18724441 -19881820
14333 -19881820 -21057760 -22053262 -22672098 -22787030 -22373097 -21490839 -20236290 -18691703 -16900609
14324 -16900609 -14869923 -12588860 -10051696 -7273211 -4290353 -1151980 2093589 5402207
14316 5402207 8724446 11988921 15091210 17899919 20280757 22125665 23369292 23986431
14308 23986431 23982109 23392320 22299829 20849687 19243297 17703444 16422404 15514942 14993697
14299 14993697 14772287 14690365 14549754 14151993 13330878 11976252 10047937 7581773 4688574
14290 4688574 1540090 -1666368 -4760790 -7648416 -10327945 -12874419 -15400872 -18013111
14282 -18013111 -20763066 -23609722 -26410544 -28963905 -31092528 -32723270 -33914236 -34812980
14274 -34812980 -35573649 -36283232 -36935767 -37461703 -37790070 -37907270 -37880638 -37835238 -37900939 -38164985
14264 -38164985 -38655382 -39351055 -40198398 -41126400 -42069680 -43000772 -43950847 -44997391 -46223786
14255 -46223786 -47676442 -49338659 -51124626 -52893523 -54484532 -55762058 -56646441 -57111870
14247 -57111870 -57158356 -56782233 -55964257 -54676649 -52897508 -50619223 -47845174 -44581664 -40840250
14238 -40840250 -36659136 -32133661 -27431491 -22772875 -18378546 -14411221 -10942810 -7962566
14230 -7962566 -5414789 -3240143 -1400950 114025 1300886 2161155 2721455 3040632 3200975
14221 3200975 3293853 3413325 3658841 4134151 4929513 6088041 7571868 9248129 10906448
14212 10906448 12304629 13227948 13544798 13243113 12433606 11312261 10092024 8933461 7907245
14203 7907245 7001978 6164588 5346634 4533788 3750646 3049538 2499660 2185329 2206247 2665751
14193 2665751 3643079 5161135 7166276 9529077 12064214 14560692 16812679 18645917
14185 18645917 19940645 20651621 20818687 20558533 20036700 19429344 18884575 18487270 18232429
14176 18232429 18019546 17679671 17031408 15944816 14387563 12436314 10250696 8021245
14168 8021245 5912108 4018831 2351216 839698 -640633 -2232702 -4051344 -6138991
14160 -6138991 -8441031 -10817464 -13090693 -15104218 -16756082 -17990453 -18766182 -19036780
14152 -19036780 -18757258 -17904686 -16494129 -14587876 -12305966 -9837340 -7439640 -5417776
14144 -5417776 -4081542 -3689231 -4387965 -6167229 -8844374 -12091937 -15501070 -18664308
14136 -18664308 -21257000 -23095889 -24158143 -24559510 -24508079 -24253723 -24040983 -24063295 -24422306
14127 -24422306 -25106865 -26003819 -26936759 -27715464 -28177818 -28213225 -27765654 -26824443 -25418572
14118 -25418572 -23626176 -21593460 -19540252 -17731670 -16417976 -15768037 -15826011 -16505415 -17615707
14109 -17615707 -18908083 -20128651 -21069852 -21609945 -21729570 -21498629 -21036525 -20460236 -19841990
14100 -19841990 -19195795 -18497173 -17720058 -16863075 -15945183 -14973553 -13908079 -12651760 -11080862
14091 -11080862 -9102820 -6709710 -3995077 -1124284 1721075 4388048 6760497 8733805
14083 8733805 10183854 10959399 10907049 9915499 7956888 5108610 1548552 -2474980 -6687865
14074 -6687865 -10830164 -14675603 -18032009 -20740919 -22692291 -23850588 -24271631 -24091387
14066 -24091387 -23485100 -22614613 -21590458 -20466928 -19266783 -18013851 -16752647 -15550032
14058 -15550032 -14484347 -13623418 -12990447 -12530488 -12105904 -11539855 -10692170 -9524224 -8116537
14049 -8116537 -6636743 -5284420 -4242151 -3644284 -3556820 -3959551 -4734461 -5676603 -6538391
14040 -6538391 -7095879 -7206378 -6830554 -6016550 -4866263 -3506106 -2069572 -685276 535687
14031 535687 1510053 2183264 2520555 2497311 2098242 1325205 204034 -1218725 -2888821
14022 -2888821 -4757635 -6785248 -8929381 -11126466 -13279051 -15264673 -16971454 -18346926
14014 -18346926 -19430955 -20346300 -21244728 -22235190 -23329436 -24424612 -25321008 -25765842 -25517073
14005 -25517073 -24416418 -22444855 -19728473 -16485658 -12945541 -9286966 -5627395 -2050365
13997 -2050365 1363995 4530031 7365782 9802882 11789654 13294858 14318280 14901174
13989 14901174 15125621 15104353 14973477 14892750 15039571 15577877 16601433 18077326 19826401
13980 19826401 21561817 22973290 23815532 23958712 23389390 22185489 20494466 18518167
13972 18518167 16485787 14606087 13017740 11765756 10812176 10066372 9417761 8764663 8037314
13963 8037314 7208910 6289103 5303645 4271809 3192298 2043079 795514 -563271 -2013007
13954 -2013007 -3501273 -4965261 -6362786 -7695540 -9011854 -10384860 -11872350 -13475744
13946 -13475744 -15120092 -16667632 -17959028 -18863650 -19319664 -19350621 -19052217 -18553850 -17973204
13937 -17973204 -17385841 -16817904 -16251495 -15630067 -14866490 -13867121 -12574398 -11008036 -9275912
13928 -9275912 -7541995 -5967166 -4656264 -3638849 -2888051 -2359110 -2021275 -1866620 -1897940
13919 -1897940 -2111925 -2493775 -3026275 -3701571 -4521344 -5482187 -6554725 -7665870 -8688269
13910 -8688269 -9442572 -9725051 -9368218 -8318119 -6687955 -4749984 -2859183 -1339650 -383089
13901 -383089 -520 -41296 -262612 -414935 -313500 115715 816248 1612402 2258655 2518623
13891 2518623 2241929 1405268 109654 -1447832 -3009614 -4301023 -5088390 -5241134 -4769083
13882 -4769083 -3812969 -2592362 -1334549 -207089 731485 1550373 2422787 3560662 5131080
13873 5131080 7191160 9668776 12390534 15135443 17686821 19866000 21548044 22669338
13865 22669338 23234843 23324082 23088173 22730196 22467502 22484180 22889854 23700273 24844141
13856 24844141 26188020 27568614 28827565 29845496 30564721 30986818 31143822 31060718 30732139
13847 30732139 30123072 29188165 27899959 26278331 24411031 22450965 20581023 18954394
13839 18954394 17635686 16571646 15606366 14533681 13163305 11375881 9152827 6579374
13831 6579374 3826581 1120813 -1291203 -3178326 -4364007 -4767565 -4433505 -3526885 -2287547
13822 -2287547 -964810 232417 1152368 1695138 1807772 1489485 798540 -153950 -1230186
13813 -1230186 -2304442 -3296321 -4181572 -4977132 -5711820 -6397268 -7007582 -7472833 -7692847
13804 -7692847 -7572218 -7061239 -6177138 -4991648 -3596149 -2068894 -459859 1208270 2930966
13795 2930966 4708274 6527967 8351964 10116559 11749454 13191527 14405563 15366881
13787 15366881 16049255 16422529 16462785 16161910 15527828 14581118 13357880 11918056 10348794
13778 10348794 8755745 7245479 5907520 4802627 3960455 3386848 3077671 3033425 3268798
13769 3268798 3812883 4696689 5927429 7457107 9162952 10858039 12336050 13432416
13761 13432416 14072685 14287628 14194625 13958445 13744300 13671990 13782725 14034508 14333298 14584961
13751 14584961 14735550 14772606 14686133 14416200 13825540 12721960 10924054 8335849 4992420
13742 4992420 1060279 -3197279 -7468844 -11442138 -14844174 -17474812 -19235363 -20148849
13734 -20148849 -20359319 -20096690 -19610977 -19104434 -18695754 -18426940 -18291551 -18252538 -18237062 -18124882
13724 -18124882 -17759634 -16996139 -15763752 -14104143 -12153777 -10079286 -8005638 -5976700
13716 -5976700 -3961355 -1891788 288797 2587442 4942609 7230003 9291438 10978770
13708 10978770 12199802 12950295 13317651 13450830 13507136 13600486 13774980 14009854 14241487
13699 14241487 14383140 14335513 13994647 13263788 12067500 10364360 8160616 5527943 2617624
13690 2617624 -345206 -3095707 -5381952 -7016788 -7915589 -8114489 -7763119 -7084292 -6303859
13681 -6303859 -5574552 -4929247 -4288032 -3515652 -2500425 -1217525 250733 1745201 3097345
13672 3097345 4204145 5075707 5832343 6652995 7702677 9076704 10787728 12795451 15054049
13663 15054049 17542864 20257761 23167599 26165414 29049326 31549126 33385522 34331905
13655 34331905 34254684 33128649 31038956 28178480 24834832 21353568 18074714 15261597
13647 15261597 13053730 11465672 10427354 9838748 9609642 9672257 9974369 10468034 11102736
13638 11102736 11822793 12566219 13264952 13849172 14259117 14466812 14504275 14483837 14589216 15027126
13628 15027126 15956293 17430933 19387223 21669766 24069503 26346908 28238328 29465036
13620 29465036 29765749 28954518 26981781 23965332 20170289 15945560 11647458 7581134
13612 7581134 3971128 953537 -1421653 -3182011 -4415560 -5243823 -5789885 -6152468 -6398137
13603 -6398137 -6575354 -6738925 -6964397 -7340250 -7944515 -8822263 -9972923 -11345322 -12839595
13594 -12839595 -14323171 -15664910 -16774685 -17624715 -18239863 -18666524 -18940684 -19068244 -19019362
13585 -19019362 -18736602 -18158378 -17252306 -16039808 -14590781 -12985256 -11265434 -9412496
13577 -9412496 -7366702 -5078880 -2560741 93812 2720103 5109270 7032272 8261874
13569 8261874 8607270 7967137 6381573 4048879 1287775 -1542236 -4128400 -6269464
13561 -6269464 -7903167 -9094073 -9986448 -10738078 -11463585 -12213720 -12993399 -13793796 -14608079
13552 -14608079 -15420948 -16187098 -16820691 -17205309 -17218629 -16761620 -15787419 -14329058 -12520685
13543 -12520685 -10597818 -8861061 -7602967 -7022448 -7166063 -7925732 -9091750 -10429076
13535 -10429076 -11735112 -12855227 -13664699 -14047696 -13898111 -13140911 -11752387 -9762373 -7242418
13526 -7242418 -4296130 -1059363 2299293 5593422 8654243 11374635 13739428 15823315
13518 15823315 17753004 19647989 21563777 23458326 25191236 26554009 27322539 27319362 26470963
13509 26470963 24844218 22647706 20191091 17809717 15776819 14233715 13163387 12416753
13501 12416753 11780096 11054901 10115521 8921439 7486475 5833630 3972220 1914307
13493 1914307 -287758 -2522439 -4643967 -6526008 -8100943 -9354544 -10286752 -10877921
13485 -10877921 -11091766 -10913601 -10394561 -9667774 -8920780 -8337751 -8045812 -8095152 -8475890
13476 -8475890 -9149076 -10066278 -11169362 -12381045 -13603972 -14739555 -15721633 -16543746 -17256798
13467 -17256798 -17932162 -18609514 -19258112 -19769871 -19985306 -19740362 -18915029 -17464484 -15422839
13458 -15422839 -12884063 -9973410 -6822041 -3552919 -280785 2879997 5814696 8425775
13450 8425775 10661555 12533363 14104106 15453169 16639347 17681548 18561916 19242504
13442 19242504 19684188 19862713 19781324 19476391 19008558 18438835 17803513 17107050 16338980
13433 16338980 15502684 14638219 13828754 13187980 12829678 12826395 13173360 13776948 14476892 15093212
13423 15093212 15476087 15538697 15266876 14712453 13978223 13193874 12478240 11892407 11401676
13414 11401676 10867836 10082530 8834866 6989455 4542326 1629637 -1512158 -4612191
13406 -4612191 -7428646 -9792606 -11627506 -12944965 -13821465 -14365323 -14684339 -14860391 -14936251
13397 -14936251 -14922667 -14828742 -14700162 -14634956 -14756412 -15154549 -15833784 -16701260 -17601162 -18369820
13387 -18369820 -18878311 -19046655 -18838003 -18250571 -17315273 -16092763 -14660335 -13088231 -11416060
13378 -11416060 -9642711 -7734056 -5640029 -3311006 -716778 2119231 5073803 7899043
13370 7899043 10256311 11808549 12325708 11751662 10213001 7980625 5401079 2811092
13362 2811092 454555 -1571473 -3322089 -4961599 -6691145 -8674340 -10987429 -13609597
13354 -13609597 -16449890 -19389966 -22318727 -25146807 -27805065 -30239886 -32414124 -34310456
13346 -34310456 -35925997 -37253210 -38257978 -38873484 -39018727 -38632814 -37706721 -36297337 -34517259
13337 -34517259 -32503032 -30373827 -28198732 -25988843 -23718916 -21367278 -18949876 -16524306
13329 -16524306 -14158669 -11887863 -9692566 -7519111 -5327006 -3133605 -1032212 823356
13321 823356 2262074 3152784 3454504 3240358 2686983 2035521 1537073 1394747 1713280
13312 1713280 2469265 3515925 4628532 5577242 6194871 6407917 6225992 5713227 4964984
13303 4964984 4088437 3173361 2258051 1317027 287379 -882440 -2195005 -3597056 -4999197
13294 -4999197 -6306974 -7448270 -8384874 -9104874 -9607914 -9901753 -10014589 -10007859 -9973769 -10020161
13284 -10020161 -10256745 -10786764 -11693549 -13015285 -14720300 -16704703 -18821150 -20925359
13276 -20925359 -22917187 -24761268 -26486482 -28171903 -29926436 -31864465 -34076183 -36593672
13268 -36593672 -39362258 -42233579 -44992534 -47414885 -49335994 -50703212 -51587924 -52148520
13260 -52148520 -52560801 -52953655 -53384110 -53853955 -54338432 -54797234 -55165445 -55343953 -55205177
13251 -55205177 -54613429 -53450570 -51638221 -49149127 -46002993 -42251820 -37969937 -33260898
13243 -33260898 -28276650 -23230118 -18384112 -14014766 -10363410 -7596603 -5787396 -4918000
13235 -4918000 -4895766 -5576552 -6794882 -8396834 -10260699 -12289410 -14377649 -16381414 -18121901
13226 -18121901 -19430400 -20207911 -20461647 -20298502 -19884578 -19396398 -18985371 -18761612 -18789930
13217 -18789930 -19087583 -19619886 -20299041 -20994803 -21559126 -21856905 -21790044 -21305693 -20387774
13208 -20387774 -19039208 -17267709 -15086591 -12532148 -9686739 -6692323 -3745609 -1075603
13200 -1075603 1090188 2563053 3225918 3055491 2129813 616360 -1265324 -3302751 -5346608
13191 -5346608 -7328451 -9225947 -11003639 -12579360 -13844802 -14723999 -15227070 -15466609 -15632500
13182 -15632500 -15941401 -16581834 -17672450 -19245056 -21253577 -23597848 -26146946 -28755887
13174 -28755887 -31281788 -33606650 -35663581 -37454721 -39050774 -40569220 -42134809 -43832928
13166 -43832928 -45674294 -47590420 -49465690 -51189714 -52698930 -53981534 -55043545 -55861787
13158 -55861787 -56360383 -56429965 -55976473 -54967916 -53455285 -51562299 -49449783 -47266183 -45104235
13149 -45104235 -42986070 -40882170 -38745636 -36538318 -34241885 -31860678 -29420328 -26959884
13141 -26959884 -24518674 -22124199 -19784452 -17484502 -15190961 -12869497 -10510068 -8143367
13133 -8143367 -5837617 -3681735 -1767741 -177126 1031906 1836362 2253160 2331430 2134694
13124 2134694 1721797 1136372 409306 -429783 -1341451 -2273533 -3169128 -3983629 -4704693
13115 -4704693 -5365289 -6043686 -6855753 -7949145 -9494776 -11656084 -14529064 -18080905 -22131261
13106 -22131261 -26393360 -30548667 -34312642 -37469081 -39877681 -41469487 -42240042 -42243443 -41586602
13097 -41586602 -40420137 -38921222 -37266401 -35598066 -33995084 -32462958 -30955303 -29421983
13089 -29421983 -27858571 -26326228 -24929119 -23763361 -22864585 -22175397 -21542899 -20749707 -19574414
13080 -19574414 -17863570 -15586066 -12846044 -9850703 -6849344 -4069034 -1671307 255294
13072 255294 1671582 2558538 2910272 2753097 2167556 1288466 281043 -689246 -1478335
13063 -1478335 -1976527 -2118996 -1894992 -1351925 -591672 240232 971240 1424488 1448153 948770
13053 948770 -80719 -1551562 -3295973 -5102871 -6754490 -8050562 -8822483 -8949960 -8387006
13044 -8387006 -7189259 -5524070 -3647024 -1843243 -351554 697464 1302845 1568001
13036 1568001 1645404 1676064 1741535 1836343 1866845 1683741 1146677 198393 -1091382 -2544971
13026 -2544971 -3956157 -5185839 -6215118 -7125797 -8031191 -9012890 -10103355 -11307271 -12624164
13017 -12624164 -14046873 -15544941 -17059750 -18525250 -19902902 -21204979 -22485377 -23797525
13009 -23797525 -25143175 -26445975 -27568992 -28366224 -28739705 -28676581 -28253101 -27603219 -26861526
13000 -26861526 -26105336 -25325552 -24438693 -23326308 -21877799 -20022981 -17752061 -15119826
12992 -15119826 -12227326 -9183699 -6069116 -2926921 205000 3246616 6054345 8452501
12984 8452501 10301824 11557405 12277446 12586069 12627440 12545297 12491167 12638706 13179633 14291748
12974 14291748 16085625 18548296 21510378 24662719 27629842 30074016 31779860 32679426
12966 32679426 32817016 32288836 31197189 29635859 27697703 25484898 23106831 20662834
12958 20662834 18219866 15801426 13398520 11000954 8637311 6407302 4487697 3096171
12950 3096171 2415568 2510139 3280505 4485643 5819657 7001407 7836557 8234803 8188732
12941 8188732 7733285 6907152 5732930 4223602 2410743 378800 -1715910 -3658325
12933 -3658325 -5219926 -6215333 -6540723 -6178178 -5174312 -3613798 -1600503 754691 3343283
12924 3343283 6065046 8829356 11555512 14174567 16628141 18858798 20796668 22355069
12916 22355069 23442403 23985250 23951784 23367699 22320845 20953376 19443778 17983685 16752319
12907 16752319 15888265 15460915 15449746 15740830 16145778 16442854 16432513 15988851 15084548 13781623
12897 13781623 12202934 10505262 8859299 7429028 6349212 5710342 5555581 5882079
12889 5882079 6640112 7736156 9048966 10454593 11845056 13130417 14228374 15054484
12881 15054484 15525210 15577037 15191268 14404540 13292311 11935794 10400312 8744465 7051469
12872 7051469 5454688 4136032 3297508 3119897 3720244 5114317 7193586 9732083 12430063
12863 12430063 14977888 17107799 18613658 19349441 19233981 18274984 16596336 14439117
12855 14439117 12120311 9959823 8205704 6988425 6320389 6135471 6345282 6881449 7700796
12846 7700796 8752775 9935283 11076591 11963466 12400293 12262338 11517606 10220614 8495941
12837 8495941 6519449 4491235 2598672 984637 -259150 -1072028 -1400103 -1194512 -437436
12828 -437436 825765 2477101 4351160 6283091 8154711 9916263 11572683 13138914
12820 13138914 14585783 15807414 16633251 16883835 16444578 15321604 13652021 11662154
12812 11662154 9591791 7618897 5816300 4150898 2513965 765081 -1220306 -3505743
12804 -3505743 -6063732 -8778285 -11485843 -14036820 -16343912 -18389562 -20190649 -21746330
12796 -21746330 -23006328 -23882946 -24300198 -24248862 -23813853 -23159163 -22480852 -21954514 -21702836
12787 -21702836 -21793371 -22256163 -23099716 -24310083 -25835847 -27575343 -29380145 -31074186 -32475901
12778 -32475901 -33413374 -33735971 -33332926 -32158868 -30249765 -27713262 -24698891 -21371360
12770 -21371360 -17901802 -14467556 -11240689 -8359923 -5900665 -3862515 -2182560 -768084
12762 -768084 468028 1587517 2630945 3636496 4653655 5738954 6937733 8266285
12754 8266285 9707000 11221024 12774530 14367115 16045658 17889122 19962705 22260072
12746 22260072 24667995 26982432 28974569 30469624 31392312 31760317 31645153 31134549 30316314
12737 30316314 29280802 28126624 26955360 25851313 24855762 23952346 23074482 22132881 21053437
12728 21053437 19815324 18477866 17181240 16110592 15431130 15222138 15443190 15949392 16543948
12719 16543948 17035907 17275564 17165963 16670400 15829198 14773489 13711443 12878572 12470133
12710 12470133 12584066 13194176 14157757 15249492 16207398 16780349 16776222 16110950 14845233
12701 14845233 13184403 11428832 9891387 8816404 8326730 8406031 8912794 9621059 10280076
12692 10280076 10678025 10691757 10310510 9632563 8841543 8169823 7853511 8083481 8962101
12683 8962101 10479748 12520904 14897180 17392688 19803284 21956255 23708649 24936522
12675 24936522 25534545 25436316 24644663 23247866 21406796 19319968 17185420 15170772 13390335
12666 13390335 11887693 10632295 9542643 8536827 7591797 6782490 6279307 6301932 7046414
12657 7046414 8612640 10959174 13903336 17167195 20449154 23488285 26095628 28150049
12649 28150049 29576937 30330293 30386439 29746305 28440728 26534313 24123740 21328716 18279221
12640 18279221 15105183 11930340 8867185 6011657 3441135 1219046 -595719 -1939557
12632 -1939557 -2739575 -2918080 -2409875 -1189993 700240 3143673 5959751 8930786 11828281
12623 11828281 14431366 16541006 18000209 18724004 18725962 18117806 17070616 15752740 14274550
12614 14274550 12660726 10851940 8729903 6161041 3049980 -616046 -4751610 -9191355
12606 -9191355 -13729512 -18162332 -22321569 -26095144 -29433484 -32338169 -34830076 -36903158
12598 -36903158 -38485100 -39434121 -39587387 -38843158 -37230062 -34919335 -32172034 -29255732
12590 -29255732 -26380153 -23678787 -21226636 -19065126 -17214367 -15673218 -14416927 -13396561
12582 -13396561 -12536684 -11729095 -10829636 -9671690 -8104495 -6047334 -3534874 -728374
12574 -728374 2116632 4715507 6828110 8311152 9125692 9299138 8871825 7868666 6311072
12565 6311072 4248113 1777504 -951241 -3742529 -6369204 -8608124 -10297234 -11388858
12557 -11388858 -11967029 -12217853 -12369161 -12627083 -13131534 -13939032 -15027063 -16307246 -17641076
12548 -17641076 -18864533 -19828190 -20442546 -20703722 -20683545 -20493460 -20246032 -20027610 -19878621
12539 -19878621 -19777494 -19639125 -19344434 -18798695 -17988053 -16995505 -15961602 -15013089 -14204498
12530 -14204498 -13508080 -12855666 -12205530 -11596892 -11166350 -11121578 -11684207 -13021851 -15191403
12521 -15191403 -18112315 -21577364 -25293263 -28934826 -32198459 -34846391 -36735056 -37822048
12513 -37822048 -38152144 -37830761 -36994790 -35786241 -34331744 -32732455 -31066791 -29400138
12505 -29400138 -27790672 -26286448 -24918908 -23699130 -22615955 -21631946 -20680705 -19677508
12497 -19677508 -18551192 -17288376 -15965476 -14745388 -13835975 -13432050 -13670555 -14613542 -16250726
12488 -16250726 -18505108 -21235652 -24242741 -27280741 -30074079 -32333912 -33781187 -34183646
12480 -34183646 -33402194 -31427854 -28389441 -24526051 -20137265 -15534912 -11014255 -6841901
12472 -6841901 -3241324 -365830 1722944 3040407 3624689 3481319 2574095 870532 -1596782
12463 -1596782 -4701571 -8245857 -12012087 -15809198 -19488588 -22932716 -26040002 -28728474
12455 -28728474 -30958636 -32755706 -34213079 -35476073 -36713867 -38081530 -39672349 -41475819
12447 -41475819 -43370704 -45169966 -46699235 -47864852 -48673138 -49191268 -49471013 -49476998 -49063650
12438 -49063650 -48021897 -46173672 -43459061 -39967607 -35906714 -31537478 -27113210 -22837665
12430 -22837665 -18845567 -15204989 -11937823 -9046118 -6529478 -4388301 -2618102 -1199955
12422 -1199955 -87368 806346 1607371 2457622 3476436 4729898 6222565 7906785 9695818
12413 9695818 11473779 13103832 14437477 15328673 15659442 15377396 14526044 13237523 11677149
12404 11677149 9968355 8146278 6168257 3970230 1532310 -1082563 -3734399 -6249612
12396 -6249612 -8477351 -10331594 -11805218 -12958039 -13888462 -14699800 -15472231 -16247140 -17022205
12387 -17022205 -17753005 -18364568 -18779853 -18959020 -18926487 -18766602 -18593011 -18514902 -18617794 -18957818
12377 -18957818 -19556654 -20388215 -21362744 -22327276 -23097285 -23509924 -23466701 -22940807 -21956062
12368 -21956062 -20563779 -18830412 -16825953 -14602706 -12173497 -9509975 -6572179 -3361235
12360 -3361235 28140 3384446 6406802 8780105 10265924 10764488 10318996 9068031
12352 9068031 7181769 4823270 2152717 -643484 -3336832 -5679721 -7460116 -8555389
12344 -8555389 -8952765 -8725850 -7985492 -6839916 -5389428 -3748810 -2062751 -484352 878789
12335 878789 2014564 3016197 4045010 5270331 6819384 8753363 11062736 13666159
12327 13666159 16407654 19060262 21346312 22976603 23703710 23379925 22004420 19741775
12319 19741775 16903137 13896769 11161191 9090178 7958657 7867807 8731528 10313194
12311 10313194 12301175 14400455 16416370 18306575 20180694 22242834 24696392 27646715
12303 27646715 31035793 34629873 38063755 40926617 42858310 43622859 43141329 41486582
12295 41486582 38851247 35496914 31691275 27649093 23501733 19312041 15124648 11016162
12287 11016162 7108736 3538826 408961 -2237001 -4396781 -6069389 -7228369 -7830090
12279 -7830090 -7847770 -7304536 -6284880 -4920458 -3358460 -1725767 -102893 1482609 3043899
12270 3043899 4614915 6236593 7955702 9830766 11931315 14320671 17029752 20044589
12262 20044589 23322895 26826318 30535132 34425913 38426300 42378825 46035762 49088533
12254 49088533 51225220 52202585 51908713 50390513 47836738 44528943 40779447 36869110
12246 36869110 32996661 29258076 25670462 22230013 18967149 15961890 13312786 11086315
12238 11086315 9281806 7827221 6596820 5435702 4187533 2730102 1015855 -899464
12230 -899464 -2858530 -4637548 -6000222 -6751846 -6783473 -6103694 -4853516 -3294643 -1765046
12221 -1765046 -608756 -98754 -375000 -1416729 -3060673 -5060770 -7163117 -9161157
12213 -9161157 -10913557 -12335252 -13382262 -14039678 -14312592 -14223057 -13816559 -13168821 -12375744
12204 -12375744 -11523703 -10658500 -9770915 -8797419 -7625404 -6103875 -4070638 -1396095 1976192
12195 1976192 6015169 10617984 15637104 20896376 26191230 31288858 35944914 39933020
12187 39933020 43067432 45208887 46265710 46205847 45076280 43012582 40231719 37016985
12179 37016985 33701169 30639544 28163382 26521025 25826759 26034666 26945132 28246904
12171 28246904 29593309 30698268 31419573 31790975 31983530 32214288 32651144 33361118 34315938
12162 34315938 35432088 36611092 37760257 38794291 39630311 40192137 40432853 40365522 40073573
12153 40073573 39679171 39282482 38915096 38543479 38118551 37632698 37144211 36756224 36568567
12144 36568567 36635689 36955347 37488959 38193215 39039048 40007628 41070155 42166819 43198685
12135 43198685 44038019 44552807 44635430 44226284 43325450 41984754 40275041 38239243 35861134
12126 35861134 33076660 29821918 26080366 21897426 17367090 12619442 7824929 3202105
12118 3202105 -993657 -4507049 -7133999 -8771572 -9452743 -9351430 -8746946 -7954492 -7248920
12109 -7248920 -6811146 -6706642 -6885714 -7196333 -7415056 -7304122 -6684258 -5493281 -3803582
12100 -3803582 -1793960 309791 2306851 4087115 5667182 7174323 8778127 10602029
12092 10602029 12660806 14850589 16984407 18847516 20250150 21065983 21251573 20848181
12084 20848181 19974101 18814308 17601195 16571860 15901952 15644371 15711456 15915255 16043760
12075 16043760 15934907 15522242 14845595 14029818 13238386 12616333 12245737 12134552 12242379
12066 12242379 12525043 12968398 13588990 14401734 15378208 16425963 17403149 18157299 18563685
12057 18563685 18546249 18080979 17190848 15939034 14421477 12758536 11086090 9543772 8254515
12048 8254515 7293080 6653394 6235496 5870036 5379384 4651182 3688125 2605977 1577587
12039 1577587 750451 181046 -180801 -454009 -760000 -1161813 -1630395 -2043472 -2213989
12030 -2213989 -1941795 -1075157 439514 2538482 5053639 7743039 10324547 12510168
12022 12510168 14043991 14739848 14508327 13367635 11441072 8942811 6146790 3335272
12014 3335272 737343 -1519892 -3425984 -5060754 -6538958 -7952100 -9333919 -10659550
12006 -10659550 -11866167 -12874494 -13601777 -13971462 -13925528 -13435520 -12503908 -11154194 -9417455
11997 -9417455 -7326442 -4925182 -2293212 429112 3034886 5276390 6914550 7772131
11989 7772131 7774286 6967491 5509237 3624250 1539007 -577467 -2642736 -4657724 -6682686
11980 -6682686 -8799985 -11067956 -13480842 -15958569 -18375549 -20609807 -22581733 -24264705
11972 -24264705 -25668885 -26809962 -27680155 -28241194 -28447588 -28283558 -27783477 -27022211 -26090975
11963 -26090975 -25082020 -24086824 -23194751 -22482081 -21994419 -21731149 -21638240 -21614525 -21535369 -21289800
11953 -21289800 -20816056 -20117992 -19254976 -18311466 -17360040 -16432282 -15508936 -14533791 -13444216
11944 -13444216 -12201600 -10807547 -9306768 -7788771 -6392422 -5298020 -4688483 -4686475 -5303847
11935 -5303847 -6438681 -7921635 -9580777 -11291124 -12994974 -14696209 -16435455 -18251711
11927 -18251711 -20139606 -22017043 -23718448 -25020897 -25696871 -25575126 -24587153 -22784195
11919 -22784195 -20323882 -17437004 -14387408 -11433214 -8792994 -6621424 -5001270 -3953107
11911 -3953107 -3450895 -3425674 -3753367 -4245231 -4665801 -4784888 -4446186 -3625420 -2455719
11902 -2455719 -1206958 -218271 197680 -156946 -1319068 -3174955 -5515437 -8108294 -10757458
11893 -10757458 -13328760 -15741365 -17942154 -19883831 -21515858 -22784731 -23638481 -24035578
11885 -24035578 -23959486 -23434904 -22537284 -21388733 -20138664 -18932931 -17879959 -17026193 -16351939
11876 -16351939 -15788999 -15248518 -14643218 -13898193 -12957928 -11798211 -10439594 -8950164 -7431338
11867 -7431338 -5992920 -4728017 -3693106 -2894008 -2279292 -1743869 -1144071 -324430 844373
11858 844373 2422453 4368736 6539228 8721214 10687441 12244851 13263283 13686616
11850 13686616 13532501 12877219 11820108 10438832 8764253 6794603 4536016 2035232
11842 2035232 -616322 -3299092 -5884476 -8251301 -10304398 -11992350 -13311722 -14291946
11834 -14291946 -14972369 -15390100 -15586954 -15627679 -15613306 -15675614 -15947482 -16515342 -17370659 -18382237
11824 -18382237 -19305562 -19830479 -19653087 -18550921 -16442917 -13419929 -9734530 -5746825
11816 -5746825 -1840732 1657276 4525019 6647067 7990634 8584157 8514533 7933170 7046223
11807 7046223 6076243 5211124 4573263 4227772 4216157 4581922 5363807 6559601 8086968
11798 8086968 9772357 11382382 12683537 13495601 13709772 13271485 12155534 10363813 7952616
11789 7952616 5067305 1951377 -1086338 -3732655 -5729150 -6908805 -7208362 -6660228
11781 -6660228 -5362651 -3431937 -958523 2004518 5412634 9183335 13166060 17147537
11773 17147537 20888279 24169895 26830365 28774779 29965418 30404175 30116123 29135608
11765 29135608 27496679 25232318 22381335 18993629 15128973 10857725 6273053 1507815
11757 1507815 -3262871 -7841620 -12038611 -15693745 -18688602 -20958610 -22510329 -23433382
11749 -23433382 -23890883 -24082351 -24188845 -24319423 -24477700 -24560235 -24388445 -23765452 -22541433
11740 -22541433 -20667526 -18220280 -15387698 -12423389 -9589596 -7111956 -5156614 -3825340
11732 -3825340 -3159123 -3144273 -3717834 -4768930 -6136640 -7614593 -8977497 -10034972 -10696513
11723 -10696513 -11013466 -11166646 -11396000 -11905593 -12793200 -14033464 -15506689 -17046713 -18489658
11714 -18489658 -19716814 -20681089 -21401401 -21923548 -22271627 -22423066 -22322407 -21921683 -21220627
11705 -21220627 -20284003 -19229585 -18197694 -17320538 -16701795 -16403601 -16434259 -16738377 -17199294
11696 -17199294 -17660920 -17965733 -17997005 -17710778 -17146142 -16410061 -15643612 -14984230 -14536936
11687 -14536936 -14357272 -14439447 -14705839 -15006772 -15146101 -14934707 -14249177 -13061799 -11424500
11678 -11424500 -9420037 -7114130 -4539605 -1721999 1272105 4300063 7149286 9583055
11670 9583055 11400037 12480862 12809176 12462920 11574412 10270139 8620515 6631903 4286049
11661 4286049 1597043 -1356130 -4444662 -7543328 -10589298 -13610990 -16709195 -19996986
11653 -19996986 -23521540 -27196421 -30771819 -33863188 -36039757 -36947198 -36419538 -34537346
11645 -34537346 -31609407 -28083283 -24418022 -20969786 -17934173 -15355844 -13178453 -11294545
11637 -11294545 -9573086 -7871663 -6055671 -4037913 -1828043 439004 2526223 4175015
11629 4175015 5212359 5630999 5598829 5393934 5305042 5549886 6238167 7369033 8839501
11620 8839501 10455070 11951618 13037321 13448954 13004962 11637025 9391483 6407201
11612 6407201 2887620 -919310 -4735977 -8277745 -11287503 -13569795 -15008694 -15566613
11604 -15566613 -15273744 -14216964 -12527023 -10357436 -7855672 -5141186 -2309505 534903
11596 534903 3241333 5605145 7401345 8437347 8591774 7824449 6165732 3699697 549489
11587 549489 -3131702 -7163758 -11342939 -15455960 -19307833 -22751608 -25703336 -28137956
11579 -28137956 -30077612 -31585483 -32765245 -33753623 -34693555 -35688626 -36756896 -37812256
11571 -37812256 -38693120 -39230963 -39321881 -38958422 -38205008 -37139142 -35800451 -34177233 -32228508
11562 -32228508 -29915028 -27213135 -24108119 -20586877 -16649898 -12339696 -7761992 -3080485
11554 -3080485 1511314 5823018 9692069 12999400 15679390 17724812 19185410 20158616
11546 20158616 20771351 21154935 21421054 21649288 21891250 22186440 22576965 23106959 23801556
11537 23801556 24638449 25537581 26383644 27067753 27518398 27705373 27625543 27288698 26712691
11528 26712691 25926761 24977837 23932030 22863573 21831814 20857349 19908932 18905352 17733167
11519 17733167 16281410 14486424 12366584 10026562 7628765 5346868 3318649 1611034
11511 1611034 210008 -956168 -1969135 -2874340 -3661155 -4273112 -4634062 -4674165 -4348906
11502 -4348906 -3652639 -2628684 -1371868 -14333 1308520 2498731 3519659 4389762
11494 4389762 5155513 5865314 6558189 7264077 8003501 8778781 9560255 10279391 10839149
11485 10839149 11140658 11113139 10730636 10006250 8966082 7615872 5920483 3813891 1240536
11476 1240536 -1793793 -5192489 -8776381 -12319993 -15591441 -18377671 -20493362 -21784041
11468 -21784041 -22134815 -21488713 -19868775 -17391452 -14259897 -10735450 -7098181 -3612876
11460 -3612876 -509618 2025589 3861336 4936251 5270348 4959620 4151273 3010764 1696590
11451 1696590 352113 -887511 -1884030 -2494507 -2589567 -2089303 -999417 575451 2451719
11442 2451719 4408461 6227318 7717178 8728924 9172324 9036603 8402944 7436357 6354793
11433 6354793 5384444 4715142 4468562 4685186 5326095 6280575 7376826 8404011 9153409
11424 9153409 9469826 9288565 8637865 7609978 6323317 4896038 3434236 2025624 732652
11415 732652 -410657 -1390621 -2195602 -2800704 -3171219 -3288048 -3178269 -2924138 -2636786
11406 -2636786 -2408995 -2280109 -2236238 -2239274 -2257215 -2273515 -2274999 -2233267 -2093629 -1777186 -1196445
11395 -1196445 -282678 982403 2546271 4293378 6084977 7813506 9441582 11003761
11387 11003761 12572120 14206226 15912310 17628811 19244367 20641624 21745306 22545110
11379 22545110 23076326 23370816 23414214 23140688 22468223 21349124 19801337 17898126 15718364
11370 15718364 13286125 10540986 7366198 3664420 -563205 -5181200 -9943672 -14558539
11362 -14558539 -18757384 -22344867 -25218375 -27359757 -28806491 -29614923 -29833126 -29498336
11354 -29498336 -28659530 -27407286 -25886010 -24275720 -22752042 -21445011 -20412932 -19637412
11346 -19637412 -19041570 -18531565 -18051039 -17621330 -17337636 -17314962 -17613182 -18187131 -18890760
11337 -18890760 -19529066 -19925801 -19973668 -19650755 -19006783 -18134120 -17138084 -16112315 -15116832
11328 -15116832 -14157565 -13176428 -12067935 -10728803 -9123772 -7333565 -5556905 -4063746
11320 -4063746 -3121394 -2922943 -3539919 -4908529 -6848673 -9107031 -11410349 -13514615 -15240713
11311 -15240713 -16493199 -17261695 -17604141 -17612784 -17369758 -16906787 -16186232 -15114656 -13587074
11302 -13587074 -11545529 -9026429 -6172156 -3196131 -312783 2336080 4721537 6912573
11294 6912573 9013318 11086938 13107387 14960863 16486395 17523223 17937387 17624857
11286 17624857 16511460 14571315 11864344 8567361 4965753 1394392 -1847267 -4561301
11278 -4561301 -6669433 -8190717 -9210016 -9860270 -10314546 -10766748 -11387653 -12267254 -13374520
11269 -13374520 -14563596 -15628900 -16378425 -16683271 -16483773 -15768463 -14557109 -12901374 -10888957
11260 -10888957 -8630428 -6228100 -3749968 -1233843 1275994 3684716 5829437 7506096
11252 7506096 8530634 8805088 8358677 7348700 6025475 4679166 3587335 2971696 2961908
11243 2961908 3566211 4660371 6010494 7330705 8355619 8901072 8897711 8394658 7534011
11234 7534011 6499664 5454781 4493004 3624574 2800239 1958261 1072645 182109 -612615
11225 -612615 -1179963 -1398527 -1188278 -527486 537508 1889060 3353232 4740111 5895975
11216 5895975 6742027 7285114 7604538 7826441 8093249 8532783 9232434 10222571 11469812
11207 11469812 12881176 14322956 15654527 16765954 17601074 18154443 18446024 18489368 18270705
11198 18270705 17749806 16882137 15650256 14087303 12281453 10362815 8482647 6793266
11190 6793266 5430229 4494683 4036233 4041712 4437097 5105005 5910808 6724083 7426042 7905368
11180 7905368 8053020 7763590 6943225 5523176 3482053 875731 -2141121 -5326485 -8404701
11171 -8404701 -11141389 -13401259 -15162869 -16492983 -17503067 -18309802 -19008372 -19655163 -20254078
11162 -20254078 -20747385 -21019419 -20919492 -20298714 -19045973 -17111938 -14521854 -11383209 -7887482
11153 -7887482 -4296494 -906192 2006528 4236137 5680155 6339101 6286863 5625326 4443254
11144 4443254 2798162 730476 -1696875 -4357033 -7046243 -9517917 -11553942 -13034914
11136 -13034914 -13964891 -14434356 -14550985 -14392571 -14013555 -13484178 -12910991 -12409653 -12050289
11127 -12050289 -11820744 -11634627 -11375322 -10947426 -10309911 -9479055 -8505328 -7442646 -6331687
11118 -6331687 -5206381 -4113452 -3125990 -2338939 -1848606 -1728876 -2017960 -2720590 -3817826
11109 -3817826 -5271747 -7020382 -8969891 -10993576 -12941614 -14660591 -16019613 -16934195
11101 -16934195 -17373908 -17346489 -16868633 -15944013 -14560464 -12702482 -10369323 -7593039 -4453113
11092 -4453113 -1082364 2340269 5609794 8526042 10933906 12764490 14054249 14916539
11084 14916539 15465568 15733371 15637865 15030299 13792596 11917683 9521065 6784739 3878969
11075 3878969 911194 -2078757 -5091321 -8135269 -11210227 -14303993 -17391236 -20422350
11067 -20422350 -23307090 -25910446 -28072060 -29640367 -30501703 -30594704 -29917753 -28539427 -26607701
11058 -26607701 -24342495 -22003043 -19839140 -18045298 -16732037 -15917470 -15536242 -15462841 -15546490
11049 -15546490 -15651791 -15695901 -15671941 -15649446 -15746003 -16073210 -16675530 -17492647 -18370139 -19116544
11039 -19116544 -19574821 -19667553 -19396225 -18807645 -17957437 -16890234 -15634173 -14197964 -12568459
11030 -12568459 -10718189 -8627784 -6312512 -3835844 -1304155 1148615 3375964 5231931
11022 5231931 6586091 7341336 7451990 6938977 5895834 4474839 2848056 1157355 -517752
11013 -517752 -2156060 -3765683 -5359518 -6952635 -8573044 -10266313 -12085462 -14072261
11005 -14072261 -16238895 -18554060 -20935865 -23255606 -25354386 -27068814 -28259968 -28842546
10997 -28842546 -28811283 -28255509 -27348705 -26307799 -25333440 -24553613 -23989853 -23552772 -23062447
10988 -23062447 -22285402 -20981393 -18955327 -16108141 -12474755 -8232203 -3665539 903561
10980 903561 5198956 9046921 12383671 15216188 17563212 19410145 20698322 21345985
10972 21345985 21282266 20476990 18961898 16845298 14315151 11619021 9019636 6745509
10964 6745509 4961772 3767081 3199730 3236765 3790905 4723278 5878968 7131021 8409408
10955 8409408 9699895 11012368 12331258 13571766 14570642 15128482 15090428 14423185 13244123
10946 13244123 11787379 10327892 9099778 8236615 7745574 7517662 7368518 7093287 6513330
10937 6513330 5502451 3997981 2008422 -380647 -3011127 -5673602 -8141673 -10211681
10929 -10211681 -11740730 -12672553 -13036235 -12911622 -12379638 -11493903 -10297788 -8872972 -7375938
10920 -7375938 -6026106 -5046601 -4591466 -4697438 -5279809 -6170306 -7179409 -8155457 -9012858
10911 -9012858 -9719674 -10262867 -10622853 -10774634 -10706552 -10435246 -10003089 -9459054 -8833114 -8116599
10901 -8116599 -7257297 -6170725 -4763768 -2967890 -779050 1708121 4294659 6714875
10893 6714875 8705805 10077794 10761033 10819456 10429433 9820228 9186672 8609837 8029331
10884 8029331 7283333 6190689 4629443 2579042 120367 -2593070 -5373599 -8031436
10876 -8031436 -10393221 -12311707 -13679066 -14452341 -14684190 -14536380 -14252588 -14087691 -14221226
10867 -14221226 -14698424 -15427348 -16226026 -16887789 -17234489 -17146745 -16575567 -15541151 -14121088
10858 -14121088 -12432731 -10620269 -8854226 -7336109 -6287174 -5906466 -6310158 -7486987
10850 -7486987 -9297790 -11515483 -13878033 -16133030 -18072698 -19563405 -20561431 -21102433
10842 -21102433 -21268903 -21158612 -20872961 -20521598 -20224596 -20100113 -20242990 -20709380 -21517129
10833 -21517129 -22658018 -24108464 -25828225 -27749851 -29772218 -31768982 -33610320 -35186541
10825 -35186541 -36422216 -37276475 -37732791 -37786482 -37438196 -36696080 -35582449 -34138314 -32421627
10816 -32421627 -30498052 -28425653 -26240104 -23952828 -21570754 -19129568 -16715437 -14453494
10808 -14453494 -12467250 -10839753 -9607105 -8785056 -8398135 -8480367 -9047350 -10067703 -11458390
10799 -11458390 -13101851 -14865639 -16612398 -18204107 -19510635 -20427993 -20904265 -20962871 -20705975
10790 -20705975 -20286282 -19856707 -19525781 -19340853 -19297684 -19361001 -19486172 -19640103 -19816121 -20034600
10780 -20034600 -20331057 -20744686 -21314028 -22070659 -23022193 -24135461 -25340952 -26561592 -27742867
10771 -27742867 -28859926 -29902012 -30855369 -31701301 -32425801 -33023977 -33486805 -33772725 -33779647
10762 -33779647 -33335295 -32215449 -30189022 -27082722 -22852521 -17637990 -11768857 -5708820
10754 -5708820 42569 5045108 8977846 11664393 13080667 13350634 12720749 11508340
10746 11508340 10036125 8573765 7301654 6301547 5571480 5058422 4698794 4453740 4324757
10737 4324757 4340269 4517537 4821155 5144599 5327514 5197910 4613993 3484515 1763465
10728 1763465 -569430 -3526260 -7115831 -11332275 -16128044 -21378360 -26855983 -32240514
10720 -32240514 -37170749 -41319416 -44455576 -46474725 -47400307 -47366678 -46585874 -45299821 -43730012
10711 -43730012 -42040935 -40323845 -38597192 -36820466 -34921610 -32832696 -30518998 -27986810
10703 -27986810 -25268714 -22400412 -19406967 -16305421 -13115170 -9862958 -6580545 -3305727
10695 -3305727 -93252 2974020 5789389 8244233 10254404 11778592 12826247 13455898
10687 13455898 13762169 13853799 13833569 13789542 13793956 13898451 14121175 14431424 14738709 14890920
10677 14890920 14689004 13926793 12452185 10225956 7348591 4043184 607898 -2638110
10669 -2638110 -5401105 -7452429 -8666290 -9051468 -8762296 -8074742 -7326312 -6834831 -6821429
10660 -6821429 -7363064 -8390191 -9728215 -11163360 -12504260 -13616387 -14423774 -14889611 -14993878
10651 -14993878 -14720572 -14056115 -12993695 -11539085 -9716783 -7574089 -5177550 -2599533
10643 -2599533 96062 2853582 5604300 8235364 10571007 12384115 13442535 13577063
10635 13577063 12741450 11029218 8630064 5745586 2512448 -1024742 -4884771 -9094523
10627 -9094523 -13643012 -18460886 -23419844 -28343287 -33030718 -37301904 -41051372 -44284834
10619 -44284834 -47111650 -49693638 -52176674 -54636448 -57057421 -59350191 -61401364 -63136082
10611 -63136082 -64561046 -65760225 -66841140 -67860636 -68772770 -69429820 -69638871 -69247271 -68214855
10602 -68214855 -66637746 -64714602 -62675986 -60712549 -58930153 -57338886 -55865936 -54379685
10594 -54379685 -52719045 -50725597 -48272876 -45285297 -41745659 -37699248 -33262758 -28634589
10586 -28634589 -24090785 -19951474 -16518686 -14005769 -12485203 -11871774 -11943633 -12396995 -12926826
10577 -12926826 -13314346 -13487837 -13527817 -13617278 -13967239 -14750033 -16053350 -17854995 -20021932
10568 -20021932 -22340412 -24573029 -26521916 -28071568 -29193925 -29916697 -30275668 -30282545 -29930211
10559 -29930211 -29228769 -28240349 -27080695 -25881543 -24737550 -23672119 -22641341 -21567174
10551 -21567174 -20372287 -18994248 -17379374 -15473414 -13222057 -10578030 -7505546 -3984741
10543 -3984741 -31404 4261070 8678190 12878717 16451578 19020308 20349311 20407337
10535 20407337 19368894 17561710 15385281 13229185 11410708 10137427 9495652 9470274
10527 9470274 9995464 11010587 12479946 14359920 16545557 18848452 21028414 22858455
10519 22858455 24187613 24979073 25317361 25386249 25423704 25665448 26292155 27394804 28966909
10510 28966909 30922295 33130443 35463807 37853329 40338153 43083733 46351826 50434166
10502 50434166 55581410 61956758 69632613 78636871 89035158 101011705 114907995 131198600
10494 131198600 150403610 172945666 198967871 228134395 259430481 291000121 320146575
10487 320146575 343686888 358721378 363549554 358230423 344446431 324791204 301936855
10480 301936855 278075557 254727814 232791593 212686958 194514595 178187278 163516585
10473 163516585 150264665 138181145 127031341 116613625 106772393 97413043 88509162
10466 88509162 80087772 72197086 64875500 58131761 51933430 46203669 40833727 35712402
10458 35712402 30759355 25943360 21274262 16772777 12436679 8224976 4068069 -106790
10450 -106790 -4351382 -8682027 -13074155 -17462573 -21743103 -25773175 -29377548 -32371083
10442 -32371083 -34599130 -35975434 -36493700 -36209787 -35213762 -33612397 -31526933 -29096090
10434 -29096090 -26472052 -23807504 -21244253 -18912985 -16936299 -15415394 -14396339 -13840191
10426 -13840191 -13625978 -13588890 -13570459 -13458054 -13205932 -12837496 -12428884 -12077955 -11868189 -11837448
10416 -11837448 -11960482 -12154402 -12309162 -12328238 -12154949 -11772783 -11190563 -10430741 -9527411
10407 -9527411 -8526756 -7479451 -6421382 -5351301 -4224071 -2974015 -1560595 -6867
10399 -6867 1596481 3122559 4452623 5509279 6268863 6756311 7029789 7162178 7227072
10390 7227072 7295860 7444876 7759709 8320268 9164763 10253949 11464988 12625813 13572595
10381 13572595 14200536 14487917 14490984 14319013 14102364 13964495 14003894 14286260 14843510 15673770
10371 15673770 16735851 17937147 19125854 20105151 20675898 20691735 20099459 18950593 17391082
10362 17391082 15640708 13961174 12605556 11757417 11488270 11758495 12457817 13457618 14652033
10353 14652033 15983459 17452702 19104475 20981729 23066583 25245180 27321904 29073928
10345 29073928 30312574 30921234 30861426 30158952 28888701 27168369 25157948 23055017 21078331
10336 21078331 19436014 18277638 17639281 17407169 17329861 17086190 16381422 15028269 12983438
10327 12983438 10337095 7271971 4014798 796869 -2172796 -4728625 -6768436 -8266810
10319 -8266810 -9274738 -9907349 -10326675 -10720707 -11275182 -12141239 -13411250 -15112674 -17218206
10310 -17218206 -19663380 -22363372 -25221448 -28121246 -30903123 -33343004 -35164103 -36098502
10302 -36098502 -35980051 -34820677 -32826693 -30348339 -27793227 -25543171 -23895015 -23024708
10294 -23024708 -22968768 -23624168 -24772746 -26132320 -27426420 -28453120 -29128184 -29485530 -29637792
10285 -29637792 -29718783 -29835073 -30043883 -30357674 -30762604 -31234862 -31746743 -32266277 -32759420
10276 -32759420 -33198507 -33572413 -33890983 -34179066 -34459603 -34729781 -34939603 -34984569 -34720452
10267 -34720452 -34000361 -32726082 -30896844 -28632895 -26158508 -23751728 -21688430 -20203850
10259 -20203850 -19470568 -19576599 -20498332 -22083577 -24062697 -26087904 -27784333 -28797813
10251 -28797813 -28836467 -27709172 -25358072 -21873852 -17482333 -12500518 -7272293 -2101316
10243 -2101316 2800635 7336048 11510034 15393181 19079206 22658062 26210163 29807825
10235 29807825 33504269 37306346 41150084 44903834 48403857 51500866 54089825 56112939
10227 56112939 57544740 58370889 58566604 58082897 56854678 54835703 52042230 48576172
10219 48576172 44615024 40380461 36102899 31988192 28188708 24789447 21819726 19281642
10211 19281642 17169463 15464237 14116687 13045660 12162712 11405308 10751997 10210056 9789512
10202 9789512 9484800 9273676 9127540 9022122 8942014 8877791 8816719 8730450 8566051 8245595
10192 8245595 7673579 6748302 5377578 3503420 1135122 -1622125 -4562827 -7413901
10184 -7413901 -9899704 -11814760 -13070083 -13690243 -13767854 -13407811 -12692531 -11675479 -10390410
10175 -10390410 -8864458 -7131817 -5243727 -3264667 -1251135 773094 2822926 4929310
10167 4929310 7099531 9283906 11368338 13197289 14614150 15496439 15770451 15408307 14420648
10158 14420648 12850803 10765037 8236357 5331473 2111308 -1358741 -5002082 -8731809
10150 -8731809 -12448646 -16027063 -19298598 -22053847 -24076294 -25198399 -25352967 -24593943
10142 -24593943 -23078839 -21025560 -18664266 -16198682 -13782631 -11515351 -9457561 -7659970
10134 -7659970 -6183896 -5096054 -4439263 -4200086 -4296467 -4595176 -4952815 -5262899 -5487700
10125 -5487700 -5660205 -5857760 -6163737 -6634977 -7282811 -8066513 -8897027 -9650755 -10191369
10116 -10191369 -10393103 -10157219 -9417051 -8134140 -6292693 -3898489 -984096 2379473
10108 2379473 6064191 9864916 13495590 16622611 18936122 20229760 20449254 19690856
10100 19690856 18159255 16105908 13764391 11297409 8773561 6186695 3510541 760945
10092 760945 -1965387 -4492298 -6602735 -8096612 -8843786 -8811407 -8057916 -6701990 -4883443
10083 -4883443 -2729852 -334120 2255348 5026899 7974844 11051730 14128040 16990059
10075 16990059 19387821 21111613 22054905 22231721 21747298 20745881 19363018 17697583
10067 17697583 15804453 13699430 11365594 8757354 5811744 2481208 -1213954 -5141252
10059 -5141252 -9054953 -12648770 -15635705 -17812098 -19079549 -19431427 -18933303 -17722661
10051 -17722661 -16026433 -14167599 -12530048 -11479244 -11270420 -11985670 -13521847 -15624817
10043 -15624817 -17952274 -20147524 -21910621 -23056539 -23551975 -23522265 -23220162 -22955740 -23002993
10034 -23002993 -23513003 -24464247 -25667282 -26822335 -27611555 -27796095 -27285669 -26157747 -24622034
10025 -24622034 -22945762 -21368791 -20040023 -18996368 -18186425 -17522873 -16938415 -16421285 -16015424
10016 -16015424 -15786089 -15769530 -15935139 -16180850 -16361217 -16328293 -15961921 -15180136 -13940120
10007 -13940120 -12248900 -10190327 -7949219 -5799340 -4038497 -2892953 -2442188 -2607079
9999 -2607079 -3204660 -4032115 -4931561 -5808842 -6612308 -7297128 -7800435 -8041161 -7944555 -7477825
9989 -7477825 -6675781 -5642636 -4535344 -3545396 -2885453 -2767969 -3362123 -4737729 -6824927
9980 -6824927 -9414239 -12199989 -14853269 -17104745 -18813095 -19991086 -20772706 -21336042 -21824803
9971 -21824803 -22308907 -22793285 -23254950 -23683934 -24114453 -24638352 -25392301 -26517985 -28111783
9962 -28111783 -30188870 -32675159 -35422199 -38233980 -40899828 -43229917 -45084700 -46387006
9954 -46387006 -47113276 -47272278 -46884683 -45971833 -44552757 -42643608 -40257854 -37412960 -34148611
9945 -34148611 -30549239 -26753048 -22935379 -19271684 -15896055 -12868059 -10155461 -7642103
9937 -7642103 -5168857 -2598971 122456 2947248 5748974 8371527 10669799 12525859
9929 12525859 13845583 14551303 14582813 13909649 12548390 10572608 8103245 5277003 2206011
9920 2206011 -1049146 -4479335 -8105346 -11952013 -16028799 -20315530 -24751566 -29236917
9912 -29236917 -33655448 -37914150 -41974821 -45857861 -49620709 -53330764 -57048015 -60815861
9904 -60815861 -64651572 -68536731 -72419528 -76238940 -79963504 -83618356 -87272399 -90979488
9896 -90979488 -94697585 -98222429 -101159103 -102932508 -102826028 -100040922 -93782972 -83399765
9888 -83399765 -68587912 -49634132 -27566244 -4062375 18922614 39662175 57040042
9881 57040042 70644473 80608605 87360184 91424544 93326887 93566694 92619724 90934923
9873 90934923 88913771 86880522 85062592 83592312 82525289 81862833 81568451 81574064 81779482
9864 81779482 82056715 82269128 82300331 82074541 81554009 80714215 79508179 77836986 75549392
9855 75549392 72488726 68576189 63883423 58643660 53191630 47869702 42948374 38584784
9847 38584784 34818139 31595043 28817376 26395626 24280414 22453652 20888999 19516838
9839 19516838 18228904 16928977 15598326 14326504 13277389 12606414 12381559 12555714 12997004
9830 12997004 13545604 14061796 14452567 14681836 14767997 14765277 14729434 14682262 14597889 14425318
9820 14425318 14137739 13776101 13453892 13318838 13502580 14096794 15165500 16767907 18958557
9811 18958557 21755247 25095126 28811652 32654530 36350284 39678436 42530701 44931406
9803 44931406 47015909 48977456 50999501 53194070 55566274 58015219 60364636 62403685
9795 62403685 63919419 64715331 64624522 63529771 61392799 58279857 54365042 49903003 45180450
9786 45180450 40466997 35982906 31887132 28274536 25168475 22509341 20157019 17923434
9778 17923434 15627662 13146430 10440328 7559674 4642793 1905906 -388524 -1988825
9770 -1988825 -2719606 -2529820 -1506813 145316 2155399 4250242 6217081 7942056 9409595
9761 9409595 10664925 11760489 12712655 13484467 13994834 14146189 13860462 13110296 11930733
9752 11930733 10404639 8632015 6704315 4698997 2692347 774931 -946596 -2366884
9744 -2366884 -3410174 -4054340 -4340847 -4372271 -4304862 -4338606 -4699459 -5608272 -7239613 -9682480
9734 -9682480 -12915694 -16803258 -21106780 -25511314 -29666214 -33243165 -36002612 -37846210
9726 -37846210 -38832506 -39147770 -39041638 -38748343 -38419971 -38097191 -37727587 -37214576 -36463051
9717 -36463051 -35399695 -33973982 -32158764 -29955729 -27392727 -24502192 -21290704 -17725111
9709 -17725111 -13752618 -9346612 -4548501 522289 5693226 10774990 15582782 19939571
9701 19939571 23682624 26692660 28938113 30503935 31578637 32399098 33176789 34036492 34990649
9692 34990649 35955901 36798893 37384842 37605215 37380220 36651780 35386220 33591432 31335528
9683 31335528 28748161 25996040 23242753 20615100 18193328 16024149 14139690 12565742
9675 12565742 11316085 10381913 9727477 9296766 9028187 8869869 8789458 8777235 8844082 9013875
9665 9013875 9308798 9731075 10251059 10809518 11331718 11743407 11981060 11995680 11753959 11241297
9655 11241297 10469204 9484559 8373012 7250220 6243247 5470684 5026151 4961442 5265176
9646 5265176 5842660 6512539 7033928 7162791 6718137 5630679 3955634 1850856 -463230
9637 -463230 -2742809 -4746928 -6248319 -7035354 -6918969 -5757875 -3502317 -237603 3800240
9628 3800240 8252976 12705079 16759691 20100972 22531185 23981299 24496564 24201872 23260304
9619 23260304 21842330 20113107 18230367 16342644 14586095 13080641 11918670 11140173
9611 11140173 10706647 10502062 10377024 10218369 10002622 9798957 9717417 9830435 10112587 10434529
9601 10434529 10613588 10486685 9960983 9022185 7716197 6134262 4415510 2753152 1378135
9592 1378135 507936 275934 675141 1545394 2613052 3571990 4180894 4342886 4133838
9583 4133838 3765316 3502633 3583131 4171987 5359372 7174550 9592498 12530398 15848874
9574 15848874 19370042 22908282 26298611 29410267 32143551 34417646 36162703 37328005
9566 37328005 37905054 37947092 37563907 36891817 36062828 35194971 34399291 33780100 33415808 33332362
9556 33332362 33490422 33794945 34119824 34336245 34338456 34063905 33502424 32687354 31668782 30484577
9546 30484577 29154269 27707493 26227183 24866165 23809648 23197716 23055637 23276370 23663063
9537 23663063 24000795 24115783 23900375 23310241 22351151 21064778 19515104 17780251 15957133
9528 15957133 14174667 12596124 11395713 10718899 10652794 11221949 12399891 14117346 16261990
9519 16261990 18681747 21203271 23661697 25925556 27904146 29538631 30788612 31625120
9511 31625120 32032956 32018700 31618697 30900918 29954425 28863911 27677074 26382841 24917026
9502 24917026 23195262 21153017 18767326 16050964 13033631 9755093 6283046 2744381
9494 2744381 -657498 -3662000 -6008012 -7504865 -8084925 -7814869 -6863113 -5438960 -3728718
9485 -3728718 -1856115 113154 2124318 4074754 5789915 7062561 7739523 7801726 7381973
9476 7381973 6704909 5986336 5354474 4834164 4385422 3954548 3504550 3023762 2528905 2069078
9466 2069078 1722522 1579523 1716454 2171126 2926890 3910422 5004784 6069616 6953711
9457 6953711 7497153 7542187 6972650 5769820 4041139 1988247 -172641 -2288704 -4304279
9448 -4304279 -6243441 -8162649 -10100784 -12047314 -13940025 -15692137 -17235345 -18557393
9440 -18557393 -19715110 -20815025 -21969981 -23255764 -24694743 -26275653 -27991035 -29861745
9432 -29861745 -31931740 -34239049 -36779616 -39479325 -42186881 -44696323 -46795320 -48320136
9424 -48320136 -49195303 -49447650 -49195211 -48613839 -47886667 -47150945 -46464724 -45811299 -45142867
9415 -45142867 -44444249 -43780964 -43295947 -43146763 -43418368 -44068116 -44936429 -45810101 -46498045
9406 -46498045 -46885727 -46954074 -46762317 -46404266 -45957998 -45451677 -44856815 -44104495 -43112564 -41813029
9396 -41813029 -40172251 -38200396 -35950798 -33510827 -30983149 -28457426 -25981281 -23545410
9388 -23545410 -21091005 -18534324 -15797587 -12839388 -9680340 -6416454 -3212038 -271548
9380 -271548 2200737 4042121 5166350 5585844 5413448 4837568 4074676 3315967 2688895
9371 2688895 2244411 1966168 1791544 1638112 1432906 1138963 770210 388922 86971 -43623
9361 -43623 58162 404103 965268 1704417 2606436 3678264 4915709 6264416 7605723
9352 7605723 8774969 9596339 9914447 9614607 8635408 6979591 4723375 2015977 -940818
9343 -940818 -3933314 -6780843 -9362452 -11615047 -13513751 -15054612 -16250118 -17132741 -17756734
9334 -17756734 -18193758 -18522118 -18808737 -19084844 -19324408 -19439966 -19304171 -18790843 -17817760
9325 -17817760 -16370977 -14497009 -12264453 -9716714 -6847970 -3621245 -17058 3919437
9317 3919437 8057690 12188458 16044331 19325441 21734121 23024365 23059114 21851852 19565998
9308 19565998 16463827 12825927 8879919 4769186 566073 -3689801 -7954291 -12159848
9300 -12159848 -16217492 -20030431 -23506334 -26559649 -29104298 -31044325 -32271340 -32673009
9292 -32673009 -32150966 -30643921 -28152139 -24758272 -20635310 -16032163 -11237231 -6533590
9284 -6533590 -2162889 1694093 4921911 7463413 9304192 10455463 10945940 10829395 10205914
9275 10205914 9247659 8212869 7426416 7214584 7812733 9294201 11562462 14405788 17574125
9266 17574125 20835343 23994310 26884147 29349834 31243762 32443196 32883026 32585427
9258 32585427 31672211 30358195 28926866 27683895 26888514 26683517 27060066 27881141 28953583
9249 28953583 30109983 31257514 32370856 33438914 34403719 35135879 35466089 35252876 34444393
9240 34444393 33102669 31386659 29509179 27684102 26075616 24760422 23712764 22816300
9232 22816300 21899516 20787289 19355758 17568930 15474545 13156933 10675933 8034259
9224 8034259 5194905 2133845 -1107213 -4396911 -7528914 -10269038 -12419104 -13875335
9216 -13875335 -14657982 -14898131 -14786616 -14508388 -14190938 -13883520 -13564973 -13166982 -12600354
9207 -12600354 -11775813 -10611626 -9025181 -6920014 -4191461 -764098 3354822 8042469
9199 8042469 13075140 18185856 23133500 27750017 31952722 35733241 39142312 42274183
9191 42274183 45234540 48080932 50757856 53075326 54762833 55577436 55402998 54285427
9183 54285427 52395840 49958628 47192356 44287675 41411140 38704489 36260213 34085317
9175 34085317 32086683 30101091 27959651 25551045 22852196 19920614 16864707 13811785
9167 13811785 10883791 8181704 5777465 3712978 2003940 643032 -401374 -1186550
9159 -1186550 -1784966 -2255416 -2607176 -2784055 -2688104 -2233418 -1394036 -213607 1223753
9150 1223753 2832823 4548387 6323114 8117133 9894342 11628267 13309510 14943091
9142 14943091 16527693 18021248 19313274 20228188 20566942 20170105 18975849 17054517 14611949
9133 14611949 11958003 9443485 7383458 5994788 5367067 5465952 6155952 7231988 8455007
9124 8455007 9588435 10431266 10842609 10750434 10137615 9008852 7358898 5167490 2429119
9115 2429119 -800655 -4373276 -8052121 -11557051 -14631448 -17100973 -18893514 -20010558
9107 -20010558 -20472207 -20277203 -19407344 -17870947 -15750719 -13220146 -10517670 -7897011 -5581584
9098 -5581584 -3737421 -2459637 -1762200 -1571583 -1736567 -2064617 -2379885 -2580783 -2667821
9089 -2667821 -2721617 -2834974 -3030367 -3207222 -3149939 -2593568 -1312525 808679 3743304
9080 3743304 7323862 11265147 15207653 18785072 21703711 23801340 25056590 25549978
9072 25549978 25405888 24747212 23676169 22277114 20630832 18831585 17000948 15292674
9064 15292674 13880335 12921587 12507038 12620184 13135430 13856444 14571136 15099694 15330839
9055 15330839 15248971 14944086 14591197 14401055 14560846 15182787 16268995 17702259 19278191
9046 19278191 20781980 22081685 23188687 24249085 25469637 27018510 28949856 31179716
9038 31179716 33507931 35662638 37350756 38312863 38380566 37519497 35835471 33539171 30889404
9029 30889404 28141725 25515843 23179774 21244226 19763356 18740091 18134344 17872955
9021 17872955 17860607 17990759 18156061 18258711 18220117 17985851 17522136 16807396 15830437 14603964
9011 14603964 13186694 11693775 10279130 9093143 8236137 7727530 7498133 7405198 7270374
9002 7270374 6937453 6332422 5496642 4573838 3759906 3245297 3174313 3624591 4598224 6022513
8992 6022513 7768223 9688127 11660664 13611610 15497693 17265647 18824080 20058635
8984 20058635 20883867 21289563 21340447 21127114 20704958 20061193 19123246 17797898 16025806
8975 16025806 13835571 11372963 8879199 6616884 4779545 3433646 2515452 1866928
8967 1866928 1281246 543377 -531168 -2057541 -4054665 -6447941 -9105351 -11888051 -14686184
8958 -14686184 -17423621 -20039775 -22469605 -24634997 -26444951 -27796946 -28579804 -28685206
8950 -28685206 -28029954 -26579349 -24358112 -21445087 -17961771 -14066256 -9950431 -5825497
8942 -5825497 -1887765 1720475 4927513 7714192 10079011 12016473 13522241 14612172
8934 14612172 15332283 15747868 15917437 15865821 15569281 14959952 13951226 12478523 10540752
8925 10540752 8222403 5682151 3110430 674418 -1526662 -3479371 -5240277 -6890648
8917 -6890648 -8478913 -9978021 -11279433 -12224535 -12655102 -12462683 -11626962 -10238475 -8497798
8908 -8497798 -6683679 -5094055 -3978139 -3482331 -3625658 -4307328 -5335242 -6457215 -7384725
8899 -7384725 -7819677 -7505805 -6308257 -4288867 -1728250 929927 3193385 4649240 5063770
8890 5063770 4427748 2935681 905964 -1325961 -3494603 -5438463 -7082955 -8401975
8882 -8401975 -9389927 -10056773 -10436442 -10589118 -10586176 -10484640 -10308174 -10043084 -9642272 -9028480
8872 -9028480 -8101329 -6758701 -4929086 -2594757 210379 3422197 6965080 10751137
8864 10751137 14661188 18524443 22118512 25202016 27570689 29108210 29803643 29730659 29009475
8855 29009475 27778567 26188666 24411816 22647230 21107124 19977958 19369601 19276339 19570668
8846 19570668 20035777 20426639 20541511 20284922 19704932 18989364 18412601 18242888 18646046
8837 18646046 19633619 21081094 22794336 24572071 26229266 27591103 28490900 28788382 28396292
8828 28396292 27297792 25552210 23296201 20741065 18158735 15851303 14108210 13162050
8820 13162050 13155327 14126638 16016768 18687153 21941918 25549757 29265876 32853319 36101812
8811 36101812 38843923 40969385 42435497 43269216 43558643 43435014 43047419 42535113 42009078
8802 42009078 41555815 41261374 41231711 41581728 42390293 43650962 45256878 47035587 48815090
8793 48815090 50481473 51992720 53339558 54478346 55281010 55536329 55002118 53478049 50866360
8784 50866360 47205102 42671994 37558208 32214446 26984793 22152982 17915459 14375761
8776 14375761 11548850 9375562 7753550 6577663 5766794 5260638 4995780 4887205 4831406
8767 4831406 4725337 4486362 4067025 3467693 2746085 2012100 1396878 1002546 858546 911452
8757 911452 1053957 1172988 1187361 1056510 761961 278994 -439759 -1455815 -2816529 -4527355
8747 -4527355 -6543728 -8784146 -11149071 -13530464 -15811343 -17867282 -19581180 -20871698
8739 -20871698 -21723555 -22201385 -22433140 -22564436 -22703510 -22883829 -23061645 -23147477 -23055099 -22744203
8729 -22744203 -22234452 -21582219 -20834963 -19995230 -19018501 -17840965 -16411941 -14710373 -12745030
8720 -12745030 -10550029 -8183968 -5733083 -3314794 -1075454 824947 2242098 3079522
8712 3079522 3307106 2958814 2115947 886238 -616018 -2286977 -4043785 -5824616 -7578087
8703 -7578087 -9246685 -10751276 -11984847 -12822277 -13146525 -12883066 -12030330 -10676201 -8994186
8694 -8994186 -7216220 -5585805 -4304869 -3491712 -3160611 -3222903 -3504151 -3773226 -3780505 -3301062
8684 -3301062 -2175666 -339486 2172422 5247834 8740070 12511092 16456668 20508932
8676 20508932 24625140 28773999 32924643 37037605 41057479 44909852 48504584 51743142
8668 51743142 54525032 56751125 58325978 59160950 59176778 58305563 56497743 53739913 50078808
8659 50078808 45635695 40598147 35192059 29650052 24190172 19005248 14252967 10040563
8651 10040563 6412783 3361282 863061 -1070358 -2367481 -2915737 -2612768 -1418749
8643 -1418749 611958 3320490 6448587 9662018 12599052 14938169 16462902 17100007
8635 17100007 16922030 16122588 14978989 13811634 12941159 12641124 13089866 14334697 16284643
8626 16284643 18737502 21429943 24090126 26478159 28411478 29778201 30540051 30724994
8618 30724994 30411099 29705183 28721939 27571475 26359893 25194602 24175043 23359253 22724339
8609 22724339 22155981 21486337 20565311 19327668 17822020 16188755 14600574 13200822 12075324
8600 12075324 11265203 10792448 10662714 10839546 11218579 11634740 11909520 11915312 11621862 11101037
8590 11101037 10491812 9950109 9611524 9579012 9929933 10730212 12043480 13923876 16389207
8581 16389207 19389356 22796465 26429564 30097461 33631268 36893754 39775557 42193048
8573 42193048 44090246 45437440 46223667 46451214 46142567 45358486 44211091 42854612 41451498
8564 41451498 40128360 38940457 37857341 36774365 35545386 34020322 32068425 29584222
8556 29584222 26493583 22775045 18486022 13767375 8815363 3839033 -968994 -5435184
8548 -5435184 -9388036 -12638569 -14976590 -16194063 -16131526 -14727981 -12052327 -8306154 -3799696
8539 -3799696 1094535 6005924 10636296 14814308 18508793 21792164 24772835 27535122
8531 27535122 30117269 32525861 34756441 36792433 38583483 40028946 40989504 41327198
8523 41327198 40955146 39875389 38191681 36093009 33809582 31549138 29431188 27445894
8515 27445894 25461249 23280647 20724995 17701255 14231643 10440572 6511953 2634816
8507 2634816 -1043020 -4436503 -7516806 -10290697 -12783876 -15032390 -17072412 -18923683
8499 -18923683 -20578764 -22014540 -23224058 -24244755 -25158307 -26059141 -27011205 -28016868 -29010115
8490 -29010115 -29872795 -30466191 -30668527 -30408364 -29684490 -28566135 -27172917 -25640852 -24087428
8481 -24087428 -22590626 -21189540 -19900802 -18736212 -17710087 -16835742 -16118396 -15551527 -15118851
8472 -15118851 -14800326 -14579338 -14447573 -14403701 -14444116 -14550544 -14686400 -14811694 -14910561 -15007669
8462 -15007669 -15150953 -15364850 -15608786 -15778661 -15757190 -15479207 -14966308 -14311207 -13632361 -13038021
8452 -13038021 -12621055 -12470528 -12668694 -13260120 -14213390 -15409550 -16672010 -17821375 -18724424
8443 -18724424 -19315265 -19584854 -19549644 -19218377 -18575856 -17591266 -16241638 -14532514 -12505227
8434 -12505227 -10233889 -7820443 -5390111 -3082677 -1036084 633515 1844325 2543869
8426 2543869 2685892 2203684 1003776 -1002813 -3838279 -7396750 -11423509 -15554791 -19404678
8417 -19404678 -22660043 -25142594 -26816977 -27752393 -28066852 -27886550 -27335154 -26540657 -25633991
8408 -25633991 -24727270 -23886269 -23121068 -22399766 -21666460 -20846161 -19843456 -18557494 -16922380
8399 -16922380 -14952928 -12761725 -10528438 -8434081 -6597124 -5047627 -3751073 -2663093
8391 -2663093 -1781132 -1166689 -931460 -1198696 -2060770 -3554044 -5659905 -8321098 -11451277
8382 -11451277 -14925951 -18565818 -22135291 -25369144 -28020796 -29913026 -30970111 -31216805
8374 -31216805 -30743945 -29659019 -28048944 -25971264 -23467848 -20583622 -17379285 -13937686
8366 -13937686 -10363234 -6766898 -3232416 223236 3666892 7222848 11011010 15082828
8358 15082828 19387323 23775189 28026727 31887411 35104649 37463092 38811244 39073440
8350 39073440 38252359 36433455 33791942 30586734 27126624 23714839 20598077 17944815
8342 17944815 15858057 14407664 13659292 13680501 14515499 16136922 18400830 21037701 23696915
8333 23696915 26030832 27779912 28822068 29174050 28956660 28342028 27496536 26533081 25490511
8324 25490511 24350155 23075454 21642918 20044094 18269297 16300824 14129048 11778120
8316 11778120 9318218 6853059 4488157 2294682 286821 -1572201 -3334020 -5018837
8308 -5018837 -6589741 -7965177 -9059103 -9819399 -10238523 -10330340 -10089295 -9460570 -8344943
8299 -8344943 -6640559 -4298980 -1362944 2035429 5715155 9506203 13300591 17070854
8291 17070854 20850081 24690824 28629595 32669649 36774336 40859796 44788924 48375584
8283 48375584 51399336 53622831 54811693 54767707 53379293 50672350 46834139 42194821
8275 42194821 37171683 32193849 27628943 23732035 20628592 18327550 16749364 15756674
8267 15756674 15184130 14865203 14648654 14399695 13993871 13320521 12304912 10939950 9306526
8258 9306526 7564981 5914786 4536072 3536522 2925788 2627381 2520789 2493024 2475832
8249 2475832 2454655 2451519 2495493 2595410 2725106 2827963 2841820 2732670 2514220 2236157 1947116
8238 1947116 1657996 1330379 897431 305817 -445801 -1298919 -2170604 -3014734 -3869805 -4863111
8228 -4863111 -6172249 -7966761 -10351375 -13323580 -16756573 -20416243 -24008255 -27238020
8220 -27238020 -29866637 -31754273 -32884766 -33363489 -33387898 -33204514 -33068812 -33210993 -33799922
8211 -33799922 -34905386 -36474538 -38340187 -40263076 -41993306 -43330469 -44166280 -44500578
8203 -44500578 -44428626 -44104500 -43691163 -43312467 -43024247 -42816180 -42640398 -42445908 -42195642 -41860597
8193 -41860597 -41406959 -40796174 -40001643 -39026901 -37907014 -36689243 -35407032 -34068089 -32666800
8184 -32666800 -31211232 -29741753 -28324077 -27020023 -25855690 -24805529 -23797067 -22729924
8176 -22729924 -21500613 -20025620 -18254378 -16165801 -13751805 -11002429 -7907545 -4476892
8168 -4476892 -765148 3114728 6997883 10691462 14009395 16809391 19018057 20627271
8160 20627271 21657322 22108473 21939321 21095345 19572304 17470822 15005209 12461439 10127067
8151 10127067 8223419 6862766 6041157 5664345 5591430 5675502 5787713 5825201 5711243 5393098
8141 5393098 4837153 4021897 2935445 1584914 14511 -1683187 -3378208 -4936522 -6259219
8132 -6259219 -7308647 -8114917 -8768799 -9407619 -10192624 -11273127 -12742164 -14602048 -16760405
8123 -16760405 -19062135 -21341211 -23465347 -25353268 -26961793 -28256330 -29185991 -29680306
8115 -29680306 -29670393 -29122071 -28062585 -26588841 -24854756 -23040921 -21314127 -19791220 -18524034
8106 -18524034 -17509858 -16711928 -16068378 -15484890 -14828588 -13944355 -12696180 -11013580 -8915306
8097 -8915306 -6495125 -3879630 -1187756 1481868 4037261 6380420 8419118 10097544
8089 10097544 11419370 12445449 13270788 13994844 14693804 15400065 16096612 16730291 17235797
8080 17235797 17556729 17658509 17536038 17214777 16738883 16149575 15471069 14716366 13901129
8071 13901129 13040442 12120179 11064887 9734214 7959860 5604858 2612380 -979093
8063 -979093 -5053589 -9448850 -13980869 -18457258 -22688900 -26507761 -29786849 -32452848
8055 -32452848 -34488601 -35929780 -36857140 -37379127 -37602716 -37602836 -37406488 -36996713 -36326021 -35328641
8045 -35328641 -33936450 -32112005 -29897034 -27449375 -25035882 -22974028 -21549135 -20947828
8037 -20947828 -21233398 -22361132 -24211545 -26617159 -29371938 -32230237 -34910470 -37113249
8029 -37113249 -38552699 -38993405 -38284803 -36384901 -33366030 -29400867 -24734683 -19652144
8021 -19652144 -14442452 -9363722 -4610903 -295401 3558498 7002436 10142614 13109875
8013 13109875 16022159 18946576 21875179 24725509 27363931 29638382 31407720 32563749
8005 32563749 33047304 32858041 32056555 30761715 29146827 27429576 25843588 24589629 23786112
7996 23786112 23446325 23491940 23788051 24179753 24523498 24716039 24717496 24555320 24300642 24026334
7986 24026334 23769053 23512407 23192365 22715824 21985476 20928823 19526301 17827174 15944093
7977 15944093 14028916 12241625 10722622 9571673 8833463 8490867 8468455 8648692 8901449
7968 8901449 9121856 9262679 9344101 9433272 9603837 9897905 10310281 10799822 11316871 11830257
7958 11830257 12345142 12912591 13628838 14610650 15936203 17569936 19319190 20862407 21841670
7949 21841670 21969378 21098003 19236130 16526203 13206620 9570767 5925793 2551937
7941 2551937 -334387 -2608752 -4253852 -5359384 -6105252 -6726801 -7464818 -8512610 -9979615
7932 -9979615 -11885439 -14180858 -16777533 -19567963 -22429241 -25216056 -27753046 -29836022
7924 -29836022 -31248833 -31795539 -31335975 -29806109 -27214309 -23625781 -19157658 -13991388
7916 -13991388 -8381456 -2632280 2959722 8168647 12868349 17015489 20605266 23629965
7908 23629965 26058062 27833989 28892053 29180586 28692019 27487029 25697188 23501119
7900 23501119 21087541 18626006 16255346 14084211 12193373 10635476 9433516 8580804
7892 8580804 8046205 7788021 7773173 7989583 8441382 9130635 10040268 11128628 12334252
7883 12334252 13584787 14807469 15940033 16938182 17776676 18447818 18964617 19370125 19745440
7874 19745440 20205956 20880872 21880681 23265400 25026428 27084736 29297484 31467574 33363241
7865 33363241 34757060 35476227 35438181 34651683 33187500 31137897 28580294 25553976 22060048
7856 22060048 18091047 13677772 8924171 4010148 -830181 -5333506 -9230117 -12281202
7848 -12281202 -14341789 -15425455 -15719539 -15518895 -15106487 -14656805 -14222395 -13795511 -13381129
7839 -13381129 -13023996 -12783108 -12686279 -12698951 -12723614 -12631173 -12312626 -11725503 -10907979 -9953592
7829 -9953592 -8965480 -8016961 -7133163 -6293029 -5443776 -4518684 -3451091 -2182883 -671373
7820 -671373 1101134 3114603 5298023 7521278 9602285 11338667 12559629 13175766 13202416
7811 13202416 12750619 11999255 11162695 10454938 10044727 10007190 10294105 10746070 11148356 11303935
7801 11303935 11087737 10464410 9478252 8232294 6862464 5504301 4257568 3164746 2214923
7792 2214923 1368073 584418 -153667 -833026 -1416896 -1866606 -2168495 -2350840 -2480181 -2639259
7782 -2639259 -2898218 -3289966 -3794874 -4338372 -4806789 -5082066 -5082320 -4786522 -4231760 -3492642
7772 -3492642 -2660687 -1830176 -1084788 -483403 -53164 206063 315474 320640 299891 360763
7762 360763 614942 1140619 1950647 2980339 4099384 5144999 5967599 6474996 6659595
7753 6659595 6597847 6421485 6271525 6252052 6397210 6655412 6888716 6886430 6394391 5159013
7743 5159013 2979925 -238771 -4450270 -9452242 -14908374 -20403661 -25521774 -29925868
7735 -29925868 -33421649 -35981858 -37719063 -38812292 -39414637 -39579127 -39233124 -38213018 -36347707
7726 -36347707 -33555892 -29910273 -25636079 -21050007 -16480748 -12214938 -8482195 -5459292
7718 -5459292 -3264706 -1933947 -1393105 -1459015 -1880371 -2406148 -2849141 -3118011 -3213219 -3198965
7708 -3198965 -3163745 -3176732 -3250142 -3324973 -3292416 -3042482 -2513209 -1716084 -731243 318698
7698 318698 1302804 2110811 2665158 2911984 2801692 2279417 1298606 -148661 -2006455
7689 -2006455 -4155588 -6443638 -8726869 -10897777 -12884765 -14634750 -16102234 -17257074
7681 -17257074 -18101266 -18675991 -19050710 -19302345 -19499233 -19698070 -19949030 -20294897 -20754189
7672 -20754189 -21295174 -21821891 -22188382 -22236975 -21841417 -20938295 -19541597 -17741104 -15684563
7663 -15684563 -13545283 -11483664 -9617063 -8009642 -6683284 -5640108 -4884382 -4436281
7655 -4436281 -4333463 -4616330 -5297976 -6335045 -7625234 -9040976 -10475705 -11864607 -13164501
7646 -13164501 -14313898 -15207772 -15705217 -15662926 -14972744 -13581771 -11486911 -8715230 -5310978
7637 -5310978 -1339021 3104328 7885154 12829711 17720269 22296754 26282768 29439934
7629 29439934 31625230 32815937 33089811 32581048 31443185 29832483 27902225 25793650
7621 25793650 23622556 21472376 19401235 17458493 15699854 14192631 13008311 12205346
7613 12205346 11812093 11822791 12210409 12943825 13990464 15298346 16771471 18261097 19586645
7604 19586645 20581220 21138738 21233727 20899424 20179166 19086913 17604646 15714298 13437842
7595 13437842 10859306 8118779 5382429 2798963 458051 -1628993 -3511505 -5250952
7587 -5250952 -6870805 -8336886 -9578081 -10529838 -11172720 -11546939 -11736629 -11827875 -11857524
7578 -11857524 -11782855 -11498134 -10895350 -9934550 -8683590 -7310972 -6044034 -5117301 -4732351
7569 -4732351 -5039800 -6140328 -8089939 -10895196 -14498734 -18769139 -23506722 -28462438
7561 -28462438 -33359489 -37914421 -41864763 -45008463 -47245343 -48596955 -49183546 -49159193 -48634716
7552 -48634716 -47630156 -46082008 -43897080 -41020882 -37488458 -33441243 -29109411 -24769994
7544 -24769994 -20699043 -17138285 -14286037 -12302317 -11305824 -11349125 -12382222 -14233144 -16630297
7535 -16630297 -19266399 -21876541 -24294442 -26466300 -28425756 -30247439 -31996872 -33691879
7527 -33691879 -35289949 -36709543 -37876038 -38765461 -39417581 -39906436 -40279789 -40497526 -40405303
7518 -40405303 -39766813 -38345383 -35991923 -32690347 -28542896 -23720445 -18420009 -12851815
7510 -12851815 -7244977 -1845331 3108016 7416202 10941138 13601087 15350525 16164284
7502 16164284 16037909 15000322 13126229 10538594 7399384 3892793 207029 -3481524
7494 -3481524 -7022345 -10305145 -13271733 -15915475 -18260594 -20328427 -22112650 -23582469
7486 -23582469 -24710313 -25499349 -25988462 -26235671 -26299616 -26233131 -26083092 -25882817 -25636847 -25315050
7476 -25315050 -24871644 -24285122 -23595888 -22915136 -22392472 -22152870 -22234902 -22567091 -22998245 -23361381
7466 -23361381 -23528900 -23429856 -23034608 -22332519 -21318019 -19979261 -18281066 -16151059 -13489375
7457 -13489375 -10210237 -6298686 -1851566 2921258 7739241 12320010 16445368 19996875
7449 19996875 22950053 25339176 27218715 28642404 29661293 30325277 30674523 30725649 30470970
7440 30470970 29899237 29022752 27887806 26564407 25134186 23693391 22364598 21295351
7432 21295351 20631058 20471569 20835601 21655452 22808149 24166644 25640868 27186041 28778774
7423 28778774 30379717 31904126 33215895 34153094 34579466 34437019 33767132 32685153 31324125
7414 31324125 29780881 28091057 26238936 24188733 21915144 19417326 16717449 13857787
7406 13857787 10905811 7960393 5143024 2566052 288373 -1716919 -3559275 -5386410
7398 -5386410 -7319207 -9399099 -11569928 -13692619 -15577547 -17022275 -17846784 -17916136 -17142342
7389 -17142342 -15472799 -12888947 -9432846 -5250413 -615584 4093808 8465328 12136026
7381 12136026 14859920 16542825 17238262 17100995 16307341 14975163 13125953 10708015 7661626
7372 7661626 3988226 -206225 -4707576 -9231435 -13490622 -17263850 -20435240 -22993768
7364 -22993768 -25005265 -26575700 -27814744 -28801492 -29558817 -30051007 -30216859 -30031454 -29564506
7355 -29564506 -28994352 -28560020 -28475604 -28855414 -29685097 -30840182 -32130138 -33343634 -34280336
7346 -34280336 -34767357 -34670348 -33912019 -32498800 -30540033 -28241625 -25869948 -23696588 -21939987
7337 -21939987 -20720213 -20042030 -19813495 -19891126 -20130042 -20419427 -20695131 -20930794 -21114766
7328 -21114766 -21226154 -21225263 -21063603 -20703078 -20130333 -19364728 -18468384 -17558577 -16806504 -16405550
7318 -16405550 -16512112 -17183981 -18346762 -19806023 -21301434 -22579115 -23450256 -23815353 -23656821
7309 -23656821 -23017612 -21978452 -20634080 -19067797 -17332532 -15450114 -13432604 -11317641
7301 -11317641 -9200379 -7240820 -5634631 -4560888 -4141937 -4441809 -5493060 -7315440
7293 -7315440 -9901177 -13175788 -16965647 -20999773 -24953506 -28518229 -31463855 -33662835
7285 -33662835 -35070781 -35689674 -35546038 -34694708 -33233436 -31307059 -29090186 -26750846 -24407203
7276 -24407203 -22094652 -19759760 -17288458 -14560958 -11511617 -8166932 -4646206 -1132776
7268 -1132776 2159559 5007049 7188914 8512431 8858718 8232686 6785250 4784012 2535769
7259 2535769 293950 -1803922 -3740690 -5573815 -7374825 -9188636 -11024656 -12868284
7251 -12868284 -14693445 -16463974 -18125447 -19599630 -20793823 -21626157 -22053398 -22081861 -21751233
7242 -21751233 -21100836 -20144152 -18875264 -17306996 -15511729 -13627925 -11819355 -10211263
7234 -10211263 -8846070 -7685190 -6649277 -5667328 -4709824 -3798973 -2998286 -2381505 -1983996
7225 -1983996 -1755998 -1549184 -1154471 -376496 892234 2629721 4687023 6829448 8801103
7216 8801103 10391590 11483172 12065874 12221863 12090311 11827748 11578137 11459058 11556159
7207 11556159 11910136 12492504 13188949 13815636 14172268 14105503 13547785 12517603 11097136
7198 11097136 9415230 7648409 6025769 4811506 4255441 4532739 5708785 7748166
7190 7748166 10553783 14003443 17960842 22263534 26710042 31068501 35112321 38666889
7182 38666889 41641191 44027369 45872516 47241944 48190408 48744364 48890950 48574342 47707711
7173 47707711 46206859 44038923 41266619 38065290 34700246 31471840 28654697 26461313
7165 26461313 25042543 24510468 24955067 26435955 28952710 32413227 36621118 41294507
7157 41294507 46114182 50782571 55065803 58800607 61872566 64191569 65686581 66321230
7149 66321230 66115344 65157059 63598824 61638259 59489920 57358465 55423780 53840712
7141 53840712 52744615 52249196 52428900 53289778 54743651 56605222 58625008 60551408 62194296
7132 62194296 63459484 64343693 64905408 65234215 65427352 65567577 65698446 65806284 65823461
7123 65823461 65656365 65224730 64492667 63479079 62246585 60874885 59427328 57921944 56318548
7114 56318548 54527572 52435995 49938423 46961983 43479948 39516714 35151598 30526573
7106 30526573 25852610 21399712 17459308 14284897 12032888 10726782 10256343 10409430
7098 10409430 10923960 11542696 12056152 12327609 12300807 11991438 11464546 10806988 10108314 9454365
7088 9454365 8923950 8578816 8450801 8537618 8810046 9222347 9719889 10246512 10754374 11211875
7078 11211875 11604311 11930360 12203711 12463129 12781465 13258957 13997214 15069807 16513429
7069 16513429 18346671 20594163 23283433 26406080 29872597 33503269 37072216 40380449
7061 40380449 43312635 45846947 48023785 49906292 51562074 53068708 54523256 56036904
7053 56036904 57711552 59606268 61703468 63886462 65943231 67605569 68614332 68784146
7045 68784146 68040579 66419628 64039413 61063988 57675765 54060738 50398125 46841960
7037 46841960 43491283 40363350 37395748 34492392 31595602 28738370 26039332 23647151
7029 23647151 21679738 20198176 19215139 18709636 18630787 18899823 19424451 20119187 20910040
7020 20910040 21715013 22420258 22882963 22970911 22614216 21830405 20703274 19329911 17769321
7011 17769321 16019759 14032465 11751957 9162840 6320720 3352905 430319 -2274589
7003 -2274589 -4626368 -6548733 -8024014 -9071382 -9716223 -9970105 -9834648 -9325299 -8497108
6994 -8497108 -7455982 -6351495 -5356632 -4638563 -4320825 -4443935 -4945633 -5683805 -6501157
6985 -6501157 -7297767 -8068023 -8883705 -9840473 -11000618 -12356589 -13825621 -15276531 -16580246
6976 -16580246 -17662198 -18527735 -19242973 -19879467 -20453308 -20891433 -21040591 -20712266 -19745090
6967 -19745090 -18066051 -15734281 -12951719 -10030081 -7319187 -5120281 -3614771 -2829263
6959 -2829263 -2641635 -2820808 -3086170 -3168942 -2858587 -2026018 -628321 1293134 3614574
6950 3614574 6137307 8612076 10783031 12438994 13452672 13795827 13531756 12794052 11759013
6941 11759013 10613316 9516326 8561690 7753595 7016970 6246312 5370431 4396046 3409661
6932 3409661 2549864 1976898 1850517 2304730 3409172 5130592 7323805 9766952 12223147
6923 12223147 14492153 16429420 17938976 18961974 19474131 19489640 19063165 18284055 17259196
6914 17259196 16085316 14822546 13487928 12074868 10580040 9012587 7383295 5697246
6906 5697246 3969157 2250029 633337 -776565 -1916081 -2795136 -3484498 -4065316 -4576200
6897 -4576200 -4993447 -5256039 -5319953 -5213223 -5064511 -5086069 -5506483 -6472639 -7964497 -9769122
6887 -9769122 -11532325 -12865623 -13463307 -13190192 -12119693 -10515800 -8762137 -7256690 -6308669
6878 -6308669 -6076104 -6561463 -7653944 -9192583 -11025841 -13048562 -15202892 -17443800 -19690742
6869 -19690742 -21797077 -23556633 -24743408 -25165483 -24713680 -23392136 -21325606 -18744789
6861 -18744789 -15953288 -13278344 -11010328 -9346942 -8365026 -8031093 -8238695 -8849760 -9726793
6852 -9726793 -10755708 -11859221 -12995755 -14143946 -15284033 -16388161 -17419368 -18330421
6844 -18330421 -19060186 -19536357 -19692830 -19496665 -18969123 -18188531 -17275095 -16365938 -15587580
6835 -15587580 -15028891 -14717737 -14608082 -14584044 -14480770 -14115029 -13318184 -11969618 -10031042
6826 -10031042 -7575883 -4798064 -1983379 558254 2577084 3946713 4677039 4876128
6818 4876128 4688976 4250090 3671551 3061390 2548072 2286673 2437301 3123817 4390863
6809 4390863 6178187 8325379 10608198 12792936 14686837 16167901 17191844 17783593
6801 17783593 18019103 17998423 17813144 17519069 17127634 16621381 15984772 15232655 14421541 13641016
6791 13641016 12993447 12570721 12429842 12566597 12893953 13239988 13375963 13068674 12136023
6782 12136023 10482750 8104618 5065611 1465064 -2586109 -6969618 -11547919 -16150338
6774 -16150338 -20572780 -24598682 -28034757 -30741840 -32640651 -33690081 -33860614 -33133737
6766 -33133737 -31537661 -29195632 -26345769 -23306792 -20400349 -17869972 -15837672 -14312565
6758 -14312565 -13232823 -12507727 -12038845 -11723324 -11456123 -11143488 -10725912 -10198565 -9616551
6749 -9616551 -9080623 -8710730 -8621631 -8909631 -9646683 -10871741 -12577050 -14698943 -17122934
6740 -17122934 -19701177 -22272382 -24679585 -26789656 -28516103 -29836256 -30791058 -31466420
6732 -31466420 -31966726 -32390749 -32811968 -33262923 -33728846 -34157428 -34482191 -34645539 -34607464 -34336867
6722 -34336867 -33793687 -32914656 -31614752 -29811130 -27464196 -24616573 -21407298 -18051328
6714 -18051328 -14792166 -11844035 -9339443 -7297368 -5626825 -4170626 -2773914 -1347761
6706 -1347761 96611 1449130 2531539 3150426 3163580 2537807 1365401 -180061 -1928851
6697 -1928851 -3788432 -5759074 -7889012 -10205520 -12660962 -15109400 -17312945 -18978191
6689 -18978191 -19822595 -19654804 -18436799 -16300008 -13510035 -10395648 -7267073 -4350215
6681 -4350215 -1759310 482199 2382926 3915077 4970853 5369118 4913476 3472741 1039503
6672 1039503 -2263296 -6224497 -10607229 -15202204 -19856530 -24477750 -29021502 -33472656
6664 -33472656 -37824986 -42060494 -46133831 -49972904 -53498581 -56647018 -59371791 -61622674
6656 -61622674 -63322573 -64365963 -64643061 -64077919 -62666054 -60498184 -57756638 -54678912
6648 -54678912 -51500770 -48403782 -45486721 -42764135 -40184996 -37663424 -35114689 -32487693
6640 -32487693 -29783308 -27051343 -24368536 -21810784 -19436623 -17290930 -15422596 -13899185
6632 -13899185 -12803327 -12208025 -12142340 -12566184 -13368770 -14392923 -15476056 -16493356 -17387773
6623 -17387773 -18173321 -18908415 -19654723 -20448149 -21295889 -22186808 -23092398 -23954462 -24680031
6614 -24680031 -25164087 -25336137 -25202978 -24858221 -24449597 -24122450 -23972846 -24034606 -24299086 -24747316
6604 -24747316 -25374839 -26201036 -27262002 -28589050 -30181206 -31985564 -33894525 -35758383
6596 -35758383 -37408355 -38687883 -39486615 -39763215 -39546009 -38915733 -37982398 -36859852 -35635911
6587 -35635911 -34347051 -32976719 -31482026 -29828135 -28006613 -26037333 -23970404 -21894036
6579 -21894036 -19934791 -18235766 -16915305 -16023799 -15518802 -15272683 -15114543 -14890951 -14518985
6570 -14518985 -14011134 -13468352 -13048075 -12915366 -13189782 -13909715 -15032901 -16467577 -18104222
6561 -18104222 -19821236 -21468782 -22861519 -23807102 -24168102 -23926883 -23216688 -22299461 -21498520
6552 -21498520 -21114805 -21357696 -22307472 -23910112 -25998028 -28331495 -30654717 -32753333 -34494824
6543 -34494824 -35839735 -36826729 -37544871 -38104384 -38610308 -39142519 -39748194 -40448421 -41249035
6534 -41249035 -42141424 -43091162 -44029333 -44863264 -45507119 -45915659 -46103251 -46142524 -46148053 -46251008
6524 -46251008 -46566719 -47159024 -48013229 -49032229 -50059771 -50919113 -51450279 -51537198 -51123905
6515 -51123905 -50217470 -48873863 -47172178 -45194468 -43025090 -40765202 -38544161 -36512801
6507 -36512801 -34816475 -33557099 -32761368 -32374970 -32291023 -32396370 -32603560 -32849724 -33074614
6498 -33074614 -33206297 -33170199 -32913530 -32426263 -31744828 -30934289 -30053900 -29120234 -28087328
6489 -28087328 -26856470 -25312028 -23366890 -21000714 -18280290 -15355097 -12424313 -9682249
6481 -9682249 -7263937 -5215644 -3499381 -2021057 -668336 646865 1945303 3153083
6473 3153083 4111697 4628717 4544670 3782491 2361310 377021 -2037392 -4754619 -7678362
6464 -7678362 -10735822 -13842185 -16865468 -19623686 -21923152 -23615625 -24639633 -25026214
6456 -25026214 -24875872 -24328072 -23537753 -22656837 -21811154 -21070539 -20423052 -19770761 -18958428
6447 -18958428 -17829681 -16287361 -14329579 -12047683 -9595707 -7152162 -4887219 -2935242
6439 -2935242 -1370395 -190014 685994 1396305 2103769 2953327 4032327 5345401 6815470
6430 6815470 8313781 9705558 10885017 11779054 12324928 12451542 12089858 11207047 9834092
6421 9834092 8063517 6020083 3822431 1549249 -783247 -3225115 -5872404 -8829973
6413 -8829973 -12176346 -15946656 -20135116 -24705937 -29599419 -34726866 -39959579 -45125073
6405 -45125073 -50019780 -54434140 -58177536 -61095111 -63076505 -64056699 -64006662 -62918204 -60798585
6396 -60798585 -57688591 -53698813 -49039791 -44020165 -39002813 -34330960 -30253793 -26885391
6388 -26885391 -24215656 -22163485 -20640849 -19597555 -19034834 -18992934 -19523471 -20657206 -22377681
6379 -22377681 -24608555 -27214679 -30010824 -32775206 -35272476 -37288567 -38665415 -39314281
6371 -39314281 -39198623 -38302344 -36610830 -34118109 -30850042 -26884018 -22353814 -17440871
6363 -17440871 -12359597 -7344163 -2639364 1509687 4878475 7297923 8694115 9117175
6355 9117175 8746597 7866613 6811678 5893514 5335264 5241002 5611996 6396983 7550134
6346 7550134 9070418 11002864 13396480 16238621 19407681 22680587 25794168 28520450
6338 28520450 30710115 32288546 33224754 33505413 33130851 32125963 30547445 28476038 25999211
6329 25999211 23199615 20158388 16966451 13727853 10545541 7494403 4595046 1801459
6321 1801459 -988106 -3893309 -6996470 -10296366 -13700084 -17059106 -20224856 -23088765
6313 -23088765 -25589677 -27695981 -29381346 -30610616 -31343673 -31552732 -31238008 -30429447 -29178824
6304 -29178824 -27557881 -25669568 -23661863 -21728871 -20093516 -18975399 -18550999 -18918162
6296 -18918162 -20080585 -21958336 -24411315 -27256652 -30277795 -33239823 -35918626 -38131273
6288 -38131273 -39751134 -40709692 -41001187 -40695562 -39944549 -38964140 -37997996 -37283052 -37028761
6279 -37028761 -37398412 -38476664 -40230499 -42493548 -44996824 -47437062 -49548796 -51148931
6271 -51148931 -52144813 -52517483 -52298693 -51554226 -50374761 -48868197 -47149386 -45329516 -43508644
6262 -43508644 -41769550 -40168242 -38722161 -37405362 -36159588 -34919195 -33635576 -32285792
6254 -32285792 -30863750 -29368717 -27807321 -26207979 -24629615 -23149497 -21834746 -20717528
6246 -20717528 -19792284 -19039093 -18460049 -18102588 -18046499 -18356100 -19029229 -19979966 -21064974
6237 -21064974 -22131977 -23061600 -23787388 -24292248 -24584937 -24664634 -24487521 -23950929 -22905245
6228 -22905245 -21193602 -18706997 -15433229 -11480514 -7070049 -2502664 1894657 5835858
6220 5835858 9139583 11764635 13801621 15425690 16827127 18138280 19379276 20448406
6212 20448406 21168368 21366963 20948878 19925338 18400359 16538074 14539046 12637049 11104348
6203 11104348 10241052 10334545 11599762 14126096 17849476 22551892 27883625 33406320 38655626
6194 38655626 43214791 46781741 49210213 50513576 50834644 50396948 49454362 48248116 46973462
6185 46973462 45758401 44659052 43673252 42765761 41891096 41000153 40028912 38885532 37458849
6176 37458849 35654007 33433656 30835732 27960683 24946837 21954220 19158055 16739289
6168 16739289 14864539 13660847 13195595 13466406 14400338 15863623 17687779 19712462 21828449
6159 21828449 23993944 26211565 28482342 30767195 32974369 34972210 36619831 37807330
6151 37807330 38490452 38700071 38518989 38039524 37323960 36382498 35173491 33624351 31662511
$$ [...]
##END NTUPLES=NMR SPECTRUM
##END=
