##TITLE=31Pdec_DE-40W2
 D2O
 24 sc
 1.4.2024
##JCAMPDX= 6.0         $$ Bruker NMR JCAMP-DX V2.0
##DATA TYPE= NMR SPECTRUM
##DATA CLASS= NTUPLES
##ORIGIN= UXNMR, Bruker Analytische Messtechnik GmbH
##OWNER= root
$$ XWIN-NMR		Version 3.5
$$ Mon Apr  1 14:45:42 2024 Russian Standard Time (UT+4h)  she@DPX200
##.OBSERVE FREQUENCY= 81.013821
##.OBSERVE NUCLEUS= ^31P
##.ACQUISITION MODE= SIMULTANEOUS
##.ACQUISITION SCHEME= undefined
##.AVERAGES= 24
##.DIGITISER RES= 16
##SPECTROMETER/DATA SYSTEM= spect
##.PULSE SEQUENCE= zgpg30
##.SOLVENT NAME= D2O
##.SHIFT REFERENCE= (INTERNAL, D2O, 0, 248.564)
##AUDIT TRAIL= $$ (NUMBER, WHEN, WHO, WHERE, WHAT)
$$ ##TITLE= Audit trail, XWIN-NMR		Version 3.5
$$ ##JCAMPDX= 5.01
$$ ##ORIGIN= Bruker BioSpin GmbH
$$ ##OWNER= she
$$ F:/spectra/data/she/nmr/P31/1/pdata/1/auditp.txt
$$ ##AUDIT TRAIL=  $$ (NUMBER, WHEN, WHO, WHERE, WHAT)
(   1,<2024-04-01 14:44:46.35 +0400>,<she>,<DPX200>,
      <created by zg, POWCHK disabled, PULCHK disabled
       configuration hash MD5:
       00 E9 B6 7A A2 85 ED C7 34 08 36 98 17 FE 4E 26
       data hash MD5: 32K
       AD 00 83 A2 C5 8E FC 9A 88 0A 4C F5 C2 C2 C9 83>)
(   2,<2024-04-01 14:44:48.67 +0400>,<she>,<DPX200>,
      <Start of raw data processing
       efp BC_mod = 2 LB = 10 FT_mod = 6 PKNL = 1 PHC0 = -12834.8 PHC1 = 98.68332 SI = 64K 
       data hash MD5: 64K
       93 8C 95 BD 0E 2F 9E 75 68 AA E3 32 BB 36 A5 82>)
(   3,<2024-04-01 14:45:06.15 +0400>,<she>,<DPX200>,
      <pk PHC0 = -202.1049 PHC1 = 313.0001 
       data hash MD5: 64K
       5F F2 35 8E 95 0A BD 14 F6 02 51 6F 54 3F 85 56>)
$$ ##END=
$$ 
$$ hash MD5
$$ 75 10 25 08 F9 88 CE AB 50 D3 31 9C 52 96 0D 1A
##$RELAX= 
##$RELAX= 
##$RELAX= 
##$RELAX= 
##$RELAX= 
##$RELAX= 
##$RELAX= 
##$RELAX= 
##$RELAX= 
$$ Bruker specific parameters
$$ --------------------------
##$DU= <F:/spectra>
##$EXPNO= 1
##$NAME= <P31>
##$PROCNO= 1
##$TYPE= <nmr>
##$USER= <she>
##$AMP= (0..31)
100 100 100 100 100 100 100 100 100 100 100 100 100 100 100 100 100 100 
100 100 100 100 100 100 100 100 100 100 100 100 100 100 
##$AQSEQ= 0
##$AQ_mod= 1
##$AUNM= <au_zg>
##$AUTOPOS= <>
##$BF1= 81.014009
##$BF2= 200.13
##$BF3= 200.13
##$BF4= 200.13
##$BF5= 200.13
##$BF6= 200.13
##$BF7= 200.13
##$BF8= 200.13
##$BYTORDA= 1
##$CFDGTYP= 0
##$CFRGTYP= 5
##$CHEMSTR= <none>
##$CNST= (0..31)
1 1 145 1 1 1 1 1 1 1 1 1 1 1 1 1 1 1 1 1 1 1 1 1 1 1 1 1 1 1 1 1 
##$CPDPRG= <waltz16>
##$CPDPRG1= <>
##$CPDPRG2= <waltz16>
##$CPDPRG3= <>
##$CPDPRG4= <mlev>
##$CPDPRG5= <mlev>
##$CPDPRG6= <mlev>
##$CPDPRG7= <mlev>
##$CPDPRG8= <mlev>
##$CPDPRGB= <>
##$CPDPRGT= <>
##$D= (0..31)
0 1 0 0 0 0 0 0 0 0 0 0.03 2e-05 3e-06 0 0 0 0 0 0 0 0 0 0 0 0 0 0 0 0 
0 0 
##$DATE= 1711968285
##$DBL= (0..7)
120 120 120 11 120 120 24 19 
##$DBP= (0..7)
150 150 150 150 150 150 150 150 
##$DBP07= 0
##$DBPNAM0= <>
##$DBPNAM1= <>
##$DBPNAM2= <>
##$DBPNAM3= <>
##$DBPNAM4= <>
##$DBPNAM5= <>
##$DBPNAM6= <>
##$DBPNAM7= <>
##$DBPOAL= (0..7)
0.5 0.5 0.5 0.5 0.5 0.5 0.5 0.5 
##$DBPOFFS= (0..7)
$$ [...]
##$SUBNAM2= <"">
##$SUBNAM3= <"">
##$SUBNAM4= <"">
##$SUBNAM5= <"">
##$SUBNAM6= <"">
##$SUBNAM7= <"">
##$SUBNAM8= <"">
##$SUBNAM9= <"">
##$SW= 501.771253377433
##$SWIBOX= (0..15)
0 1 3 0 0 0 0 0 0 0 0 0 0 0 0 0 
##$SW_h= 40650.406504065
##$TD= 32768
##$TD0= 1
##$TE= 0
##$TE2= 300
##$TE3= 300
##$TEG= 300
##$TL= (0..7)
0 120 53 12 22 120 120 120 
##$TP= (0..7)
150 150 150 150 150 150 150 150 
##$TP07= 0
##$TPNAME0= <>
##$TPNAME1= <>
##$TPNAME2= <>
##$TPNAME3= <>
##$TPNAME4= <>
##$TPNAME5= <>
##$TPNAME6= <>
##$TPNAME7= <>
##$TPOAL= (0..7)
0.5 0.5 0.5 0.5 0.5 0.5 0.5 0.5 
##$TPOFFS= (0..7)
0 0 0 0 0 0 0 0 
##$TUNHIN= 0
##$TUNHOUT= 0
##$TUNXOUT= 0
##$USERA1= <user>
##$USERA2= <user>
##$USERA3= <user>
##$USERA4= <user>
##$USERA5= <user>
##$V9= 5
##$VALIST= <valist>
##$VCLIST= <CCCCCCCCCCCCCCC>
##$VD= 0
##$VDLIST= <DDDDDDDDDDDDDDD>
##$VPLIST= <PPPPPPPPPPPPPPP>
##$VTLIST= <TTTTTTTTTTTTTTT>
##$WBST= 1024
##$WBSW= 4
##$XGAIN= (0..3)
0 0 0 0 
##$XL= 0
##$YL= 0
##$YMAX_a= 1040
##$YMIN_a= -1559
##$ZGOPTNS= <>
##$ZL1= 120
##$ZL2= 120
##$ZL3= 120
##$ZL4= 120
##$ABSF1= 0
##$ABSF2= 0
##$ABSG= 0
##$ABSL= 0
##$ALPHA= 0
##$AQORDER= 0
##$ASSFAC= 0
##$ASSFACI= 0
##$ASSFACX= 0
##$ASSWID= 0
##$AUNMP= <proc_1d>
##$AZFE= 0.1
##$AZFW= 0.5
##$BCFW= 0
##$BC_mod= 2
##$BYTORDP= 0
##$COROFFS= 0
##$CY= -3
##$DATMOD= 1
##$DC= 0
##$DFILT= <>
##$DTYPP= 0
##$F1P= 0
##$F2P= 0
##$FCOR= 1
##$FTSIZE= 65536
##$FT_mod= 6
##$GAMMA= 0
##$GB= 0
##$INTBC= 1
##$INTSCL= 6.047779e-11
##$ISEN= 30
##$LB= 10
##$LEV0= 0
##$LPBIN= 0
##$MAXI= 10000
##$MC2= 0
##$MEAN= 0
##$ME_mod= 0
##$MI= 50
##$NCOEF= 0
##$NC_proc= -12
##$NLEV= 6
##$NOISF1= 182.463
##$NOISF2= 159.3651
##$NSP= 0
##$NTH_PI= 0
##$NZP= 0
##$OFFSET= 248.5645
##$PC= 4
##$PHC0= -13036.9
##$PHC1= 411.6834
##$PH_mod= 1
##$PKNL= yes
##$PPARMOD= 0
##$PSCAL= 0
##$PSIGN= 0
##$REVERSE= no
##$SF= 81.0140089999694
##$SI= 65536
##$SIGF1= 159.3651
##$SIGF2= -187.1042
##$SINO= 113.3802
##$SIOLD= 16384
##$SREGLST= <1H.CDCl3>
##$SSB= 0
##$STSI= 65536
##$STSR= 0
##$SW_p= 40650.406504065
##$SYMM= 0
##$S_DEV= 0
##$TDeff= 32768
##$TDoff= 0
##$TI= <>
##$TILT= no
##$TM1= 0
##$TM2= 0
##$TOPLEV= 0
##$USERP1= <user>
##$USERP2= <user>
##$USERP3= <user>
##$USERP4= <user>
##$USERP5= <user>
##$WDW= 1
##$XDIM= 65536
##$YMAX_p= 497549295
##$YMIN_p= -101985568
$$ End of Bruker specific parameters
$$ ---------------------------------
##NTUPLES= NMR SPECTRUM
##VAR_NAME=  FREQUENCY,     SPECTRUM/REAL,   SPECTRUM/IMAG
##SYMBOL=    X,             R,               I
##VAR_TYPE=  INDEPENDENT,   DEPENDENT,       DEPENDENT
##VAR_FORM=  AFFN,          ASDF,            ASDF
##VAR_DIM=   65536,         65536,           65536
##UNITS=     HZ,            ARBITRARY UNITS, ARBITRARY UNITS
##FACTOR=    0.620285442955139, 1,           1
##FIRST=     20137.2065510682, 0,            0
##LAST=      -20513.1999529968, 0,           0
##MIN=       -20513.1999529968, -101985568,  0
##MAX=       20137.2065510682, 497549295,    0
$$ Real data points
##PAGE= N=1
##DATA TABLE= (X++(R..R)), XYDATA
$$ [...]
14161 -18448656 -20204265 -22176554 -24126766 -25876445 -27310288 -28355267 -28969595 -29146406
14153 -29146406 -28915905 -28340360 -27512495 -26557724 -25618152 -24801601 -24117535 -23451206 -22609363
14144 -22609363 -21417081 -19803402 -17819494 -15581222 -13179139 -10615170 -7799810 -4602243
14136 -4602243 -919135 3271678 7887140 12737908 17537862 21925964 25517807 27993845
14128 27993845 29195917 29180409 28195780 26598606 24753492 22958424 21412780 20220507
14120 20220507 19406312 18925177 18665223 18463121 18146701 17594451 16783785 15806293 14846864
14111 14846864 14137263 13900185 14299729 15407702 17186282 19486863 22070887 24655649
14103 24655649 26972566 28816376 30074459 30739812 30908083 30747506 30435961 30083911 29679489
14094 29679489 29084338 28084460 26476392 24153969 21159517 17680580 14002329 10445252
14086 10445252 7313146 4858206 3258154 2601332 2880429 3996620 5774471 7985582
14078 7985582 10375903 12691661 14705203 16247773 17249140 17766094 17973933 18111690 18400365
14069 18400365 18968558 19813339 20808070 21753220 22449484 22758107 22616839 22007656 20904589
14060 20904589 19238799 16899520 13765050 9746094 4824523 -924300 -7331157 -14152572
14052 -14152572 -21102313 -27885193 -34225870 -39889904 -44699240 -48545505 -51398855 -53302431
14044 -53302431 -54344717 -54617235 -54179811 -53053724 -51244887 -48782053 -45752488 -42324970
14036 -42324970 -38753434 -35352145 -32438062 -30255488 -28916543 -28385492 -28506486 -29050727
14028 -29050727 -29760669 -30385078 -30708023 -30573777 -29908317 -28736507 -27186480 -25468242 -23827162
14019 -23827162 -22494921 -21660835 -21459774 -21953938 -23102200 -24741317 -26605809 -28382255
14011 -28382255 -29766453 -30497670 -30371020 -29245511 -27058618 -23842164 -19727020 -14929151
14003 -14929151 -9718092 -4374239 854334 5779939 10275953 14256488 17661030 20465121
13995 20465121 22707545 24501827 26013048 27413943 28848636 30416661 32169579 34109514
13987 34109514 36188536 38313582 40359415 42187588 43666246 44686157 45173739 45107660
13979 45107660 44541941 43624658 42590421 41711545 41217065 41214498 41656071 42368513 43125403
13970 43125403 43715065 43969341 43757617 42978209 41572020 39554841 37043491 34250804 31440676
13961 31440676 28857399 26661204 24900334 23526516 22433921 21495167 20584310 19595978
13953 19595978 18472390 17234974 15999982 14955971 14301399 14169108 14576156 15421039 16521806
13944 16521806 17672604 18699456 19503934 20084747 20527402 20960301 21490418 22142056 22820905
13935 22820905 23315393 23335576 22581515 20827051 17998620 14224051 9829531 5276862 1053733
13926 1053733 -2451013 -5044850 -6765909 -7843783 -8608242 -9383765 -10400208 -11734450
13918 -11734450 -13292227 -14839003 -16077016 -16743073 -16688892 -15915305 -14554128 -12811521 -10898703
13909 -10898703 -8978586 -7145872 -5436572 -3846895 -2345516 -880369 609226 2171914
13901 2171914 3825768 5555811 7329150 9112366 10870299 12539584 13995304 15044023
13893 15044023 15464668 15084612 13848521 11839165 9244543 6304053 3272301 408984
13885 408984 -2029048 -3817688 -4813393 -4992224 -4457566 -3414315 -2120664 -829001 274266
13876 274266 1114888 1741512 2286449 2887825 3614417 4439550 5278145 6055586 6758873 7442406
13866 7442406 8196656 9106727 10224279 11563288 13116260 14875501 16840849 19005866
13858 19005866 21331332 23723595 26031920 28069783 29655589 30660031 31043204 30866950
13850 30866950 30275177 29444905 28523636 27579020 26582354 25426910 23964316 22044895 19560815
13841 19560815 16490776 12930337 9086223 5229270 1624862 -1528462 -4127350 -6152056
13833 -6152056 -7631462 -8615388 -9173555 -9408937 -9453510 -9430550 -9402915 -9343284 -9145994 -8672386
13823 -8672386 -7807083 -6504366 -4810561 -2854384 -805613 1185047 3040254 4778294
13815 4778294 6491198 8290355 10249155 12371384 14596895 16836421 19016375 21113769
13807 21113769 23168265 25269007 27523212 30016043 32769128 35706606 38644789 41322334
13799 41322334 43470015 44891004 45509770 45365598 44560950 43197249 41329437 38956087
13791 38956087 36046095 32586687 28622964 24259877 19622408 14803232 9838451 4729499
13783 4729499 -506321 -5792463 -10982436 -15882226 -20287925 -24020096 -26947792 -29003642
13775 -29003642 -30189424 -30567674 -30240938 -29332303 -27981418 -26352890 -24636038 -23017585
13767 -23017585 -21632016 -20517166 -19607197 -18778950 -17939855 -17118110 -16504165 -16410707 -17163392
13758 -17163392 -18978051 -21886029 -25730900 -30211437 -34930389 -39432674 -43246012 -45939553
13750 -45939553 -47195196 -46868077 -45011977 -41857620 -37748876 -33058763 -28115363 -23160006
13742 -23160006 -18341722 -13737604 -9383991 -5304176 -1524029 1920328 4969448 7518398
13734 7518398 9404082 10426430 10404855 9242869 6968566 3735440 -213072 -4599659
13726 -4599659 -9166384 -13703357 -18047621 -22067064 -25648255 -28695344 -31136417 -32932281
13718 -32932281 -34083432 -34629844 -34640813 -34198409 -33379943 -32241467 -30804887 -29057311 -26970663
13709 -26970663 -24536814 -21800587 -18873729 -15925543 -13158244 -10779360 -8977806 -7899694
13701 -7899694 -7616787 -8093413 -9174585 -10614419 -12136254 -13492955 -14503504 -15068234 -15177866
13692 -15177866 -14920879 -14479477 -14105221 -14077205 -14654592 -16034909 -18322739 -21506538 -25440892
13683 -25440892 -29839842 -34295407 -38331377 -41484593 -43388814 -43834127 -42786892 -40370887
13675 -40370887 -36822375 -32438007 -27533017 -22416878 -17380222 -12680851 -8522714 -5033164
13667 -5033164 -2249969 -126185 1447258 2608831 3495096 4222547 4888418 5583920 6402061
13658 6402061 7424453 8690514 10172439 11779425 13392485 14908429 16269221 17467771
13650 17467771 18534232 19509233 20411336 21211900 21832977 22173319 22151435 21747588 21031076
13641 21031076 20165852 19392020 18986641 19213031 20267521 22229172 25022428 28412687 32051493
13632 32051493 35563027 38636952 41090709 42886656 44113190 44947694 45614400 46340963
13624 46340963 47310842 48612091 50196910 51876307 53364289 54360356 54639014 54113243 52849855
13615 52849855 51030749 48875341 46560000 44173217 41722624 39178690 36524479 33786597
13607 33786597 31036907 28368075 25857427 23539439 21400055 19388359 17429419 15429546
13599 15429546 13283213 10897607 8234997 5349265 2386056 -463497 -3033272 -5236954
13591 -5236954 -7078054 -8616259 -9917141 -11014784 -11897855 -12510921 -12763822 -12555886 -11822976
13582 -11822976 -10594502 -9027726 -7394593 -6025637 -5236558 -5261315 -6204674 -8022187 -10534879
13573 -10534879 -13480419 -16590183 -19665790 -22618004 -25441462 -28138359 -30647877 -32840164
13565 -32840164 -34581255 -35814469 -36592181 -37036260 -37260545 -37309994 -37151813 -36715931 -35952664
13556 -35952664 -34870707 -33538020 -32053804 -30513668 -28988996 -27532525 -26208574 -25129610
13548 -25129610 -24471449 -24448854 -25256797 -27001222 -29645634 -32991527 -36699508 -40346006 -43499955
13539 -43499955 -45800229 -47018302 -47094997 -46142812 -44410980 -42221504 -39895255 -37690581
13531 -37690581 -35771209 -34207034 -32995888 -32087156 -31396537 -30816622 -30233208 -29549218 -28710528
13522 -28710528 -27728424 -26692371 -25759146 -25105033 -24850349 -24994441 -25402121 -25850565 -26106355
13513 -26106355 -25989044 -25396611 -24298055 -22714632 -20705398 -18355400 -15754327 -12960728
13505 -12960728 -9966091 -6686604 -3002881 1159782 5748163 10541026 15176313 19232762
13497 19232762 22329475 24209729 24791839 24181354 22643195 20539953 18255186 16125992
13489 16125992 14400340 13220410 12626029 12571975 12952036 13621087 14411888 15154914 15712861
13480 15712861 16026670 16149211 16240835 16523892 17218463 18483925 20374742 22810005 25565432
13471 25565432 28304266 30648942 32268491 32946077 32606471 31305626 29195648 26480431
13463 26480431 23377399 20094378 16814439 13672498 10723083 7924306 5162302 2306252
13455 2306252 -744235 -4044274 -7608586 -11408937 -15359798 -19313745 -23083823 -26484509
13447 -26484509 -29367205 -31632787 -33220797 -34087581 -34188625 -33473884 -31894716 -29418291
13439 -29418291 -26052227 -21883919 -17122466 -12110087 -7274318 -3027524 343588 2749717
13431 2749717 4307266 5289429 6046576 6926744 8215871 10098481 12629982 15721814 19155518
13422 19155518 22636802 25874608 28650704 30853823 32478034 33600837 34353030 34883260
13414 34883260 35319618 35737567 36146734 36502372 36734009 36773945 36570675 36086562 35293669
13405 35293669 34183001 32788415 31208711 29605472 28166998 27051921 26341655 26024090
13397 26024090 26007665 26148197 26275865 26224389 25865249 25136198 24048240 22670217 21105419
13388 21105419 19469747 17867550 16365519 14983161 13717754 12589239 11660296 10999736
13380 10999736 10608377 10366563 10051888 9423971 8325247 6739638 4784540 2655260 562606
13371 562606 -1305581 -2794710 -3782304 -4184274 -3972208 -3186597 -1926482 -311787 1563370
13362 1563370 3661188 6002837 8650288 11680999 15162785 19127665 23542708 28283906
13354 28283906 33128279 37778280 41917279 45278268 47705040 49192517 49894839 50086605
13346 50086605 50075284 50095852 50241909 50469332 50660315 50699835 50519256 50092884 49406906 48436083
13336 48436083 47152447 45559953 43725454 41780850 39894771 38228570 36891975 35911096
13328 35911096 35220486 34681825 34115919 33331408 32149291 30435139 28140758 25335792 22203801
13319 22203801 18993653 15942102 13202008 10812307 8723554 6855863 5145590 3555430
13311 3555430 2061707 649817 -671397 -1854565 -2819885 -3482432 -3780373 -3685027 -3191485
13302 -3191485 -2304560 -1035943 584487 2495857 4609602 6834966 9111902 11424053
13294 11424053 13774988 16139011 18419595 20443838 21996520 22876320 22952311 22204038 20733915
13285 20733915 18747705 16509837 14288712 12306737 10704724 9526602 8726224 8191159
13277 8191159 7774348 7328011 6738222 5954424 5000567 3956495 2912970 1921118 964599
13268 964599 -27374 -1133967 -2396874 -3808461 -5337454 -6962671 -8683239 -10501763
13260 -10501763 -12401260 -14333033 -16213011 -17915603 -19265290 -20041547 -20012871 -18997297
13252 -18997297 -16924563 -13868160 -10029748 -5682370 -1096400 3523001 8065055 12502822
13244 12502822 16853886 21131025 25297582 29238072 32757337 35618702 37610645 38608535
13236 38608535 38601491 37684484 36038783 33917010 31627615 29505065 27861996 26933932 26834994
13227 26834994 27542059 28914804 30743446 32805357 34912752 36940795 38830432 40564987
13219 40564987 42129863 43476523 44513437 45132506 45257020 44881647 44078320 42964833 41658622
13210 41658622 40244649 38768429 37241790 35642477 33903120 31905016 29498950 26560049
13202 26560049 23055251 19083639 14861596 10659079 6721010 3209076 182065 -2385664
13194 -2385664 -4562134 -6415735 -7993426 -9321600 -10415783 -11286399 -11939083 -12372306 -12572262
13185 -12572262 -12508121 -12137811 -11430040 -10391518 -9079458 -7590153 -6032735 -4505814 -3091124
13176 -3091124 -1866977 -927956 -386095 -339526 -825836 -1799289 -3156420 -4795151 -6666394
13167 -6666394 -8784447 -11190649 -13891716 -16809104 -19773611 -22576092 -25049218 -27132452
13159 -27132452 -28883388 -30433137 -31911900 -33376656 -34766094 -35901299 -36539739 -36465742
13151 -36465742 -35575229 -33912340 -31647279 -29019992 -26282426 -23654192 -21290012 -19258847
13143 -19258847 -17544050 -16072769 -14767386 -13594260 -12581078 -11791010 -11270342 -11004161
13135 -11004161 -10905479 -10836570 -10643728 -10190981 -9390417 -8228561 -6780823 -5203511 -3700891
13126 -3700891 -2477107 -1691252 -1433963 -1732866 -2576617 -3936980 -5774006 -8023202 -10571458
13117 -10571458 -13230878 -15725675 -17714071 -18858639 -18930321 -17902813 -15988669 -13591662
13109 -13591662 -11188486 -9187075 -7819586 -7106841 -6891375 -6908658 -6866747 -6519454 -5724073
13100 -5724073 -4471279 -2878592 -1154081 451488 1689353 2350657 2299644 1502420 46559
13091 46559 -1859100 -3918356 -5821564 -7344084 -8430335 -9219966 -9995958 -11072867 -12672290
13082 -12672290 -14834384 -17392338 -20010356 -22269178 -23773537 -24245785 -23569141 -21768657
13074 -21768657 -18958728 -15304255 -11016135 -6357283 -1620879 2929050 7125928 10936311
13066 10936311 14440070 17763230 20996477 24139093 27093305 29705194 31824251 33350125
13058 33350125 34251597 34563774 34376803 33818876 33024229 32085176 31013745 29748843 28214620
13049 28214620 26390225 24342495 22211827 20179789 18442085 17179764 16512184 16438716
13041 16438716 16799590 17282495 17477759 16962718 15386158 12527575 8322179 2861590 -3614193
13032 -3614193 -10731068 -18016037 -24968283 -31158701 -36321531 -40391844 -43467248 -45718357
13024 -45718357 -47303809 -48334635 -48890617 -49056146 -48940065 -48665586 -48340281 -48027498 -47735830
13015 -47735830 -47427822 -47036716 -46482446 -45689619 -44612529 -43260842 -41710839 -40093604 -38563951
13006 -38563951 -37258322 -36249671 -35512842 -34919915 -34276727 -33389400 -32131463 -30482266 -28522820
12997 -28522820 -26394622 -24242136 -22165519 -20204044 -18354229 -16607593 -14981164 -13518392
12989 -13518392 -12260157 -11210548 -10326466 -9536598 -8767983 -7958096 -7055578 -6029379 -4890885
12980 -4890885 -3705293 -2564860 -1528138 -565358 447013 1674606 3249329 5213910
12972 5213910 7509563 10001343 12524827 14940004 17175514 19238466 21173218 22986418
12964 22986418 24590050 25810731 26466745 26463148 25844638 24781329 23508540 22261461 21233480
12955 21233480 20562639 20333795 20580843 21281384 22348502 23630564 24924943 26003121 26643125
12946 26643125 26667222 25976313 24562040 22484006 19826771 16670911 13097526 9211368
12938 9211368 5153192 1090270 -2802396 -6356255 -9419624 -11871422 -13634814 -14676732
12930 -14676732 -14986470 -14548214 -13335615 -11342549 -8631826 -5364083 -1783067 1832881
12922 1832881 5221944 8166490 10491487 12047187 12700454 12355822 11005683 8780376
12914 8780376 5959008 2923179 71230 -2268927 -3896285 -4751559 -4898150 -4484337 -3699929
12905 -3699929 -2738006 -1771818 -951010 -405882 -238043 -488442 -1101302 -1913626 -2681986
12896 -2681986 -3134048 -3026744 -2199761 -613342 1643566 4379416 7346666 10288568 12975465
12887 12975465 15229147 16932986 18025508 18485033 18322855 17596386 16432495 15033346
12879 15033346 13641578 12470861 11640146 11153490 10934434 10884509 10926570 11016294 11128891
12870 11128891 11234952 11279201 11177590 10840336 10206023 9256759 8000384 6440539 4570595
12861 4570595 2404538 19365 -2432465 -4760063 -6799846 -8466106 -9756015 -10714563
12853 -10714563 -11390622 -11812837 -11993463 -11948723 -11715114 -11344584 -10878497 -10321535 -9640461
12844 -9640461 -8790050 -7741898 -6492812 -5056560 -3461067 -1759472 -36054 1616277
12836 1616277 3141747 4554621 5926369 7332597 8799987 10287284 11696310 12885028
12828 12885028 13671270 13845822 13214244 11656857 9174812 5901512 2082736 -1963438
12820 -1963438 -5902828 -9452488 -12440611 -14833100 -16714917 -18239314 -19571648 -20846520
12812 -20846520 -22138510 -23438307 -24636693 -25535316 -25900743 -25549871 -24424216 -22611008
12804 -22611008 -20304828 -17743396 -15159578 -12766037 -10756992 -9301018 -8512506 -8411553
12796 -8411553 -8896168 -9749893 -10692941 -11462118 -11886588 -11925410 -11650919 -11188987 -10648103 -10073411
12786 -10073411 -9446513 -8724333 -7888294 -6974822 -6077569 -5329782 -4876721 -4840621 -5281431
12777 -5281431 -6166445 -7365730 -8679036 -9882799 -10777929 -11224803 -11163809 -10626385 -9735626
12768 -9735626 -8684191 -7679321 -6869774 -6296054 -5898808 -5577697 -5255752 -4910967 -4575077
12759 -4575077 -4321620 -4251505 -4463765 -5006308 -5827765 -6760442 -7542893 -7864402 -7410695 -5905514
12749 -5905514 -3151921 928944 6272366 12667315 19778778 27191597 34467364 41200210
12741 41200210 47056820 51795164 55267807 57418207 58273182 57931530 56550686 54334046
12733 54334046 51519006 48364697 45140426 42116193 39553161 37689297 36717260 36756204
12725 36756204 37824815 39828097 42568926 45782318 49175524 52458059 55363061 57672728
12717 57672728 59251235 60071897 60223243 59891055 59323441 58787094 58522537 58707481 59434353
12708 59434353 60700421 62406267 64363910 66320376 67998037 69144140 69577297 69219284
12700 69219284 68103273 66354265 64145515 61645019 58973735 56195952 53347251 50481181
12692 50481181 47699035 45134857 42896884 40995248 39295387 37526033 35348166 32463476
12684 32463476 28717987 24154706 18995491 13570376 8234572 3307200 -956848 -4370352
12676 -4370352 -6808457 -8207319 -8571322 -7985895 -6628039 -4764359 -2726934 -863894
12668 -863894 525853 1253234 1274083 688535 -293251 -1409435 -2413713 -3129638 -3469995
12659 -3469995 -3415203 -2971097 -2140209 -924873 652194 2540163 4678368 7023785 9562075
12650 9562075 12295035 15216882 18290853 21427059 24466186 27188684 29366538 30841712
12642 30841712 31581947 31673102 31257363 30469511 29415176 28187472 26884326 25599438 24394262
12633 24394262 23276352 22199671 21085196 19852042 18446851 16856430 15092719 13156453
12625 13156453 11004897 8550969 5701878 2419772 -1228184 -5059558 -8815582 -12232675
12617 -12232675 -15113866 -17371488 -19030421 -20197520 -21010776 -21585646 -21978693 -22184209 -22163749
12608 -22163749 -21889142 -21371284 -20657723 -19806080 -18860252 -17854695 -16847484 -15955641 -15361611
12599 -15361611 -15280371 -15900887 -17324421 -19519286 -22309361 -25410261 -28510303 -31365233
12591 -31365233 -33859235 -36001144 -37866933 -39533904 -41048757 -42434225 -43703719 -44854832
12583 -44854832 -45845343 -46579889 -46924623 -46738985 -45904336 -44345143 -42051478 -39103195 -35680739
12574 -35680739 -32048382 -28511195 -25360027 -22820651 -21018420 -19962076 -19542469 -19542456 -19665924
12565 -19665924 -19599042 -19097030 -18058230 -16541934 -14721100 -12803047 -10961862 -9305761
12557 -9305761 -7879607 -6691739 -5747720 -5068931 -4682150 -4589287 -4744331 -5058921 -5434500
12548 -5434500 -5799455 -6126933 -6422537 -6692945 -6924370 -7097229 -7235532 -7456164 -7975981
12539 -7975981 -9062819 -10955992 -13799138 -17613473 -22310388 -27722641 -33633691 -39799120
12531 -39799120 -45968333 -51916462 -57483251 -62599157 -67276636 -71564085 -75487345 -79014165
12523 -79014165 -82058394 -84509095 -86254781 -87187275 -87195889 -86173336 -84042049 -80789944 -76496148
12514 -76496148 -71331864 -65531386 -59339538 -52954083 -46488448 -39971849 -33383413 -26700358
12506 -26700358 -19939400 -13179683 -6563011 -271832 5507422 10620319 14965525 18497121
12498 18497121 21213257 23137258 24295573 24698998 24335781 23181819 21226574 18508293
12490 18508293 15147587 11362603 7449594 3727879 469276 -2159874 -4126841 -5528499
12482 -5528499 -6558116 -7445894 -8382891 -9450661 -10585499 -11597640 -12243931 -12325653 -11766013
12473 -11766013 -10630513 -9088771 -7352792 -5631229 -4109778 -2939471 -2217663 -1970185
12465 -1970185 -2151451 -2660926 -3356628 -4056394 -4543878 -4604043 -4089071 -2983600 -1428384
12456 -1428384 319135 1975278 3331781 4322333 5027180 5622183 6300749 7197107 8331662
12447 8331662 9598343 10808150 11774456 12390300 12648925 12606246 12330676 11881378 11311332
12438 11311332 10662219 9934239 9050042 7846559 6111157 3648735 347489 -3785496
12430 -3785496 -8625025 -13947814 -19452077 -24775697 -29526506 -33329136 -35874407 -36956981
12422 -36956981 -36504764 -34609622 -31548481 -27762456 -23772979 -20055685 -16927601 -14499889
12414 -14499889 -12710623 -11408412 -10436766 -9681536 -9076220 -8583841 -8172658 -7789403 -7333923
12405 -7333923 -6653212 -5573836 -3965868 -1803332 813518 3683071 6559782 9220233
12397 9220233 11511903 13363913 14760017 15700072 16179858 16194984 15752811 14880277 13630241
12388 13630241 12089669 10383547 8668432 7117571 5899667 5147605 4919775 5173382
12380 5173382 5772922 6537810 7309513 8009275 8661225 9366236 10232259 11292727 12455219
12371 12455219 13505071 14159546 14152777 13329615 11720464 9560117 7226183 5116248 3526673
12362 3526673 2595901 2325604 2638333 3420229 4533121 5816636 7100306 8221119 9032127
12353 9032127 9402672 9223660 8423020 6982368 4947291 2434217 -362855 -3173189 -5670066
12344 -5670066 -7517125 -8434831 -8270905 -7047800 -4959330 -2310207 573330 3417130
12336 3417130 6029231 8289973 10123834 11475402 12305650 12613319 12465871 12006959 11416433
12327 11416433 10836445 10310817 9779299 9128042 8261495 7158867 5900219 4663778 3696517
12318 3696517 3259883 3563349 4709582 6670324 9294692 12338523 15502741 18472891
12310 18472891 20954181 22699154 23530080 23359033 22201132 20168894 17440483 14211502
12302 14211502 10654256 6906519 3094801 -623247 -4025444 -6828931 -8745004 -9570351
12294 -9570351 -9271079 -8010505 -6102893 -3921963 -1814079 -45988 1215393 1903726
12286 1903726 2037488 1690312 964964 -7969 -1050449 -1929364 -2391994 -2241505 -1416459
12277 -1416459 -33789 1625419 3184200 4272944 4638349 4222110 3176274 1803763
12269 1803763 448396 -613857 -1235098 -1393389 -1148218 -583216 243292 1327676 2721145
12260 2721145 4500694 6727104 9412230 12503867 15879368 19341346 22625567 25436389
12252 25436389 27507247 28662670 28857711 28186989 26867346 25197687 23499925 22054523
12244 22054523 21051243 20568015 20575719 20960564 21559169 22201188 22747905 23115157 23279592
12235 23279592 23274551 23175707 23069942 23011773 22992517 22950244 22821027 22596807 22346446 22184042
12225 22184042 22208774 22459992 22915940 23529885 24272735 25152463 26200671 27436712 28829753
12216 28829753 30279660 31630193 32712877 33402935 33661840 33549634 33205290 32803859 32504106
12207 32504106 32404930 32529930 32847118 33307170 33869723 34499911 35146225 35725803 36131051
12198 36131051 36250686 35994229 35319582 34265081 32971220 31664693 30593306 29938466 29757773
12189 29757773 29996069 30556615 31381200 32484494 33926719 35755892 37965008 40483453
12181 40483453 43188525 45917138 48475985 50660253 52281543 53191565 53289734 52517184 50850247
12172 50850247 48305082 44956247 40960393 36566768 32097146 27893343 24250247 21359628
12164 21359628 19282234 17955202 17235129 16966540 17047549 17455150 18210997 19306918 20636855
12155 20636855 21976172 23019902 23463190 23092182 21850370 19853468 17348475 14640613
12147 14640613 12023687 9735110 7933962 6693363 6006535 5808283 6002296 6477408 7107857
12138 7107857 7750483 8252122 8464526 8256386 7524213 6215596 4367054 2133061 -225877
12129 -225877 -2406088 -4151794 -5335701 -5996230 -6313827 -6529138 -6834188 -7292291 -7834747
12120 -7834747 -8332758 -8687924 -8876586 -8930885 -8893798 -8794760 -8657573 -8517884 -8425558 -8428566
12110 -8428566 -8552614 -8792775 -9124821 -9530505 -10017835 -10615764 -11341272 -12163925 -13001186
12101 -13001186 -13754515 -14362310 -14833994 -15248824 -15730223 -16415740 -17432555 -18877455 -20800827
12092 -20800827 -23199703 -26023311 -29185854 -32577080 -36067952 -39518419 -42794501 -45790953
12084 -45790953 -48444902 -50727098 -52612457 -54049052 -54949411 -55213088 -54764689 -53578427
12076 -53578427 -51671892 -49078767 -45828044 -41951203 -37516403 -32668262 -27644512 -22748498
12068 -22748498 -18278129 -14440038 -11294080 -8760236 -6683220 -4918025 -3395313 -2143378
12060 -2143378 -1263246 -867381 -1005952 -1615549 -2518274 -3470245 -4230462 -4619759 -4561116 -4106335
12050 -4106335 -3443109 -2861616 -2671529 -3096665 -4198590 -5864510 -7853004 -9863336 -11599884
12041 -11599884 -12824758 -13400580 -13316651 -12684373 -11696912 -10567671 -9474731 -8534660 -7812442
12032 -7812442 -7353312 -7206698 -7414258 -7959558 -8712946 -9421340 -9769263 -9490350 -8476060
12023 -8476060 -6832990 -4869752 -3022811 -1747108 -1406008 -2196882 -4135617 -7095511
12015 -7095511 -10869529 -15219369 -19893393 -24622921 -29122484 -33114356 -36376923 -38795311
12007 -38795311 -40384789 -41266597 -41598367 -41489090 -40946265 -39891101 -38234292 -35960794 -33168972
11998 -33168972 -30052386 -26857525 -23853820 -21318996 -19517254 -18655840 -18830847 -19986607
11990 -19986607 -21907704 -24249912 -26604133 -28576900 -29864957 -30304341 -29884320 -28727514
11982 -28727514 -27046444 -25092713 -23113603 -21321057 -19869357 -18841428 -18253535 -18085351
11974 -18085351 -18322137 -18979799 -20093555 -21679358 -23695050 -26021271 -28464800 -30778670
11966 -30778670 -32694500 -33962036 -34387561 -33864687 -32396933 -30110838 -27250364 -24142747
11958 -24142747 -21140980 -18563539 -16649045 -15527961 -15208226 -15581404 -16458341 -17624397
11950 -17624397 -18884410 -20075941 -21061223 -21727022 -22005490 -21898916 -21482539 -20878809 -20218630
11941 -20218630 -19608509 -19111875 -18744549 -18483191 -18282881 -18094182 -17870278 -17567079 -17150771
11932 -17150771 -16620748 -16033701 -15501590 -15151409 -15065970 -15242078 -15591185 -15981371 -16298943
11923 -16298943 -16499406 -16620664 -16749379 -16961816 -17280275 -17671788 -18077156 -18436291 -18692320
11914 -18692320 -18786889 -18664632 -18285290 -17629874 -16698028 -15506970 -14097086 -12535942 -10913541
11905 -10913541 -9334098 -7910404 -6751689 -5929689 -5428978 -5117402 -4773226 -4168378 -3163919
11896 -3163919 -1762837 -92191 1672629 3399368 5056323 6702618 8416320 10206364
11888 10206364 11966800 13501790 14601098 15118465 15014365 14351785 13256526 11865526
11880 11865526 10288737 8600019 6853320 5105428 3426196 1887504 535217 -639191
11872 -639191 -1704299 -2759417 -3885001 -5106766 -6397683 -7712707 -9031507 -10386348
11864 -10386348 -11862839 -13570298 -15589773 -17922259 -20464415 -23025411 -25376642 -27312646
11856 -27312646 -28701837 -29513855 -29819970 -29769734 -29549902 -29335300 -29249783 -29359025 -29699883
11847 -29699883 -30318903 -31276795 -32599325 -34200861 -35834236 -37108385 -37576111 -36856030 -34736459
11838 -34736459 -31222915 -26524617 -21003196 -15108163 -9306838 -4007579 514650 4168242
11830 4168242 7050220 9401685 11523576 13674912 15985828 18419149 20796413 22872211
11822 22872211 24418131 25282436 25415879 24873126 23798784 22396450 20877170 19396171
11814 19396171 18001728 16622423 15104419 13286413 11079796 8516701 5743092 2960752
11806 2960752 345810 -2019548 -4172928 -6244076 -8384902 -10686966 -13122030 -15530379
11798 -15530379 -17660399 -19243332 -20076262 -20085240 -19348400 -18074331 -16547629 -15063041 -13868435
11789 -13868435 -13128603 -12912104 -13196242 -13883399 -14824802 -15850575 -16803447 -17570116 -18104003
11780 -18104003 -18435619 -18668373 -18958497 -19481510 -20392403 -21787221 -23671347 -25941934 -28396815
11771 -28396815 -30776708 -32827668 -34354996 -35248247 -35481711 -35107306 -34245758 -33067682 -31761023
11762 -31761023 -30497423 -29412209 -28595827 -28082562 -27833010 -27727435 -27590552 -27248136 -26591243
11753 -26591243 -25615463 -24414989 -23136360 -21920805 -20870502 -20053993 -19534048 -19387347 -19701129
11744 -19701129 -20555527 -22004413 -24055407 -26645328 -29619209 -32731870 -35684857 -38193237
11736 -38193237 -40060179 -41229715 -41792355 -41936772 -41866585 -41716935 -41500132 -41092392 -40259969
11727 -40259969 -38715564 -36190009 -32500979 -27604275 -21618404 -14812766 -7551996 -208519
11719 -208519 6916402 13618431 19753573 25178238 29720844 33210422 35542044 36733894
11711 36733894 36940042 36413408 35442912 34297822 33196063 32287965 31638099 31204536 30836514
11702 30836514 30311075 29404100 27966207 25972596 23535283 20884386 18327393 16188561
11694 16188561 14732683 14093788 14242217 15009779 16155000 17422791 18565891 19338242 19498340
11685 19498340 18845428 17273017 14804231 11587995 7863260 3912770 21678 -3557624
11677 -3557624 -6639654 -9137087 -11073909 -12562106 -13741760 -14713397 -15503872 -16086339 -16435951
11668 -16435951 -16579410 -16607774 -16654919 -16867384 -17386324 -18340039 -19832521 -21922204 -24601386
11659 -24601386 -27789331 -31340040 -35057554 -38717611 -42102186 -45046048 -47476232 -49417625
11651 -49417625 -50954243 -52166222 -53082856 -53684731 -53955164 -53945057 -53802521 -53739873 -53950267
11642 -53950267 -54516008 -55353692 -56221465 -56785646 -56720980 -55808306 -53997230 -51414975 -48319800
11633 -48319800 -45015646 -41762807 -38726841 -35990060 -33609595 -31673466 -30311912 -29660479
11625 -29660479 -29806267 -30750930 -32402129 -34586444 -37072721 -39597363 -41885558 -43667430
11617 -43667430 -44695909 -44775202 -43799479 -41786643 -38884587 -35335355 -31406008 -27320503
11609 -27320503 -23231929 -19246767 -15472181 -12042528 -9106846 -6795801 -5196175 -4340960
11601 -4340960 -4203591 -4688068 -5624329 -6787817 -7950585 -8944865 -9700635 -10230229 -10573925
11592 -10573925 -10755740 -10790214 -10733224 -10728556 -11004561 -11813549 -13344724 -15654062 -18641647
11583 -18641647 -22081878 -25689875 -29197866 -32416705 -35262842 -37739430 -39878940 -41679325
11575 -41679325 -43074976 -43963576 -44273941 -44035531 -43409315 -42657309 -42056973 -41798808 -41921505
11566 -41921505 -42321205 -42827820 -43304586 -43720380 -44162857 -44787618 -45726003 -46996208 -48465191
11557 -48465191 -49882213 -50962703 -51474577 -51286931 -50372311 -48782072 -46621988 -44042413
11549 -44042413 -41236720 -38428976 -35837192 -33619555 -31830723 -30414222 -29233525 -28119606
11541 -28119606 -26909878 -25471777 -23720433 -21636421 -19274988 -16754412 -14224901 -11835301
11533 -11835301 -9714875 -7971127 -6687960 -5907771 -5598913 -5632241 -5796422 -5861841 -5669797
11524 -5669797 -5202172 -4592820 -4070077 -3853002 -4046883 -4587646 -5264879 -5813692 -6027076
11515 -6027076 -5830327 -5286341 -4543114 -3760353 -3049230 -2442393 -1897477 -1328105 -647714
11506 -647714 192977 1188636 2284122 3395386 4437884 5352820 6122073 6768722 7347453
11497 7347453 7929172 8578889 9327547 10149161 10960529 11651212 12133818 12392671 12507407
11488 12507407 12635721 12955991 13591251 14547536 15692833 16783995 17530935 17675580 17058454
11479 17058454 15651396 13550516 10939138 8038015 5061888 2199016 -383311 -2527698
11471 -2527698 -4100249 -5036201 -5387639 -5331946 -5126098 -5027712 -5218289 -5756511 -6574214 -7512119
11461 -7512119 -8378070 -9003582 -9279398 -9162861 -8662032 -7810654 -6650305 -5227146 -3596618
11452 -3596618 -1826155 4180 1798335 3445071 4841206 5941693 6808726 7616764
11444 7616764 8593933 9923981 11659734 13690509 15774626 17617403 18959094 19638425
11436 19638425 19613282 18944496 17766472 16264504 14656855 13165527 11970948 11168151 10746344
11427 10746344 10596265 10534707 10338490 9787394 8710769 7022596 4732000 1929806 -1238582
11418 -1238582 -4604780 -8008329 -11322575 -14470427 -17426579 -20206751 -22848864 -25392185
11410 -25392185 -27856100 -30216094 -32380982 -34190265 -35453004 -36025353 -35889311 -35184149
11402 -35184149 -34167608 -33126019 -32279417 -31724458 -31431108 -31278203 -31097456 -30702319 -29897246
11393 -29897246 -28478574 -26242684 -23011675 -18674158 -13225051 -6785020 406910 8017427
11385 8017427 15647593 22866543 29258643 34484158 38338471 40788429 41969813 42142045
11377 42142045 41611923 40653700 39457320 38121378 36680787 35142759 33510806 31794149
11369 31794149 30008616 28170794 26284665 24328992 22260763 20037956 17643188 15087310
11361 15087310 12394749 9591675 6710268 3802260 949362 -1733954 -4109219 -6043303
11353 -6043303 -7457882 -8375345 -8929691 -9333104 -9817207 -10575153 -11720423 -13268900 -15145784
11344 -15145784 -17211061 -19291040 -21207941 -22808451 -23990883 -24721037 -25025426 -24963610 -24595280
11335 -24595280 -23958146 -23060913 -21884405 -20383518 -18491636 -16136231 -13268821 -9899351
11327 -9899351 -6119886 -2109950 1877081 5548826 8631014 10933179 12395948 13101921
11319 13101921 13254960 13141987 13083938 13381891 14276166 15933498 18448881 21830142 25960890
11310 25960890 30584898 35358039 39956982 44176966 47956820 51328134 54334126 56964871
11302 56964871 59129289 60666164 61391403 61168690 59972885 57909904 55178320 51994096
11294 51994096 48522425 44853510 41029619 37099765 33164731 29384218 25940929 22977799
11286 22977799 20536047 18524375 16744215 14975125 13087083 11115495 9245031 7706854
11278 7706854 6658292 6127750 6056279 6395368 7187200 8577374 10760600 13896049 18035093
11269 18035093 23088949 28840792 34985846 41173671 47036835 52212188 56374016 59288183
11261 59288183 60872719 61235694 60667183 59581544 58426360 57587106 57318091 57718221 58749880
11252 58749880 60283123 62144622 64158789 66177673 68100375 69881606 71525859 73063331
11244 73063331 74511411 75838313 76950860 77716534 78007953 77745406 76919215 75588328 73859805
11235 73859805 71855137 69672338 67358190 64902778 62255258 59348694 56125100 52562736
11227 52562736 48706700 44687342 40700977 36945038 33536182 30461468 27597444 24790847
11219 24790847 21957947 19149221 16544764 14382083 12852461 12014894 11761274 11838735 11916591
11210 11916591 11679774 10924091 9617708 7896077 5987927 4110163 2386126 822829
11202 822829 -651847 -2117823 -3594404 -5008033 -6209825 -7028644 -7328519 -7046017 -6202232
11193 -6202232 -4894724 -3273105 -1500417 292682 2049521 3813687 5728905 8001082
11185 8001082 10820886 14268384 18241275 22444629 26452568 29819968 32202422 33441324
11177 33441324 33587590 32866477 31611503 30198970 28995851 28315115 28373952 29264915 30954269
11168 30954269 33307649 36127418 39186315 42253252 45113083 47579794 49502511 50768656
11160 50768656 51308328 51095048 50134525 48445250 46048408 42978779 39307228 35155280
11152 35155280 30694667 26140956 21749322 17807353 14614393 12445784 11511159 11917616
11144 11917616 13643482 16524313 20253370 24401715 28462868 31919777 34320759 35345596
11136 35345596 34847978 32869386 29623636 25453127 20765581 15971377 11442192 7495583
11128 7495583 4390665 2316951 1374591 1561637 2783220 4879430 7653782 10889251
11120 10889251 14356333 17825410 21085837 23963336 26331152 28120560 29334039 30050855
11112 30050855 30410594 30574080 30676922 30791343 30901964 30897846 30588257 29748833 28189371
11103 28189371 25816509 22663715 18880633 14694966 10363870 6122687 2138064 -1514841
11095 -1514841 -4829596 -7807136 -10399809 -12505769 -14015319 -14866196 -15063636 -14658127 -13708491
11086 -13708491 -12263430 -10376122 -8141383 -5727349 -3374251 -1354143 88292 785562
11078 785562 674004 -198578 -1676815 -3513878 -5405406 -7041731 -8168070 -8633795 -8412670
11069 -8412670 -7589543 -6327728 -4838236 -3358231 -2126281 -1340992 -1111773 -1430264 -2182802
11060 -2182802 -3195234 -4283344 -5291005 -6114610 -6713351 -7098207 -7302037 -7354839 -7288524
11051 -7288524 -7163212 -7078192 -7143650 -7430349 -7935638 -8586540 -9269826 -9865255 -10264625 -10375410
11041 -10375410 -10123512 -9471547 -8446997 -7147684 -5698320 -4175536 -2552019 -694342
11033 -694342 1592137 4494432 8112357 12385207 17064855 21772046 26118601 29822770
11025 29822770 32752053 34891081 36283539 36992996 37091800 36666086 35829188 34741825 33629124
11016 33629124 32772242 32456654 32885394 34095956 35927801 38061734 40110652 41715863
11008 41715863 42610211 42634709 41716842 39829576 36956098 33083524 28230688 22488416 16040610
10999 16040610 9152841 2140744 -4664947 -10954371 -16480239 -21098187 -24787349 -27641150
10991 -27641150 -29837191 -31600591 -33164254 -34723250 -36392390 -38191056 -40071750 -41977539
10983 -41977539 -43887018 -45812605 -47754809 -49649504 -51350104 -52663232 -53424205 -53573803
10975 -53573803 -53190699 -52454531 -51558766 -50629369 -49698593 -48736180 -47698527 -46556697 -45293920
10966 -45293920 -43886292 -42283781 -40404754 -38152259 -35448131 -32267256 -28654820 -24723896
10958 -24723896 -20639082 -16586985 -12734821 -9194624 -6020875 -3250039 -955805 719274
10950 719274 1575317 1402141 42995 -2543080 -6239496 -10771177 -15753474 -20777031 -25496189
10941 -25496189 -29687951 -33264638 -36245427 -38709027 -40754875 -42489990 -44036080 -45531365
10933 -45531365 -47103354 -48817972 -50643629 -52469454 -54174683 -55697479 -57046409 -58244826
10925 -58244826 -59253096 -59926880 -60038213 -59345626 -57678891 -55003195 -51437137 -47217781
10917 -47217781 -42630427 -37934176 -33305560 -28805540 -24372496 -19851627 -15064406 -9894895
10909 -9894895 -4351686 1420932 7176182 12618909 17463463 21487765 24575025 26731452
10901 26731452 28072931 28782255 29045603 28985369 28616152 27850375 26559871 24669032 22234795
10892 22234795 19472524 16712513 14305659 12520992 11478432 11138258 11340490 11870062
10884 11870062 12522138 13149028 13678008 14096747 14413915 14617744 14663872 14509261 14172160
10875 14172160 13769102 13491248 13527952 13983109 14829163 15915236 17018025 17909328 18410695
10866 18410695 18415617 17881213 16808009 15222688 13164309 10670495 7767988 4475008 815506
10857 815506 -3160442 -7355401 -11611127 -15719360 -19468429 -22711402 -25416366 -27663819
10849 -27663819 -29591237 -31321133 -32916670 -34383737 -35702481 -36854197 -37823289 -38581644
10841 -38581644 -39077357 -39243211 -39026871 -38435070 -37574155 -36658841 -35965620 -35737281 -36081400
10832 -36081400 -36916205 -37991733 -38974091 -39552155 -39520730 -38810214 -37462662 -35582767 -33300195
10823 -33300195 -30759639 -28123848 -25561728 -23211286 -21137812 -19319614 -17674231 -16107740
10815 -16107740 -14557932 -13015158 -11521978 -10157444 -9009498 -8142969 -7578241 -7292004
10807 -7292004 -7234476 -7344552 -7551250 -7770310 -7916331 -7938978 -7865933 -7820701 -7996203 -8595263
10797 -8595263 -9769515 -11583074 -14006910 -16935174 -20213168 -23669771 -27147664 -30525420
10789 -30525420 -33730157 -36743733 -39603331 -42390499 -45200241 -48090398 -51027928 -53861072
10781 -53861072 -56341585 -58196692 -59220286 -59339405 -58626076 -57254958 -55432050 -53326656
10773 -53326656 -51032353 -48570622 -45934621 -43150357 -40318465 -37607453 -35199892 -33225401
10765 -33225401 -31721132 -30637159 -29873249 -29320815 -28892460 -28533945 -28216945 -27913069 -27561219
10756 -27561219 -27053531 -26258992 -25075899 -23480809 -21546907 -19430038 -17336598 -15483825
10748 -15483825 -14056616 -13168491 -12838059 -12985623 -13446182 -13998326 -14415489 -14538106 -14342587
10739 -14342587 -13968618 -13678987 -13761362 -14416014 -15682566 -17433789 -19424450 -21362633 -22981688
10730 -22981688 -24106556 -24701100 -24868179 -24788665 -24629060 -24473900 -24317396 -24102777 -23772513
10721 -23772513 -23300179 -22695051 -21985855 -21197780 -20336783 -19386307 -18311141 -17061023 -15573085
10712 -15573085 -13778505 -11619260 -9075539 -6194851 -3105980 -4153 2890103 5379784
10704 5379784 7326324 8659271 9363564 9459360 8993951 8055555 6798251 5454495 4319364
10695 4319364 3708186 3898272 5066557 7240039 10281879 13926495 17850100 21741309
10687 21741309 25340464 28442882 30887441 32556014 33388642 33394420 32636730 31197572 29150086
10678 29150086 26561563 23519134 20151364 16628058 13141212 9879291 7002151 4617373
10670 4617373 2760648 1391619 418990 -247553 -647518 -757814 -528440 58543 936771
10661 936771 1924470 2724847 2976391 2355829 690757 -1986391 -5475217 -9501093 -13801626
10652 -13801626 -18166039 -22427334 -26427528 -29980739 -32860004 -34826689 -35698996 -35428928
10644 -35428928 -34144628 -32126950 -29721151 -27221702 -24787072 -22424605 -20042642 -17531188
10636 -17531188 -14829376 -11961133 -9043190 -6274493 -3907615 -2196744 -1325099 -1334479 -2093551
10627 -2093551 -3330639 -4722501 -5998273 -7012978 -7767451 -8379168 -9023844 -9871859 -11042589
10618 -11042589 -12591024 -14522278 -16811904 -19410522 -22230471 -25130445 -27914129 -30345635
10610 -30345635 -32174902 -33167886 -33140993 -31996697 -29748637 -26521532 -22523314 -18007599
10602 -18007599 -13252048 -8558535 -4251321 -644964 2015853 3610026 4156038 3791637
10594 3791637 2740634 1281194 -289810 -1703807 -2769842 -3404098 -3623944 -3512990 -3183513
10585 -3183513 -2761464 -2394757 -2259698 -2541062 -3389720 -4888127 -7050522 -9855700 -13283046
10576 -13283046 -17318768 -21921296 -26968197 -32227867 -37387610 -42130163 -46215468 -49524348
10568 -49524348 -52052480 -53874705 -55106605 -55876513 -56306656 -56498430 -56520030 -56397711 -56113838
10559 -56113838 -55616940 -54846836 -53766575 -52380048 -50718338 -48803779 -46624140 -44141582
10551 -44141582 -41326898 -38185823 -34755834 -31083357 -27208378 -23172581 -19044193 -14939889
10543 -14939889 -11028037 -7510031 -4585886 -2413410 -1070804 -533120 -671006 -1274101
10535 -1274101 -2095164 -2906361 -3553208 -3986404 -4257628 -4484694 -4807212 -5351151 -6207996
10526 -6207996 -7428125 -9026297 -10990255 -13280529 -15824337 -18523293 -21285246 -24062728
10518 -24062728 -26872230 -29788947 -32927266 -36410051 -40324816 -44681513 -49400088 -54338556
10510 -54338556 -59340453 -64269807 -69017673 -73486590 -77572994 -81166520 -84165961 -86490085
10502 -86490085 -88065320 -88800113 -88568462 -87205436 -84497666 -80159000 -73795153 -64861810
10494 -64861810 -52628754 -36187152 -14540366 13211331 47592781 88369709 134113738
10487 134113738 181960540 227903724 267723364 298170947 317781376 326940768 327352288
10480 327352288 321325699 311210200 299044365 286376159 274214214 263084058 253144603
10473 253144603 244317987 236409583 229209649 222563683 216398914 210708048 205505256 200775516
10465 200775516 196438534 192340050 188267340 183976598 179227443 173831320 167714713 160975706
10457 160975706 153896601 146887538 140373890 134676435 129936864 126108884 122998136 120323905
10449 120323905 117786819 115132066 112190756 108883318 105187854 101095431 96576387 91571722
10441 91571722 86012595 79859927 73145642 65996563 58633340 51347641 44461837 38275464
10433 38275464 33010300 28772410 25542974 23196134 21535788 20344986 19439441 18708441
10425 18708441 18124735 17718778 17533068 17581877 17833810 18218630 18648906 19044492 19348610
10416 19348610 19527894 19559264 19419835 19096687 18614555 18058425 17566673 17289283 17327063 17679631
10406 17679631 18230628 18785160 19146213 19190484 18904478 18370203 17720265 17092085 16602445
10397 16602445 16348748 16428413 16956966 18066696 19880914 22471811 25814829 29754230 33997379
10388 33997379 38151479 41801332 44608045 46397118 47202772 47246466 46854550 46350446 45963198
10379 45963198 45769488 45661949 45343445 44369796 42258847 38641159 33386691 26645517 18789164
10370 18789164 10294447 1634677 -6778703 -14607223 -21584452 -27531485 -32384220 -36205280
10362 -36205280 -39161770 -41474399 -43357343 -44965383 -46358623 -47494883 -48258187 -48518101
10354 -48518101 -48193443 -47285711 -45866893 -44041117 -41917414 -39612092 -37261524 -35009273
10346 -35009273 -32954928 -31094109 -29298306 -27358942 -25071602 -22305826 -19020790 -15234712
10338 -15234712 -10992192 -6365947 -1488109 3425800 8090445 12199423 15482826 17748869
10330 17748869 18900571 18930716 17904093 15939586 13203362 9913477 6342802 2806139
10322 2806139 -369992 -2885994 -4510131 -5121014 -4744301 -3564418 -1894865 -111745
10314 -111745 1425081 2437242 2765163 2373847 1329982 -240596 -2200846 -4442031 -6906139
10305 -6906139 -9587645 -12515844 -15725399 -19227769 -22993798 -26948766 -30973853 -34908622
10297 -34908622 -38556838 -41704955 -44159631 -45794802 -46582226 -46583038 -45906730 -44672899 -43007900
10288 -43007900 -41072000 -39078371 -37267856 -35841964 -34897417 -34414076 -34314523 -34560046 -35214312
10279 -35214312 -36422231 -38309343 -40863106 -43869799 -46944004 -49632904 -51541163 -52420617
10271 -52420617 -52196525 -50939429 -48815475 -46043681 -42863310 -39494853 -36085771 -32660635
10263 -32660635 -29114322 -25271867 -20995730 -16284289 -11306110 -6354218 -1751172 2247016
10255 2247016 5517657 8103273 10209108 12160521 14321106 16996168 20361139 24439911
10247 24439911 29126830 34227918 39501156 44687621 49531748 53792776 57254933 59745779
10239 59745779 61164111 61506420 60875579 59462820 57508563 55259154 52937245 50733815
10231 50733815 48818008 47354220 46513206 46462165 47323849 49114273 51694299 54776331 57999233
10222 57999233 61039892 63705242 65963482 67913182 69720653 71558853 73562861 75800761
10214 75800761 78257286 80833189 83363759 85654812 87528730 88866054 89621700 89802258
10206 89802258 89418025 88446598 86833481 84517999 81455058 77624435 73044874 67801669
10198 67801669 62067486 56089615 50142439 44469636 39241595 34538781 30359456 26644194
10190 26644194 23307542 20269778 17486298 14970035 12794981 11071042 9897886 9321930
10182 9321930 9317647 9795828 10627415 11672760 12813945 13987964 15209191 16563412 18166159
10173 18166159 20101508 22373179 24891623 27497064 30001575 32232320 34062801 35421113
10165 35421113 36270338 36572598 36263463 35259407 33497144 30980489 27807541 24167857
10157 24167857 20317946 16548731 13152695 10394023 8487668 7594528 7831727 9285403
10149 9285403 12010856 16013644 21217531 27434969 34360776 41603961 48752396 55441813
10141 55441813 61396388 66429486 70421090 73299016 75039423 75681342 75335837 74171901
10133 74171901 72377271 70111031 67471005 64488853 61150487 57430013 53322805 48864826
10125 48864826 44132041 39225116 34252689 29324708 24558557 20092109 16092002 12744180
10117 12744180 10220840 8632529 7985108 8159274 8919680 9952766 10928961 11578801 11761521
10108 11761521 11497819 10946349 10327595 9827416 9526287 9385710 9288813 9104770 8744564
10099 8744564 8191263 7501618 6781959 6148384 5690199 5454789 5456860 5698474 6184429 6928369
10089 6928369 7952816 9282778 10926818 12845774 14926543 16987924 18830727 20312637
10081 20312637 21407060 22212964 22911295 23689076 24662527 25828588 27065087 28181929 29001366
10072 29001366 29428220 29475688 29238913 28838582 28368990 27872587 27340221 26724140 25956686
10063 25956686 24977509 23769372 22387700 20960719 19648924 18578050 17777719 17155132
10055 17155132 16513464 15604159 14192553 12117379 9330446 5909556 2045027 -1994912
10047 -1994912 -5914656 -9453646 -12450685 -14888790 -16896927 -18701673 -20547255 -22616084
10039 -22616084 -24975066 -27556112 -30167307 -32529509 -34335555 -35326326 -35367235 -34498944 -32940648
10030 -32940648 -31044440 -29220553 -27860034 -27273643 -27653928 -29058288 -31405637 -34481492
10022 -34481492 -37957326 -41437655 -44536551 -46957906 -48539490 -49240640 -49092725 -48153423
10014 -48153423 -46491202 -44193611 -41375424 -38173029 -34732161 -31201361 -27729470 -24451718
10006 -24451718 -21455158 -18735750 -16174635 -13554804 -10617528 -7137531 -2988510 1823172
9998 1823172 7164427 12812928 18507386 23990730 29035078 33449877 37082718 39821520
9990 39821520 41600176 42404462 42274012 41297859 39603500 37342616 34678486 31777059 28798472
9981 28798472 25886078 23156986 20701166 18588662 16874879 15595043 14749917 14293302
9973 14293302 14131572 14139326 14186432 14162879 13987346 13599610 12953614 12025642 10829453 9414757
9963 9414757 7839439 6135307 4298401 2314580 200456 -1972610 -4090103 -6035737
9955 -6035737 -7740585 -9217499 -10568237 -11960913 -13581757 -15570463 -17955489 -20611896
9947 -20611896 -23262737 -25531338 -27029870 -27450630 -26624209 -24527238 -21250716 -16957767
9939 -16957767 -11856007 -6190548 -245493 5663687 11217055 16133947 20221404 23411241
9931 23411241 25771145 27481328 28779983 29894857 30986139 32120582 33281274 34401893
9923 34401893 35406549 36238357 36869462 37298133 37546790 37672091 37785304 38068249 38767593
9914 38767593 40161795 42512881 46025697 50831133 56992183 64518254 73373652 83477180
9906 83477180 94701718 106887945 119880652 133580495 147990667 163240276 179580179
9899 179580179 197355527 216958211 238765144 263076352 290060719 319692358 351644563
9892 351644563 385123792 418664256 449957257 475863056 492794809 497549295 488353328
9885 488353328 465611264 431892774 391134939 347501580 304455025 264325301 228319860
9878 228319860 196768460 169435653 145810809 125329211 107505176 91983109 78524429
9871 78524429 66951502 57077583 48655568 41364468 34833869 28701741 22697526 16721529
9863 16721529 10871572 5386954 534472 -3498258 -6647020 -8944673 -10460105 -11252589
9855 -11252589 -11371866 -10895356 -9964552 -8786670 -7597842 -6609110 -5957360 -5672494 -5668624
9846 -5668624 -5769071 -5766998 -5503083 -4924999 -4098162 -3163390 -2267562 -1506335 -904923 -435842
9836 -435842 -53143 277694 563452 779923 878518 799574 487819 -95520 -967027 -2120292
9826 -2120292 -3526454 -5134403 -6871989 -8651220 -10380509 -11984824 -13428008 -14724507
9818 -14724507 -15929856 -17113373 -18328987 -19596711 -20893922 -22151736 -23261760 -24103653
9810 -24103653 -24590240 -24706746 -24517791 -24136320 -23675633 -23217004 -22811242 -22502876 -22346239
9801 -22346239 -22393716 -22667687 -23143932 -23758163 -24422291 -25035345 -25491717 -25696635 -25585602 -25133872
9791 -25133872 -24350667 -23268086 -21937441 -20437748 -18893894 -17496324 -16506307 -16228962 -16950361
9782 -16950361 -18856984 -21966005 -26088760 -30839791 -35696765 -40103745 -43588483 -45850854
9774 -45850854 -46792273 -46488240 -45131808 -42978330 -40306664 -37393186 -34482628 -31742128
9766 -31742128 -29207073 -26755950 -24154194 -21166106 -17678626 -13765281 -9662258 -5689544
9758 -5689544 -2172185 610134 2454373 3265819 3092470 2144010 773378 -586267 -1513659
9749 -1513659 -1688603 -946264 719584 3198418 6326100 9938706 13895023 18067677 22324494
9740 22324494 26524881 30536899 34257672 37615952 40554384 43010117 44913407 46203334
9732 46203334 46840429 46800519 46058586 44587168 42380494 39487386 36024533 32157939 28064571
9723 28064571 23896653 19765706 15751518 11928977 8396402 5288842 2768461 992998
9715 992998 68240 -2161 654233 1792190 3103269 4284944 5098285 5407424 5202783
9706 5202783 4599265 3795047 2996042 2339448 1857046 1497882 1197411 954568 870855 1123596
9696 1123596 1884200 3226914 5077683 7225983 9389685 11304107 12801263 13847839
9688 13847839 14523590 14948518 15195325 15232913 14928838 14105730 12621163 10436436 7654405
9679 7654405 4523986 1414909 -1237368 -3015528 -3617357 -2932412 -1063222 1722254 5086903
9670 5086903 8725463 12426245 16074185 19611279 22993257 26174007 29117802 31812955
9662 31812955 34263391 36460245 38354860 39850355 40813832 41104829 40616696 39321337 37294649
9653 37294649 34699583 31726969 28523710 25146829 21564121 17695397 13471428 8885302
9645 8885302 4018058 -968011 -5862129 -10447310 -14532999 -17967081 -20630948 -22431235
9637 -22431235 -23299064 -23198381 -22141268 -20209096 -17572522 -14491973 -11283490 -8260484
9629 -8260484 -5683669 -3741004 -2548288 -2147666 -2496794 -3459631 -4810230 -6254173 -7471025
9620 -7471025 -8175820 -8179957 -7421422 -5950908 -3890264 -1391174 1390287 4302731 7197988
9611 7197988 9928725 12356738 14374834 15930206 17034195 17755007 18198034 18475036 18664751
9602 18664751 18781842 18777803 18578485 18135173 17460926 16642214 15831052 15221730 15012323 15356802
9592 15356802 16319876 17843348 19726285 21624341 23081716 23604934 22765607 20297461 16153772
9583 16153772 10514980 3758746 -3594684 -10961944 -17800299 -23712275 -28507631 -32191943
9575 -32191943 -34892612 -36767685 -37942608 -38492072 -38457276 -37880462 -36842235 -35488327 -34029532
9566 -34029532 -32704362 -31715303 -31171282 -31067549 -31308127 -31750950 -32253259 -32706949 -33060118
9557 -33060118 -33319418 -33530968 -33747140 -33991536 -34232917 -34380408 -34313453 -33943186 -33270687 -32397948
9547 -32397948 -31481872 -30668334 -30050578 -29660285 -29468680 -29383099 -29251042 -28889594 -28138107 -26912198
9537 -26912198 -25236310 -23244666 -21153548 -19214085 -17653896 -16614055 -16094188 -15930886
9529 -15930886 -15832608 -15464677 -14542091 -12884569 -10423237 -7183733 -3271569 1137387 5811596
9520 5811596 10486524 14889121 18761213 21885983 24118981 25414392 25831731 25515145 24652545
9511 24652545 23432443 22013429 20508685 18980941 17448237 15905150 14353680 12821922
9503 12821922 11351421 9960526 8616521 7247278 5793504 4269025 2785268 1518446
9495 1518446 639577 253054 375017 946668 1861491 2998503 4261507 5605645 7019202
9486 7019202 8458697 9787350 10778999 11201213 10929896 10026886 8737086 7404832 6348576
9477 6348576 5755245 5645247 5915269 6419529 7038695 7711539 8434581 9243720 10185263 11281342
9467 11281342 12500192 13743440 14854085 15639257 15901867 15480381 14291801 12358744 9797588
9458 9797588 6766904 3406882 -193089 -3987566 -7946521 -12026752 -16151400 -20198333
9450 -20198333 -24000896 -27364672 -30097509 -32044488 -33117403 -33307184 -32673405 -31321705
9442 -31321705 -29391490 -27061269 -24548606 -22075457 -19802155 -17769343 -15886694 -13975113
9434 -13975113 -11840440 -9347235 -6463386 -3256456 152219 3640772 7108831 10460716
9426 10460716 13577947 16314750 18525691 20107555 21029245 21332869 21106677 20446620 19429519
9417 19429519 18111838 16550017 14824170 13045492 11337398 9795391 8443412 7207662
9409 7207662 5920256 4352208 2268030 -507315 -4022250 -8154973 -12616877 -17013323
9401 -17013323 -20943900 -24100126 -26318061 -27570243 -27916808 -27452653 -26276467 -24484630
9393 -24484630 -22179244 -19478365 -16519089 -13448794 -10409399 -7526297 -4905626 -2628503
9385 -2628503 -732676 804751 2054986 3086364 3903267 4420108 4493034 3993890 2888871
9376 2888871 1287548 -554531 -2278071 -3493098 -3862451 -3172773 -1372247 1435562 5035762
9367 5035762 9164277 13565685 18031114 22409596 26594265 30492395 33993531 36950398
9359 36950398 39183795 40515186 40816986 40055353 38299203 35690148 32394825 28569679
9351 28569679 24353940 19885345 15319120 10828220 6575082 2669319 -858229 -4047099
9343 -4047099 -6976093 -9733304 -12395021 -15005128 -17553573 -19967365 -22124514 -23884954
9335 -23884954 -25126086 -25776369 -25841207 -25409255 -24630692 -23676223 -22698069 -21808495 -21077644
9326 -21077644 -20545073 -20237166 -20179474 -20393449 -20877574 -21585236 -22411402 -23188628 -23687737 -23628094
9316 -23628094 -22711784 -20685592 -17409158 -12894709 -7301622 -901901 5953151 12852275
9308 12852275 19343635 24975349 29360349 32245588 33557180 33403447 32038417 29805437
9300 29805437 27083819 24250287 21652578 19586523 18271563 17826398 18252084 19432673
9292 19432673 21159783 23175905 25220064 27059854 28505401 29412016 29682299 29276633 28234673
9283 28234673 26697657 24909632 23180083 21814209 21040088 20963078 21558467 22693892 24166263
9274 24166263 25740664 27183867 28290323 28902264 28924414 28330473 27160816 25518117 23567379
9265 23567379 21533238 19676579 18245121 17421952 17308767 17956598 19416126 21761113 25058549
9256 25058549 29299580 34336281 39870531 45508549 50847051 55533620 59272778 61807109
9248 61807109 62927384 62527008 60658151 57537075 53492346 48894820 44106365 39451312
9240 39451312 35195719 31528875 28556459 26313951 24794827 23975190 23815862 24238788 25098995
9231 25098995 26184975 27261006 28127078 28653627 28770843 28431959 27583970 26158676 24073758
9222 24073758 21235845 17552720 12961015 7458020 1119283 -5900265 -13367817 -20969861
9214 -20969861 -28317261 -34973842 -40507923 -44552833 -46864843 -47372549 -46207353 -43697951
9206 -43697951 -40317818 -36593541 -32999796 -29873910 -27376769 -25508641 -24165375 -23206702
9198 -23206702 -22512770 -22017449 -21712101 -21614394 -21710240 -21902461 -22009483 -21829745 -21240146 -20271878
9188 -20271878 -19123444 -18108007 -17559781 -17733778 -18733290 -20490587 -22802072 -25388554 -27940715
9179 -27940715 -30133300 -31628362 -32101641 -31304035 -29133752 -25675853 -21178864 -15973980
9171 -15973980 -10378086 -4632786 1093185 6655466 11886167 16583678 20541460 23591076
9163 23591076 25638040 26686290 26850961 26348284 25450383 24415313 23428270 22586710 21928862
9154 21928862 21473818 21239765 21230423 21405075 21659508 21840766 21798811 21450623 20816805 20004997
9144 20004997 19150086 18348966 17626243 16942186 16227138 15415573 14463208 13351209 12091508
9135 12091508 10734963 9365743 8069249 6890099 5817899 4821944 3913785 3190297 2823504
9126 2823504 3001542 3855393 5409437 7574868 10180036 13016333 15878290 18587215 20999533
9117 20999533 23007696 24541851 25576160 26137065 26305935 26208450 25987686 25764548 25595309
9108 25595309 25440606 25161505 24553571 23415799 21630826 19218775 16334988 13212667 10083915
9099 10083915 7122006 4429529 2067699 98943 -1393988 -2337646 -2737660 -2742118 -2644162
9090 -2644162 -2807444 -3554095 -5080293 -7439681 -10584809 -14423846 -18855382 -23774938 -29070449
9081 -29070449 -34619599 -40281772 -45873685 -51141480 -55764640 -59414213 -61845477 -62975716
9073 -62975716 -62908181 -61897527 -60277053 -58373086 -56428971 -54559781 -52754348 -50926812
9065 -50926812 -48998099 -46969927 -44952446 -43127786 -41666873 -40643423 -39987462 -39494759
9057 -39494759 -38881010 -37857801 -36206846 -33829156 -30750533 -27085084 -22985540 -18614358
9049 -18614358 -14142223 -9750063 -5612929 -1872336 1382659 4122349 6384466 8283075
9041 8283075 9994123 11700832 13521193 15464998 17448419 19351930 21084469 22624978
9033 22624978 24030991 25415160 26896724 28542795 30321066 32083818 33593405 34586698
9025 34586698 34862359 34360629 33198801 31639994 30008174 28594430 27599021 27120704 27172054
9016 27172054 27696347 28581100 29676011 30816200 31839850 32589622 32898273 32570589 31380649
9007 31380649 29101951 25572905 20775536 14889874 8296477 1526809 -4818288 -10159448
8999 -10159448 -14022782 -16104245 -16303785 -14726429 -11656972 -7516350 -2801828 1987909
8991 1987909 6431492 10246356 13317097 15691261 17551815 19168297 20822631 22719690
8983 22719690 24918449 27324941 29756268 32038120 34077822 35878632 37505509 39038379
8975 39038379 40539696 42037874 43517496 44917432 46147866 47127578 47822915 48264881 48536892
8966 48536892 48742867 48966286 49224252 49425690 49357586 48724165 47236959 44716875 41155974
8957 41155974 36710766 31640536 26231173 20742293 15392352 10371831 5860083 2022391
8949 2022391 -1019068 -3222030 -4638411 -5390852 -5626836 -5481727 -5067934 -4480102 -3795538
8940 -3795538 -3063529 -2296991 -1481616 -600344 344640 1326048 2296683 3189951 3910352 4327738
8930 4327738 4293563 3680984 2430204 575402 -1757700 -4376796 -7054521 -9555027 -11656399
8921 -11656399 -13177416 -14011656 -14158098 -13730130 -12932876 -12015864 -11220334 -10739344 -10696203
8912 -10696203 -11133751 -12006443 -13180219 -14454571 -15609829 -16458586 -16872088 -16773327 -16116517
8903 -16116517 -14878477 -13069914 -10755176 -8062249 -5168684 -2260638 519295 3104896
8895 3104896 5495707 7708092 9721215 11453818 12785062 13605148 13866394 13607324 12937920
8886 12937920 11996599 10906821 9760033 8629960 7596716 6751620 6173656 5897686 5902879
8877 5902879 6128354 6496244 6920935 7305628 7542594 7522348 7138012 6274550 4796829 2562993
8867 2562993 -529339 -4487470 -9190771 -14393745 -19756943 -24894485 -29433813 -33080857
8859 -33080857 -35671166 -37183005 -37703907 -37368764 -36304972 -34614905 -32399432 -29794657
8851 -29794657 -26982155 -24154626 -21458883 -18959395 -16646263 -14471542 -12378449 -10305905
8843 -10305905 -8181461 -5925095 -3469685 -785529 2104240 5120106 8134364 10996639
8835 10996639 13579402 15827668 17782608 19561180 21306103 23140911 25154796 27415381
8827 27415381 29988647 32943188 36326368 40118768 44193617 48313094 52172941 55473999
8819 55473999 57982928 59557567 60140319 59741239 58429175 56332047 53633833 50559139
8811 50559139 47349775 44242455 41446468 39114330 37312580 36017598 35152120 34644742
8803 34644742 34474295 34675618 35312539 36437045 38049424 40070189 42335316 44621160 46693444
8794 46693444 48365190 49545395 50259814 50630294 50816829 50949787 51087957 51220809 51304986
8785 51304986 51306802 51222957 51066053 50822296 50407384 49651749 48331609 46235443 43235733
8776 43235733 39336536 34684617 29547854 24267629 19188973 14579305 10563824 7111251
8768 7111251 4080154 1297915 -1373148 -4010167 -6639842 -9263127 -11879034 -14503330
8760 -14503330 -17180374 -19982030 -22986580 -26238480 -29703369 -33241906 -36621027 -39563099
8752 -39563099 -41815002 -43213335 -43727604 -43471464 -42679725 -41658949 -40729265 -40174095 -40202467
8743 -40202467 -40919799 -42309005 -44234429 -46478180 -48799954 -50995013 -52925890 -54519880
8735 -54519880 -55743768 -56578096 -57009259 -57040865 -56708754 -56081347 -55239310 -54243183 -53104584
8726 -53104584 -51777068 -50177306 -48231974 -45926068 -43323458 -40550036 -37755047 -35072737
8718 -35072737 -32595280 -30359532 -28350723 -26522808 -24823639 -23208392 -21636147 -20060080
8710 -20060080 -18424902 -16676331 -14776817 -12716017 -10505829 -8159633 -5666909 -2974914
8702 -2974914 20539 3475394 7576346 12480457 18220642 24620670 31276492 37629774
8694 37629774 43107198 47263738 49869936 50916190 50549229 48982159 46418298 43010243
8686 43010243 38857874 34038852 28657290 22888640 16997981 11318424 6192525 1897101
8678 1897101 -1415140 -3726547 -5113482 -5683800 -5537934 -4778418 -3554577 -2102901 -744977
8669 -744977 170458 361854 -296089 -1728634 -3679667 -5782723 -7655782 -8984866 -9568573
8660 -9568573 -9317869 -8231375 -6373440 -3863434 -863840 2441830 5869556 9235407
8652 9235407 12337700 14944702 16809704 17711040 17495150 16104007 13585463 10095518 5896279
8643 5896279 1342050 -3157274 -7197119 -10450170 -12724832 -13985904 -14329538 -13930377 -12994199
8634 -12994199 -11737261 -10383594 -9154284 -8235979 -7742991 -7699378 -8054537 -8722368 -9618378
8625 -9618378 -10670395 -11796435 -12867468 -13686303 -14005553 -13584507 -12263403 -10025006 -7018741
8616 -7018741 -3539478 26591 3266594 5800955 7335277 7700274 6866930 4927168 2049758
8607 2049758 -1563882 -5707065 -10180413 -14797418 -19380295 -23738974 -27641950 -30807708
8599 -30807708 -32940195 -33797716 -33253936 -31315715 -28099459 -23796212 -18649747 -12946635
8591 -12946635 -7003722 -1144463 4334026 9196057 13293204 16567675 19030455 20731468
8583 20731468 21746244 22184991 22203248 21987849 21713569 21493185 21353602 21257469 21163035 21090004
8573 21090004 21150330 21518717 22353034 23709126 25501103 27526763 29530343 31253680 32452597
8564 32452597 32899655 32408189 30882817 28365406 25041955 21202949 17177045 13265984
8556 13265984 9700061 6617877 4061197 1976327 227534 -1364117 -2958080 -4633483
8548 -4633483 -6358342 -7994368 -9323901 -10089750 -10050019 -9044466 -7051553 -4210256 -796481
8539 -796481 2833610 6308279 9289448 11497327 12720372 12829512 11804241 9757085 6935384
8530 6935384 3691228 425210 -2485929 -4765122 -6291318 -7108288 -7377537 -7302440 -7066908
8521 -7066908 -6810851 -6630439 -6579308 -6662361 -6831913 -6997591 -7051521 -6901500 -6500425 -5858888
8511 -5858888 -5033248 -4095065 -3100500 -2077467 -1034166 21531 1065521 2051236 2915120
8502 2915120 3593367 4047800 4291594 4396994 4469706 4594859 4783862 4956910 4974385 4699331
8492 4699331 4056702 3060242 1795857 372094 -1132620 -2691126 -4301824 -5937316 -7511962
8483 -7511962 -8898497 -9982110 -10709736 -11100652 -11220497 -11147458 -10955068 -10713667 -10499054
8474 -10499054 -10400070 -10522800 -10987646 -11913789 -13391769 -15453581 -18050411 -21043431 -24212474
8465 -24212474 -27289717 -30019048 -32224223 -33854888 -34985432 -35765968 -36349744 -36829505 -37204701
8456 -37204701 -37384995 -37225648 -36585126 -35385684 -33648523 -31484173 -29048929 -26501494 -23984182
8447 -23984182 -21622087 -19518360 -17737185 -16285011 -15103717 -14081764 -13083548 -11990584
8439 -11990584 -10738536 -9332733 -7839615 -6366193 -5036422 -3962133 -3209567 -2777399
8431 -2777399 -2602816 -2592685 -2661296 -2760958 -2901427 -3151445 -3612256 -4368812 -5448400 -6816390
8421 -6816390 -8408468 -10170749 -12081969 -14154207 -16419999 -18908733 -21614327 -24468516
8413 -24468516 -27340743 -30067925 -32489284 -34455305 -35806890 -36355359 -35901042 -34298679
8405 -34298679 -31536407 -27777533 -23337144 -18610489 -13997983 -9859780 -6497388 -4138556
8397 -4138556 -2912082 -2822576 -3743525 -5435096 -7577980 -9811905 -11775296 -13148836 -13701802
8388 -13701802 -13330185 -12071168 -10086385 -7619486 -4941485 -2299279 116013 2169029
8380 2169029 3756641 4793039 5232886 5123483 4638599 4051813 3653010 3652566 4120387 4979055
8370 4979055 6039971 7056555 7773063 7964962 7479848 6280218 4468638 2270323 -27293
8361 -27293 -2146466 -3865000 -5023703 -5512895 -5263381 -4250962 -2502312 -85541 2914061
8352 2914061 6413067 10326682 14552425 18969110 23465983 27982639 32523075 37125153
8344 37125153 41800508 46478629 50982697 55046921 58369225 60681288 61809120 61698183
8336 61698183 60395249 58006902 54667863 50536379 45804200 40695725 35444627 30257002
8328 30257002 25277632 20571956 16131326 11903444 7839362 3939545 283256 -2966079
8320 -2966079 -5582055 -7322535 -7992705 -7501819 -5892102 -3332627 -84882 3547492 7268065
8311 7268065 10815392 13957150 16463447 18092821 18618364 17891567 15912838 12870567 9126610
8302 9126610 5153212 1447477 -1548167 -3504693 -4241529 -3735697 -2101755 450039 3656256
8293 3656256 7226302 10857088 14256936 17187677 19506666 21178124 22240775 22750838
8285 22750838 22737408 22197203 21128375 19580392 17690620 15685842 13842685 12421878 11608263
8276 11608263 11486468 12057719 13276386 15079169 17395073 20140962 23213748 26489788
8268 26489788 29837671 33139825 36307751 39280395 42013926 44480007 46674484 48619378
8260 48619378 50345780 51868645 53175233 54233771 55008524 55466177 55573820 55301296 54637848
8251 54637848 53618474 52340770 50950751 49592076 48339111 47151304 45880286 44335657
8243 44335657 42384745 40039866 37485131 35021106 32950955 31467469 30597747 30223417
8235 30223417 30150906 30189861 30210555 30172602 30128801 30207378 30572757 31367847 32650340 34344326
8225 34344326 36228096 37966778 39180879 39528242 38773145 36823045 33727999 29654310
8217 29654310 24852965 19637636 14369458 9431592 5180423 1880770 -348400 -1551790
8209 -1551790 -1912286 -1695477 -1184175 -618825 -155682 147629 317372 431474 588694 889767
8199 889767 1426085 2265398 3430353 4874734 6466796 7991583 9183894 9793292 9661775
8190 9661775 8779929 7295325 5472302 3623195 2035501 914437 354958 348872 817902
8181 817902 1651406 2730138 3932306 5130416 6189141 6971551 7359429 7288647 6788031
8172 6788031 5997774 5146645 4489973 4237083 4505458 5320591 6648250 8425256 10562976
8163 10562976 12927611 15326339 17525874 19303574 20506662 21092276 21135592 20807339 20328507
8154 20328507 19915287 19732606 19869606 20332283 21036190 21794702 22324771 22297828 21433941 19598718
8144 19598718 16852326 13426894 9649107 5850872 2310028 -761686 -3199210 -4866823
8136 -4866823 -5664965 -5553997 -4568562 -2802977 -370778 2639732 6187909 10265212 14845201
8127 14845201 19823216 24980545 30000457 34538732 38320212 41213253 43243195 44543703
8119 44543703 45283691 45614341 45652057 45480898 45151964 44674497 44010355 43085626 41822321
8110 41822321 40177077 38162984 35837512 33264210 30476718 27468667 24209903 20674604
8102 20674604 16869262 12851548 8726196 4606574 552595 -3479931 -7642774 -12141056
8094 -12141056 -17140523 -22673671 -28586143 -34553490 -40168954 -45066028 -49019965 -51986189
8086 -51986189 -54070082 -55455696 -56331656 -56841145 -57062175 -57009094 -56643716 -55890760 -54658177
8077 -54658177 -52863086 -50460620 -47469545 -43985801 -40174407 -36236112 -32359494 -28683053
8069 -28683053 -25290140 -22237335 -19589653 -17428569 -15820429 -14765313 -14161212 -13805935
8061 -13805935 -13435697 -12784931 -11649023 -9931585 -7660009 -4965349 -2042069 888028
8053 888028 3597132 5870539 7542546 8548964 8969282 9023686 9010792 9207664 9778719
8044 9778719 10737384 11975934 13343216 14726641 16094428 17477077 18904092 20342133
8036 20342133 21679242 22763333 23462197 23704402 23487924 22870645 21956486 20875697 19756370
8027 19756370 18698093 17763529 16989131 16400252 16017277 15852257 15903711 16156521 16589552
8018 16589552 17186273 17934695 18804685 19712072 20503321 20991107 21034511 20621046 19905258 19187832
8008 19187832 18849741 19266940 20726724 23360332 27103234 31692561 36707021 41645217
8000 41645217 46024262 49470068 51774016 52906312 52990886 52251054 50936420 49249780 47302705
7991 47302705 45123184 42712645 40119483 37484984 35033034 33006098 31577666 30781453
7983 30781453 30486841 30427382 30269261 29696484 28486625 26552696 23939002 20783151 17275828
7974 17275828 13643237 10146756 7071648 4685590 3178482 2615841 2932295 3967309
7966 3967309 5521188 7399490 9424894 11422458 13206645 14595477 15449928 15711036 15405935
7957 15405935 14615183 13418601 11850027 9887844 7488686 4645010 1429648 -2003879
7949 -2003879 -5469813 -8820895 -11999016 -15033434 -17986789 -20882590 -23655882 -26146658
7941 -26146658 -28129250 -29365945 -29680928 -29042169 -27613343 -25731944 -23808739 -22199426
7933 -22199426 -21117679 -20622731 -20661796 -21124434 -21880586 -22799601 -23758450 -24642789 -25339521
7924 -25339521 -25723254 -25646280 -24943348 -23457109 -21082973 -17823950 -13833663 -9415714 -4958367
7915 -4958367 -821453 2768406 5756057 8214161 10254309 11949344 13303772 14275193
7907 14275193 14826498 14980801 14853626 14646207 14599209 14922599 15727104 16981737 18512681
7898 18512681 20047007 21292648 22033756 22210332 21950617 21540145 21337216 21666068 22725243
7889 22725243 24539512 26965394 29739191 32541478 35052289 36986356 38114007 38278160
7881 38278160 37412034 35554342 32853720 29553278 25953179 22362561 19059655 16270728
7873 16270728 14162513 12836164 12316994 12542898 13359861 14536477 15805222 16919527 17695916
7864 17695916 18016794 17802903 16989734 15531605 13426930 10742983 7624633 4281010 949725
7855 949725 -2151161 -4861484 -7090803 -8809265 -10037256 -10842612 -11334246 -11638573 -11861464
7846 -11861464 -12053404 -12195201 -12210288 -11997296 -11468173 -10575600 -9320782 -7746336 -5928520
7837 -5928520 -3978334 -2043851 -293825 1128139 2162179 2867632 3408824 3994941 4802988
7828 4802988 5918502 7318709 8904256 10562161 12224675 13891866 15610280 17425304
7820 17425304 19333002 21251009 23018728 24426071 25256727 25325484 24498582 22702060 19927300
7811 19927300 16234021 11744761 6631141 1100735 -4609476 -10239087 -15522519 -20224586
7803 -20224586 -24181813 -27327806 -29687317 -31341322 -32379453 -32858268 -32779019 -32094257 -30744876
7794 -30744876 -28713883 -26068923 -22969445 -19637488 -16313351 -13219465 -10540157 -8410314
7786 -8410314 -6905178 -6033089 -5739971 -5930348 -6498516 -7355727 -8442007 -9720407 -11159061
7777 -11159061 -12709837 -14294391 -15807385 -17137656 -18194283 -18919992 -19286774 -19285737 -18926306
7768 -18926306 -18247354 -17331706 -16316370 -15394155 -14797215 -14749256 -15389054 -16698772 -18483895
7759 -18483895 -20425844 -22182710 -23489271 -24221086 -24416715 -24266736 -24072767 -24173183 -24842262
7750 -24842262 -26193475 -28133794 -30401397 -32674359 -34693682 -36337929 -37625137 -38665786
7742 -38665786 -39608267 -40599417 -41756284 -43139550 -44733245 -46446371 -48143575 -49691852
7734 -49691852 -50999577 -52032140 -52803684 -53353313 -53716586 -53905307 -53906204 -53696445 -53261777 -52607926
7724 -52607926 -51770109 -50823939 -49882812 -49064859 -48443138 -48021415 -47762634 -47649599 -47729273 -48108053
7714 -48108053 -48900664 -50159444 -51819756 -53694230 -55526840 -57080856 -58211141 -58885113
7706 -58885113 -59154890 -59109952 -58838205 -58406092 -57854566 -57204616 -56470381 -55680298 -54899983 -54238679
7696 -54238679 -53821522 -53731440 -53950707 -54336823 -54645898 -54591065 -53913092 -52442874 -50138704
7687 -50138704 -47084254 -43444264 -39394528 -35057521 -30471728 -25603755 -20392450 -14805524
7679 -14805524 -8890179 -2802678 3194162 8767528 13574482 17326981 19846563 21099276
7671 21099276 21202002 20390830 18952400 17141071 15120165 12955479 10655807 8224583
7663 8224583 5684951 3068909 392854 -2351368 -5181155 -8097651 -11067053 -14012577
7655 -14012577 -16812826 -19308508 -21326784 -22725009 -23437957 -23504514 -23061177 -22308644 -21467095
7646 -21467095 -20733126 -20246567 -20073523 -20207965 -20585997 -21102540 -21626595 -22022313 -22184545
7637 -22184545 -22084079 -21800119 -21514748 -21464735 -21876102 -22917957 -24690059 -27226064 -30488635
7628 -30488635 -34359401 -38649358 -43141637 -47644420 -52019026 -56170490 -60017787 -63470137
7620 -63470137 -66424725 -68785651 -70492403 -71541037 -71985007 -71915033 -71429985 -70615174 -69537873
7611 -69537873 -68256106 -66824420 -65282913 -63635009 -61834885 -59795422 -57404153 -54532701
7603 -54532701 -51049847 -46861226 -41971693 -36529399 -30812979 -25166572 -19923601 -15355419
7595 -15355419 -11651294 -8916769 -7180029 -6406335 -6523173 -7449873 -9114775 -11444901 -14332322
7586 -14332322 -17602600 -21012106 -24280679 -27144054 -29403450 -30955250 -31792136 -31976405
7578 -31976405 -31597232 -30730070 -29411986 -27636096 -25361354 -22533145 -19109262 -15083250
7570 -15083250 -10497706 -5446912 -75121 5424940 10818275 15849404 20282932 23948924
7562 23948924 26768936 28746826 29929039 30355700 30026730 28899059 26918051 24071489
7554 24071489 20440632 16218864 11682956 7131163 2824873 -1035991 -4306366 -6887047
7546 -6887047 -8733029 -9865791 -10361180 -10308243 -9768427 -8767985 -7327575 -5504608 -3419179
7537 -3419179 -1245380 836187 2711135 4394418 6041672 7889299 10146587 12894543
7529 12894543 16043143 19365402 22586523 25483392 27953357 30032790 31869237 33665897
7521 33665897 35622642 37893631 40568424 43670158 47163368 50973311 55019705 59252267
7513 59252267 63662038 68253917 72995524 77774709 82386724 86548959 89930561 92189603
7505 92189603 93017122 92186375 89600298 85325974 79602364 72809036 65396070 57798486
7497 57798486 50374460 43394326 37069590 31580200 27064143 23570916 21013737 19157548
7489 19157548 17656608 16130457 14253322 11827633 8815016 5313099 1493460 -2460507
7481 -2460507 -6379302 -10092520 -13407421 -16122094 -18080950 -19236202 -19668044 -19548160 -19072999
7472 -19072999 -18406875 -17657217 -16880243 -16103692 -15350550 -14646360 -13997655 -13348722 -12549764
7463 -12549764 -11376327 -9610182 -7141988 -4029748 -474586 3262851 6942777 10378962
7455 10378962 13430282 15986998 17973668 19360804 20167568 20451173 20294143 19802843 19119958
7446 19119958 18437183 17984073 17978437 18552762 19695430 21239438 22900675 24344068 25255059
7437 25255059 25400971 24666704 23052597 20642848 17574708 14032920 10262290 6568997
7429 6568997 3291165 745307 -829979 -1312647 -703799 901716 3365472 6545001 10299429
7420 10299429 14468787 18858821 23256097 27468808 31365311 34883498 38006629 40728089
7412 40728089 43038788 44954367 46564291 48059987 49707861 51769521 54407236 57622986
7404 57622986 61260538 65065074 68764848 72133265 75011225 77299256 78941523 79915111
7396 79915111 80226797 79917894 79076309 77842675 76387805 74854341 73290492 71622271 69687837
7387 69687837 67312855 64381279 60870115 56847782 52451995 47856922 43229487 38679860
7379 38679860 34227468 29808990 25333406 20754479 16115703 11543989 7206980 3268501
7371 3268501 -136611 -2912000 -5006488 -6421625 -7213498 -7483719 -7362667 -6992559 -6515594
7362 -6515594 -6067288 -5771756 -5735515 -6037811 -6716212 -7747177 -9026972 -10367205 -11520924
7353 -11520924 -12240709 -12348719 -11789850 -10649638 -9135190 -7526794 -6113047 -5129415 -4721930
7344 -4721930 -4943610 -5769340 -7107838 -8803644 -10639426 -12351128 -13660006 -14319503 -14171208
7335 -14171208 -13194181 -11521540 -9406156 -7146771 -5012626 -3202966 -1849133 -1038080
7327 -1038080 -828923 -1249136 -2278425 -3839260 -5806052 -8026840 -10339830 -12574264 -14543249
7318 -14543249 -16045103 -16880706 -16880016 -15927087 -13979604 -11082558 -7371444 -3058253 1597375
7309 1597375 6316852 10817426 14817048 18048740 20296950 21444988 21508637 20640067 19103574
7300 19103574 17231324 15366176 13803997 12755441 12338899 12593965 13494680 14957058 16852554
7291 16852554 19032129 21345527 23639072 25738278 27440341 28534841 28848922 28297935
7283 28297935 26920570 24883230 22448569 19916320 17554895 15543789 13941624 12687905
7275 12687905 11638828 10627531 9529511 8309466 7029737 5814535 4787232 4018382
7267 4018382 3519856 3288063 3359071 3827411 4811686 6396146 8595165 11361461 14617353
7258 14617353 18272718 22215187 26289093 30287469 33965818 37071851 39384897 40760232
7250 40760232 41165635 40689354 39506794 37816773 35778620 33482715 30966872 28260453
7242 28260453 25418840 22522137 19648018 16854360 14192687 11733961 9570646 7785310
7234 7785310 6414991 5446730 4847501 4598065 4699576 5150974 5924013 6964993 8227034
7225 8227034 9706557 11449043 13510149 15891384 18487622 21076268 23355766 25020185
7217 25020185 25843575 25743525 24800909 23231214 21321673 19355849 17545054 15982552 14633067
7208 14633067 13359606 11974064 10291167 8172152 5553528 2456996 -1023088 -4748295
7200 -4748295 -8563578 -12311895 -15842003 -19022566 -21763266 -24029497 -25839976 -27250226
7192 -27250226 -28331218 -29147987 -29739214 -30101937 -30189451 -29927754 -29247402 -28118586 -26572479
7183 -26572479 -24696061 -22601803 -20390614 -18132332 -15875387 -13674294 -11608647 -9773152
7175 -9773152 -8240873 -7023368 -6054961 -5211350 -4349329 -3343169 -2102210 -574334 1247724
7166 1247724 3307150 5459718 7468006 9030498 9846223 9696992 8516115 6411804 3632332
7157 3632332 493062 -2693250 -5652924 -8157274 -10020483 -11104048 -11325330 -10662476 -9151578
7148 -9151578 -6873265 -3928330 -413167 3585133 7965610 12580730 17225880 21665261
7140 21665261 25677754 29092944 31800419 33737876 34875755 35212640 34783496 33671299
7132 33671299 32008466 29960172 27693978 25349821 23023905 20771141 18622239 16607559
7124 16607559 14777337 13206789 11981482 11173153 10823528 10942276 11508476 12466352 13723701
7115 13723701 15169140 16709059 18305417 19992573 21862433 24020061 26525175 29348128
7107 29348128 32366726 35403324 38271386 40799739 42831646 44221793 44852448 44667661
7099 44667661 43703206 42085884 39993903 37601444 35047761 32451238 29946009 27697650
7091 27697650 25877261 24611816 23942547 23808357 24054838 24466210 24816362 24925411 24699443
7082 24699443 24138207 23315071 22346335 21361028 20468788 19722733 19089615 18450305 17640406
7073 17640406 16512954 14991360 13093144 10925298 8658487 6482507 4547609 2909741
7065 2909741 1506055 175340 -1286842 -3065525 -5279998 -7961978 -11055475 -14434551
7057 -14434551 -17934537 -21384613 -24624826 -27501743 -29858114 -31540344 -32431008 -32486721 -31750576
7048 -31750576 -30324702 -28320577 -25825832 -22914775 -19690261 -16312372 -12978971 -9867562
7040 -9867562 -7081337 -4633439 -2469384 -506541 1327474 3067257 4701410 6189353
7032 6189353 7495564 8619523 9599667 10486849 11305413 12031791 12610201 12995744 13189402
7023 13189402 13232956 13166215 12984141 12633732 12057252 11250425 10293388 9333844 8534542 8015847
7013 8015847 7820335 7908754 8179995 8501236 8737798 8778637 8554821 8045835 7270899 6273905
7003 6273905 5119502 3908847 2800081 2005750 1753286 2222599 3490702 5508073 8116188
6994 8116188 11100426 14258121 17451287 20618947 23748071 26828183 29820802 32657083
6986 32657083 35253518 37527304 39403996 40825398 41767023 42260084 42399846 42327294 42190387
6977 42190387 42104434 42126825 42249237 42405978 42499467 42440405 42187112 41758971 41208386 40562039
6967 40562039 39766958 38679934 37115424 34932039 32113866 28805140 25281907 21875578
6959 21875578 18883094 16498572 14785045 13684236 13050698 12698227 12452484 12202104 11932984
6950 11932984 11730545 11749122 12163887 13122828 14706379 16896311 19559824 22458969 25289823
6941 25289823 27744831 29583589 30692365 31110487 31010116 30637736 30245034 30034420 30125539
6932 30125539 30539289 31204038 31994427 32797267 33574334 34386962 35369200 36664858 38359115
6923 38359115 40435312 42777051 45215186 47593407 49812269 51825919 53602068 55084534
6915 55084534 56194571 56875644 57153443 57172729 57187090 57502389 58393931 60025946 62399852
6906 62399852 65347080 68566229 71689747 74358917 76289378 77317134 77419472 76704473
6898 76704473 75364583 73602674 71558809 69274261 66711984 63818867 60590681 57104018
6890 57104018 53505053 49971736 46675829 43760725 41332085 39449664 38117529 37283461
6882 37283461 36856935 36737862 36835618 37065959 37333751 37521129 37494672 37130597 36346292 35125209
6872 35125209 33527391 31682855 29765416 27945309 26329367 24915073 23589731 22183326
6864 22183326 20546974 18610454 16389432 13949832 11362802 8681501 5947272 3208779
6856 3208779 532186 -2005202 -4328027 -6370395 -8077397 -9409082 -10349641 -10912914 -11134857
6847 -11134857 -11057511 -10722243 -10185544 -9548724 -8971967 -8644592 -8711397 -9191175 -9939265 -10685480
6837 -10685480 -11133236 -11067693 -10418828 -9259263 -7757264 -6122070 -4567176 -3296321 -2503181
6828 -2503181 -2370406 -3053968 -4647975 -7143378 -10408976 -14219835 -18334927 -22593857 -26980021
6819 -26980021 -31603008 -36595733 -41980376 -47584238 -53052841 -57941313 -61825891 -64390702
6811 -64390702 -65479811 -65120473 -63517835 -61017351 -58040280 -55008723 -52278735 -50094009
6803 -50094009 -48565179 -47674092 -47299017 -47254589 -47337253 -47363742 -47191889 -46722640 -45894088 -44682322
6793 -44682322 -43114490 -41281315 -39323303 -37373944 -35476772 -33526587 -31282350 -28453677
6785 -28453677 -24812759 -20273296 -14910193 -8931518 -2628297 3678483 9684285 15138692
6777 15138692 19876483 23841128 27089801 29766162 32042455 34054347 35856367 37407758
6769 37407758 38579647 39174879 38965356 37754497 35453981 32140941 28060303 23564585
6761 23564585 19019489 14719640 10845344 7464211 4561967 2081865 -42655 -1866839
6753 -1866839 -3418849 -4681995 -5581080 -5992932 -5792913 -4919194 -3414769 -1418258 891729
6744 891729 3368156 5949690 8676200 11661035 15032752 18870850 23159252 27771528
6736 27771528 32493786 37083479 41345044 45183877 48605594 51665905 54413812 56868378
6728 56868378 59031791 60910354 62516802 63849975 64866115 65460164 65469117 64698511 62963534
6719 62963534 60133789 56172844 51163170 45306350 38897745 32291146 25871764 20036352
6711 20036352 15160377 11542029 9342760 8557217 9024827 10467655 12537173 14871519
6703 14871519 17170390 19272146 21193030 23097127 25207687 27708183 30681473 34101654
6695 34101654 37858581 41785695 45676548 49295770 52400003 54779066 56311691 57013122
6687 57013122 57046231 56681594 56220054 55914347 55925534 56324996 57124740 58309197 59851756
6678 59851756 61713475 63829709 66096289 68371775 70506429 72387962 73976441 75306879
6670 75306879 76462651 77539046 78612231 79718590 80847198 81946992 82940999 83733616
6662 83733616 84208768 84236699 83706871 82576939 80902234 78818120 76484469 74031135 71538676
6653 71538676 69057799 66644868 64387441 62405164 60821367 59708571 59026089 58584680
6645 58584680 58070204 57126353 55459912 52922558 49543566 45513026 41128109 36721179
6637 36721179 32594664 28984441 26054203 23902413 22561625 21987026 22047006 22530868 23181890
6628 23181890 23754238 24079832 24119788 23977137 23867579 24067068 24858467 26484446 29101488
6619 29101488 32735545 37255054 42381075 47739610 52940424 57656582 61682082 64951784
6611 64951784 67514798 69467166 70873867 71723883 71943265 71448750 70198444 68210739 65556063
6602 65556063 62338779 58673368 54651017 50308796 45631440 40602351 35278863 29837155
6594 29837155 24547891 19695443 15496545 12070613 9468894 7725725 6889191 7015782
6586 7015782 8141571 10250583 13255700 16999181 21269717 25824202 30406438 34769622
6578 34769622 38711623 42110208 44925616 47153734 48755923 49616688 49562147 48430886 46159690
6569 46159690 42842827 38738028 34216388 29678189 25468727 21819778 18823365 16433090
6561 16433090 14489954 12772377 11062263 9204475 7133980 4864182 2458281 13978
6553 13978 -2331601 -4401563 -6011812 -7034238 -7454622 -7385793 -7024325 -6573594 -6173876
6544 -6173876 -5873821 -5652610 -5471910 -5318875 -5209321 -5152133 -5110859 -5006095 -4768886 -4405345
6534 -4405345 -4014035 -3733068 -3651325 -3743758 -3868002 -3818803 -3411405 -2559118 -1315537 132294
6524 132294 1509924 2515487 2873116 2374168 907483 -1523334 -4801114 -8717950 -13016532
6515 -13016532 -17438735 -21766159 -25844622 -29597730 -33034251 -36237284 -39317607 -42340803
6507 -42340803 -45272673 -47984035 -50310895 -52125727 -53377910 -54092573 -54341109 -54201829 -53727319
6498 -53727319 -52932538 -51808643 -50352136 -48589637 -46584939 -44430493 -42235548 -40119719
6490 -40119719 -38209593 -36629716 -35484607 -34838654 -34704806 -35047241 -35794750 -36856951 -38135614
6481 -38135614 -39526676 -40914367 -42165136 -43130693 -43663641 -43639606 -42974491 -41629120 -39603594
6472 -39603594 -36930318 -33671083 -29914083 -25763711 -21324079 -16685580 -11922017 -7097377
6464 -7097377 -2277406 2458174 7008340 11255314 15080731 18381172 21071651 23083123
6456 23083123 24372695 24952641 24917821 24441451 23728937 22949639 22181838 21400415 20517727
6447 20517727 19462876 18259564 17054531 16072759 15523073 15511471 16010588 16892767 17997840
6438 17997840 19196929 20423524 21660303 22892100 24056907 25030821 25660410 25823449 25481761
6429 25481761 24696149 23594416 22309303 20922626 19448489 17857987 16116062 14200549
6421 14200549 12101252 9818132 7370716 4811602 2230764 -254015 -2516257 -4443172
6413 -4443172 -5956785 -7030574 -7698167 -8049460 -8211165 -8316073 -8471962 -8738331 -9110742
6404 -9110742 -9511569 -9792117 -9751094 -9166459 -7836462 -5633319 -2567995 1161063 5177996
6395 5177996 9014426 12233815 14533971 15788040 16025681 15381877 14042765 12206857 10065555
6386 10065555 7796019 5558244 3492908 1717667 316748 -677128 -1297931 -1644089 -1855483
6377 -1855483 -2079649 -2438974 -3006393 -3796049 -4773292 -5878146 -7046717 -8219626 -9339946
6368 -9339946 -10349355 -11188138 -11803679 -12172067 -12326825 -12372626 -12463944 -12755243 -13352350 -14288612
6358 -14288612 -15526163 -16971217 -18497249 -19973260 -21290098 -22378029 -23216304 -23837294
6350 -23837294 -24320717 -24772641 -25296180 -25970124 -26843889 -27942501 -29271432 -30817542 -32547725
6341 -32547725 -34408745 -36333287 -38254263 -40119190 -41892304 -43545458 -45055778 -46423431
6333 -46423431 -47698202 -48988156 -50435188 -52166463 -54244974 -56640122 -59226562 -61804396
6325 -61804396 -64126285 -65924073 -66939256 -66959110 -65843970 -63526795 -59987359 -55228559
6317 -55228559 -49280402 -42229695 -34249803 -25605451 -16625575 -7655009 996310 9089488
6309 9089488 16467613 23039464 28744247 33516516 37273311 39932105 41446074 41833398
6301 41833398 41188775 39681868 37550060 35083262 32592285 30357726 28569917 27284635
6293 27284635 26421525 25811637 25266666 24628439 23782058 22653199 21215738 19506353 17619269
6284 17619269 15668337 13737875 11858264 10023073 8232533 6532049 5022408 3837947
6276 3837947 3103696 2887787 3166796 3820843 4665910 5512329 6224031 6754556 7147833 7503142
6266 7503142 7915384 8416679 8951640 9400902 9634990 9562783 9149994 8407715 7367372 6059890
6256 6059890 4507826 2727130 730106 -1471471 -3855663 -6371965 -8932432 -11430785
6248 -11430785 -13784757 -15972829 -18036630 -20041586 -22013103 -23882970 -25483542 -26604847
6240 -26604847 -27087765 -26897654 -26136040 -24990741 -23658113 -22275043 -20883807 -19435986 -17826262
6231 -17826262 -15935936 -13666612 -10957123 -7789771 -4194817 -254571 3901583 8121605
6223 8121605 12271298 16266564 20069094 23643887 26912297 29739868 31966965 33457182
6215 33457182 34135800 34010304 33177741 31819484 30177838 28513169 27049630 25923882 25153861
6206 25153861 24643348 24226322 23732610 23039891 22085813 20844136 19293468 17406166 15164921
6197 15164921 12595996 9800658 6966711 4348281 2215356 789133 184492 376178
6189 376178 1200202 2396616 3685151 4843766 5754545 6403647 6851422 7196225 7541269
6180 7541269 7963237 8486308 9072734 9637503 10083828 10347378 10431761 10416814 10431715 10606602
6170 10606602 11031898 11745358 12739227 13962540 15306710 16593023 17593392 18092050 17957286
6161 17957286 17178881 15852795 14132203 12177931 10127263 8081188 6102777 4220087
6153 4220087 2428295 689083 -1067846 -2932680 -4989498 -7283042 -9791874 -12422203
6145 -12422203 -15030603 -17470964 -19646042 -21537656 -23199041 -24713710 -26143873 -27496049
6137 -27496049 -28718588 -29724639 -30421219 -30729498 -30594238 -29986691 -28903571 -27364336 -25411744
6128 -25411744 -23116946 -20580116 -17915164 -15220362 -12551395 -9911594 -7259061 -4521062
6120 -4521062 -1610905 1548851 4994397 8689007 12510064 16267215 19744383 22742106
6112 22742106 25100767 26705958 27493453 27468209 26735634 25527579 24197727 23165866 22812946
6103 22812946 23362073 24800040 26878860 29195227 31308270 32845465 33564150 33366707 32290481
6094 32290481 30493084 28233779 25837191 23636120 21913584 20870654 20626812 21235059
6086 21235059 22688509 24909992 27735867 30915560 34142164 37109802 39574758 41395027
6078 41395027 42536384 43047149 43010133 42485783 41469384 39886489 37633404 34642819 30939729
6069 30939729 26660388 22028963 17307626 12744245 8534385 4799321 1574891 -1186641
6061 -1186641 -3591756 -5757406 -7761360 -9622658 -11323877 -12853742 -14233831 -15509292
6053 -15509292 -16712555 -17825478 -18762074 -19380791 -19521979 -19055076 -17915158 -16116091 -13744154
6044 -13744154 -10945049 -7909262 -4848985 -1963187 596789 2742385 4437752 5675847
6036 5675847 6456530 6775695 6627862 6021321 5000653 3666646 2183379 766437 -348952
6027 -348952 -955262 -921291 -220868 1072254 2815513 4829509 6912190 8842332 10396684
6018 10396684 11393119 11740687 11460312 10656496 9455552 7946743 6154662 4048770 1579225
6009 1579225 -1277814 -4483697 -7926512 -11443838 -14869837 -18082398 -21025120 -23695296
6001 -23695296 -26111336 -28283227 -30199985 -31831053 -33133468 -34065092 -34608648 -34798635 -34726504
5992 -34726504 -34503277 -34188505 -33727245 -32942073 -31596575 -29500926 -26602695 -23016146 -18981592
5983 -18981592 -14784410 -10677613 -6838527 -3362519 -274996 2457410 4916354 7205487
5975 7205487 9400577 11496081 13384194 14886238 15822027 16080207 15656083 14645592 13209571
5966 13209571 11536348 9823097 8273067 7089304 6451999 6486339 7238674 8673741 10693895
5957 10693895 13169747 15962473 18920608 21855996 24529906 26680362 28088385 28645269
5949 28645269 28380447 27439079 26029172 24365399 22625209 20922156 19302080 17769811
5941 17769811 16340925 15087876 14140095 13624999 13583022 13912221 14377655 14681585 14564058
5932 14564058 13894726 12716854 11217637 9633237 8136044 6762282 5409201 3889507
5924 3889507 2007956 -372823 -3297495 -6719571 -10529072 -14585953 -18744173 -22866631
5916 -22866631 -26836995 -30563195 -33959631 -36911813 -39254802 -40797807 -41391338 -40996376
5908 -40996376 -39715955 -37780637 -35502463 -33211668 -31186660 -29595962 -28475841 -27752293
5900 -27752293 -27291121 -26949002 -26606276 -26175577 -25591545 -24796863 -23743274 -22413004 -20842703
5891 -20842703 -19123078 -17366585 -15665401 -14072164 -12616628 -11342037 -10331661 -9706491
5883 -9706491 -9596025 -10097513 -11239532 -12960356 -15108162 -17467842 -19812218 -21962264 -23829785
5874 -23829785 -25419217 -26786627 -27980307 -28996247 -29765999 -30172075 -30080091 -29384902 -28067231
5865 -28067231 -26240147 -24153425 -22140272 -20525132 -19532736 -19233391 -19539890 -20252926 -21137267
5856 -21137267 -21999391 -22735368 -23332691 -23835558 -24302404 -24783117 -25322976 -25976546 -26806085
5847 -26806085 -27852039 -29089202 -30402330 -31611367 -32544366 -33114840 -33345744 -33316377 -33068224
5838 -33068224 -32538577 -31567886 -29973320 -27643610 -24608287 -21052590 -17270946 -13574847
5830 -13574847 -10193283 -7212343 -4583306 -2191795 52979 2158600 4047743 5607163
5822 5607163 6755960 7500878 7958821 8338059 8879783 9777278 11104737 12786019 14613433
5813 14613433 16303842 17567828 18167774 17948831 16840735 14842183 12002626 8408682
5805 8408682 4175544 -555474 -5610927 -10774365 -15781700 -20333117 -24122309 -26873622
5797 -26873622 -28373905 -28491112 -27182459 -24501762 -20610154 -15782145 -10394300 -4891250
5789 -4891250 266735 4666216 8001803 10120481 11035172 10905080 9992081 8605490 7047190
5780 7047190 5570612 4363206 3546734 3177086 3233080 3605533 4108754 4525089 4671608
5771 4671608 4462867 3940722 3253254 2589322 2100502 1848439 1797760 1849472 1894691 1865330
5761 1865330 1761987 1649585 1627489 1792279 2208809 2894481 3815303 4893020 6022548
5752 6022548 7095601 8025516 8771874 9364432 9919063 10631096 11735431 13439589 15853745
5743 15853745 18947697 22554602 26420785 30279463 33914765 37189601 40034982 42422074
5735 42422074 44341477 45796339 46798673 47360859 47489753 47196000 46517254 45537081 44380146
5726 44380146 43179462 42028978 40943591 39847091 38597879 37044432 35084536 32697234
5718 32697234 29933253 26879965 23635544 20312876 17056334 14032855 11382249 9160904
5710 9160904 7333325 5828279 4615800 3741521 3295802 3352577 3930065 4994157 6485234
5701 6485234 8338086 10482498 12833717 15289015 17739144 20090886 22287310 24311669
5693 24311669 26170492 27864475 29362492 30591985 31452576 31851133 31744087 31161931 30194588
5684 30194588 28938783 27434546 25627562 23382151 20544940 17032234 12897019 8339049
5676 8339049 3655625 -833882 -4850181 -8185996 -10713531 -12377629 -13181410 -13172519 -12436889
5667 -12436889 -11094868 -9285580 -7135836 -4729675 -2099438 754681 3824878 7050925
5659 7050925 10290236 13323805 15904535 17827323 18985586 19391508 19160616 18472695 17521227
5650 17521227 16466649 15412339 14412946 13504215 12731195 12157751 11853739 11865140 12178858
5641 12178858 12702474 13282332 13767673 14097114 14358990 14783214 15661075 17233978 19608143
5632 19608143 22728810 26407626 30374409 34329985 37992851 41138682 43626514 45401403
5624 45401403 46470012 46860146 46586762 45644370 44028530 41770022 38960326 35758872 32386674
5615 32386674 29112482 26227849 24001220 22610767 22077415 22235109 22766031 23294025 23494352
5606 23494352 23171231 22279835 20900702 19186140 17294203 15327311 13303960 11190030
5598 11190030 8981841 6786332 4831457 3386990 2647574 2660136 3336266 4517423 6026858
5589 6026858 7672938 9224727 10405382 10926855 10550509 9139337 6679044 3270022 -893446
5580 -893446 -5545661 -10374817 -15053656 -19268679 -22738223 -25221433 -26531730 -26563837 -25328122
5571 -25328122 -22977298 -19811920 -16254041 -12782868 -9840686 -7738484 -6599597 -6364307
5563 -6364307 -6848623 -7825453 -9089090 -10477666 -11856865 -13093593 -14050917 -14614479 -14734655
5554 -14734655 -14455385 -13903282 -13228423 -12519649 -11745086 -10763434 -9405936 -7579146 -5329722
5545 -5329722 -2846798 -416118 1647401 3069164 3673277 3417505 2396992 818791 -1043349
5536 -1043349 -2904424 -4526119 -5767053 -6610129 -7153697 -7567287 -8030878 -8682756 -9588237
5527 -9588237 -10723284 -11963454 -13082842 -13780914 -13748712 -12761865 -10766038 -7917873 -4561678
$$ [...]
##END NTUPLES=NMR SPECTRUM
##END=
