##TITLE=31Pdec_DE-37_rm_2h
 
 64 sc
 6.3.2024
##JCAMPDX= 6.0         $$ Bruker NMR JCAMP-DX V2.0
##DATA TYPE= NMR SPECTRUM
##DATA CLASS= NTUPLES
##ORIGIN= UXNMR, Bruker Analytische Messtechnik GmbH
##OWNER= root
$$ XWIN-NMR		Version 3.5
$$ Wed Mar  6 13:29:00 2024 Russian Standard Time (UT+4h)  she@DPX200
##.OBSERVE FREQUENCY= 81.013821
##.OBSERVE NUCLEUS= ^31P
##.ACQUISITION MODE= SIMULTANEOUS
##.ACQUISITION SCHEME= undefined
##.AVERAGES= 64
##.DIGITISER RES= 16
##SPECTROMETER/DATA SYSTEM= spect
##.PULSE SEQUENCE= zgpg30
##.SOLVENT NAME= DMSO
##.SHIFT REFERENCE= (INTERNAL, DMSO, 0, 248.564)
##AUDIT TRAIL= $$ (NUMBER, WHEN, WHO, WHERE, WHAT)
$$ ##TITLE= Audit trail, XWIN-NMR		Version 3.5
$$ ##JCAMPDX= 5.01
$$ ##ORIGIN= Bruker BioSpin GmbH
$$ ##OWNER= she
$$ F:/spectra/data/she/nmr/P31/1/pdata/1/auditp.txt
$$ ##AUDIT TRAIL=  $$ (NUMBER, WHEN, WHO, WHERE, WHAT)
(   1,<2024-03-06 13:27:47.51 +0400>,<she>,<DPX200>,
      <continue with go, POWCHK disabled, PULCHK disabled
       configuration hash MD5:
       00 E9 B6 7A A2 85 ED C7 34 08 36 98 17 FE 4E 26
       data hash MD5: 32K
       B0 81 0C B2 A8 14 77 5C 9A D2 59 15 1D C7 FE F4>)
(   2,<2024-03-06 13:27:50.59 +0400>,<she>,<DPX200>,
      <Start of raw data processing
       efp BC_mod = 2 LB = 10 FT_mod = 6 PKNL = 1 PHC0 = -12440.79 PHC1 = -539.5166 SI = 64K 
       data hash MD5: 64K
       40 EC 6B 96 1C 1D 71 AE 0B D5 69 14 8C 30 EC 57>)
(   3,<2024-03-06 13:28:15.32 +0400>,<she>,<DPX200>,
      <pk PHC0 = -344.5138 PHC1 = 312.4001 
       data hash MD5: 64K
       1B D3 AA 9E 9B 19 11 85 1B FA EF D3 53 3D E9 0A>)
(   4,<2024-03-06 13:28:18.59 +0400>,<she>,<DPX200>,
      <abs ABSG = 5 
       data hash MD5: 64K
       74 E3 8C 72 CD 94 1B A3 B4 13 E3 51 98 7B F9 06>)
$$ ##END=
$$ 
$$ hash MD5
$$ 9F 19 2C FF 3F 8E 8E EE CF D3 20 53 D0 15 F5 5F
##$RELAX= 
##$RELAX= 
##$RELAX= 
##$RELAX= 
##$RELAX= 
##$RELAX= 
##$RELAX= 
##$RELAX= 
##$RELAX= 
$$ Bruker specific parameters
$$ --------------------------
##$DU= <F:/spectra>
##$EXPNO= 1
##$NAME= <P31>
##$PROCNO= 1
##$TYPE= <nmr>
##$USER= <she>
##$AMP= (0..31)
100 100 100 100 100 100 100 100 100 100 100 100 100 100 100 100 100 100 
100 100 100 100 100 100 100 100 100 100 100 100 100 100 
##$AQSEQ= 0
##$AQ_mod= 1
##$AUNM= <au_zg>
##$AUTOPOS= <>
##$BF1= 81.014009
##$BF2= 200.13
##$BF3= 200.13
##$BF4= 200.13
##$BF5= 200.13
##$BF6= 200.13
##$BF7= 200.13
##$BF8= 200.13
##$BYTORDA= 1
##$CFDGTYP= 0
##$CFRGTYP= 5
##$CHEMSTR= <none>
##$CNST= (0..31)
1 1 145 1 1 1 1 1 1 1 1 1 1 1 1 1 1 1 1 1 1 1 1 1 1 1 1 1 1 1 1 1 
##$CPDPRG= <waltz16>
##$CPDPRG1= <>
##$CPDPRG2= <waltz16>
##$CPDPRG3= <>
##$CPDPRG4= <mlev>
##$CPDPRG5= <mlev>
##$CPDPRG6= <mlev>
##$CPDPRG7= <mlev>
##$CPDPRG8= <mlev>
##$CPDPRGB= <>
##$CPDPRGT= <>
##$D= (0..31)
0 1 0 0 0 0 0 0 0 0 0 0.03 2e-05 3e-06 0 0 0 0 0 0 0 0 0 0 0 0 0 0 0 0 
0 0 
##$DATE= 1709717186
##$DBL= (0..7)
120 120 120 11 120 120 24 19 
##$DBP= (0..7)
150 150 150 150 150 150 150 150 
##$DBP07= 0
##$DBPNAM0= <>
##$DBPNAM1= <>
$$ [...]
##$SUBNAM3= <"">
##$SUBNAM4= <"">
##$SUBNAM5= <"">
##$SUBNAM6= <"">
##$SUBNAM7= <"">
##$SUBNAM8= <"">
##$SUBNAM9= <"">
##$SW= 501.771253377433
##$SWIBOX= (0..15)
0 1 3 0 0 0 0 0 0 0 0 0 0 0 0 0 
##$SW_h= 40650.406504065
##$TD= 32768
##$TD0= 1
##$TE= 0
##$TE2= 300
##$TE3= 300
##$TEG= 300
##$TL= (0..7)
0 120 53 12 22 120 120 120 
##$TP= (0..7)
150 150 150 150 150 150 150 150 
##$TP07= 0
##$TPNAME0= <>
##$TPNAME1= <>
##$TPNAME2= <>
##$TPNAME3= <>
##$TPNAME4= <>
##$TPNAME5= <>
##$TPNAME6= <>
##$TPNAME7= <>
##$TPOAL= (0..7)
0.5 0.5 0.5 0.5 0.5 0.5 0.5 0.5 
##$TPOFFS= (0..7)
0 0 0 0 0 0 0 0 
##$TUNHIN= 0
##$TUNHOUT= 0
##$TUNXOUT= 0
##$USERA1= <user>
##$USERA2= <user>
##$USERA3= <user>
##$USERA4= <user>
##$USERA5= <user>
##$V9= 5
##$VALIST= <valist>
##$VCLIST= <CCCCCCCCCCCCCCC>
##$VD= 0
##$VDLIST= <DDDDDDDDDDDDDDD>
##$VPLIST= <PPPPPPPPPPPPPPP>
##$VTLIST= <TTTTTTTTTTTTTTT>
##$WBST= 1024
##$WBSW= 4
##$XGAIN= (0..3)
0 0 0 0 
##$XL= 0
##$YL= 0
##$YMAX_a= 7121
##$YMIN_a= -1835
##$ZGOPTNS= <>
##$ZL1= 120
##$ZL2= 120
##$ZL3= 120
##$ZL4= 120
##$ABSF1= 248.5645
##$ABSF2= -253.2056
##$ABSG= 5
##$ABSL= 3
##$ALPHA= 0
##$AQORDER= 0
##$ASSFAC= 0
##$ASSFACI= 0
##$ASSFACX= 0
##$ASSWID= 0
##$AUNMP= <proc_1d>
##$AZFE= 0.1
##$AZFW= 0.5
##$BCFW= 0
##$BC_mod= 2
##$BYTORDP= 0
##$COROFFS= 0
##$CY= -3
##$DATMOD= 1
##$DC= 0
##$DFILT= <>
##$DTYPP= 0
##$F1P= 0
##$F2P= 0
##$FCOR= 1
##$FTSIZE= 65536
##$FT_mod= 6
##$GAMMA= 0
##$GB= 0
##$INTBC= 1
##$INTSCL= 6.047779e-11
##$ISEN= 30
##$LB= 10
##$LEV0= 0
##$LPBIN= 0
##$MAXI= 10000
##$MC2= 0
##$MEAN= 0
##$ME_mod= 0
##$MI= 50
##$NCOEF= 0
##$NC_proc= -11
##$NLEV= 6
##$NOISF1= 182.463
##$NOISF2= 159.3651
##$NSP= 0
##$NTH_PI= 0
##$NZP= 0
##$OFFSET= 248.5645
##$PC= 4
##$PHC0= -12785.3
##$PHC1= -227.1165
##$PH_mod= 1
##$PKNL= yes
##$PPARMOD= 0
##$PSCAL= 0
##$PSIGN= 0
##$REVERSE= no
##$SF= 81.0140089999694
##$SI= 65536
##$SIGF1= 159.3651
##$SIGF2= -187.1042
##$SINO= 113.3802
##$SIOLD= 16384
##$SREGLST= <1H.CDCl3>
##$SSB= 0
##$STSI= 65536
##$STSR= 0
##$SW_p= 40650.406504065
##$SYMM= 0
##$S_DEV= 0
##$TDeff= 32768
##$TDoff= 0
##$TI= <>
##$TILT= no
##$TM1= 0
##$TM2= 0
##$TOPLEV= 0
##$USERP1= <user>
##$USERP2= <user>
##$USERP3= <user>
##$USERP4= <user>
##$USERP5= <user>
##$WDW= 1
##$XDIM= 65536
##$YMAX_p= 409982099
##$YMIN_p= -75073505
$$ End of Bruker specific parameters
$$ ---------------------------------
##NTUPLES= NMR SPECTRUM
##VAR_NAME=  FREQUENCY,     SPECTRUM/REAL,   SPECTRUM/IMAG
##SYMBOL=    X,             R,               I
##VAR_TYPE=  INDEPENDENT,   DEPENDENT,       DEPENDENT
##VAR_FORM=  AFFN,          ASDF,            ASDF
##VAR_DIM=   65536,         65536,           65536
##UNITS=     HZ,            ARBITRARY UNITS, ARBITRARY UNITS
##FACTOR=    0.620285442955139, 1,           1
##FIRST=     20137.2065510682, 0,            0
##LAST=      -20513.1999529968, 0,           0
##MIN=       -20513.1999529968, -75073505,   0
##MAX=       20137.2065510682, 409982099,    0
$$ Real data points
##PAGE= N=1
##DATA TABLE= (X++(R..R)), XYDATA
$$ [...]
12957B7940344j180722j773793k128324k206425k037536j703696j308177r46594
$$ 27940344 26759622 24985829 22857505 20651080 18613544 16909848 15601671 14655077
12949A4655077o86273n52002n24181n58024o15519o86083p81525r16102j091889
$$ 14655077 13968804 13416802 12892621 12334597 11719078 11032995 10251470 9335368 8243479
12940H243479j295336j495804j641090j659462j479876j066131m43888K99015
$$ 8243479 6948143 5452339 3811249 2151787 671911 -394220 -838108 -539093
12932e39093J039270J654342K050302K177060K036786J687375J232875P93074
$$ -539093 500177 2154519 4204821 6381881 8418667 10106042 11338917 12131991
12924A2131991M60303K67811J91543J82729K04339K44865L06727L87768M73218
$$ 12131991 12592294 12860105 13051648 13234377 13438716 13683581 13990308 14378076 14851294
12915A4851294N40412N69287N52625N01801M43581M07446M10728M51106N09686
$$ 14851294 15391706 15960993 16513618 17015419 17459000 17866446 18277174 18728280 19237966
12906A9237966N61150N85977N79919N55359N32471N26504N41739N76113O29478
$$ 19237966 19799116 20385093 20965012 21520371 22052842 22579346 23121085 23697198 24326676
12897B4326676P04681P98252Q89055R38476R07767P81063N72594L08741P52l65231
$$ 24326676 25031357 25829609 26718664 27657140 28564907 29345970 29918564 30227305 30228057 29862826
12887B9862826q11467j342585j934511k545752l138449l691542m197195m644329
$$ 29862826 29051359 27708774 25774263 23228511 20090062 16398520 12201325 7556996
12879G556996n001847n215055n220603m972742m466842l748413k904115k039097
$$ 7556996 2555149 -2659906 -7880509 -12853251 -17320093 -21068506 -23972621 -26011718
12871b6011718j250555o08745j50988J15757K12196J84977R8357J6587j1943M4520
$$ -26011718 -27262273 -27871018 -28022006 -27906249 -27694053 -27509076 -27410719 -27394132 -27406075 -27361555
12861b7361555K11353N09901R43208J480932K063951K626688L115836L493434
$$ -27361555 -27150202 -26640301 -25697093 -24216161 -22152210 -19525522 -16409686 -12916252
12853a2916252L733923L828231L791612L661449L479890L270403L022893K698373
$$ -12916252 -9182329 -5354098 -1562486 2098963 5578853 8849256 11872149 14570522
12845A4570522K254168J676234R96314K80905l98080r87700j459093j797299j990224
$$ 14570522 16824690 18500924 19497238 19778143 19380063 18392363 16933270 15135971 13145747
12836A3145747k029576j926167j726913j512685j368622j344794j436147j592212
$$ 13145747 11116171 9190004 7463091 5950406 4581784 3236990 1800843 208631
12828B08631j742477j819664j775994j593442j284820q82795m22421P2656N93834
$$ 208631 -1533846 -3353510 -5129504 -6722946 -8007766 -8890561 -9312982 -9240326 -8646492
12819h646492J138866J692575K207843K605543K802462K751700K466394K011165
$$ -8646492 -7507626 -5815051 -3607208 -1001665 1800797 4552497 7018891 9030056
12811I030056J471312R22478M17064j0234l26827m92023m64548k26310J94773
$$ 9030056 10501368 11423846 11840910 11830676 11503849 11011826 10547278 10320968 10515741
12802A0515741P22541J255942J704023K011512K162430K163717K021182J723936
$$ 10515741 11238282 12494224 14198247 16209759 18372189 20535906 22557088 24281024
12794B4281024J250215N95500j95141j018763j744341k263272k524726k534826
$$ 24281024 25531239 26126739 25931598 24912835 23168494 20905222 18380496 15845670
12786A5845670k331566j964935j499415j028531o74591n54884p23992j128517
$$ 15845670 13514104 11549169 10049754 9021223 8346632 7791748 7067756 5939239
12778E939239j610649j966454k028228j726934j106632k91014N74492J373556
$$ 5939239 4328590 2362136 333908 -1393026 -2499658 -2790672 -2216180 -842624
12770h42624K041258K559041K938282L204412L381969L481519L496561L413676
$$ -842624 1198634 3757675 6695957 9900369 13282338 16763857 20260418 23674094
12762B3674094L224718K928321K523769K009164J385399O58323j59743j038023
$$ 23674094 26898812 29827133 32350902 34360066 35745465 36403788 36244045 35206022
12754C5206022j906594k650984l143261l298459l118054k689709k144883j601704
$$ 35206022 33299428 30648444 27505183 24206724 21088670 18398961 16254078 14652374
12746A4652374j123624p10892l24949O8513M62125P99071J002227J019901Q53253
$$ 14652374 13528750 12817858 12492909 12561422 13023547 13822618 14824845 15844746 16697999
12737A6697999N46345J54039k79742p17685j111736j395417j496133j362716r96988
$$ 16697999 17244344 17398383 17118641 16400956 15289220 13893803 12397670 11034954 10037966
12728A0037966m73579P0328M82141O57608N81732L20847k3490l62263o40150q29635
$$ 10037966 9564387 9634715 10116856 10774464 11356196 11677043 11653553 11291290 10651140 9821505
12718I821505r16162q89524p45358m93444j66109J83053M96226P35865Q96487
$$ 9821505 8905343 8015819 7270461 6777017 6610908 6793961 7290187 8026052 8922539
12709H922539R92250J032387J008450R03940P14930M63267J94090l9461j97010
$$ 8922539 9914789 10947176 11955626 12859566 13574496 14037763 14231853 14192392 13995382
12700A3995382k68459k78209k70000k78833l08588l32944l19366k55663j56268
$$ 13995382 13726923 13448714 13178714 12899881 12591293 12258349 11938983 11683320 11527052
12691A1527052m5037O6533J85660L28235N06308P22896R70923J230305J466009
$$ 11527052 11482015 11548548 11734208 12062443 12568751 13291647 14262570 15492875 16958884
12682A6958884J636218J713163J704701J657177J630600J660448J733986J796825
$$ 16958884 18595102 20308265 22012966 23670143 25300743 26961191 28695177 30492002
12674C0492002J779597J624169J301055Q21187K39455l60291q98092j328512j648274
$$ 30492002 32271599 33895768 35196823 36018010 36257465 35897174 34999082 33670570 32022296
12665C2022296j880795k054538k189184k291875k360495k391671k389454k367796
$$ 32022296 30141501 28086963 25897779 23605904 21245409 18853738 16464284 14096488
12657A4096488k342471k317077k274745k184429k018938j771637j460275j116872
$$ 14096488 11754017 9436940 7162195 4977766 2958828 1187191 -273084 -1389956
12649a389956p71042m35383j00627K52400O25989R81624J241388J318820J158687
$$ -1389956 -2160998 -2596381 -2697008 -2444608 -1818619 -836995 404393 1723213 2881900
12640B881900P60616J78342m96686j155614j690315k009427k055186j820282j355333
$$ 2881900 3642516 3820858 3324172 2168558 478243 -1531184 -3586370 -5406652 -6761985
12631f761985p56900j40409L85170P32848Q52710P52694N09594K50391J08740
$$ -6761985 -7518885 -7659294 -7274124 -6541276 -5688566 -4935872 -4426278 -4175887 -4067147
12622d067147J83492N17299J091684J830910K616233L311297L788781L949270
$$ -4067147 -3883655 -3366356 -2274672 -443762 2172471 5483768 9272549 13221819
12614A3221819L736374L154529K281172J254750K34539o47792j318520j764123
$$ 13221819 16958193 20112722 22393894 23648644 23883183 23235391 21916871 20152748
12606B0152748k014216k117329k116040k027987j844435j551260j156603o98553
$$ 20152748 18138532 16021203 13905163 11877176 10032741 8481481 7324878 6626325
12598F626325k25396K29288O51029J028982J341196J552569J621051J508542J199944
$$ 6626325 6400929 6630217 7281246 8310228 9651424 11203993 12825044 14333586 15533530
12589A5533530P25106J63617l80255q18721j110722j268434j346509j423467j578114
$$ 15533530 16258636 16422253 16041998 15223277 14112555 12844121 11497612 10074145 8496031
12580H496031j863936k289871k815280l359825l823720m113660m169492l983275
$$ 8496031 6632095 4342224 1526944 -1832881 -5656601 -9770261 -13939753 -17923028
12572a7923028l600082l095767k540862j971436j383333p48147l6127P64299J630351
$$ -17923028 -21523110 -24618877 -27159739 -29131175 -30514508 -31262655 -31298782 -30534483 -28904132
12563b8904132K494095L248360L776989L997264L890004L502710K930080K284332
$$ -28904132 -26410037 -23161677 -19384688 -15387424 -11497420 -7994710 -5064630 -2780298
12555b780298J664426J131692P01011L52851N9150j93994m00863n46503o18649
$$ -2780298 -1115872 15820 716831 1069682 1128832 934838 533975 -12528 -631177
12546f31177o09586n12798l28532q0607J73282L56078M06252L08314R9021j50961
$$ -631177 -1240763 -1753561 -2082093 -2162700 -1989418 -1633340 -1227088 -918774 -819753 -970714
12536i70714l67923n06376n69184o04497o75759q18728j011778j179882j232274
$$ -970714 -1338637 -1845013 -2414197 -3018694 -3694453 -4513181 -5524959 -6704841 -7937115
12527g937115j112180q27602m42535l4955L48067P07601J075574J480943J922766
$$ -7937115 -9049295 -9876897 -10319432 -10354387 -10006320 -9298719 -8223145 -6742202 -4819436
12518d819436K362604K736991K984096L072829L018352K873389K701036K547365
$$ -4819436 -2456832 280159 3264255 6337084 9355436 12228825 14929861 17477226
12510A7477226K427813K326498K200103J985810J620404J070760L59386m35034
$$ 17477226 19905039 22231537 24431640 26417450 28037854 29108614 29468000 29032966
12502B9032966j204876j849399k297150k510531k484391k248609j870434j445515
$$ 29032966 27828090 25978691 23681541 21171010 18686619 16438010 14567576 13122061
12494A3122061j074085q30458p38853p66487q40402q86245q73079q36899q62341
$$ 13122061 12047976 11217518 10478665 9712178 8871776 7985531 7112452 6275553 5413212
12485E413212j028159j349696j756846k123413k329184k315628k104333j775670
$$ 5413212 4385053 3035357 1278511 -844902 -3174086 -5489714 -7594047 -9369717
12477i369717j429156j149025r85860r54817j048132j253748j564098j963477
$$ -9369717 -10798873 -11947898 -12933758 -13888575 -14936707 -16190455 -17754553 -19718030
12469a9718030k403842k795446l029025l019297k743597k255501j668784j118409
$$ -19718030 -22121872 -24917318 -27946343 -30965640 -33709237 -35964738 -37633522 -38751931
12461c8751931p13013m98115m46064m75735m91399m23072k50747j883K73491N30693
$$ -38751931 -39464944 -39963059 -40409123 -40884858 -41376257 -41799329 -42050076 -42051959 -41778468 -41247775
12451d1247775P42125Q91658R67444R66763R10047Q49860Q63751J030346J396697
$$ -41247775 -40505650 -39613992 -38646548 -37679785 -36769738 -35919878 -35056127 -34025781 -32629084
12442c2629084J950274K610629L250209L739083L991391L987031L757877L353761
$$ -32629084 -30678810 -28068181 -24817972 -21078889 -17087498 -13100467 -9342590 -5988829
12434e988829K816322K176800J469540P41208M5075n73029j083201j466738j703150
$$ -5988829 -3172507 -995707 473833 1215041 1260116 687087 -396114 -1862852 -3566002
12425c566002j761732j607353j218199o04260J83104J052896J887288K564851
$$ -3566002 -5327734 -6935087 -8153286 -8757546 -8574442 -7521546 -5634258 -3069407
12417c069407K987757L100560K894260K402637J698947Q87885Q3086o25288j194611
$$ -3069407 -81650 3018910 5913170 8315807 10014754 10902639 10985725 10360437 9165826
12408I165826j633448j987100k310781k634697k934569l130248l121108k836692
$$ 9165826 7532378 5545278 3234497 599800 -2334769 -5465017 -8586125 -11422817
12400a1422817k269282j474536n50724L88301J239221J929674K426241K728530
$$ -11422817 -13692099 -15166635 -15717359 -15329058 -14089837 -12160163 -9733922 -7005392
12392g005392K857276K844351K724170K522899K249637J899627J470937R81186
$$ -7005392 -4148116 -1303765 1420405 3943304 6192941 8092568 9563505 10544691
12384A0544691M69604j3627m14971o76512p42245n86813k51114J53384M88912
$$ 10544691 11014295 11000668 10585697 9909185 9166940 8580127 8329013 8482397 8971309
12375H971309O56462O35820M80589K83003J32501Q2404J33163K39275L37561L79808
$$ 8971309 9627771 10263591 10744180 11027183 11159684 11242088 11375251 11614526 11952087 12331895
12365A2331895L49398K54812J10216p9041l14825n92584q91405j178377j420541
$$ 12331895 12681293 12936105 13046321 12967280 12652455 12059871 11168466 9990089 8569548
12356H569548j589603j657893j600070j409374j115464p83211m89370k94478k26880
$$ 8569548 6979945 5322052 3721982 2312608 1197144 413933 -75437 -369915 -596795
12347e96795k79827m12331n49958n91779m32249J464P09598J599167K500800L223061
$$ -596795 -876622 -1288953 -1838911 -2430690 -2862939 -2861475 -2151877 -552710 1948090 5171151
12337E171151L621302L646647L351545K855416K296586J796795J445189J291515
$$ 5171151 8792453 12439100 15790645 18646061 20942647 22739442 24184631 25476146
12329B5476146J339171J540814J805112K017891K073371J906614J514677R53803
$$ 25476146 26815317 28356131 30161243 32179134 34252505 36159119 37673796 38627599
12321C8627599L11216l30866r15246j406987j783481k034789k173215k236820
$$ 38627599 38938815 38607949 37692703 36285716 34502235 32467446 30294231 28057411
12313B8057411k277013k334524k415452k478144k439640k205959j718488r95466
$$ 28057411 25780398 23445874 21030422 18552278 16112638 13906679 12188191 11192725
12305A1192725j45243O59074J235632J458711J305258Q61381K84321k61834o65278
$$ 11192725 11047482 11706556 12942188 14400899 15706157 16567538 16851859 16590025 15924747
12296A5924747q93877r82710r94420r78791r56450r32877r24475r71145j125866
$$ 15924747 15030870 14048160 13053740 12074949 11118499 10185622 9261147 8290002 7164136
12287G164136j432259j904433k514366l188418l817725m283336m486374m371834
$$ 7164136 5731877 3827444 1313078 -1875340 -5693065 -9976401 -14462775 -18834609
12279a8834609l944336l276536k499948j766479j191646q13913n95092m52404
$$ -18834609 -22778945 -26055481 -28555429 -30321908 -31513554 -32327467 -32922559 -33374963
12271c3374963k94284m5805L31349Q22839J361911J855702K226817K445440K535698
$$ -33374963 -33669247 -33715052 -33383703 -32560864 -31198953 -29343251 -27116434 -24670994 -22135296
12262b2135296K559131K589440K690008K897785L212944L595176L969901M245376
$$ -22135296 -19576165 -16986725 -14296717 -11398932 -8185988 -4590812 -620911 3624465
12254C624465M335442M179279L753572L079059K224873J308091M79889j07786
$$ 3624465 7959907 12139186 15892758 18971817 21196690 22504781 22984670 22876884
12246B2876884l48929k23636J90556P43606J259930J583979J610991J303705O97423
$$ 22876884 22527955 22304319 22494875 23238481 24498411 26082390 27693381 28997086 29694509
12237B9694509j10401r87179j797729k427493k794308k858445k633707k187866
$$ 29694509 29584108 28596929 26799200 24371707 21577399 18718954 16085247 13897381
12229A3897381j621697j034612m97771m8126L00985N46104O86933P28426O86189
$$ 13897381 12275684 11241072 10743301 10695175 10996160 11542264 12229197 12957623 13643812
12220A3643812N86566M57702L17457J68818O318j73612l67059n63049p45366q93366
$$ 13643812 14230378 14688080 15005537 15174355 15180673 15007061 14640002 14076953 13331587 12438221
12210A2438221r84769j004203r55668q69246p91668p60894p79901q09060p84261
$$ 12438221 11453452 10449249 9493581 8624335 7832667 7071773 6291872 5482812 4698551
12201D698551o50764l95153o0275K65532M83034N23942L76011P9790k92483o57290
$$ 4698551 4047787 3652634 3592359 3857891 4340925 4864867 5240878 5320668 5028185 4370895
12191D370895r33150j053798r86117p47037m08470q3195J07576P4406k09965p04070
$$ 4370895 3437745 2383947 1397830 650793 242323 159128 266704 341110 131145 -572925
12181e72925j314599j924330k419622k712561k756044k550786k145621j631832
$$ -572925 -1887524 -3811854 -6231476 -8944037 -11700081 -14250867 -16396488 -18028320
12173a8028320j125685p33245n07740m26970m11497l74818k72926j23850J0757
$$ -18028320 -19154005 -19887250 -20394990 -20821960 -21233457 -21608275 -21881201 -22005051 -21994294
12164b1994294O9464L6873l3835l7406J32512N24621J098699J743442K334483
$$ -21994294 -21924830 -21887957 -21921792 -21959198 -21826686 -21302065 -20203366 -18459924 -16125441
12155a6125441K795018L119049L346976L520355L652371L727575L717905L597831
$$ -16125441 -13330423 -10211374 -6864398 -3344043 308328 4035903 7753808 11351639
12147A1351639L353366K986698K516586J975416J407937Q73967M46612J94374
$$ 11351639 14705005 17691703 20208289 22183705 23591642 24465609 24912221 25106595
12139B5106595J49067K79126M89197O49209O35902L64530j99511j042940k108116
$$ 25106595 25255662 25534788 26023985 26673194 27309096 27673626 27474115 26431175 24323059
12130B4323059l293225m456770n436391o081212o284598o003378n259578m131038
$$ 24323059 21029834 16573064 11136673 5055461 -1229137 -7232515 -12492093 -16623131
12122a6623131k739048j236786K03268J408159K232906K593571K490339K006115
$$ -16623131 -19362179 -20598965 -20395697 -18987538 -16754632 -14161061 -11670722 -9664607
12114i664607J280015M69619k82605q73027j250779j419398j422769j320125j162931
$$ -9664607 -8384592 -7914973 -8197578 -9070605 -10321384 -11740782 -13163551 -14483676 -15646607
12105a5646607r83654p95566n96673l73845j07989K17742O06426J035423J450672
$$ -15646607 -16630261 -17425827 -18022500 -18396345 -18504334 -18286592 -17680166 -16644743 -15194071
12096a5194071J775968J939221J903731J684008J335339R28010N28761J99269
$$ -15194071 -13418103 -11478882 -9575151 -7891143 -6555804 -5627794 -5099033 -4899764
12088d899764j500k9646J18162L88133O79991Q80954R05299P24952L81942k6166
$$ -4899764 -4901264 -4930910 -4812748 -4424615 -3744624 -2863670 -1958371 -1233419 -851477 -877643
12078h77643l88850o33887p55457q02492q40564r15219j035242j177665j306537
$$ -877643 -1266493 -1900380 -2655837 -3458329 -4298893 -5214112 -6249354 -7427019 -8733556
12069h733556j394320j434846j442535j441472j451567j476793j498673j479726
$$ -8733556 -10127876 -11562722 -13005257 -14446729 -15898296 -17375089 -18873762 -20353488
12061b0353488j379193j175652q84177n56958k64743o7102J3496P98m5958n6892
$$ -20353488 -21732681 -22908333 -23792510 -24349468 -24614211 -24681313 -24667817 -24667019 -24712977 -24769869
12051b4769869J7897J83020L93090N77711O81956O91830O29554N34799M54761
$$ -24769869 -24751972 -24568952 -24175862 -23598151 -22916195 -22224365 -21594811 -21060012 -20605251
12042b0605251M41775N42297P77533J134839J577702K058360K518597K887133
$$ -20605251 -20163476 -19621179 -18843646 -17708807 -16131105 -14072745 -11554148 -8667015
12034h667015L090520L076286K831120K382893J790539J129715M77407j02647
$$ -8667015 -5576495 -2500209 330911 2713804 4504343 5634058 6111465 6008818
12026F008818n70346r13652j148372j313249j457215j618533j803759j979749
$$ 6008818 5438472 4524820 3376448 2063199 605984 -1012549 -2816308 -4796057
12018d796057k087796k076508j937059j718990j513635j411210j454716j616389
$$ -4796057 -6883853 -8960361 -10897420 -12616410 -14130045 -15541255 -16995971 -18612360
12010a8612360j809182j926401j889148j680007j350367j001940p53939p10156
$$ -18612360 -20421542 -22347943 -24237091 -25917098 -27267465 -28269405 -29023344 -29733500
12002b9733500r33792j429416k131832k910022l595717m031469m115829l824443
$$ -29733500 -30667292 -32096708 -34228540 -37138562 -40734279 -44765748 -48881577 -52706020
11994e2706020l204037k350379j381486m13581M53020J136569J575666J742104
$$ -52706020 -55910057 -58260436 -59641922 -60055503 -59602483 -58465914 -56890248 -55148144
11986e5148144J659389J405801J090003Q11112O26099N37960N04994M65712L70779
$$ -55148144 -53488755 -52082954 -50992951 -50181839 -49555740 -49017780 -48512786 -48047074 -47676295
11977d7676295K10404K6643r4966n4725K19082P36064J439855K234704L016205
$$ -47676295 -47465891 -47439248 -47534214 -47588939 -47369857 -46633793 -45193938 -42959234 -39943029
11968c9943029L683139M138117M301463M143047L708200L114001K515615K058695
$$ -39943029 -36259890 -32121773 -27820310 -23677263 -19969063 -16855062 -14339447 -12280752
11960a2280752J833339J842662K000753K166998K203317K024924J621414J046929
$$ -12280752 -10447413 -8604751 -6603998 -4437000 -2233683 -208759 1412655 2459584
11952B459584L95369k23861p05786r69703r79212p54409l67589P6635M67961P15515
$$ 2459584 2854953 2631092 1925306 955603 -23609 -778018 -1145607 -1068972 -601011 114504
11942A14504P67872O24590L34919j6951l34650n34129n66722m36078j99430N3113
$$ 114504 882376 1506966 1841885 1824934 1490284 956155 389433 -46645 -246075 -192962
11932a92962K32187K74814J48838j54892o23518j211822j837400k397216k797731
$$ -192962 39225 314039 462877 307985 -315533 -1527355 -3364755 -5761971 -8559702
11923h559702k975494k898615k563071j998343j274812m93212K47286Q81601J387994
$$ -8559702 -11535196 -14433811 -16996882 -18995225 -20270037 -20763249 -20515963 -19634362 -18246368
11914a8246368J770050K028409K145178K093411J864941J494560J059769O54005
$$ -18246368 -16476318 -14447909 -12302731 -10209320 -8344379 -6849819 -5790050 -5136045
11906e136045L50265J75886J09299R8561R2384O7311L5645L2671R6770K54554
$$ -5136045 -4785780 -4609894 -4500595 -4402034 -4309650 -4242339 -4206694 -4174023 -4077253 -3822699
11896c822699N10247Q35985J170680J437849J575331J554173J374407J050734
$$ -3822699 -3312452 -2476467 -1305787 132062 1707393 3261566 4635973 5686707
11888E686707O07907Q6982m53449r50139j352455j629221j762988j742372j563362
$$ 5686707 6294614 6381596 5928147 4978008 3625553 1996332 233344 -1509028 -3072390
11879c072390j240927q22671l91558m8848J18564O9363j78836n56853r63665j290983
$$ -3072390 -4313317 -5135988 -5527546 -5576394 -5457830 -5388467 -5567303 -6124156 -7087821 -8378804
11869h378804j449394j389769j110337o47229n8543N87861J223484J790120K248449
$$ -8378804 -9828198 -11217967 -12328304 -12975533 -13034076 -12446215 -11222731 -9432611 -7184162
11860g184162K575470K753061K763254K600521K291276J899729J509563J191473
$$ -7184162 -4608692 -1855631 907623 3508144 5799420 7699149 9208712 10400185
11852A0400185R77532Q57307P94028P46179O80503N75032M20382K24847J8201
$$ 10400185 11377717 12235024 13029052 13775231 14455734 15030766 15451148 15675995 15694196
11843A5694196j54481k50223k48113j61340l6654N7752N3634q9439l58225o77612
$$ 15694196 15539715 15289492 15041379 14880039 14843385 14901137 14954771 14865332 14507107 13829495
11833A3829495r32329j012521q58436m81268M2687N91741J023493J205871J053670
$$ 13829495 12897166 11884645 11026209 10544941 10587628 11179369 12202862 13408733 14462403
11824A4462403N57452k11310j122720k026917k791911l329148l603759l631750
$$ 14462403 15019855 14808545 13685825 11658908 8866997 5537849 1934090 -1697660
11816a697660l467718l185026k851910k512249k181492j858830j544085j245278
$$ -1697660 -5165378 -8350404 -11202314 -13714563 -15896055 -17754885 -19298970 -20544248
11808b0544248r73177p30425n05295k75584k2074K55154N28633P52237Q84657
$$ -20544248 -21517425 -22247850 -22753145 -23028729 -23050803 -22795649 -22267016 -21514779 -20630122
11799b0630122R13787Q65917P93036P46475P53419Q08477Q80291R25164R01604
$$ -20630122 -19716335 -18850418 -18057382 -17310907 -16557488 -15749011 -14868720 -13943556 -13041952
11790a3041952P83885N71824K90771k0368l26403o07093q56101j070646j241255
$$ -13041952 -12258067 -11686243 -11395472 -11415840 -11742243 -12349336 -13205437 -14276083 -15517338
11781a5517338j350739j383599j335807j212570j014153p25462l24562J92365
$$ -15517338 -16868077 -18251676 -19587483 -20800053 -21814206 -22539668 -22864230 -22671865
11773b2671865P88124J380916J863448K135552K135916J860123J358210P13964
$$ -22671865 -21883741 -20502825 -18639377 -16503825 -14367909 -12507786 -11149576 -10435612
11765a0435612J6435o61594j267223j755515k079581k200262k111310j854098
$$ -10435612 -10419177 -11080771 -12347994 -14103509 -16183090 -18383352 -20494662 -22348760
11757b2348760j501615j121853p50537l90843l1180L38122P18164J101193J470499
$$ -22348760 -23850375 -24972228 -25722765 -26113608 -26144788 -25806666 -25088502 -23987309 -22516810
11748b2516810J798391K045096K164070K116945J893267J523061J072466O22180
$$ -22516810 -20718419 -18673323 -16509253 -14392308 -12499041 -10975980 -9903514 -9281334
11740i281334K38599m7110k38857l53579l94297l41574j70917J20877N05148R34301
$$ -9281334 -9042735 -9089845 -9328702 -9682281 -10076578 -10418152 -10589069 -10468192 -9963044 -9028743
11730i028743J363419J760603K100729K355390K494826K503353K393481K203777
$$ -9028743 -7665324 -5904721 -3803992 -1448602 1046224 3549577 5943058 8146835
11722H146835J981305J763443J570931J411217J283985J183739J100216J020488
$$ 8146835 10128140 11891583 13462514 14873731 16157716 17341455 18441671 19462159
11714A9462159R35621Q48728P74235P21643O74347N86321M06384J11557k79654
$$ 19462159 20397780 21246508 22020743 22742386 23416733 24003054 24409438 24520995 24241341
11705B4241341p23124j176622j616016k032665k420719k767861l057403l278505
$$ 24241341 23518217 22341595 20725579 18692914 16272195 13504334 10446931 7168426
11697G168426l432187l523661l547129l480055l295543k982159k553513k041702
$$ 7168426 3736239 212578 -3334551 -6814606 -10110149 -13092308 -15645821 -17687523
11689a7687523j483032r06523l29728K36947P77672J256403J613334J783082J728336
$$ -17687523 -19170555 -20077078 -20406806 -20169859 -19392187 -18135784 -16522450 -14739368 -13011032
11680a3011032J466480J069005O35101K60764K2724k4560J44512N09827R94923
$$ -13011032 -11544552 -10475547 -9840446 -9579682 -9556958 -9581518 -9437006 -8927179 -7932256
11671g932256J485685J879017K131900K275645K386542K536429K755818L024650
$$ -7932256 -6446571 -4567554 -2435654 -160009 2226533 4762962 7518780 10543430
11663A0543430L283379L450088L437412L171999K618256J799900Q05535k33137
$$ 10543430 13826809 17276897 20714309 23886308 26504564 28304464 29109999 28876862
11655B8876862j187593j981097k608918l114802l540497l886784m113830m173684
$$ 28876862 27689269 25708172 23099254 19984452 16443955 12557171 8443341 4269657
11647D269657m042998l730990l264814k671939j973955j191707l54646M91623
$$ 4269657 226659 -3504331 -6769145 -9441084 -11415039 -12606746 -12961392 -12469769
11639a2469769J283491J945873K406024K609392K532964K194359J654147J005856
$$ -12469769 -11186278 -9240405 -6834381 -4224989 -1692025 502334 2156481 3162337
11631C162337L52103k23964o76583r96986j200315j312234j363175j388361j424527
$$ 3162337 3514440 3290476 2613893 1616907 416592 -895642 -2258817 -3647178 -5071705
11622e071705j496319j597913j686757j700742j589606j338698r74013n55076
$$ -5071705 -6568024 -8165937 -9852694 -11553436 -13143042 -14481740 -15455753 -16010829
11614a6010829j63154J19582K42661K15668J07818J4876J7553J58739M44782Q57356
$$ -16010829 -16173983 -16054401 -15811740 -15596072 -15488254 -15473378 -15455825 -15297086 -14852304 -13994948
11604a3994948J363676J924013K498996L055643L568819M017500M379518M629984
$$ -13994948 -12631272 -10707259 -8208263 -5152620 -1583801 2433699 6813217 11443201
11596A1443201M746462M718060M550820M263691L877160L402592K838832K177185
$$ 11443201 16189663 20907723 25458543 29722234 33599394 37001986 39840818 42018003
11588D2018003J412348N55168l59291j275218k131669k881685l502767l992977
$$ 42018003 43430351 43985519 43626228 42351010 40219341 37337656 33834889 29841912
11580B9841912m356135m585334m655075m529491m185450l636274k936191k157411
$$ 29841912 25485777 20900443 16245368 11715877 7530427 3894153 957962 -1199449
11572a199449j355075n48541K64931J076341J840778K482729K922963L102849
$$ -1199449 -2554524 -3103065 -2838134 -1761793 78985 2561714 5484677 8587526
11564H587526K992257K589863J930890J099991K29099n34248j077449j363070
$$ 8587526 11579783 14169646 16100536 17200527 17429626 16895378 15817929 14454859
11556A4454859j434227j382044j294334j214552j132418j005571p91744m69481
$$ 14454859 13020632 11638588 10344254 9129702 7997284 6991713 6199969 5730488
11548E730488m1097M74379J049377J653489K255322K820228L307103L669010L858063
$$ 5730488 5689391 6163770 7213147 8866636 11121958 13942186 17249289 20918299 24776362
11539B4776362L832050L563894L057071K361696J575863Q21888K05986k16334
$$ 24776362 28608412 32172306 35229377 37591073 39166936 39988824 40194810 39978476
11531C9978476m50312n44413n58356n37911n11895n07830n65813p33305j044217
$$ 39978476 39528164 38983751 38425395 37887484 37375589 36867759 36301946 35568641 34524424
11522C4524424j500700k070664k698129l315429l850105m227154m373043m229119
$$ 34524424 33023724 30953060 28254931 24939502 21089397 16862243 12489200 8260081
11514H260081l774776l048719k151114j220563l97084K11609N51880O33528N24744
$$ 8260081 4485305 1436586 -714528 -1935091 -2332175 -2120566 -1568686 -935158 -410414
11505d10414L27602J37400M346p9964j63566k96429m96989p39583r66936j120614
$$ -410414 -82812 54588 58934 -21030 -184596 -481025 -978014 -1717597 -2684533 -3805147
11495c805147j173323j143674j083230j044943j055174j106047j168006j210299
$$ -3805147 -4978470 -6122144 -7205374 -8250317 -9305491 -10411538 -11579544 -12789843
11487a2789843j216083j185444j128157j055047r75650r00362q39265p96572p68915
$$ -12789843 -14005926 -15191370 -16319527 -17374574 -18350224 -19250586 -20089851 -20886423 -21655338
11478b1655338p51499p42488p35122p02649n93177l44445Q7697P01040J432139
$$ -21655338 -22406837 -23149325 -23884447 -24587096 -25180273 -25524718 -25437021 -24735981 -23303842
11469b3303842K165487K770287L151610L287893L231738L075490K904664K763350
$$ -23303842 -21138355 -18368068 -15216458 -11928565 -8696827 -5621337 -2716673 46677
11461D6677K642227K488427K233838J834008J299200O94160J00969m28981q95452
$$ 46677 2688904 5177331 7411169 9245177 10544377 11238537 11339506 10910525 10015073
11452A0015073j329433j757066k179436k575597k914125l161333l286434l265654
$$ 10015073 8685640 6928574 4749138 2173541 -740584 -3901917 -7188351 -10454005
11444a0454005l083287k730714k208261j529944p25677J59169J060908J892857
$$ -10454005 -13537292 -16268006 -18476267 -20006211 -20731888 -20572719 -19511811 -17618954
11436a7618954K552841K952980L061223K928157K675538K441275K302665K224332
$$ -17618954 -15066113 -12113133 -9051910 -6123753 -3448215 -1006940 1295725 3520057
11428C520057K076026J721757J122596L77497l27615q22791j036997j013213q59912
$$ 3520057 5596083 7317840 8440436 8817933 8490318 7667527 6630530 5617317 4757405
11419D757405o82053n37376m34675l56193k75789j62839J5805K82819O31804J021803
$$ 4757405 4075352 3537976 3103301 2747108 2471319 2308480 2324285 2607104 3238908 4260711
11409D260711J395975J713997J973860K205715K443722K699952K959308L191665
$$ 4260711 5656686 7370683 9344543 11550258 13993980 16693932 19653240 22844905
11401B2844905L361927L427585L334736L030703K495046J768109R51593J74439
$$ 22844905 26206832 29634417 32969153 35999856 38494902 40263011 41214604 41389043
11393D1389043m58182r04874j197896j420931j666899j995959k412628k869020
$$ 41389043 40930861 40025987 38828091 37407160 35740261 33744302 31331674 28462654
11385B8462654l285649l576035l669615l533753l189768k711655k203712j767554
$$ 28462654 25177005 21600970 17931355 14397602 11207834 8496179 6292467 4524913
11377D524913j471535j328588j288279j253637j125182q51084m51429k552M03144
$$ 4524913 3053378 1724790 436511 -817126 -1942308 -2793392 -3244821 -3247373 -2844229
11368b844229O95271Q45742Q70741Q19937P57110P35279P72855Q42223Q80122
$$ -2844229 -2148958 -1303216 -432475 387462 1144572 1879851 2652706 3494929 4375051
11359D375051Q15683N99354K19637k90532q51297j342008j627433j604150j249226
$$ 4375051 5190734 5790088 6009725 5719193 4867896 3525888 1898455 294305 -954921
11350i54921o47023K4204N50114P63266O08309J49573m79121j140372j730092
$$ -954921 -1601944 -1577740 -1027626 -264360 343949 493522 14401 -1125971 -2856063
11341b856063k175704k419204k412954k136850j621250r48509k21135M81702J121567
$$ -2856063 -5031767 -7450971 -9863925 -12000775 -13622025 -14570534 -14791669 -14309967 -13188400
11332a3188400J681341K138978K466645K649795K696899K629974K473916K257851
$$ -13188400 -11507059 -9368081 -6901436 -4251641 -1554742 1075232 3549148 5806999
11324E806999K017855J786972J578389J378129J151883Q57920M61296m7443o31006
$$ 5806999 7824854 9611826 11190215 12568344 13720227 14578147 15039443 14992000 14360994
11315A4360994j196664j617690j784212j656843j286451p83660k58843K24568
$$ 14360994 13164330 11546640 9762428 8105585 6819134 6035474 5776631 6001199
11307F001199O54114J036662J364001J604387J722213J704253J568435J350049
$$ 6001199 6655313 7691975 9055976 10660363 12382576 14086829 15655264 17005313
11299A7005313J081505P84058M72869J61652j42148m44260p59360j094424j432678
$$ 17005313 18086818 18870876 19343745 19505397 19363249 18918989 18159629 17065205 15632527
11290A5632527j731839j938396k008164j921430j687644j342282r40535n48302
$$ 15632527 13900688 11962292 9954128 8032698 6345054 5002772 4062237 3513935
11282C513935k27936k0035P0477P4160M0809J5533J9877M6624O8730N6663m094
$$ 3513935 3285999 3265964 3336441 3410601 3451410 3466943 3486820 3533444 3602174 3658837 3654743
11271C654743j02466k02581k55652k17548o3873K03015N55313R46773J323234
$$ 3654743 3552277 3349696 3094044 2876496 2812623 3015638 3570951 4517724 5840958
11262E840958J634379J842976J928124J882641J708297J412851J011846N35330
$$ 5840958 7475337 9318313 11246437 13129078 14837375 16250226 17262072 17797402
11254A7797402L4419m21596p62647r42539r56566q43554o74124n30368m81116
$$ 17797402 17831821 17410225 16647578 15705039 14748473 13904919 13230795 12700427 12219311
11245A2219311n60255p59328j038513j345754j629749j844580j955608j951774
$$ 12219311 11659056 10899728 9861215 8515461 6885712 5041132 3085524 1133750
11237A133750j855490j717239j593793j523320j512781j541474j572391j561588
$$ 1133750 -721740 -2438979 -4032772 -5556092 -7068873 -8610347 -10182738 -11744326
11229a1744326j465434j252767r23265n20154j21787J89787L66181M11854L72260
$$ -11744326 -13209760 -14462527 -15385792 -15905946 -16027733 -15837946 -15471765 -15059911 -14687651
11220a4687651K99678K22585J42989O2821J1844M4425K01306M69343P78119J039736
$$ -14687651 -14387973 -14165388 -14022399 -13959578 -13947734 -13903309 -13702003 -13232660 -12454541 -11414805
11210a1414805J199860J261553J270824J283274J337118J441224J571542J671839
$$ -11414805 -10214945 -8953392 -7682568 -6399294 -5062176 -3620952 -2049410 -377571
11202c77571J665367J482761J094525N25677j56708q68339j524704k048226k378538
$$ -377571 1287796 2770557 3865082 4390759 4234051 3365712 1841008 -207218 -2585756
11193b585756k489323k396509k143919j774272j307700p40486n9269P38849J624916
$$ -2585756 -5075079 -7471588 -9615507 -11389779 -12697479 -13437965 -13497234 -12758385 -11133469
11184a1133469K521831L307134L845321M039425L871924L408616K765278K062085
$$ -11133469 -8611638 -5304504 -1459183 2580242 6452166 9860782 12626060 14688145
11176A4688145J393327Q20823L78886P5861j09261k25656l38732n11792p88604
$$ 14688145 16081472 16902295 17281181 17357042 17247781 17022125 16683393 16171601 15382997
11167A5382997j178351j643251k097088k427018k538373k400695k066437j651254
$$ 15382997 14204646 12561395 10464307 8037289 5498916 3098221 1031784 -619470
11159f19470j290383j095445j125242j369862j746190k110701k296602k169588
$$ -619470 -1909853 -3005298 -4130540 -5500402 -7246592 -9357293 -11653895 -13823483
11151a3823483j680739q90647M9475R53602J668446K120870K324958K353409K296628
$$ -13823483 -15504222 -16394869 -16345394 -15391792 -13723346 -11602476 -9277518 -6924109 -4627481
11142d627481K231441K205788K233956K297171K348631K323226K152124J782807
$$ -4627481 -2396040 -190252 2043704 4340875 6689506 9012732 11164856 12947663
11134A2947663J201641M48810l86488j192273j869842k364019k677438k865302
$$ 12947663 14149304 14598114 14211626 13019353 11149511 8785492 6108054 3242752
11126C242752l011193l191065l440300l739687m026736m224776m274079m150712
$$ 3242752 231559 -2959506 -6399806 -10139493 -14166229 -18391005 -22665084 -26815796
11118b6815796l867738l463239k984062k471951j955029j446659r52698m82702
$$ -26815796 -30683534 -34146773 -37130835 -39602786 -41557815 -43004474 -43957172 -44439874
11110d4439874n5499L07564N96330Q18834R92879J129322J225581J280554J318869
$$ -44439874 -44495373 -44187809 -43591479 -42772645 -41779766 -40650444 -39424863 -38144309 -36825440
11101c6825440J394750J558507J806652K062197K211933K176912J961570J646230
$$ -36825440 -35430690 -33872183 -32065531 -30003334 -27791401 -25614489 -23652919 -22006689
11093b2006689J335001J100598R60231Q89110Q55624Q54394R17717J097686J427884
$$ -22006689 -20671688 -19571090 -18610859 -17721749 -16866125 -16011731 -15094014 -13996328 -12568444
11084a2568444J887938K395992K836990L108582L153744K963888K563435J997548
$$ -12568444 -10680506 -8284514 -5447524 -2338942 814802 3778690 6342125 8339673
11076H339673J328678O29250l8004o39621j170403j629201j993152k215859k254647
$$ 8339673 9668351 10297601 10259597 9619976 8449573 6820372 4827220 2611361 356714
11067C56714k107452j832193j534262j328753j297189j457350j754839k076722
$$ 356714 -1750738 -3582931 -5117193 -6445946 -7743135 -9200485 -10955324 -13032046
11059a3032046k283974k256057j933909j342341n78366K30574R77032J607591
$$ -13032046 -15316020 -17572077 -19505986 -20848327 -21426693 -21196119 -20219087 -18611496
11051a8611496K127646K580422L012373L438620L821945M077122M102314L822730
$$ -18611496 -16483850 -13903428 -10891055 -7452435 -3630490 446632 4548946 8371676
11043H371676L222616K350227J299418J84881q74159j759637k360310k589758
$$ 8371676 11594292 13944519 15243937 15428818 14554659 12795022 10434712 7844954
11035G844954k416590j888397j126165k84510M99732J139493J598276J874469
$$ 7844954 5428364 3539967 2413802 2129292 2629024 3768517 5366793 7241262
11027G241262J990680J994046J955727J956672K060275K284624K588407K877760
$$ 7241262 9231942 11225988 13181715 15138387 17198662 19483286 22071693 24949453
11019B4949453L034445K958075K605612K007096J248009M31194l56728j059903
$$ 24949453 27983898 30941973 33547585 35554681 36802690 37233884 36877156 35817253
11011C5817253j652767k133544k513146k799493k985845l053035k980665k750900
$$ 35817253 34164486 32030942 29517796 26718303 23732458 20679423 17698758 14947858
11003A4947858k340900j722379q86424J17912J167734K096694K755139L058644
$$ 14947858 12606958 10884579 9998155 10116067 11283801 13380495 16135634 19194278
10995A9194278K997946K617628J989651J198659L36742n03033j239694j820635
$$ 19194278 22192224 24809852 26799503 27998162 28334904 27831871 26592177 24771542
10987B4771542k232971k502564k678431k808517k919108l008675l057676l045331
$$ 24771542 22538571 20036007 17357576 14549059 11629951 8621276 5563600 2518269
10979B518269k960238k798048k552070k211403j775057j273333p76700l79884
$$ 2518269 -441969 -3240017 -5792087 -8003490 -9778547 -11051880 -11828580 -12208464
10971a2208464j66964j74662l70616o57951r09241j018390r44448p22725m38867
$$ -12208464 -12375428 -12550090 -12920706 -13578657 -14487898 -15506288 -16450736 -17173461 -17612328
10962a7612328j83047p442R6680J93960L72785O99561J182170J759920K320856
$$ -17612328 -17795375 -17802817 -17706137 -17512177 -17139392 -16439831 -15257661 -13497741 -11176885
10953a1176885K735447K893934K736067K263243J530028O23836l53075j293869
$$ -11176885 -8441438 -5547504 -2811437 -548194 981834 1605670 1252595 -41274
10945d1274k096062k676648k991468l048612k906654k656518k394457k197933
$$ -41274 -2137336 -4813984 -7805452 -10854064 -13760718 -16417236 -18811693 -21009626
10937b1009626k112446k148697k284534k470213k641032k737093k719932k575496
$$ -21009626 -23122072 -25270769 -27555303 -30025516 -32666548 -35403641 -38123573 -40699069
10929d0699069k306513j927590j468970r79631n19160j41828J15665K39277K41493
$$ -40699069 -43005582 -44933172 -46402142 -47381773 -47900933 -48042761 -47927096 -47687819 -47446326
10920d7446326J64576P4232L9176J07458K94543N85710R44223J320402J663996
$$ -47446326 -47281750 -47207518 -47168342 -47060884 -46766341 -46180631 -45236408 -43916006 -42252010
10911d2252010J938510K128011K230005K242053K157230J974593J714721J423602
$$ -42252010 -40313500 -38185489 -35955484 -33713431 -31556201 -29581608 -27866887 -26443285
10903b6443285J157092R54963Q23123P35327O49709N28772L58207J64560K1664
$$ -26443285 -25286193 -24331230 -23508107 -22772780 -22123071 -21594299 -21236092 -21071532 -21049868
10894b1049868K7643K51578O82977J227132J755278K171441K447259K609497K703338
$$ -21049868 -21022225 -20770647 -20087670 -18860538 -17105260 -14933819 -12486560 -9877063 -7173725
10885g173725K761874K793754K785299K712080K555663K316169K010306J656540
$$ -7173725 -4411851 -1618097 1167202 3879282 6434945 8751114 10761420 12417960
10877A2417960J261835Q21271L26995k22919q18214j430410k010777k499289k841662
$$ 12417960 13679795 14501066 14828061 14605142 13786928 12356518 10345741 7846452 5004790
10868E004790l001927k964860k737403k356973j897517j455320j112058q97124
$$ 5004790 2002863 -961997 -3699400 -6056373 -7953890 -9409210 -10521268 -11418392
10860a1418392p77771o85836n61138l79605j49837J10575L95209P13632J085391
$$ -11418392 -12196163 -12881999 -13443137 -13822742 -13972579 -13862004 -13466795 -12753163 -11667772
10851a1667772J528577K042061K586152L078618L418698L528599L387076L039396
$$ -11667772 -10139195 -8097134 -5510982 -2432364 986334 4514933 7902009 10941405
10843A0941405K584817K147610J836266J702865J723270J810782J854045J756750
$$ 10941405 13526222 15673832 17510098 19212963 20936233 22747015 24601060 26357810
10835B6357810J463354R69314L20274l98432j082690j637101j998514k145223
$$ 26357810 27821164 28790478 29110752 28712320 27629630 25992529 23994015 21848792
10827B1848792k090854j871698j535969j136424p24934l50524o0570J03143J20599
$$ 21848792 19757938 17886240 16350271 15213847 14488913 14138389 14077819 14180962 14301561
10818A4301561J2958j55739l03567l66159l17708j68592M9749K99375N46588P71025
$$ 14301561 14314519 14158780 13855213 13489054 13171346 13002754 13052503 13351878 13898466 14669491
10808A4669491R70129J150782J307259J401819J370635J158651P57811K17735
$$ 14669491 15639620 16790402 18097661 19499480 20870115 22028766 22786577 23004312
10800B3004312l74805r24353j345021j574034j590744j431219j177184r16766
$$ 23004312 22629507 21705154 20360133 18786099 17195355 15764136 14586952 13670186
10792A3670186p02690n37847l94748k49102j00982K7757J09874J25091O1344q7434
$$ 13670186 12967496 12429649 12034901 11785799 11684817 11712574 11822448 11947539 12008883 11921449
10782A1921449l18949o18069r56442j295356j587910j783727j842109j748624
$$ 11921449 11602500 10984431 10027989 8732633 7144723 5360996 3518887 1770263
10774A770263j521090j199799q32816m68559j54501O6003J59404J04052j11553
$$ 1770263 249173 -950626 -1783442 -2252001 -2406502 -2340499 -2181095 -2077043 -2188596
10765b188596m86162r94646j577801k147401k608389k883632k926178k719099
$$ -2188596 -2674758 -3669404 -5247205 -7394606 -10002995 -12886627 -15812805 -18531904
10757a8531904k274581j637342q84035j10047N92022J150916J527771J722038
$$ -18531904 -20806485 -22443827 -23327862 -23437909 -22845887 -21694971 -20167200 -18445162
10749a8445162J771129J738539J691524J678211J712609J770107J796230J731672
$$ -18445162 -16674033 -14935494 -13243970 -11565759 -9853150 -8083043 -6286813 -4555141
10741d555141J545234J253326R12345N94496L68463K91416M01408P03226J155674
$$ -4555141 -3009907 -1756581 -844236 -249740 118723 410139 811547 1514773 2670447
10732B670447J672028K136710K434448K485550K274869J857884J338285Q30668
$$ 2670447 4342475 6479185 8913633 11399183 13674052 15531936 16870221 17700889
10724A7700889M27859J80553Q7454R8818J39223J42696P9694l7956j68571k56867
$$ 17700889 18128748 18309301 18396755 18495573 18634796 18777492 18857186 18819230 18650659 18393792
10714A8393792k53439j40491M5945K17505K66617J14013k58093q03633j436304
$$ 18393792 18140353 17999862 18045807 18263312 18529929 18643942 18385849 17582216 16145912
10705A6145912k061466k599116k990585l192738l170436k896794k363824j597845
$$ 16145912 14084446 11485330 8494745 5302007 2131571 -765223 -3129047 -4726892
10697d726892o68642L16778J235342J972792K441242K589261K411786J961476
$$ -4726892 -5395534 -5078756 -3843414 -1870622 570620 3159881 5571667 7533143
10689G533143J351867P40650K90389J16476K42200N85322R89878J290283J372199
$$ 7533143 8885010 9625660 9916049 10032525 10274725 10860047 11849925 13140208 14512407
10680A4512407J199443Q04271K59554l49996r50823j494524j959350k340886k639489
$$ 14512407 15711850 16516121 16775675 16425679 15474856 13980332 12020982 9680096 7040607
10671G040607k850620k959972k946219k794119k511778k136571j721040j309557
$$ 7040607 4189987 1230015 -1716204 -4510323 -7022101 -9158672 -10879712 -12189269
10663a2189269r26252n82353k90632o8172P9832J84562L25663O13894J143157
$$ -12189269 -13115521 -13697874 -13988506 -14056678 -13976846 -13792284 -13466621 -12852727 -11709570
10654a1709570J931716K885169L807185M459098M642543M269078L390411K179495
$$ -11709570 -9777854 -6892685 -3085500 1373598 6016141 10285219 13675630 15855125
10646A5855125Q67227l44000j349962k155870k821773l384567l816369m043924
$$ 15855125 16722352 16378352 15028390 12872520 10050747 6666180 2849811 -1194113
10638a194113m003211l685634l151689k512822j893136j387318j034654q22617
$$ -1194113 -5197324 -8882958 -12034647 -14547469 -16440605 -17827923 -18862577 -19685194
10630a9685194p14672o81545p17159q33897j044098j340652j688626k032033k309017
$$ -19685194 -20399866 -21081411 -21798570 -22632467 -23676565 -25017217 -26705843 -28737876 -31046893
10621c1046893k465627k463874k284642j924961j390042o87800J63953J119241
$$ -31046893 -33512520 -35976394 -38261036 -40185997 -41576039 -42263839 -42099886 -40980645
10613d0980645K091867K966331L630299M009580M085887L891434L489519K955251
$$ -40980645 -38888778 -35922447 -32292148 -28282568 -24196681 -20305247 -16815728 -13860477
10605a3860477K364517J789496J294860R31078P24878O69734P24000Q26560R29186
$$ -13860477 -11495960 -9706464 -8411604 -7480526 -6755648 -6085914 -5361914 -4535354 -3606168
10596c606168J024582J143452J317594J538349J745946J859215J824720J653311
$$ -3606168 -2581586 -1438134 -120540 1417809 3163755 5022970 6847690 8501001
10588H501001J420430J225006J126361J098508J036555Q15289L61765l04338j082686
$$ 8501001 9921431 11146437 12272798 13371306 14407861 15223150 15584915 15280577 14197891
10579A4197891j841507k471018k913948l165475l253242l214314l080147k872530
$$ 14197891 12356384 9885366 6971418 3805943 552701 -2661613 -5741760 -8614290
10571h614290k609104k312992k015908j745940j505570j260742r57572n59626
$$ -8614290 -11223394 -13536386 -15552294 -17298234 -18803804 -20064546 -21022118 -21581744
10563b1581744p8134M28662Q85727J237070J463186J576376J608597J604245J614414
$$ -21581744 -21659878 -21231216 -20345489 -19108419 -17645233 -16068857 -14460260 -12856015 -11241601
10554a1241601J682186J820700J999322K150929K198027K084654J799635J381127
$$ -11241601 -9559415 -7738715 -5739393 -3588464 -1390437 694217 2493852 3874979
10546C874979R00850M37508N4131k13346l58665m01036l72390k98922j87948k7319
$$ 3874979 4775829 5213337 5267468 5054122 4695457 4294421 3922031 3623109 3435161 3407842
10536C407842K06444N36610R69615J474664J974415K362714K546156K486659K221915
$$ 3407842 3614286 4150896 5120511 6595175 8569590 10932304 13478460 15965119 18187034
10527A8187034J854482J515774J323727J355231J639372K158475K846046L590706
$$ 18187034 20041516 21557290 22881017 24236248 25875620 28034095 30880141 34470847
10519C4470847M260471M740672M962334M909545M614072M146716L605901L103580
$$ 34470847 38731318 43471990 48434324 53343869 57957941 62104657 65710558 68814138
10511F8814138K751624K646606K848790L362816M136325N080779O101180P120322
$$ 68814138 71565762 74212368 77061158 80423974 84560299 89641078 95742258 102862580
10503A02862580Q092304R004302R870732J0731908J1662112J2769013J4164844
$$ 102862580 110954884 119959186 129829918 140561826 152223938 164992951 179157795
10496A79157795J5922857J8051902K0493665K3112702K5657409K7697740K8565436
$$ 179157795 195080652 213132554 233626219 256738921 282396330 310094070 338659506
10489C38659506K7367708K3201321J5619330N134234o671179j7668369k6072009
$$ 338659506 366027214 389228535 404847865 409982099 403310920 385642551 359570542
10482C59570542l1096447l3000343l2648308l0991802k8748028k6309775k3806446
$$ 359570542 328474095 295473752 262825444 231833642 203085614 176775839 152969393
10475A52969393k1235045j8583409j5885319j3209402j0633244q234129o085156
$$ 152969393 131734348 113150939 97265620 84056218 73422974 65188845 59103689
10468E9103689m245792k757224j646535r25207n77364n53723p79969j168159j624277
$$ 59103689 54857897 52100673 50454138 49528931 48951567 48397844 47617875 46449716 44825439
10459D4825439k061563k421671k684625k854371k935490k925469k823552k637336
$$ 44825439 42763876 40342205 37657580 34803209 31867719 28942250 26118698 23481362
10451B3481362k376453k042587j630790j144791o13211q8285L78558P68158J107256
$$ 23481362 21104909 19062322 17431532 16286741 15673530 15585245 15963803 16731961 17839217
10442A7839217J453436J861679K351096K886748L385433L745857L889526L790004
$$ 17839217 19292653 21154332 23505428 26392176 29777609 33523466 37412992 41202996
10434D1202996L475896L011110K467361J902806J351897Q22247K93165k79203
$$ 41202996 44678892 47690002 50157363 52060169 53412066 54234313 54527478 54248275
10426E4248275r38064j686697k463737l162826l687690l998057m112002m072929
$$ 54248275 53310211 51623514 49159777 45996951 42309261 38311204 34199202 30126273
10418C0126273l916058l660458l326357k956987k619650k376690k246311k187058
$$ 30126273 26210215 22549757 19223400 16266413 13646763 11270073 9023762 6836704
10410F836704k119549j965583j676853j245712p06747j33226L76309P22707Q34889
$$ 6836704 4717155 2751572 1074719 -170993 -877740 -1010966 -634657 88050 922939
10401I22939O92265L31607j68197p19656j259981j763068k225188k638635k972313
$$ 922939 1615204 1946811 1778614 1058958 -201023 -1964091 -4189279 -6827914 -9800227
10392i800227l170195l168159k921228k426544j729400r11275o9519P02981J336419
$$ -9800227 -12970422 -16138581 -19059809 -21486353 -23215753 -24127028 -24196547 -23493566 -22157147
10383b2157147J797998K091782K239180K251969K121321J834877J408837R07716
$$ -22157147 -20359149 -18267367 -16028187 -13776218 -11654897 -9820020 -8411183 -7503467
10375g503467M33113Q4307q8010j07058n6127l1780r5045k52289m70609p05288
$$ -7503467 -7070354 -6986047 -7074057 -7181115 -7237242 -7269022 -7364067 -7616356 -8086965 -8792253
10365h792253r17386j079896j180992j224759j223722j185794j106718r74068
$$ -8792253 -9709639 -10789535 -11970527 -13195286 -14419008 -15604802 -16711520 -17685588
10357a7685588p78254n22181k23268R5172M18457P46464J080086J397801J647361
$$ -17685588 -18463842 -18986023 -19209291 -19114119 -18695662 -17949198 -16869112 -15471311 -13823950
10348a3823950J765601J712800J495941J167430Q04313M82250K57474J63438K18610
$$ -13823950 -12058349 -10345549 -8849608 -7682178 -6877865 -6395615 -6138141 -5974703 -5756093
10339e756093M33686Q08028J315800J893436K442896K856754L054925L011094
$$ -5756093 -5322407 -4514379 -3198579 -1305143 1137753 3994507 7049432 10060526
10331A0060526K753192K343275J855640J364256R35505O19515M41530L96847M48154
$$ 10060526 12813718 15156993 17012633 18376889 19312394 19931909 20373439 20770286 21218440
10322B1218440N25767N40586M18409J43912k17943n48849p42693p65814o69316
$$ 21218440 21744207 22284793 22703202 22847114 22629171 22080322 21337629 20571815 19902499
10313A9902499n50249m98765n70939p93579j177450j717721k383124l109770l811432
$$ 19902499 19352250 18853485 18282546 17488967 16311517 14593796 12210672 9100902 5289470
10304E289470m404482m832126n068381n096056m879127m361018l499723k317019
$$ 5289470 884988 -3947138 -9015519 -14111575 -18990702 -23351720 -26851443 -29168462
10296b9168462r26671M77703J670745K460148K742496K528120J928467J118209
$$ -29168462 -30095133 -29617430 -27946685 -25486537 -22744041 -20215921 -18287454 -17169245
10288a7169245K90305l85173p93906q96109p24969l63926R0557N67049J039163
$$ -17169245 -16878940 -17264113 -18058019 -18954128 -19679097 -20043023 -19952466 -19385417 -18346254
10279a8346254J513346J991653K439384K785651K956209K911519K663316K263619
$$ -18346254 -16832908 -14841255 -12401871 -9616220 -6660011 -3748492 -1085176 1178443
10271A178443J778864J266890P67761L07313r6796m35110p10165r34774j121312
$$ 1178443 2957307 4224197 4991958 5299271 5202475 4767365 4057200 3122426 2001114
10262B001114j270403j370930j413164j402219j355567j282409j163165r53209
$$ 2001114 730711 -640219 -2053383 -3455602 -4811169 -6093578 -7256743 -8209952
10254h209952o16647j69344L01553O60823P82092O05387J60354m55209j119049
$$ -8209952 -8826599 -8995943 -8694390 -8033567 -7251475 -6646088 -6485734 -6940943 -8059992
10245h059992j717741k157986k370813k324837k043632j606871j123171o85639
$$ -8059992 -9777733 -11935719 -14306532 -16631369 -18675001 -20281872 -21405043 -22090682
10237b2090682l38111p5168J27235K79385L70502L85354L23158K04753P0517k8194
$$ -22090682 -22428793 -22503961 -22376726 -22097341 -21726839 -21341485 -21018327 -20813574 -20743057 -20771251
10227b0771251m6845L2026J94073M09103O48144Q82951J075965J181530J161841
$$ -20771251 -20818096 -20786070 -20591997 -20182894 -19534750 -18651799 -17575834 -16394304 -15232463
10218a5232463J002930P20268L54997l6717l98998o88045q73904r38827q82686
$$ -15232463 -14229533 -13509265 -13154268 -13190985 -13589983 -14278028 -15151932 -16090759 -16973445
10209a6973445p29547n19207k84313l4653K36548N34806Q54208J179227J489445
$$ -16973445 -17702992 -18222199 -18506512 -18541165 -18304617 -17769811 -16915603 -15736376 -14246931
10200a4246931J760303J961205K056198K012831J820583J509091J148936Q27428
$$ -14246931 -12486628 -10525423 -8469225 -6456394 -4635811 -3126720 -1977784 -1150356
10192a150356O12982N31565N67306O80658Q28768R76932J098871J170598J164873
$$ -1150356 -537374 -5809 561497 1242155 2070923 3047855 4146726 5317324 6482197
10183F482197J051115Q02810M11752r6561o57990j185464j602787j878434k037510
$$ 6482197 7533312 8336122 8747874 8651313 7993323 6807859 5205072 3326638 1289128
10174A289128k141919k248879k373286k479019k504854k405517k179101j866143
$$ 1289128 -852791 -3101670 -5474956 -7953975 -10458829 -12864346 -15043447 -16909590
10166a6909590j527656j218821r70469p83063o33438m89851l25697j22782J35694
$$ -16909590 -18437246 -19656067 -20626536 -21409599 -22043037 -22532888 -22858585 -22981367 -22845673
10157b2845673M70970Q99811J409695J935297K360515K555890K435578K001494
$$ -22845673 -22374703 -21474892 -20065197 -18129900 -15769385 -13213495 -10777917 -8776423
10149h776423J347418O18167n3618n94042r88801j245279j355002j290961j036722
$$ -8776423 -7429005 -6810838 -6864456 -7458498 -8447299 -9692578 -11047580 -12338541 -13375263
10140a3375263o14764q8623M57936R45385J312769J521639J555242J417170J130186
$$ -13375263 -13990027 -14078650 -13620714 -12675329 -11362560 -9840921 -8285679 -6868509 -5738323
10131e738323P34502K84858j56119n33136q21713j044543j259030j514435j809377
$$ -5738323 -5003821 -4718963 -4875082 -5408218 -6229931 -7274474 -8533504 -10047939 -11857316
10122a1857316k086035k265198k290354k147442j855120j444965r51677m17313
$$ -11857316 -13943351 -16208549 -18498903 -20646345 -22501465 -23946430 -24898107 -25315420
10114b5315420J02992N49585Q83039J106962J266803J422125J612885J842334
$$ -25315420 -25212428 -24662843 -23779804 -22672842 -21406039 -19983914 -18371029 -16528695
10106a6528695K080136K272629K349681K234037J867395J252388M82621k73823
$$ -16528695 -14448559 -12175930 -9826249 -7592212 -5724817 -4472429 -3989808 -4263631
10098d263631q40865j112339j093281q86726o42598m96351n20117p02748r64009
$$ -4263631 -5104496 -6216835 -7310116 -8196842 -8839440 -9335791 -9855908 -10558656 -11522665
10089a1522665j191289j279822j166433q54231m19065J4168L20067M21516L17364
$$ -11522665 -12713954 -13993776 -15160209 -16014440 -16433505 -16419337 -16099270 -15677754 -15360390
10080a5360390Q4677j42694k18825m1441M10559J079836J863064K642376L299699
$$ -15360390 -15275713 -15418407 -15637232 -15678673 -15268114 -14188278 -12325214 -9682838 -6383139
10071f383139L725078L835293L600759L062584K324924J523819P86531J98258
$$ -6383139 -2658061 1177232 4777991 7840575 10165499 11689318 12475849 12674107
10063A2674107k11760m60433n84573o16274n76624m86320l74032k68906j85559
$$ 12674107 12462347 12001914 11417341 10801067 10224443 9738123 9364091 9095185 8909626
10054H909626j19326n5809J5901R5116J68004K14365K23351K08213K05469K58353
$$ 8909626 8790300 8734491 8750392 8845508 9013512 9227877 9451228 9659441 9864910 10123263
10044A0123263L99927O45985R92061J408487J839861K216341K470976K551015
$$ 10123263 10523190 11169175 12161236 13569723 15409584 17625925 20096901 22647916
10036B2647916K420651K063345J490483P53863m8448p85021j325991j586757j557614
$$ 22647916 25068567 27131912 28622395 29376258 29327810 28542789 27216798 25630041 24072427
10027B4072427j304652r43666n98997l62548k70659l10635m49603o61605r34372
$$ 24072427 22767775 21824109 21225112 20862564 20591905 20281270 19831667 19170062 18235690
10018A8235690j257159j602572j914388k111540k115049j889684j474236r76123
$$ 18235690 16978531 15375959 13461571 11350031 9234982 7345298 5871062 4894939
10010D894939n30307k46203j71486k90603n55689r26120j386211j930394k535623
$$ 4894939 4364632 4118429 3946943 3656340 3100651 2174531 788320 -1142074 -3677697
10001c677697l149791l704662m137475m402211m467393m312670l936366l370754
$$ -3677697 -6827488 -10532150 -14669625 -19071836 -23539229 -27851899 -31788265 -35159019
9993c5159019k687834j983229j347270q43955n05871l34995l00050l34749l46413
$$ -35159019 -37846853 -39830082 -41177352 -42021307 -42527178 -42862173 -43162223 -43496972 -43843385
9984d3843385k38253N7128N41605J132751J685095K050757K146260J986518J673831
$$ -43843385 -44081638 -44024510 -43482905 -42350154 -40665059 -38614302 -36468042 -34481524 -32807693
9975c2807693J357871J188469J274947J659355K308103L122313L962334M678593
$$ -32807693 -31449822 -30261353 -28986406 -27327051 -25018948 -21896635 -17934301 -13255708
9967a3255708N140672N260844N011441M430976L608467K647907J637693O49102
$$ -13255708 -8115036 -2854192 2157249 6588225 10196692 12844599 14482292 15131394
9959A5131394k46060r71944j470947j726255j758118j598943j270546p77542j17664
$$ 15131394 14885334 13913390 12442443 10716188 8958070 7359127 6088581 5311039 5193375
9950E193375O96312J616928K563453L446796M196415M767758N131849N262365
$$ 5193375 5889687 7506615 10070068 13516864 17713279 22481037 27612886 32875251
9942C2875251N129958M706565L980019K972124J747322M07483r21642k112106
$$ 32875251 38005209 42711774 46691793 49663917 51411239 51818722 50897080 48784974
9934D8784974l067195l751950m192455m441819m548320m552908m499552m428392
$$ 48784974 45717779 41965829 37773374 33331555 28783235 24230327 19730775 15302383
9926A5302383m352440m241682m028245l631216k994478k119270j064644Q5741
$$ 15302383 10949943 6708261 2680016 -951200 -3945678 -6064948 -7129592 -7043851
9918g043851J254284K369134L350620M116467M603419M780672M649520M240600
$$ -7043851 -5789567 -3420433 -69813 4046654 8650073 13430745 18080265 22320865
9910B2320865L609860K829121J978446J146208M30704n2781j45420L82321J808351
$$ 22320865 25930725 28759846 30738292 31884500 32315204 32262423 32117003 32499324 34307675
9901C4307675M375792Q182319J3030303J8204830K2329962K3657904K0922981
$$ 34307675 38683467 46865786 59896089 78100919 100430881 124088785 145011766
9894A45011766J4260034N371064l326535r920517j3678290j4886010j4287039
$$ 145011766 159271800 164642864 161316329 151395812 137717522 122831512 108544473
9887A08544473j2645776j0578702q523981o750087n390020m481254l983584l789653
$$ 108544473 95898697 85319995 76796014 70045927 64655907 60174653 56191069 52401416
9879E2401416l757779l757519l700324l553773l347121l155576l055440l077913
$$ 52401416 48643637 44886118 41185794 37632021 34284900 31129324 28073884 24995971
9871B4995971l196622l349902l474661l535735l540220l524130l516754l516141
$$ 24995971 21799349 18449447 14974786 11439051 7898831 4374701 857947 -2658194
9863b658194l500398l456514l390443l311073l211296l064602k835279k493064
$$ -2658194 -6158592 -9615106 -13005549 -16316622 -19527918 -22592520 -25427799 -27920863
9855b7920863k026155j447997p94943j15722N44931J163217J741627K293037K813684
$$ -27920863 -29947018 -31395015 -32189958 -32305680 -31760749 -30597532 -28855905 -26562868 -23749184
9846b3749184L269226L603160L753243L663522L297465K656718J791917P91813
$$ -23749184 -20479958 -16876798 -13123555 -9460033 -6162568 -3505850 -1713933 -922120
9838i22120k41011j208994k027416k628211k963451l008579k769393k293722j676397
$$ -922120 -1163131 -2372125 -4399541 -7027752 -9991203 -12999782 -15769175 -18062897 -19739294
9829a9739294j044438n25196k12687j43485k86609n51488q15083r58149q95208
$$ -19739294 -20783732 -21308928 -21521615 -21665100 -21951709 -22503197 -23318280 -24276429 -25171637
9820b5171637n90041n7157O48868J451663K268790L019574L633284M067073M321959
$$ -25171637 -25761678 -25818835 -25169967 -23718304 -21449514 -18429940 -14796656 -10729583 -6407624
9811f407624M431994M423897M281292L951828L394762K625618J718660P71397
$$ -6407624 -1975630 2448267 6729559 10681387 14076149 16701767 18420427 19191824
9803A9191824j31871r30468j578609k040235k295724k350627k237099k010279
$$ 19191824 19059953 18129485 16550876 14510641 12214917 9864290 7627191 5616912
9795E616912j744247j525237j436570j535067j826666k253275k701368l032721
$$ 5616912 3872665 2347428 910858 -624209 -2450875 -4704150 -7405518 -10438239
9787a0438239l124615k903356k363339j570789o49361K54302J014133J556503
$$ -10438239 -13562854 -16466210 -18829549 -20400338 -21049699 -20795397 -19781264 -18224761
9779a8224761J867588J980095J949789J830263J656028J444155J211706R90466
$$ -18224761 -16357173 -14377078 -12427289 -10597026 -8940998 -7496843 -6285137 -5294671
9771e294671Q24099P52008P93550R37643J136271J306850J353545J205899Q54868
$$ -5294671 -4470572 -3718564 -2925014 -1987371 -851100 455750 1809295 3015194 3870062
9762C870062L61938j66521o23374r34917j068269j020184q08550m75270q8935
$$ 3870062 4232000 4065479 3442105 2507188 1438919 418735 -389815 -865085 -954020
9753i54020K67149N20786O37397O33026N64297M95002M56283M28855L61705K10213
$$ -954020 -686871 -166085 471312 1104338 1668635 2163637 2619920 3048775 3410480 3620693
9743C620693l7320l58243p08802j038303j301166j468208j534600j521736j475008
$$ 3620693 3583373 3225130 2516328 1478025 176859 -1291349 -2825949 -4347685 -5822693
9734e822693j459554j550465j811780k265848k867260l501784m020967m298359
$$ -5822693 -7282247 -8832712 -10644492 -12910340 -15777600 -19279384 -23300351 -27598710
9726b7598710m273611l957880l404825k675832j823511q94044O5506J005199J874899
$$ -27598710 -31872321 -35830201 -39235026 -41910858 -43734369 -44628413 -44562907 -43557708 -41682809
9717d1682809K626727L215210L598219L744213L647755L346042K921960K484401
$$ -41682809 -39056082 -35840872 -32242653 -28498440 -24850685 -21504643 -18582683 -16098282
9709a6098282K132570J924413J865618J918640K018225K084314K036348J815829
$$ -16098282 -13965712 -12041299 -10175681 -8257041 -6238816 -4154502 -2118154 -302325
9701c02325J410968Q65386K60336l18157q02891j146172j307433j250042r57473
$$ -302325 1108643 1974029 2234365 1916208 1113317 -32855 -1340288 -2590330 -3547803
9692c547803m55432J82896Q55951J462745J924135K193591K263162K162028J938906
$$ -3547803 -4003235 -3820339 -2964388 -1501643 422492 2616083 4879245 7041273 8980179
9683H980179J633101J256434Q03826K84986k49479p09907j000288j064599r19076
$$ 8980179 10613280 11869714 12673540 12958526 12709047 11999140 10998852 9934253 9015177
9674I015177o49246l73703j98849j88820l55400o59034j017052j324303j486907
$$ 9015177 8365931 7992228 7793379 7604559 7249159 6590125 5573073 4248770 2761863
9665B761863j456579j248016r30132n96197l28174j72145j32924j83173k76864
$$ 2761863 1305284 57268 -872864 -1469061 -1797235 -1969380 -2102304 -2285477 -2562341
9656b562341l63083m03013l88404l49111l38164m00730n50766p73584j047471
$$ -2562341 -2925424 -3328437 -3716841 -4065952 -4404116 -4804846 -5355612 -6129196 -7176667
9647g176667j360733j710236k088342k470648k807496l020606l015828k719668
$$ -7176667 -8537400 -10247636 -12335978 -14806626 -17614122 -20634728 -23650556 -26370224
9639b6370224k122093j291573l49044N76339J378021J981666K346227K465859
$$ -26370224 -28492317 -29783890 -30132934 -29556595 -28178574 -26196908 -23850681 -21384822
9631b1384822K371142K127331J828901J585046J490203J587011J843029K158628
$$ -21384822 -19013680 -16886349 -15057448 -13472402 -11982199 -10395188 -8552159 -6393531
9623f393531K404987K475077K325969J994644J580168J200908R48569Q61787R29712
$$ -6393531 -3988544 -1513467 812502 2807146 4387314 5588222 6536791 7398578 8328290
9614H328290J118170J397781J754089K175424K633020L072068L420582L609554
$$ 8328290 9446460 10844241 12598330 14773754 17406774 20478842 23899424 27508978
9606B7508978L594868L373506K987844K514195K038817J630010J314749J067567
$$ 27508978 31103846 34477352 37465196 39979391 42018208 43648218 44962967 46030534
9598D6030534Q19983M92552L5755n44334j190102j820043k362189k777759l066355
$$ 46030534 46850517 47343069 47378824 46834490 45644388 43824345 41462156 38684397 35618042
9589C5618042l251524l356970l391816l355117l249081l081761k855895k561754
$$ 35618042 32366518 29009548 25617732 22262615 19013534 15931773 13075878 10514124
9581A0514124k189413j751948j294570q77771n49933l35266k43951k85176m60499
$$ 10514124 8324711 6572763 5278193 4400422 3850489 3515223 3271272 2986096 2525597
9572B525597p39022j041767j260930j310307j173531r15539o49291m79223m52978
$$ 2525597 1786575 744808 -516122 -1826429 -2999960 -3915499 -4564790 -5044013 -5496991
9563e496991n43818o69960p40968p06226n76597m07818k63350j86667j95889k89114
$$ -5496991 -6040809 -6710769 -7451737 -8157963 -8734560 -9142378 -9405728 -9592395 -9788284 -10077398
9553a0077398m44271o13546p25484p04344n01789j23151L71540Q97620J389540
$$ -10077398 -10521669 -11135215 -11860699 -12565043 -13066832 -13189983 -12818443 -11920823 -10531283
9544a0531283J828677K238399K655221L098472L555426L986159M340889M574549
$$ -10531283 -8702606 -6464207 -3808986 -710514 2844912 6831071 11171960 15746509
9536A5746509M646665M513516M134128L497520K648060J679448O97880k14941
$$ 15746509 20393174 24906690 29040818 32538338 35186398 36865846 37563726 37348785
9528C7348785j013539j676866k191084k541414k717940k730902k621718k455096
$$ 37348785 36335246 34658380 32467296 29925882 27207942 24477040 21855322 19400226
9520A9400226k292085k160726k041788j874650j579673j091052l89265M83043
$$ 19400226 17108141 14947415 12905627 11030977 9451304 8360252 7970987 8454030
9512H454030J431310K338368L096334L628602L897758L900411L654742L190356
$$ 8454030 9885340 12223708 15320042 18948644 22846402 26746813 30401555 33591911
9504C3591911K545455J766468R03715N761q79862j700239k395599k909993l209014
$$ 33591911 36137366 37903834 38807549 38813310 37933448 36233209 33837610 30927617 27718603
9495B7718603l292869l198133k988416k736793k504099k321099k184944k072807
$$ 27718603 24425734 21227601 18239185 15502392 12998293 10677194 8492250 6419443
9487F419443j960782j830227j658908j416092j079733o65123k32402J42816M11773
$$ 6419443 4458661 2628434 969526 -446566 -1526299 -2191422 -2423824 -2281008 -1869235
9478a869235N70447O43590O58966O36542N93599N52685N44952O08535P79362J072518
$$ -1869235 -1298788 -655198 3768 640310 1233909 1786594 2331546 2940081 3719443 4791961
9468D791961J462941J881342K231072K415227K360750K036652J467156P32088
$$ 4791961 6254902 8136244 10367316 12782543 15143293 17179945 18647101 19379189
9460A9379189n5412p86459j383882j802318k012347j994056j747161j299465o97171
$$ 19379189 19323777 18537318 17153436 15351118 13338771 11344715 9597554 8298089 7600918
9451G600918J4507P98462J613590K400223L082787L590026L874643L916505L712367
$$ 7600918 7615425 8413887 10027477 12427700 15510487 19100513 22975156 26891661 30604028
9442C0604028L269857K617945J824551R96841K50540l36797p55175j051971j290002
$$ 30604028 33873885 36491830 38316381 39313222 39563762 39226965 38471790 37419819 36129817
9433C6129817j503473j679239j771573j738214j575241j331241j093540r53382
$$ 36129817 34626344 32947105 31175532 29437318 27862077 26530836 25437296 24483914
9425B4483914r66095j124668j361341j580334j707040j725966j685257j667638
$$ 24483914 23517819 22393151 21031810 19451476 17744436 16018470 14333213 12665575
9417A2665575j747177j953028k251757k552563k736541k702340k408889j893671
$$ 12665575 10918398 8965370 6713613 4161050 1424509 -1277831 -3686720 -5580391
9409e580391j258886o35140j40168J52946K30802J38157l5373j76591j76779L7664
$$ -5580391 -6839277 -7474417 -7614585 -7461639 -7230837 -7092680 -7128053 -7304644 -7481423 -7443759
9399g443759M83598J118047J850478K560478L119424L421630L417038L120738
$$ -7443759 -6960161 -5842114 -3991636 -1431158 1688266 5109896 8526934 11647672
9391A1647672K585717J861102R76024l6184j100251k087037k841304l230743l186799
$$ 11647672 14233389 16094491 17070515 17034331 15934080 13847043 11005739 7774996 4588197
9382D588197k720599j915480r06554J45084J080691J770937K133837K138871J802836
$$ 4588197 1867598 -47882 -954436 -809352 271339 2042276 4176113 6314984 8117820
9373H117820J187127L96947m29259j149848j662458j936623k015616j985132j927536
$$ 8117820 9304947 9701894 9272635 8122787 6460329 4523706 2508090 522958 -1404578
9364a404578j887564j865373j835392j777429j701641j650693j674947j798279
$$ -1404578 -3292142 -5157515 -6992907 -8770336 -10471977 -12122670 -13797617 -15595896
9356a5595896k003463k248706k495211k717503k893124k993049k988497k866139
$$ -15595896 -17599359 -19848065 -22343276 -25060779 -27953903 -30946952 -33935449 -36801588
9348c6801588k635095k320231j948444j537344j094995o34828j96228J51860L38501
$$ -36801588 -39436683 -41756914 -43705358 -45242702 -46337697 -46972525 -47168753 -47016893 -46678392
9339d6678392L34450J76715m8008k48774l70776m05779l74875l04983k16676j22878
$$ -46678392 -46343942 -46167227 -46215235 -46464009 -46834785 -47240564 -47615439 -47920422 -48137098 -48259976
9329d8259976k7428Q0702K29414M53324P74490J186508J652186K116359K526621
$$ -48259976 -48287404 -48206702 -47977288 -47523964 -46749474 -45562966 -43910780 -41794421 -39267800
9320c9267800K850222L077677L213646L264863L233947L118649K911041K595941
$$ -39267800 -36417578 -33339901 -30126255 -26861392 -23627445 -20508796 -17597755 -15001814
9312a5001814K154680J579464Q94757J72032m78214r41802j147870j100122q74865
$$ -15001814 -12847134 -11267670 -10372913 -10200881 -10679095 -11620897 -12768767 -13868889 -14743754
9303a4743754n90893l69168k97161m05784o65280j002953j335191j597960j763161
$$ -14743754 -15334647 -15703815 -16000976 -16406760 -17072040 -18074993 -19410184 -21008144 -22771305
9294b2771305j837423j845945j808756j724081j573561j347784j068925p86613
$$ -22771305 -24608728 -26454673 -28263429 -29987510 -31561071 -32908855 -33977780 -34764393
9286c4764393n47472l63481k03243r200K73247O69437J160795J687239K168055
$$ -34764393 -35311865 -35675346 -35878589 -35887789 -35614542 -34945105 -33784310 -32097071 -29929016
9277b9929016K532379K742569K798932K729733K579581K403822K264686K220008
$$ -29929016 -27396637 -24654068 -21855136 -19125403 -16545822 -14142000 -11877314 -9657306
9269i657306K301518K491677K715892K861417K816259K506676J915997J084782
$$ -9657306 -7355788 -4864111 -2148219 713198 3529457 6036133 7952130 9036912
9261I036912J00818r19209j858316k629137l186548l516013l612617l471652l096860
$$ 9036912 9137730 8218521 6360205 3731068 544520 -2971493 -6584110 -10055762 -13152622
9252a3152622k516736j796228j034057l40331J99585N54088P45521Q20771Q15636
$$ -13152622 -15669358 -17465586 -18499643 -18839974 -18640389 -18086301 -17340780 -16520009 -15704373
9243a5704373P39299N85999L58663Q1776k08552m89360p68324j076118j435731
$$ -15704373 -14965074 -14379075 -14020412 -13938636 -14147188 -14636548 -15404872 -16480990 -17916721
9234a7916721j829265k184985k394442k352401k000741j355768n07440M06672
$$ -17916721 -19745986 -21930971 -24325413 -26677814 -28678555 -30034323 -30541763 -30135091
9226c0135091J239755J872317K237533K331116K206472J959110J703060J539741
$$ -30135091 -28895336 -27023019 -24785486 -22454370 -20247898 -18288788 -16585728 -15045987
9218a5045987J522932J632545J773819J809473J615263J136309M18618m00458
$$ -15045987 -13523055 -11890510 -10116691 -8307218 -6691955 -5555646 -5137028 -5537486
9210e537486j139643j635641j790866j592713j108955m69188J64626O38016Q45032
$$ -5537486 -6677129 -8312770 -10103636 -11696349 -12805304 -13274492 -13109866 -12471850 -11626818
9201a1626818P53204M01050j27028p32181j324451j833425k209600k422493k460430
$$ -11626818 -10873614 -10472564 -10599592 -11331773 -12656224 -14489649 -16699249 -19121742 -21582172
9192b1582172k332881k069974j712111j291595q20727k99641K61109Q23729J327525
$$ -21582172 -23915053 -25985027 -27697138 -28988733 -29809460 -30109101 -29847992 -29024263 -27696738
9183b7696738J711580J942274K032358K039868K040189K082755K163326K235925
$$ -27696738 -25985158 -24042884 -22010526 -19970658 -17930469 -15847714 -13684388 -11448463
9175a1448463K254035K205482K117649K039294K017178K076698K209252K372057
$$ -11448463 -9194428 -6988946 -4871297 -2832003 -814825 1261873 3471125 5843182
9167E843182K504517K553551K493381K331097K098421J833398J557683J259649
$$ 5843182 8347699 10901250 13394631 15725728 17824149 19657547 21215230 22474879
9159B2474879Q94301M02869k56602j081889k015688k958357l799674m452558m869789
$$ 22474879 23369180 23772049 23515447 22433558 20417870 17459513 13659839 9207281 4337492
9150D337492n038536m964342m660586m150673l478845k720022j977550j361108
$$ 4337492 -701044 -5665386 -10325972 -14476645 -17955490 -20675512 -22653062 -24014170
9142b4014170r47747p44341o76332o15448m34578o0884M98344J163995J816862
$$ -24014170 -24961917 -25706258 -26382590 -26998038 -27432616 -27493500 -26995156 -25831161 -24014299
9133b4014299K336014K631041K662152K447394K057907J600858J190487R14554
$$ -24014299 -21678285 -19047244 -16385092 -13937698 -11879791 -10278933 -9088446 -8173892
9125h173892Q12022Q74794J069186J357844J706911K081011K438709K734721K926014
$$ -8173892 -7361870 -6487076 -5417890 -4060046 -2353135 -272124 2166585 4901306 7827320
9116G827320K979177K879772K640617K299618J903553J488684J074459O73056
$$ 7827320 10806497 13686269 16326886 18626504 20530057 22018741 23093200 23766256
9108B3766256L00852k3232k92814n29286p82496j110966j548923k079940k638919
$$ 23766256 24067108 24043876 23751062 23221776 22439280 21328314 19779391 17699451 15060532
9099A5060532l146660l553161l855011m074624m224001m286360m225976m008786
$$ 15060532 11913872 8360711 4505700 431076 -3792925 -8079285 -12305261 -16314047
9091a6314047l613273l030223k264748j348169l50305O24631J464591K085511
$$ -16314047 -19927320 -22957543 -25222291 -26570460 -26920765 -26296134 -24831543 -22746032
9083b2746032K454652K589820K539844K359871K091636J754779J353863Q99186
$$ -22746032 -20291380 -17701560 -15161716 -12801845 -10710209 -8955430 -7601567 -6702381
9075f702381M26700k308l25915n12881n76696n63435n23681m86842m52176m00918
$$ -6702381 -6275681 -6277989 -6603904 -7116785 -7693481 -8256916 -8780597 -9267439 -9719615 -10120533
9065a0120533l21131k27560j60644j63130k49146l86094n01825n14026l64918
$$ -10120533 -10441664 -10669224 -10829868 -10992998 -11242144 -11628238 -12130063 -12644089 -13009007
9056a3009007m1203M30074J000694J616509K217602K730855L073782L180298L037463
$$ -13009007 -13050210 -12620136 -11619442 -10002933 -7785331 -5054476 -1980694 1199604 4237067
9047D237067K705863K302192J948907J721175J622678J599140J573784J483368
$$ 4237067 6942930 9245122 11194029 12915204 14537882 16137022 17710806 19194174
9039A9194174J303576J060766Q25790O85956P03354Q82064J164698J458427J671735
$$ 19194174 20497750 21558516 22384306 23070262 23773616 24655680 25820378 27278805 28950540
9030B8950540J742878J653891J431674J135463Q31236N64321L48197J75373L5199
$$ 28950540 30693418 32347309 33778983 34914446 35745682 36310003 36658200 36833573 36868772
9021C6868772q0961j88609l16394m97982p56137j092710j487301j898350k266977
$$ 36868772 36787811 36599202 36282808 35784826 35028689 33935979 32448678 30550328 28283351
9012B8283351k531674k652848k629053k488588k264601j979738j654107j323181
$$ 28283351 25751677 23098829 20469776 17981188 15716587 13736849 12082742 10759561
9004A0759561j042659q72984q54491r87361j225075j486522j686639j772865j744151
$$ 10759561 9716902 8843918 7989427 7002066 5776991 4290469 2603830 830965 -913186
8995i13186j637925j495115j331563j137132q98854o24813l47365j03198R3815
$$ -913186 -2551111 -4046226 -5377789 -6514921 -7413775 -8038588 -8385953 -8489151 -8395336
8986h395336K66582M65018P37474J100523J526052J952896K311398K540476K589387
$$ -8395336 -8128754 -7663736 -6926262 -5825739 -4299687 -2346791 -35393 2505083 5094470
8977E094470K417055K004043J371128N81281k86047j169976k042142k888694l678412
$$ 5094470 7511525 9515568 10886696 11467977 11181930 10011954 7969812 5081118 1402706
8968A402706m344764m796028m947125m755171m241402l490826k630818j796058
$$ 1402706 -2942058 -7738086 -12685211 -17440382 -21681784 -25172610 -27803428 -29599486
8960b9599486j089499n51442j51268J88995N47208R56861J394346J803760K136656
$$ -29599486 -30688985 -31240427 -31391695 -31202700 -30655492 -29698631 -28304285 -26500525 -24363869
8951b4363869K375411K526954K600606K594616K503728K338332K135402J949606
$$ -24363869 -21988458 -19461504 -16860898 -14266282 -11762554 -9424222 -7288820 -5339214
8943e339214J830789J803999J862988J976320K099444K188457K212094K155597
$$ -5339214 -3508425 -1704426 158562 2134882 4234326 6422783 8634877 10790474
8935A0790474K011956J768155J403281R06605L02412l42573r41105j424900j776123
$$ 10790474 12802430 14570585 15973866 16880471 17182883 16840310 15899205 14474305 12698182
8926A2698182k031256k257056k516227k843545l240737l683508m130080m526536
$$ 12698182 10666926 8409870 5893643 3050098 -190639 -3874147 -8004227 -12530763
8918a2530763m809611m909839m760630m319061l593484k658501j639486o70934
$$ -12530763 -17340374 -22250213 -27010843 -31329904 -34923388 -37581889 -39221375 -39892309
8910c9892309J46331P65949J190281J448943J575967J596851J529254J391339
$$ -39892309 -39745978 -38980029 -37789748 -36340805 -34764838 -33167987 -31638733 -30247394
8902c0247394J207006J003192Q03853O26161M79200L63901K76567K18208K05075
$$ -30247394 -29040388 -28037196 -27233343 -26607182 -26127982 -25764081 -25487514 -25269306 -25064231
8893b5064231K70354M50852P64018J191109J681129K174583K628835L026848L368362
$$ -25064231 -24793877 -24343025 -23579007 -22387898 -20706769 -18532186 -15903351 -12876503 -9508141
8884i508141L656196L885653M035607M063457L914293L547475K965483K223670
$$ -9508141 -5851945 -1966292 2069315 6132772 10047065 13594540 16560023 18783693
8876A8783693J414242O35305l8386n70514r60115j227967j406456j537414j665925
$$ 18783693 20197935 20833240 20794854 20224340 19264225 18036258 16629802 15092388 13426463
8867A3426463j819313j982400k094994k082291j899819j562932j143639p38387
$$ 13426463 11607150 9624750 7529756 5447465 3547646 1984714 841075 102688
8859A02688m24558k28539j22395m9849L5171J38960K20853K10544M3305l02173
$$ 102688 -321870 -550409 -672804 -722653 -687482 -548522 -327669 -117125 -73820 -375993
8849c75993p84077j310185j777042k110556k282374k296282k161998j880485j450910
$$ -375993 -1160070 -2470255 -4247297 -6357853 -8640227 -10936509 -13098507 -14978992 -16429902
8840a6429902q89463k41912M21082J024129J512014J865942K101094K245780K314854
$$ -16429902 -17319365 -17561277 -17140195 -16116066 -14604052 -12738110 -10637016 -8391236 -6076382
8831f076382K294904K151139J851872J396284Q29595K36812k82025o42325p97463
$$ -6076382 -3781478 -1630339 221533 1617817 2447412 2684224 2402199 1759874 962411
8822I62411p46722n30123k14869J22373M14331O20334P36927P94695Q37806Q95196
$$ 962411 215689 -314434 -529303 -406930 7401 627735 1364662 2159357 2997163 3892359
8812C892359R61091R96300R45459P58291M08667r0250o81175j276167j785882
$$ 3892359 4853450 5849750 6795209 7553500 7962167 7871917 7190742 5914575 4128693
8803D128693k149523k350732k414244k386161k305979k184364k001149j725385
$$ 4128693 1979170 -371562 -2785806 -5171967 -7477946 -9662310 -11663459 -13388844
8795a3388844j342720q71345l58265J40253N84072R67923J321749J689905K100541
$$ -13388844 -14731564 -15602909 -15961174 -15820921 -15236849 -14268926 -12947177 -11257272 -9156731
8786i156731K543894K972211L320723L537331L603848L536114L364942L114673
$$ -9156731 -6612837 -3640626 -319903 3217428 6821276 10357390 13722332 16837005
8778A6837005K796751K420540K007164J592001J215803R16295P27243O76700P70893
$$ 16837005 19633756 22054296 24061460 25653461 26869264 27785559 28512802 29189502 29960395
8769B9960395R67474J164462J229020J057223O25160l697p15438j399345j988659
$$ 29960395 30927869 32092331 33321351 34378574 35003734 35000037 34284599 32885254 30896595
8760C0896595k472961k881078l247015l582866l877929m119285m308335m455682
$$ 30896595 28423634 25542556 22295541 18712675 14834746 10715461 6407126 1951444
8752A951444m564010m621567m613162m534711m396242m213121l994422l734832
$$ 1951444 -2612566 -7234133 -11847295 -16382006 -20778248 -24991369 -28985791 -32720623
8744c2720623l413882l007001k506855j939938j360403q21609l47477P4733M79392
$$ -32720623 -36134505 -39141506 -41648361 -43588299 -44948702 -45770311 -46117788 -46043055 -45563663
8735d5563663Q99914J350732J818189K262669K632673K883150K986029K929826
$$ -45563663 -44663749 -43313017 -41494828 -39232159 -36599486 -33716336 -30730307 -27800481
8727b7800481K717313K368814J925987J446392R88720N99063L06793J28021O8494
$$ -27800481 -25083168 -22714354 -20788367 -19341975 -18353255 -17754192 -17447399 -17319378 -17250884
8718a7250884J21302K63226M57595O66421Q64658J045018J207953J342394J409837
$$ -17250884 -17129582 -16866356 -16408761 -15742340 -14877682 -13832664 -12624711 -11282317 -9872480
8709i872480J343988J071287N44485k30279j190606k238455l265525m166957m845242
$$ -9872480 -8528492 -7457205 -6912720 -7142999 -8333605 -10572060 -13837585 -18004542 -22849784
8700b2849784n218446n240643m926807m364678l698699l084363k630519k359626
$$ -22849784 -28068230 -33308873 -38235680 -42600358 -46299057 -49383420 -52013939 -54373565
8692e4373565k208702k068520j835407j447802q96975k20147N11300J205208J769226
$$ -54373565 -56582267 -58650787 -60486194 -61933996 -62830971 -63051118 -62539818 -61334610 -59565384
8683e9565384K140158K309809K329205K284748K258946K296470K390229K491393
$$ -59565384 -57425226 -55115417 -52786212 -50501464 -48242518 -45946048 -43555819 -41064426
8675d1064426K537836K486573K332255K103197J843679J598610J407574J302879
$$ -41064426 -38526590 -36040017 -33707762 -31604565 -29760886 -28162276 -26754702 -25451823
8667b5451823J305100J416036J612933J847846K056309K178207K185533K100486
$$ -25451823 -24146723 -22730687 -21117754 -19269908 -17213599 -15035392 -12849859 -10749373
8659a0749373J986582J912085J908836J958162K016785K061167K110846K209947
$$ -10749373 -8762791 -6850706 -4941870 -2983708 -966923 1094244 3205090 5415037
8651E415037K385014K618196K858300L056428L192162L266527L269130L152959
$$ 5415037 7800051 10418247 13276547 16332975 19525137 22791664 26060794 29213753
8643B9213753K848381K315388J595751Q20323J60306k45483l40859j56458K20767
$$ 29213753 32062134 34377522 35973273 36793596 36953902 36708419 36367560 36211102 36431869
8634C6431869O84113J130512J472301J648809J639755J469516J194359Q81407
$$ 36431869 37115982 38246494 39718795 41367604 43007359 44476875 45671234 46552641
8626D6552641N94585L89638L06448L53436M96114O64853P81077P87219O67189
$$ 46552641 47147226 47536864 47843312 48196748 48692862 49357715 50138792 50926011 51593200
8617E1593200M52219K09555J2409j00460j52980k24687m06942p49245j230158
$$ 51593200 52045419 52254974 52267383 52166923 52013943 51789256 51382314 50633069 49402911
8608D9402911j766015k242466k546972k595638k358563j878646j265848o57881
$$ 49402911 47636896 45394430 42847458 40251820 37893257 36014611 34748763 34090882
8600C4090882j65017J67399L58137M57903N10226N27405M89306L60090J12530
$$ 34090882 33925865 34093264 34451401 34909304 35419530 35946935 36436241 36796331 36908861
8591C6908861k49781o80377j095289j398333j518121j438347j204464r04004o33389
$$ 36908861 36659080 35978703 34883414 33485081 31966960 30528613 29324149 28420145 27786756
8582B7786756m68321m47246n67467p91241j062159j330746j578100j820261k087954
$$ 27786756 27318435 26871189 26303722 25512481 24450322 23119576 21541476 19721215 17633261
8573A7633261k398432k742421l090106l399865l617970l678050l515755l097842
$$ 17633261 15234829 12492408 9402302 6002437 2384467 -1293583 -4809338 -7907180
8565g907180k447684j649696q27696j04315M42238Q02404J026738J192936J373764
$$ -7907180 -10354864 -12004560 -12832256 -12936571 -12494333 -11691929 -10665191 -9472255 -8098491
8556h098491J622711J970273K414492K907032L356588L664015L771362L685563
$$ -8098491 -6475780 -4505507 -2091015 816017 4172605 7836620 11607982 15293545
8548A5293545L455654L124791K700763K167361J518344P80125R499p20794j333121
$$ 15293545 18749199 21873990 24574753 26742114 28260458 29040583 29050082 28329288 26996167
8539B6996167j752722j920754j812464j448318q87326k05621N24503J241741J890308
$$ 26996167 25243445 23322691 21510227 20061909 19174583 18968962 19493465 20735206 22625514
8530B2625514K415992K774974K950005K956596K829204K596056K260688J800683
$$ 22625514 25041506 27816480 30766485 33723081 36552285 39148341 41409029 43209712
8522D3209712J181695L80632n87299j648334k675094l527591m113300m424949
$$ 43209712 44391407 44772039 44184740 42536406 39861312 36333721 32220421 27795472
8514B7795472m526073m496893m386318m204297l947641l625943l265107k893770
$$ 27795472 23269399 18772506 14386188 10181891 6234250 2608307 -656800 -3550570
8506c550570k531620k190740j885592j638934j475189j406244j424262j508784
$$ -3550570 -6082190 -8272930 -10158522 -11797456 -13272645 -14678889 -16103151 -17611935
8498a7611935j637651j785564j910535j946034j811758j437152p85644J23336
$$ -17611935 -19249586 -21035150 -22945685 -24891719 -26703477 -28140629 -28926273 -28802937
8490b8802937J196390K267874L140421L656629L761074L511646L036939K473575
$$ -28802937 -27606547 -25338673 -22198252 -18541623 -14780549 -11268903 -8231964 -5758389
8482e758389J921005J427624R99731O19750K64282q4185m35408p96212j172428
$$ -5758389 -3837384 -2409760 -1410029 -790279 -525997 -610182 -1045590 -1841802 -3014230
8473c014230j560962j936403k245269k417155k389609k134006j669845j061882
$$ -3014230 -4575192 -6511595 -8756864 -11174019 -13563628 -15697634 -17367479 -18429361
8465a8429361m02425K12678P03425J012612J101092R41419N22652j29881r32493
$$ -18429361 -18831786 -18619108 -17915683 -16903071 -15801979 -14860560 -14337908 -14467789 -15400282
8456a5400282j742082k390597k743686k750329k453455j957874j378425p98099
$$ -15400282 -17142364 -19532961 -22276647 -25026976 -27480431 -29438305 -30816730 -31614829
8448c1614829k53171K56186P43952J220266J684803K128214K534512K882207L147992
$$ -31614829 -31868000 -31611814 -30867862 -29647596 -27962793 -25834579 -23300067 -20417860 -17269868
8439a7269868L315157L381796L361623L276435L146810K987368K806570K606575
$$ -17269868 -13954711 -10572915 -7211292 -3934857 -788047 2199321 5005891 7612466
8431G612466K381181K114198J781774J359717Q33801K08963m88355j217539j935168
$$ 7612466 9993647 12107845 13889619 15249336 16083137 16292100 15803745 14586206 12651038
8422A2651038k599561l166252l587506l829116l895942l838902l728384l611511
$$ 12651038 10051477 6885225 3297719 -531397 -4427339 -8266241 -11994625 -15606136
8414a5606136l486044l306501l011311k551465j909272j103518j81331P96345
$$ -15606136 -19092180 -22398681 -25409992 -27961457 -29870729 -30974247 -31155578 -30359233
8406c0359233J763745K648789L370497L848885M028363L900711L511836K948036
$$ -30359233 -28595488 -25946699 -22576202 -18727317 -14698954 -10798243 -7286407 -4338371
8398d338371K310859J693864J168055P74047N18830L82353L38386L79471N24467
$$ -4338371 -2027512 -333648 834407 1608454 2127284 2509637 2848023 3227494 3751961
8389C751961P99115J205228J702410K211124K630782K867176K865298K633659
$$ 3751961 4551076 5756304 7458714 9669838 12300620 15167796 18033094 20666753
8381B0666753K240311J778479J326570R30294O10618L79984K51510K39084L51856
$$ 20666753 22907064 24685543 26012113 26942407 27553025 27933009 28184519 28423603 28775459
8372B8775459N85093R11156J278194J621289J881774K024042K039766J935975
$$ 28775459 29360552 30271708 31549902 33171191 35052965 37077007 39116773 41052748
8364D1052748J714240J357684Q41164J62627o27193j423376k100911k564992k786716
$$ 41052748 42766988 44124672 44965836 45128463 44501270 43077894 40976983 38411991 35625275
8355C5625275k805263k700821k558869k445213k398253k433494k551732k743743
$$ 35625275 32820012 30119191 27560322 25115109 22716856 20283362 17731630 14987887
8347A4987887k986657l234351l415051l451118l298020k975364k561353k151626
$$ 14987887 12001230 8766879 5351828 1900710 -1397310 -4372674 -6934027 -9085653
8339i085653j814770j576072j430594j361858j347564j355537j344013j271814
$$ -9085653 -10900423 -12476495 -13907089 -15268947 -16616511 -17972048 -19316061 -20587875
8331b0587875j111424q55496n14053j06559L44421Q13863J271540J683168K019596
$$ -20587875 -21699299 -22554795 -23068848 -23175407 -22830986 -22017123 -20745583 -19062415 -17042819
8322a7042819K268300K435696K534845K565597K500425K286689J869048J225834
$$ -17042819 -14774519 -12338823 -9803978 -7238381 -4737956 -2451267 -582219 643615
8314F43615M00448m97498j331671j997851k460797k743428k881846k885357k731048
$$ 643615 1044063 546565 -785106 -2782957 -5243754 -7987182 -10869028 -13754385 -16485433
8305a6485433k391341j869334j215748n17761J30192O53752J009768J181779J169882
$$ -16485433 -18876774 -20746108 -21961856 -22479617 -22349425 -21695673 -20685905 -19504126 -18334244
8296a8334244R83335O39120J68497l69579q80443j249680j386432j269477r62825
$$ -18334244 -17350909 -16711789 -16543292 -16912871 -17793314 -19042994 -20429426 -21698903 -22661728
8287b2661728n90755k91709j75623k94004o22979j064322j471371j695446j634483
$$ -22661728 -23252483 -23544192 -23719815 -24013819 -24636798 -25701120 -27172491 -28867937 -30502420
8278c0502420j263508o35826J42528R50342J682412K266358K671312K913197L046234
$$ -30502420 -31765928 -32401754 -32259226 -31308884 -29626472 -27360114 -24688802 -21775605 -18729371
8269a8729371L128802L177081L143841K945951K522196J878392J092434K84937
$$ -18729371 -15600569 -12423488 -9279647 -6333696 -3811500 -1933108 -840674 -555737
8261e55737m22307r40792j231222j296259j156294q26521l14406L59773J138774
$$ -555737 -978044 -1918836 -3150058 -4446317 -5602611 -6429132 -6743538 -6383765 -5244991
8252e244991J928205K629637L184129L587420L861371M009607M003041L811394
$$ -5244991 -3316786 -687149 2496980 6084400 9945771 13955378 17958419 21769813
8244B1769813L450654L001886K583908K298434K181365K186246K207924K133736
$$ 21769813 25220467 28222353 30806261 33104695 35286060 37472306 39680230 41813966
8236D1813966J893240J479936R41434L56562j84139n96268q24831q63540p49668
$$ 41813966 43707206 45187142 46128576 46485138 46300999 45704731 44879900 44016360 43266692
8227D3266692n31134k32176J51283O24428J162537J704217K171882K501564K663228
$$ 43266692 42735558 42503382 42654665 43279093 44441630 46145847 48317729 50819293 53482521
8218E3482521K663446K531981K300238J983478J577314J070355M64188k12926
$$ 53482521 56145967 58677948 60978186 62961664 64538978 65609333 66073521 65860595
8210F5860595r08288j562093k128316k584429k924420l143906l232822l183513
$$ 65860595 64952307 63390214 61261898 58677469 55753049 52609143 49376321 46192808
8202D6192808l008039k749967k478174k261619k137723k093456k070993j994428
$$ 46192808 43184769 40434802 37956628 35695009 33557286 31463830 29392837 27398409
8194B7398409j804116j485947j085824p01131m46799m08182o03745r75091j406384
$$ 27398409 25594293 24108346 23022522 22321391 21874592 21466410 20862665 19887574 18481190
8185A8481190j764301j944859j907521j676698j308936q52776l35065K20327P69031
$$ 18481190 16716889 14772030 12864509 11187811 9878875 9026099 8691034 8911361 9680392
8176I680392J246975J595487J786826J830934J763646J627350J453080J249663
$$ 9680392 10927367 12522854 14309680 16140614 17904260 19531610 20984690 22234353
8168B2234353J005343P03312L42881m8604m23289p36698r73365j156719j333529
$$ 22234353 23239696 23943008 24285889 24237285 23813996 23077298 22103933 20947214 19613685
8159A9613685j540193j774186j993578k144717k192325k125426j940469j628090
$$ 19613685 18073492 16299306 14305728 12161011 9968686 7843260 5902791 4274701
8151D274701j183514o30412l0604N33475R89223J293490J433165J417705J276058
$$ 4274701 3091187 2460775 2430171 2963646 3952869 5246359 6679524 8097229 9373287
8142I373287J056170Q15321N97993M14617K38630K4220k69606o63636j153985
$$ 9373287 10429457 11244778 11842771 12257388 12496018 12520238 12250632 11586996 10433011
8133A0433011j712690k290744k826058l257089l538000l649546l600856l419482
$$ 10433011 8720321 6429577 3603519 346430 -3191570 -6841116 -10441972 -13861454
8125a3861454l132326k749377k264991j679534j025520l75271J78611N56734P18029
$$ -13861454 -16993780 -19743157 -22008148 -23687682 -24713202 -25088473 -24909862 -24353128 -23635099
8116b3635099O64921M34521Q8201k95819o32037q44755q90634p77769n70564l72766
$$ -23635099 -22970178 -22535657 -22447456 -22743275 -23375312 -24220067 -25110701 -25888470 -26459034 -26831800
8106b6831800k89862l84998o50495j010005j348752j555322j557025j337506r34025
$$ -26831800 -27121662 -27506660 -28157155 -29167160 -30515912 -32071234 -33628259 -34965765 -35899790
8097c5899790m19559J21550O17827J030051J357088J619201J825692J954057J962923
$$ -35899790 -36319349 -36197799 -35579972 -34549921 -33192833 -31573632 -29747940 -27793883 -25830960
8088b5830960J827370J561258J207671Q14179M19823N8879k33912m28526n12828
$$ -25830960 -24003590 -22442332 -21234661 -20420482 -20000659 -19941780 -20175692 -20604218 -21117046
8079b1117046n04166m50082m12188m37136n31956o61612p69526q04945p41921
$$ -21117046 -21621212 -22071294 -22483482 -22920618 -23452574 -24114186 -24883712 -25688657 -26430578
8070b6430578n85632l67210j28480R7711K99730M83189O53063P94216Q64756Q11432
$$ -26430578 -27016210 -27383420 -27511900 -27414189 -27114459 -26631270 -25978207 -25183991 -24319235 -23507803
8060b3507803O01808K51234j78083o05680r64792j216259j346356j361971j286277
$$ -23507803 -22905995 -22654761 -22832844 -23438524 -24403316 -25619575 -26965931 -28327902 -29614179
8051b9614179j149555r78539p95713o29348n19595n08610o19877q40721j117306
$$ -29614179 -30763734 -31742273 -32537986 -33167334 -33686929 -34195539 -34815416 -35656137 -36773443
8042c6773443j365149j494257j439564j178930p27870j19906O08190J418046K265373
$$ -36773443 -38138592 -39632849 -41072413 -42251343 -42979213 -43099119 -42490929 -41072883 -38807510
8033c8807510L098896L864754M515694N023482N387210N627484N767781N819734
$$ -38807510 -35708614 -31843860 -27328166 -22304684 -16917474 -11289990 -5522209 297525
8025B97525N786079N674530N503365N291172N042226M742360M368080L901122
$$ 297525 6083604 11758134 17261499 22552671 27594897 32337257 36705337 40606459
8017D0606459L339463K699273K007495J291412N74556j18990p60665j322390j787380
$$ 40606459 43945922 46645195 48652690 49944102 50518658 50399668 49639003 48316613 46529233
8008D6529233k156551k447254k690057k926862l204364l557178l986645m449735
$$ 46529233 44372682 41925428 39235371 36308509 33104145 29546967 25560322 21110587
8000B1110587m867121n146736n211677n022576m588632l964624l235031k491753
$$ 21110587 16243466 11096730 5885053 862477 -3726155 -7690779 -10925810 -13417563
$$ [...]
##END NTUPLES=NMR SPECTRUM
##END=
